<?xml version="1.0" encoding="UTF-8" standalone="no"?>
<svg xmlns:xlink="http://www.w3.org/1999/xlink" height="8.0px" width="12.0px" xmlns="http://www.w3.org/2000/svg">
  <g transform="matrix(1.0, 0.0, 0.0, 1.0, 0.0, 8.0)">
    <pattern height="8" id="PatternID_110_1" overflow="visible" patternTransform="matrix(1.0, 0.0, 0.0, 1.0, 0.0, -8.0)" patternUnits="userSpaceOnUse" viewBox="0 0 12 8" width="12">
      <image height="8" width="12" xlink:href="data:image/PNG;base64,iVBORw0KGgoAAAANSUhEUgAAAAwAAAAICAYAAADN5B7xAAAAiElEQVR42mNgQAJRZsr/QZgBDWCI65t5HwQJbMxxw9AA4u8r9v7/d2YKRA6kuH3Wrf8G5j44NYAUo2hIyJv93yO45D+y1TB2a6DJ/3ttEWAM0WDq3RgbFP8fpAlkC0whSAHIVJhikEawBpjb0TWAFIPcDuOjOBVZ0NXM/D++EIMDkOkwWxjwAABCtn/yt7eZ7wAAAABJRU5ErkJggg=="/>
    </pattern>
    <path d="M12.0 -8.0 L12.0 0.0 0.0 0.0 0.0 -8.0 12.0 -8.0" style="fill:url(#PatternID_110_1)"/>
  </g>
</svg>
