<?xml version="1.0" encoding="UTF-8" standalone="no"?>
<svg xmlns:xlink="http://www.w3.org/1999/xlink" height="5.0px" width="7.0px" xmlns="http://www.w3.org/2000/svg">
  <g transform="matrix(1.0, 0.0, 0.0, 1.0, 0.0, 5.0)">
    <pattern height="5" id="PatternID_104_1" overflow="visible" patternTransform="matrix(1.0, 0.0, 0.0, 1.0, 0.0, -5.0)" patternUnits="userSpaceOnUse" viewBox="0 0 7 5" width="7">
      <image height="5" width="7" xlink:href="data:image/PNG;base64,iVBORw0KGgoAAAANSUhEUgAAAAcAAAAFCAYAAACJmvbYAAAANElEQVR42mNgAIL/QODt5QWi/jMggxZbxv9aWlpgDFKAoQikAASQFYAwigJkRRhWICsCYQCwuDVYxAQ4kQAAAABJRU5ErkJggg=="/>
    </pattern>
    <path d="M7.0 -5.0 L7.0 0.0 0.0 0.0 0.0 -5.0 7.0 -5.0" style="fill:url(#PatternID_104_1)"/>
  </g>
</svg>
