<?xml version="1.0" encoding="UTF-8" standalone="no"?>
<svg xmlns:xlink="http://www.w3.org/1999/xlink" height="35.0px" width="35.0px" xmlns="http://www.w3.org/2000/svg">
  <g transform="matrix(1.0, 0.0, 0.0, 1.0, -6.0, -50.0)">
    <path d="M28.0 60.0 L28.0 61.0 30.0 61.0 30.0 62.0 32.0 62.0 32.0 63.0 34.0 63.0 34.0 64.0 36.0 64.0 36.0 65.0 38.0 65.0 38.0 66.0 40.0 66.0 40.0 67.0 41.0 67.0 41.0 84.0 40.0 84.0 40.0 85.0 38.0 85.0 38.0 84.0 36.0 84.0 36.0 83.0 34.0 83.0 34.0 82.0 32.0 82.0 32.0 81.0 30.0 81.0 30.0 80.0 28.0 80.0 28.0 79.0 26.0 79.0 26.0 78.0 24.0 78.0 24.0 77.0 22.0 77.0 22.0 76.0 20.0 76.0 20.0 75.0 18.0 75.0 18.0 74.0 16.0 74.0 16.0 73.0 14.0 73.0 14.0 72.0 12.0 72.0 12.0 71.0 10.0 71.0 10.0 70.0 8.0 70.0 8.0 69.0 7.0 69.0 7.0 68.0 6.0 68.0 6.0 50.0 8.0 50.0 8.0 51.0 10.0 51.0 10.0 52.0 12.0 52.0 12.0 53.0 14.0 53.0 14.0 54.0 16.0 54.0 16.0 55.0 18.0 55.0 18.0 56.0 20.0 56.0 20.0 57.0 22.0 57.0 22.0 58.0 24.0 58.0 24.0 59.0 26.0 59.0 26.0 60.0 28.0 60.0" fill="#ff0000" fill-rule="evenodd" stroke="none"/>
  </g>
</svg>
