<?xml version="1.0" encoding="UTF-8" standalone="no"?>
<svg xmlns:xlink="http://www.w3.org/1999/xlink" height="12.0px" width="27.0px" xmlns="http://www.w3.org/2000/svg">
  <g transform="matrix(1.0, 0.0, 0.0, 1.0, 4.0, 7.0)">
    <pattern height="12" id="PatternID_1302_1" overflow="visible" patternTransform="matrix(-1.0, 0.0, 0.0, 1.0, 23.0, -7.0)" patternUnits="userSpaceOnUse" viewBox="0 0 27 12" width="27">
      <image height="12" width="27" xlink:href="data:image/PNG;base64,iVBORw0KGgoAAAANSUhEUgAAABsAAAAMCAYAAACTB8Z2AAAAaklEQVR42mNgoBK4PCniPwxTZAgp6jtdOP4T1I9NkFxXwnyIbjFeQ0GKsWogwnc49YEk8FlISTDidAkMI1tMVcuwhS2yxeQGIdaQwmUgORYhOxzdQryJDa8LaRVC5PiQbECK76hmITXMAQBjC3TZFBHS8QAAAABJRU5ErkJggg=="/>
    </pattern>
    <path d="M23.0 -7.0 L23.0 5.0 -4.0 5.0 -4.0 -7.0 23.0 -7.0" style="fill:url(#PatternID_1302_1)"/>
  </g>
</svg>
