<?xml version="1.0" encoding="UTF-8" standalone="no"?>
<svg xmlns:xlink="http://www.w3.org/1999/xlink" height="13.0px" width="19.0px" xmlns="http://www.w3.org/2000/svg">
  <g transform="matrix(1.0, 0.0, 0.0, 1.0, 0.0, 1.0)">
    <pattern height="13" id="PatternID_1552_1" overflow="visible" patternTransform="matrix(1.0, 0.0, 0.0, 1.0, 0.0, -1.0)" patternUnits="userSpaceOnUse" viewBox="0 0 19 13" width="19">
      <image height="13" width="19" xlink:href="data:image/PNG;base64,iVBORw0KGgoAAAANSUhEUgAAABMAAAANCAYAAABLjFUnAAAAmUlEQVR42mNgoAfQkLH5D8P4xIgyZGqDDxzjEiNoEEyxqz3CEGwYr4EwBfYWnmAM4gf6BoNxdGQkHBNlIEhwUo0XhkHohqEbOKcjANVAmC1Hts/FiXOSy7Eatqg/GNMwkAZQOOHCW1f2wA1FxigG2uvEETQI3VAYG2YgPOzQY4lYA2EY5BC8sUoqxpnWVKUt0onFROUCcg0DACTEK1Gikr6NAAAAAElFTkSuQmCC"/>
    </pattern>
    <path d="M19.0 -1.0 L19.0 12.0 0.0 12.0 0.0 -1.0 19.0 -1.0" style="fill:url(#PatternID_1552_1)"/>
  </g>
</svg>
