<?xml version="1.0" encoding="UTF-8" standalone="no"?>
<svg xmlns:xlink="http://www.w3.org/1999/xlink" height="16.0px" width="16.0px" xmlns="http://www.w3.org/2000/svg">
  <g transform="matrix(1.0, 0.0, 0.0, 1.0, 0.0, 0.0)">
    <use height="16.0" transform="matrix(1.0, 0.0, 0.0, 1.0, 0.0, 0.0)" width="16.0" xlink:href="#sprite0"/>
  </g>
  <defs>
    <g id="sprite0" transform="matrix(1.0, 0.0, 0.0, 1.0, 0.0, 0.0)">
      <use height="16.0" transform="matrix(1.0, 0.0, 0.0, 1.0, 0.0, 0.0)" width="16.0" xlink:href="#shape0"/>
    </g>
    <g id="shape0" transform="matrix(1.0, 0.0, 0.0, 1.0, 0.0, 0.0)">
      <pattern height="16" id="PatternID_382_1" overflow="visible" patternTransform="matrix(1.0, 0.0, 0.0, 1.0, 0.0, 0.0)" patternUnits="userSpaceOnUse" viewBox="0 0 16 16" width="16">
        <image height="16" width="16" xlink:href="data:image/PNG;base64,iVBORw0KGgoAAAANSUhEUgAAABAAAAAQCAYAAAAf8/9hAAAAQklEQVR42mNgGFTAzs7uP9nqQRxSDMBQT5EBMAaxBmCop8jvVDMAGROSwwg8dICsAZccQQMIGU6RATjjlNgwGGYAALi8tcM1w5ZMAAAAAElFTkSuQmCC"/>
      </pattern>
      <path d="M0.0 0.0 L16.0 0.0 16.0 16.0 0.0 16.0 0.0 0.0" style="fill:url(#PatternID_382_1)"/>
    </g>
  </defs>
</svg>
