<?xml version="1.0" encoding="UTF-8" standalone="no"?>
<svg xmlns:xlink="http://www.w3.org/1999/xlink" height="24.1px" width="12.0px" xmlns="http://www.w3.org/2000/svg">
  <g transform="matrix(1.0, 0.0, 0.0, 1.0, -0.5, 24.6)">
    <path d="M12.5 -24.6 L12.5 -6.5 0.5 -0.5 0.5 -18.9 12.5 -24.6" fill="#00ff00" fill-rule="evenodd" stroke="none"/>
  </g>
</svg>
