<?xml version="1.0" encoding="UTF-8" standalone="no"?>
<svg xmlns:xlink="http://www.w3.org/1999/xlink" height="4.0px" width="4.0px" xmlns="http://www.w3.org/2000/svg">
  <g transform="matrix(1.0, 0.0, 0.0, 1.0, 1.0, 1.0)">
    <pattern height="4" id="PatternID_1270_1" overflow="visible" patternTransform="matrix(1.0, 0.0, 0.0, 1.0, -1.0, -1.0)" patternUnits="userSpaceOnUse" viewBox="0 0 4 4" width="4">
      <image height="4" width="4" xlink:href="data:image/PNG;base64,iVBORw0KGgoAAAANSUhEUgAAAAQAAAAECAYAAACp8Z5+AAAAK0lEQVR42mOYkhT8n4GBAYzB7EQ1kf9dQA4Ig9hggb8zU8AYLAACIAaMAwCK3Rkvt0ma/gAAAABJRU5ErkJggg=="/>
    </pattern>
    <path d="M-1.0 -1.0 L3.0 -1.0 3.0 3.0 -1.0 3.0 -1.0 -1.0" style="fill:url(#PatternID_1270_1)"/>
  </g>
</svg>
