<?xml version="1.0" encoding="UTF-8" standalone="no"?>
<svg xmlns:xlink="http://www.w3.org/1999/xlink" height="2.0px" width="6.0px" xmlns="http://www.w3.org/2000/svg">
  <g transform="matrix(1.0, 0.0, 0.0, 1.0, 3.0, 0.0)">
    <pattern height="2" id="PatternID_621_1" overflow="visible" patternTransform="matrix(1.0, 0.0, 0.0, 1.0, -3.0, 0.0)" patternUnits="userSpaceOnUse" viewBox="0 0 6 2" width="6">
      <image height="2" width="6" xlink:href="data:image/PNG;base64,iVBORw0KGgoAAAANSUhEUgAAAAYAAAACCAYAAAB7Xa1eAAAAHElEQVR42mN40hX1f1+x939kAOIzgABIkgENAAAPZBZ5KapcJgAAAABJRU5ErkJggg=="/>
    </pattern>
    <path d="M3.0 2.0 L-3.0 2.0 -3.0 0.0 3.0 0.0 3.0 2.0" style="fill:url(#PatternID_621_1)"/>
  </g>
</svg>
