<?xml version="1.0" encoding="UTF-8" standalone="no"?>
<svg xmlns:xlink="http://www.w3.org/1999/xlink" height="10.0px" width="15.0px" xmlns="http://www.w3.org/2000/svg">
  <g transform="matrix(1.0, 0.0, 0.0, 1.0, -1.0, -20.0)">
    <pattern height="10" id="PatternID_1795_1" overflow="visible" patternTransform="matrix(1.0, 0.0, 0.0, 1.0, 1.0, 20.0)" patternUnits="userSpaceOnUse" viewBox="0 0 15 10" width="15">
      <image height="10" width="15" xlink:href="data:image/PNG;base64,iVBORw0KGgoAAAANSUhEUgAAAA8AAAAKCAYAAABrGwT5AAAAQUlEQVR42mNgIBJoSFt1wzADOZqINgCXJrwGEKMJQzMxinNTq/+DAFwzKTb9hwLKnIlPM4bzSAlVDOeREi3EpgEAudds8Qm9P10AAAAASUVORK5CYII="/>
    </pattern>
    <path d="M1.0 20.0 L16.0 20.0 16.0 30.0 1.0 30.0 1.0 20.0" style="fill:url(#PatternID_1795_1)"/>
  </g>
</svg>
