<?xml version="1.0" encoding="UTF-8" standalone="no"?>
<svg xmlns:xlink="http://www.w3.org/1999/xlink" height="800.9px" width="644.0px" xmlns="http://www.w3.org/2000/svg">
  <g transform="matrix(1.0, 0.0, 0.0, 1.0, 0.0, 0.0)">
    <path d="M644.0 0.0 L644.0 800.9 0.0 800.9 0.0 0.0 644.0 0.0" fill="#eceef5" fill-rule="evenodd" stroke="none"/>
    <path d="M355.0 2.95 L355.0 793.4 M335.0 2.95 L335.0 793.4 M375.0 2.95 L375.0 793.4 M155.0 2.95 L155.0 793.4 M135.0 2.95 L135.0 793.4 M275.0 2.95 L275.0 793.4 M255.0 2.95 L255.0 793.4 M315.0 2.95 L315.0 793.4 M295.0 2.95 L295.0 793.4 M195.0 2.95 L195.0 793.4 M175.0 2.95 L175.0 793.4 M235.0 2.95 L235.0 793.4 M215.0 2.95 L215.0 793.4" fill="none" stroke="#6666cc" stroke-linecap="round" stroke-linejoin="round" stroke-opacity="0.29803923" stroke-width="1.0"/>
    <path d="M115.0 2.95 L115.0 793.4" fill="none" stroke="#ff6699" stroke-linecap="round" stroke-linejoin="round" stroke-opacity="0.29803923" stroke-width="2.0"/>
    <path d="M595.0 2.95 L595.0 793.4 M575.0 2.95 L575.0 793.4 M615.0 2.95 L615.0 793.4 M395.0 2.95 L395.0 793.4 M515.0 2.95 L515.0 793.4 M495.0 2.95 L495.0 793.4 M555.0 2.95 L555.0 793.4 M535.0 2.95 L535.0 793.4 M435.0 2.95 L435.0 793.4 M415.0 2.95 L415.0 793.4 M475.0 2.95 L475.0 793.4 M455.0 2.95 L455.0 793.4" fill="none" stroke="#6666cc" stroke-linecap="round" stroke-linejoin="round" stroke-opacity="0.29803923" stroke-width="1.0"/>
    <path d="M7.0 79.15 L639.0 79.15 M7.0 99.15 L639.0 99.15 M7.0 119.15 L639.0 119.15 M7.0 139.15 L639.0 139.15 M7.0 159.15 L639.0 159.15 M7.0 179.15 L639.0 179.15 M7.0 199.15 L639.0 199.15 M7.0 219.15 L639.0 219.15 M7.0 239.15 L639.0 239.15 M7.0 259.15 L639.0 259.15 M7.0 279.15 L639.0 279.15 M7.0 299.15 L639.0 299.15 M7.0 319.15 L639.0 319.15 M7.0 339.15 L639.0 339.15 M7.0 519.15 L639.0 519.15 M7.0 499.15 L639.0 499.15 M7.0 479.15 L639.0 479.15 M7.0 459.15 L639.0 459.15 M7.0 439.15 L639.0 439.15 M7.0 419.15 L639.0 419.15 M7.0 399.15 L639.0 399.15 M7.0 379.15 L639.0 379.15 M7.0 359.15 L639.0 359.15" fill="none" stroke="#6666cc" stroke-linecap="round" stroke-linejoin="round" stroke-opacity="0.29803923" stroke-width="1.0"/>
    <path d="M7.0 289.15 L638.95 289.15 M7.0 209.15 L638.95 209.15 M7.0 229.15 L638.95 229.15 M7.0 249.15 L638.95 249.15 M7.0 169.15 L638.95 169.15 M7.0 189.15 L638.95 189.15 M7.0 109.15 L638.95 109.15 M7.0 129.15 L638.95 129.15 M7.0 149.15 L638.95 149.15 M7.0 89.15 L638.95 89.15 M7.0 529.15 L638.95 529.15 M7.0 509.15 L638.95 509.15 M7.0 489.15 L638.95 489.15 M7.0 469.15 L638.95 469.15 M7.0 449.15 L638.95 449.15 M7.0 429.15 L638.95 429.15 M7.0 409.15 L638.95 409.15 M7.0 389.15 L638.95 389.15 M7.0 369.15 L638.95 369.15 M7.0 309.15 L638.95 309.15 M7.0 329.15 L638.95 329.15 M7.0 349.15 L638.95 349.15 M7.0 269.15 L638.95 269.15" fill="none" stroke="#6666cc" stroke-linecap="round" stroke-linejoin="round" stroke-opacity="0.06666667" stroke-width="1.0"/>
    <path d="M7.0 504.15 L639.0 504.15 M7.0 524.15 L639.0 524.15 M7.0 444.15 L639.0 444.15 M7.0 464.15 L639.0 464.15 M7.0 484.15 L639.0 484.15 M7.0 404.15 L639.0 404.15 M7.0 424.15 L639.0 424.15 M7.0 344.15 L639.0 344.15 M7.0 364.15 L639.0 364.15 M7.0 384.15 L639.0 384.15 M7.0 324.15 L639.0 324.15 M7.0 304.15 L639.0 304.15 M7.0 244.15 L639.0 244.15 M7.0 284.15 L639.0 284.15 M7.0 264.15 L639.0 264.15 M7.0 224.15 L639.0 224.15 M7.0 204.15 L639.0 204.15 M7.0 144.15 L639.0 144.15 M7.0 184.15 L639.0 184.15 M7.0 164.15 L639.0 164.15 M7.0 124.15 L639.0 124.15 M7.0 104.15 L639.0 104.15 M7.0 84.15 L639.0 84.15" fill="none" stroke="#6666cc" stroke-linecap="round" stroke-linejoin="round" stroke-opacity="0.06666667" stroke-width="1.0"/>
    <path d="M7.0 684.15 L639.0 684.15 M7.0 664.15 L639.0 664.15 M7.0 644.15 L639.0 644.15 M7.0 584.15 L639.0 584.15 M7.0 624.15 L639.0 624.15 M7.0 604.15 L639.0 604.15 M7.0 564.15 L639.0 564.15 M7.0 544.15 L639.0 544.15" fill="none" stroke="#6666cc" stroke-linecap="round" stroke-linejoin="round" stroke-opacity="0.06666667" stroke-width="1.0"/>
    <path d="M7.0 294.15 L638.95 294.15 M7.0 214.15 L638.95 214.15 M7.0 234.15 L638.95 234.15 M7.0 254.15 L638.95 254.15 M7.0 174.15 L638.95 174.15 M7.0 194.15 L638.95 194.15 M7.0 114.15 L638.95 114.15 M7.0 134.15 L638.95 134.15 M7.0 154.15 L638.95 154.15 M7.0 94.15 L638.95 94.15 M7.0 534.15 L638.95 534.15 M7.0 514.15 L638.95 514.15 M7.0 494.15 L638.95 494.15 M7.0 474.15 L638.95 474.15 M7.0 454.15 L638.95 454.15 M7.0 434.15 L638.95 434.15 M7.0 414.15 L638.95 414.15 M7.0 394.15 L638.95 394.15 M7.0 374.15 L638.95 374.15 M7.0 314.15 L638.95 314.15 M7.0 334.15 L638.95 334.15 M7.0 354.15 L638.95 354.15 M7.0 274.15 L638.95 274.15" fill="none" stroke="#6666cc" stroke-linecap="round" stroke-linejoin="round" stroke-opacity="0.06666667" stroke-width="1.0"/>
    <path d="M7.0 539.15 L639.0 539.15 M7.0 559.15 L639.0 559.15 M7.0 579.15 L639.0 579.15 M7.0 599.15 L639.0 599.15 M7.0 619.15 L639.0 619.15 M7.0 639.15 L639.0 639.15 M7.0 659.15 L639.0 659.15 M7.0 679.15 L639.0 679.15 M7.0 699.15 L639.0 699.15 M7.0 719.15 L639.0 719.15 M7.0 739.15 L639.0 739.15 M7.0 759.15 L639.0 759.15" fill="none" stroke="#6666cc" stroke-linecap="round" stroke-linejoin="round" stroke-opacity="0.29803923" stroke-width="1.0"/>
    <path d="M7.0 569.15 L638.95 569.15 M7.0 589.15 L638.95 589.15 M7.0 609.15 L638.95 609.15 M7.0 549.15 L638.95 549.15 M7.0 749.15 L638.95 749.15 M7.0 669.15 L638.95 669.15 M7.0 689.15 L638.95 689.15 M7.0 709.15 L638.95 709.15 M7.0 629.15 L638.95 629.15 M7.0 649.15 L638.95 649.15 M7.0 729.15 L638.95 729.15" fill="none" stroke="#6666cc" stroke-linecap="round" stroke-linejoin="round" stroke-opacity="0.06666667" stroke-width="1.0"/>
    <path d="M7.0 604.15 L639.0 604.15 M7.0 584.15 L639.0 584.15 M7.0 564.15 L639.0 564.15 M7.0 544.15 L639.0 544.15 M7.0 704.15 L639.0 704.15 M7.0 744.15 L639.0 744.15 M7.0 724.15 L639.0 724.15 M7.0 684.15 L639.0 684.15 M7.0 664.15 L639.0 664.15 M7.0 644.15 L639.0 644.15 M7.0 624.15 L639.0 624.15" fill="none" stroke="#6666cc" stroke-linecap="round" stroke-linejoin="round" stroke-opacity="0.06666667" stroke-width="1.0"/>
    <path d="M7.0 574.15 L638.95 574.15 M7.0 594.15 L638.95 594.15 M7.0 614.15 L638.95 614.15 M7.0 554.15 L638.95 554.15 M7.0 754.15 L638.95 754.15 M7.0 674.15 L638.95 674.15 M7.0 694.15 L638.95 694.15 M7.0 714.15 L638.95 714.15 M7.0 634.15 L638.95 634.15 M7.0 654.15 L638.95 654.15 M7.0 734.15 L638.95 734.15" fill="none" stroke="#6666cc" stroke-linecap="round" stroke-linejoin="round" stroke-opacity="0.06666667" stroke-width="1.0"/>
  </g>
</svg>
