<?xml version="1.0" encoding="UTF-8" standalone="no"?>
<svg xmlns:xlink="http://www.w3.org/1999/xlink" height="14.0px" width="14.0px" xmlns="http://www.w3.org/2000/svg">
  <g transform="matrix(1.0, 0.0, 0.0, 1.0, 7.0, 7.0)">
    <path d="M7.0 7.0 L-7.0 7.0 -7.0 -7.0 7.0 -7.0 7.0 7.0" fill="#ffcc00" fill-rule="evenodd" stroke="none"/>
    <path d="M7.0 7.0 L-7.0 7.0 -7.0 -7.0 7.0 -7.0 7.0 7.0 Z" fill="none" stroke="#000000" stroke-linecap="round" stroke-linejoin="round" stroke-width="0.05"/>
  </g>
</svg>
