<?xml version="1.0" encoding="UTF-8" standalone="no"?>
<svg xmlns:xlink="http://www.w3.org/1999/xlink" height="18.6px" width="11.95px" xmlns="http://www.w3.org/2000/svg">
  <g transform="matrix(1.0, 0.0, 0.0, 1.0, 6.35, 7.1)">
    <path d="M3.95 -4.35 L4.0 -4.65 3.6 -3.9 3.45 -3.75 M3.4 -3.6 L2.75 -2.5 0.5 1.9 -0.65 4.3 -0.9 4.95 Q-0.2 4.35 0.2 3.45 L0.8 2.3 1.5 0.9 3.2 -2.5 3.95 -4.35 M-0.7 0.0 L-0.65 -0.25 -0.15 -1.55 Q0.2 -2.5 0.8 -3.25 L1.75 -4.35 M1.55 4.0 L3.95 -0.25 Q4.7 -1.5 5.05 -1.6 L3.3 1.15 1.6 4.15 0.85 5.25 0.85 5.35 0.3 6.35 0.2 6.5 -0.4 8.1 -0.45 8.6 1.15 7.5 2.45 6.35 4.3 4.0 4.75 2.85 Q5.05 3.65 4.1 5.1 L3.9 5.55 3.05 6.95 2.95 7.25 2.85 7.35 2.05 8.6 Q1.5 9.4 1.5 10.3 M0.85 5.25 L1.55 4.0 M-0.9 4.95 L-1.3 6.4 -0.7 6.4 Q-0.15 6.3 0.25 6.0 L0.75 5.4 0.85 5.35 M-1.15 1.5 L-1.55 2.3 Q-2.1 3.95 -2.1 5.6 L-0.9 4.95 M-0.7 0.0 L-1.15 1.5" fill="none" stroke="url(#gradient0)" stroke-linecap="round" stroke-linejoin="round" stroke-width="1.0"/>
    <path d="M3.6 -3.9 L3.95 -4.35 5.05 -5.4 M3.45 -3.75 L3.4 -3.6 2.55 -2.6 2.5 -2.5 1.05 -0.9 -0.35 0.55 -1.15 1.5 -1.85 2.2 Q-3.65 4.35 -4.9 6.8 L-5.85 8.75" fill="none" stroke="url(#gradient1)" stroke-linecap="round" stroke-linejoin="round" stroke-width="1.0"/>
    <path d="M0.5 1.9 L0.8 2.3 1.45 3.75 1.55 4.0 1.6 4.15 2.45 6.35 2.85 7.3 2.85 7.35 3.8 9.4 4.25 10.15 Q5.25 11.95 5.05 9.9 M-0.35 0.55 L0.45 1.8 0.5 1.9 M-3.2 -6.6 Q-3.9 -5.65 -3.25 -4.45 L-1.9 -1.95 -1.6 -1.55 -0.7 0.0 -0.35 0.55" fill="none" stroke="url(#gradient2)" stroke-linecap="round" stroke-linejoin="round" stroke-width="1.0"/>
    <path d="M-0.15 -4.1 Q-1.05 -3.85 -0.75 -2.75 -0.7 -2.65 -0.45 -2.6 L-0.15 -2.45" fill="none" stroke="url(#gradient3)" stroke-linecap="round" stroke-linejoin="round" stroke-width="1.0"/>
  </g>
  <defs>
    <linearGradient gradientTransform="matrix(0.0051, 0.0, 0.0, 0.0098, 1.45, 2.8)" gradientUnits="userSpaceOnUse" id="gradient0" spreadMethod="pad" x1="-819.2" x2="819.2">
      <stop offset="0.0" stop-color="#393987"/>
      <stop offset="1.0" stop-color="#393987"/>
    </linearGradient>
    <linearGradient gradientTransform="matrix(0.0074, 0.0, 0.0, 0.0094, -0.4, 1.65)" gradientUnits="userSpaceOnUse" id="gradient1" spreadMethod="pad" x1="-819.2" x2="819.2">
      <stop offset="0.0" stop-color="#393987"/>
      <stop offset="1.0" stop-color="#393987"/>
    </linearGradient>
    <linearGradient gradientTransform="matrix(0.006, 0.0, 0.0, 0.0115, 0.75, 2.2)" gradientUnits="userSpaceOnUse" id="gradient2" spreadMethod="pad" x1="-819.2" x2="819.2">
      <stop offset="0.0" stop-color="#393987"/>
      <stop offset="1.0" stop-color="#393987"/>
    </linearGradient>
    <linearGradient gradientTransform="matrix(0.0011, 0.0, 0.0, 0.0017, -0.5, -3.25)" gradientUnits="userSpaceOnUse" id="gradient3" spreadMethod="pad" x1="-819.2" x2="819.2">
      <stop offset="0.0" stop-color="#393987"/>
      <stop offset="1.0" stop-color="#393987"/>
    </linearGradient>
  </defs>
</svg>
