<?xml version="1.0" encoding="UTF-8" standalone="no"?>
<svg xmlns:xlink="http://www.w3.org/1999/xlink" height="10.8px" width="86.5px" xmlns="http://www.w3.org/2000/svg">
  <g transform="matrix(1.0, 0.0, 0.0, 1.0, 44.95, 1.25)">
    <path d="M-44.45 -0.15 L-40.9 -0.15 -37.15 -0.15 -33.55 -0.15 -30.0 -0.15 -26.4 -0.15 -22.65 -0.15 -19.1 -0.15 -15.95 -0.15 -12.7 -0.15 -9.45 -0.15 -5.7 -0.15 -2.05 -0.15 1.6 -0.15 4.85 -0.15 8.5 -0.15 11.9 -0.15 14.65 -0.15 18.55 -0.15 22.05 -0.15 25.95 -0.15 29.9 -0.15 33.7 -0.15 37.65 -0.15 41.05 -0.15 M-44.45 -0.45 L-43.35 -0.75 M-16.1 8.6 L-16.45 8.6 -16.95 8.75 -16.8 8.85 -16.45 9.05 -16.1 9.05 -15.6 9.05 -13.45 9.05 -11.4 9.05 -9.55 9.05 -7.7 9.05 -5.8 9.05 -5.55 9.05 -3.55 9.05 -1.45 9.05 0.55 9.05 2.65 9.05 4.8 9.05 6.9 9.05 9.0 9.05 11.15 9.05 13.25 9.05 15.4 9.05 16.4 9.05 16.75 9.05" fill="none" stroke="#393987" stroke-linecap="round" stroke-linejoin="round" stroke-width="1.0"/>
  </g>
</svg>
