<?xml version="1.0" encoding="UTF-8" standalone="no"?>
<svg xmlns:xlink="http://www.w3.org/1999/xlink" height="52.15px" width="145.75px" xmlns="http://www.w3.org/2000/svg">
  <g transform="matrix(1.0, 0.0, 0.0, 1.0, 71.25, 15.0)">
    <path d="M-70.45 26.2 Q-70.9 26.1 -70.65 25.5 L-70.45 25.35 -69.55 25.4 Q-69.35 25.45 -69.2 25.6 -54.9 18.6 -40.0 12.95 -27.0 8.0 -13.9 3.25 0.5 -2.0 15.1 -6.65 32.75 -12.25 51.0 -13.8 L68.0 -14.5 74.0 -14.0 M-36.15 33.1 L-36.65 33.05 Q-37.35 33.0 -37.25 33.7 L-37.1 33.7 -37.0 33.7 -36.6 33.75 Q-23.2 25.95 -9.05 19.85 5.65 13.55 21.1 9.45 37.35 5.2 54.0 3.0 M-17.45 36.65 Q-17.75 36.4 -17.4 35.95 L-17.15 35.8 -17.05 35.8 -16.85 35.7 -16.45 35.55 Q0.45 28.45 17.85 22.55 32.1 17.75 47.0 16.0 M-70.0 25.95 L-69.2 25.6 -68.9 25.75" fill="none" stroke="url(#gradient0)" stroke-linecap="round" stroke-linejoin="round" stroke-width="1.0"/>
  </g>
  <defs>
    <linearGradient gradientTransform="matrix(0.0563, 0.0, 0.0, 0.0194, 8.35, 18.35)" gradientUnits="userSpaceOnUse" id="gradient0" spreadMethod="pad" x1="-819.2" x2="819.2">
      <stop offset="0.0" stop-color="#cc0000"/>
      <stop offset="1.0" stop-color="#cc0000" stop-opacity="0.1764706"/>
    </linearGradient>
  </defs>
</svg>
