<?xml version="1.0" encoding="UTF-8" standalone="no"?>
<svg xmlns:xlink="http://www.w3.org/1999/xlink" height="2.0px" width="6.0px" xmlns="http://www.w3.org/2000/svg">
  <g transform="matrix(1.0, 0.0, 0.0, 1.0, 0.0, 0.0)">
    <path d="M6.0 1.0 L6.0 2.0 4.0 2.0 4.0 1.0 6.0 1.0 M0.0 1.0 L2.0 1.0 2.0 2.0 0.0 2.0 0.0 1.0" fill="#000000" fill-rule="evenodd" stroke="none"/>
    <path d="M4.0 1.0 L4.0 0.0 6.0 0.0 6.0 1.0 4.0 1.0 M0.0 1.0 L0.0 0.0 2.0 0.0 2.0 1.0 0.0 1.0" fill="#956354" fill-rule="evenodd" stroke="none"/>
  </g>
</svg>
