<?xml version="1.0" encoding="UTF-8" standalone="no"?>
<svg xmlns:xlink="http://www.w3.org/1999/xlink" height="13.0px" width="16.0px" xmlns="http://www.w3.org/2000/svg">
  <g transform="matrix(1.0, 0.0, 0.0, 1.0, -7.0, -4.0)">
    <pattern height="13" id="PatternID_1802_1" overflow="visible" patternTransform="matrix(1.0, 0.0, 0.0, 1.0, 7.0, 4.0)" patternUnits="userSpaceOnUse" viewBox="0 0 16 13" width="16">
      <image height="13" width="16" xlink:href="data:image/PNG;base64,iVBORw0KGgoAAAANSUhEUgAAABAAAAANCAYAAACgu+4kAAAAeElEQVR42mNgwAMCNTn/I2MGYgFMw858CRRMlEHYNGIziGzNeA2BGTAnTh6OcRkAkkMxBMQhRiNBA+r91MCYkO0YBoA0ZdhIoGCYQdgwSA5uwNQoRTAHZjuxGGwAzFkgg2DOItsA5PAgyQB8qRGXRqKTNnp+QNcIACrmH6lx9RGBAAAAAElFTkSuQmCC"/>
    </pattern>
    <path d="M7.0 4.0 L23.0 4.0 23.0 17.0 7.0 17.0 7.0 4.0" style="fill:url(#PatternID_1802_1)"/>
  </g>
</svg>
