<?xml version="1.0" encoding="UTF-8" standalone="no"?>
<svg xmlns:xlink="http://www.w3.org/1999/xlink" height="8.0px" width="6.0px" xmlns="http://www.w3.org/2000/svg">
  <g transform="matrix(1.0, 0.0, 0.0, 1.0, -10.0, -4.0)">
    <path d="M11.0 11.0 L12.0 11.0 12.0 12.0 11.0 12.0 11.0 11.0" fill="#ff3300" fill-opacity="0.6" fill-rule="evenodd" stroke="none"/>
    <path d="M12.0 11.0 L11.0 11.0 11.0 10.0 12.0 10.0 12.0 11.0" fill="#ff3300" fill-opacity="0.49803922" fill-rule="evenodd" stroke="none"/>
    <path d="M11.0 4.0 L11.0 5.0 10.0 5.0 10.0 4.0 11.0 4.0 M16.0 5.0 L16.0 6.0 15.0 6.0 15.0 5.0 16.0 5.0" fill="#ffffff" fill-rule="evenodd" stroke="none"/>
  </g>
</svg>
