<?xml version="1.0" encoding="UTF-8" standalone="no"?>
<svg xmlns:xlink="http://www.w3.org/1999/xlink" height="30.0px" width="18.05px" xmlns="http://www.w3.org/2000/svg">
  <g transform="matrix(1.0, 0.0, 0.0, 1.0, 10.15, 32.0)">
    <pattern height="18" id="PatternID_277_1" overflow="visible" patternTransform="matrix(0.9487, 0.3163, -0.3163, 0.9487, -4.45, -23.2)" patternUnits="userSpaceOnUse" viewBox="0 0 13 18" width="13">
      <image height="18" width="13" xlink:href="data:image/PNG;base64,iVBORw0KGgoAAAANSUhEUgAAAA0AAAASCAYAAACAa1QyAAAAUElEQVR42mNgIAL8v8TwH4QZBl7x0UYEJsnkKUnC/0GYgRQA0kC082AA5LRRTYNXEywlwDThTU7XZjL8B2FkTcgYZMC7XTg0w9IgOmagBgAAzUKHtjtRLacAAAAASUVORK5CYII="/>
    </pattern>
    <path d="M2.2 -2.0 L-10.15 -6.1 -4.45 -23.2 7.9 -19.1 2.2 -2.0" style="fill:url(#PatternID_277_1)"/>
    <pattern height="13" id="PatternID_277_2" overflow="visible" patternTransform="matrix(1.0, 0.0, 0.0, 1.0, -5.0, -32.0)" patternUnits="userSpaceOnUse" viewBox="0 0 12 13" width="12">
      <image height="13" width="12" xlink:href="data:image/PNG;base64,iVBORw0KGgoAAAANSUhEUgAAAAwAAAANCAYAAACdKY9CAAAAUElEQVR42mNggAINGZv/DGgAmxgYeHt5/8elAUMcpJjqGlDkYBqwaaKOBmyaYAqQNeC1BRueNGnS/7y8PMxgxqaYARfAZTpJGqijGFfEYQMATcd3d4tUILQAAAAASUVORK5CYII="/>
    </pattern>
    <path d="M7.0 -19.0 L-5.0 -19.0 -5.0 -32.0 7.0 -32.0 7.0 -19.0" style="fill:url(#PatternID_277_2)"/>
    <path d="M1.0 -19.0 L1.0 -20.0 2.0 -20.0 2.0 -19.0 1.0 -19.0" fill="#281c3c" fill-rule="evenodd" stroke="none"/>
    <path d="M3.0 -20.0 L3.0 -21.0 4.0 -21.0 4.0 -20.0 3.0 -20.0" fill="#281c3c" fill-rule="evenodd" stroke="none"/>
  </g>
</svg>
