<?xml version="1.0" encoding="UTF-8" standalone="no"?>
<svg xmlns:xlink="http://www.w3.org/1999/xlink" height="757.4px" width="17.4px" xmlns="http://www.w3.org/2000/svg">
  <g transform="matrix(1.0, 0.0, 0.0, 1.0, -15.0, -20.0)">
    <path d="M23.7 20.0 Q27.3 20.0 29.85 22.55 32.4 25.1 32.4 28.7 32.4 32.3 29.85 34.85 27.3 37.4 23.7 37.4 20.1 37.4 17.55 34.85 15.0 32.3 15.0 28.7 15.0 25.1 17.55 22.55 20.1 20.0 23.7 20.0 M32.4 58.0 L32.35 78.8 Q32.0 81.7 29.85 83.85 27.3 86.4 23.7 86.4 20.1 86.4 17.55 83.85 15.0 81.3 15.0 77.7 L15.0 77.5 15.0 57.7 15.0 57.5 Q15.05 54.05 17.55 51.55 20.1 49.0 23.7 49.0 27.3 49.0 29.85 51.55 32.35 54.05 32.4 57.5 L32.4 57.7 32.4 58.0 M17.55 214.85 Q15.0 212.3 15.0 208.7 15.0 205.1 17.55 202.55 20.1 200.0 23.7 200.0 27.3 200.0 29.85 202.55 32.4 205.1 32.4 208.7 32.4 212.3 29.85 214.85 27.3 217.4 23.7 217.4 20.1 217.4 17.55 214.85 M15.0 337.5 Q15.05 334.05 17.55 331.55 20.1 329.0 23.7 329.0 27.3 329.0 29.85 331.55 32.35 334.05 32.4 337.5 L32.4 337.7 32.4 338.0 32.35 358.8 Q32.0 361.7 29.85 363.85 27.3 366.4 23.7 366.4 20.1 366.4 17.55 363.85 15.0 361.3 15.0 357.7 L15.0 357.5 15.0 337.7 15.0 337.5 M17.55 382.55 Q20.1 380.0 23.7 380.0 27.3 380.0 29.85 382.55 32.4 385.1 32.4 388.7 32.4 392.3 29.85 394.85 27.3 397.4 23.7 397.4 20.1 397.4 17.55 394.85 15.0 392.3 15.0 388.7 15.0 385.1 17.55 382.55 M23.7 560.0 Q27.3 560.0 29.85 562.55 32.4 565.1 32.4 568.7 32.4 572.3 29.85 574.85 27.3 577.4 23.7 577.4 20.1 577.4 17.55 574.85 15.0 572.3 15.0 568.7 15.0 565.1 17.55 562.55 20.1 560.0 23.7 560.0 M29.85 711.55 Q32.35 714.05 32.4 717.5 L32.4 717.7 32.4 718.0 32.35 738.8 Q32.0 741.7 29.85 743.85 27.3 746.4 23.7 746.4 20.1 746.4 17.55 743.85 15.0 741.3 15.0 737.7 L15.0 737.5 15.0 717.7 15.0 717.5 Q15.05 714.05 17.55 711.55 20.1 709.0 23.7 709.0 27.3 709.0 29.85 711.55 M29.85 762.55 Q32.4 765.1 32.4 768.7 32.4 772.3 29.85 774.85 27.3 777.4 23.7 777.4 20.1 777.4 17.55 774.85 15.0 772.3 15.0 768.7 15.0 765.1 17.55 762.55 20.1 760.0 23.7 760.0 27.3 760.0 29.85 762.55" fill="#f4ede3" fill-rule="evenodd" stroke="none"/>
  </g>
</svg>
