<?xml version="1.0" encoding="UTF-8" standalone="no"?>
<svg xmlns:xlink="http://www.w3.org/1999/xlink" height="26.0px" width="14.0px" xmlns="http://www.w3.org/2000/svg">
  <g transform="matrix(1.0, 0.0, 0.0, 1.0, 7.0, 13.0)">
    <pattern height="26" id="PatternID_572_1" overflow="visible" patternTransform="matrix(1.0, 0.0, 0.0, 1.0, -7.0, -13.0)" patternUnits="userSpaceOnUse" viewBox="0 0 14 26" width="14">
      <image height="26" width="14" xlink:href="data:image/PNG;base64,iVBORw0KGgoAAAANSUhEUgAAAA4AAAAaCAYAAACHD21cAAAAn0lEQVR42mNgGAWjYGCBmJTaf3RMUIOJXcx/bACnASBBTX1nuMYrKipgDAIgMRjG0IysEYRBmg49RGgCyYEwikaYJphGkAaYRphmZIPhminSSMipWEPZV1/u/9+ZKUABpf/YogKEzXn5/u8r9garA7Hh/gRpBmmEBQRyoCAMUELVhAgkJRTFqBqV/uNJADTRqEZzjahsvE4Fgv8EMAoAAAJwBK2BvokLAAAAAElFTkSuQmCC"/>
    </pattern>
    <path d="M-7.0 -13.0 L7.0 -13.0 7.0 13.0 -7.0 13.0 -7.0 -13.0" style="fill:url(#PatternID_572_1)"/>
  </g>
</svg>
