<?xml version="1.0" encoding="UTF-8" standalone="no"?>
<svg xmlns:xlink="http://www.w3.org/1999/xlink" height="2.0px" width="2.0px" xmlns="http://www.w3.org/2000/svg">
  <g transform="matrix(1.0, 0.0, 0.0, 1.0, -13.0, 2.0)">
    <path d="M14.0 -1.0 L14.0 0.0 13.0 0.0 13.0 -1.0 14.0 -1.0 14.0 -2.0 15.0 -2.0 15.0 -1.0 14.0 -1.0" fill="#ff3300" fill-rule="evenodd" stroke="none"/>
  </g>
</svg>
