<?xml version="1.0" encoding="UTF-8" standalone="no"?>
<svg xmlns:xlink="http://www.w3.org/1999/xlink" height="4.0px" width="3.0px" xmlns="http://www.w3.org/2000/svg">
  <g transform="matrix(1.0, 0.0, 0.0, 1.0, 0.0, 0.0)">
    <pattern height="4" id="PatternID_619_1" overflow="visible" patternTransform="matrix(1.0, 0.0, 0.0, 1.0, 0.0, 0.0)" patternUnits="userSpaceOnUse" viewBox="0 0 3 4" width="3">
      <image height="4" width="3" xlink:href="data:image/PNG;base64,iVBORw0KGgoAAAANSUhEUgAAAAMAAAAECAYAAABLLYUHAAAAK0lEQVR42mP4DwU7tqz8z2CjIv4fhPcVe/9neNIV9R+E7SV4/zOACDADCABEQhor0wz7nAAAAABJRU5ErkJggg=="/>
    </pattern>
    <path d="M0.0 0.0 L3.0 0.0 3.0 4.0 0.0 4.0 0.0 0.0" style="fill:url(#PatternID_619_1)"/>
  </g>
</svg>
