<?xml version="1.0" encoding="UTF-8" standalone="no"?>
<svg xmlns:xlink="http://www.w3.org/1999/xlink" height="2.0px" width="5.0px" xmlns="http://www.w3.org/2000/svg">
  <g transform="matrix(1.0, 0.0, 0.0, 1.0, -1.0, -1.0)">
    <pattern height="2" id="PatternID_1216_1" overflow="visible" patternTransform="matrix(1.0, 0.0, 0.0, 1.0, 1.0, 1.0)" patternUnits="userSpaceOnUse" viewBox="0 0 5 2" width="5">
      <image height="2" width="5" xlink:href="data:image/PNG;base64,iVBORw0KGgoAAAANSUhEUgAAAAUAAAACCAYAAACQahZdAAAAF0lEQVR42mP4DwQMSADMP3tkL4ogCAAAOAYLRn++u7AAAAAASUVORK5CYII="/>
    </pattern>
    <path d="M1.0 1.0 L6.0 1.0 6.0 3.0 1.0 3.0 1.0 1.0" style="fill:url(#PatternID_1216_1)"/>
  </g>
</svg>
