<?xml version="1.0" encoding="UTF-8" standalone="no"?>
<svg xmlns:xlink="http://www.w3.org/1999/xlink" height="4.45px" width="81.25px" xmlns="http://www.w3.org/2000/svg">
  <g transform="matrix(1.0, 0.0, 0.0, 1.0, 40.8, 2.15)">
    <path d="M-39.85 -0.75 L-40.3 -0.85 -40.2 -0.85 -40.0 -0.8 -39.2 -0.75 -39.8 -0.75 -39.85 -0.75 -40.2 -0.7 -40.3 -0.6 Q-40.3 -0.4 -39.95 -0.45 L-39.45 -0.45 -39.2 -0.4 -38.7 -0.35 -36.8 -0.3 -33.6 -0.3 -33.1 -0.35 -31.1 -0.8 -30.45 -0.9 -29.95 -1.0 -27.85 -1.45 -27.35 -1.5 -23.65 -1.65 -21.9 -1.55 -21.15 -1.45 -19.5 -1.3 -18.0 -1.2 -17.4 -1.15 -16.8 -1.1 -16.15 -1.05 -14.9 -0.9 -14.3 -0.8 -12.9 -0.65 -12.4 -0.55 -10.7 -0.4 -9.8 -0.35 -5.45 -0.05 -4.6 0.05 -3.95 0.15 -1.6 0.75 -1.1 0.9 2.15 1.6 5.1 1.8 9.1 1.8 10.0 1.75 12.95 1.4 15.6 1.0 19.05 0.6 19.8 0.5 21.9 0.2 24.55 -0.1 25.65 -0.15 26.05 -0.2 26.8 -0.25 29.5 -0.25 33.75 -0.3 34.1 -0.25 35.0 0.1 35.35 0.15 37.0 0.35 37.85 0.4 38.6 0.45 38.85 0.5 39.45 0.5 39.95 0.5 M-39.8 -0.75 L-39.7 -0.75 -39.45 -0.75 -39.2 -0.75 M-39.85 -0.75 L-40.0 -0.8" fill="none" stroke="#393987" stroke-linecap="round" stroke-linejoin="round" stroke-width="1.0"/>
  </g>
</svg>
