<?xml version="1.0" encoding="UTF-8" standalone="no"?>
<svg xmlns:xlink="http://www.w3.org/1999/xlink" height="50.75px" width="260.85px" xmlns="http://www.w3.org/2000/svg">
  <g transform="matrix(1.0, 0.0, 0.0, 1.0, -56.35, -4.95)">
    <path d="M302.95 30.75 Q304.5 29.45 305.8 29.45 307.8 29.45 309.0 35.35 310.25 41.25 311.9 41.25 313.15 41.25 314.25 39.0 315.35 36.7 315.95 36.7 316.95 36.7 317.2 37.6 L317.2 38.55 Q317.2 39.55 315.7 41.5 313.9 43.8 311.8 43.8 307.2 43.8 306.75 40.35 L306.55 36.6 Q306.35 34.1 305.6 32.2 303.65 33.6 302.8 38.2 302.05 42.35 301.35 42.35 300.6 42.35 300.0 37.95 299.3 32.95 297.55 31.45 L294.75 31.55 Q292.85 33.1 290.35 39.05 288.5 43.4 284.85 43.4 280.65 43.4 278.5 40.75 L277.6 41.7 Q276.05 43.15 274.3 43.15 271.5 43.15 270.15 41.2 L269.05 38.7 268.7 39.3 268.8 40.0 Q268.8 40.9 267.05 42.45 265.1 44.2 263.0 44.2 259.5 44.2 257.55 41.2 L255.75 36.95 Q254.95 38.75 253.6 40.5 251.1 43.7 248.45 43.7 244.75 43.7 242.45 41.7 240.3 39.85 240.3 37.1 240.3 35.05 241.8 32.35 243.9 28.55 247.55 28.55 248.95 28.55 249.65 29.3 250.05 29.7 250.05 30.05 248.25 30.75 246.45 31.85 242.8 34.0 242.8 37.1 242.8 38.35 243.45 39.35 244.55 41.05 247.15 41.05 252.45 41.05 254.0 33.15 L254.6 28.6 253.45 28.3 252.4 27.6 Q252.6 27.05 254.6 26.55 L254.55 25.2 Q254.55 23.05 254.2 21.15 L253.8 18.25 Q253.8 16.25 255.15 17.15 256.45 18.0 256.9 19.55 L258.5 24.2 258.5 25.85 259.15 25.75 Q265.65 24.9 265.65 26.75 265.65 27.8 262.1 28.4 L258.5 28.8 258.5 36.5 259.45 38.9 Q260.4 40.5 262.2 41.35 L264.0 41.35 265.8 39.8 266.8 39.0 267.4 37.85 Q268.6 35.9 268.5 34.35 268.4 33.25 269.05 30.95 269.45 29.45 270.8 29.45 272.1 29.45 272.1 30.65 272.1 31.45 270.8 35.75 270.8 36.4 271.6 38.2 272.55 40.45 273.55 40.45 275.15 40.45 276.65 39.35 L277.5 38.65 277.0 37.45 Q277.0 29.85 286.05 29.85 287.45 29.85 288.5 31.1 L289.7 32.65 Q292.75 29.7 296.25 29.05 300.4 28.3 301.65 32.2 L302.95 30.75 M285.9 32.75 Q283.9 31.75 283.9 33.8 283.9 34.3 284.85 34.8 285.8 35.45 286.8 35.3 287.9 35.65 287.9 35.0 287.9 33.8 285.9 32.75 M286.8 39.8 L287.35 38.15 287.4 38.0 Q283.4 37.6 281.95 35.75 280.9 34.35 281.4 33.15 280.7 33.3 280.05 34.4 279.45 35.45 279.45 36.15 279.45 37.35 280.15 38.7 281.25 40.8 283.55 40.8 286.05 40.8 286.8 39.8 M268.1 21.1 Q268.1 21.65 268.95 22.5 269.75 23.35 270.6 23.8 L272.2 23.65 272.65 23.0 272.9 22.35 Q272.9 21.5 271.25 21.15 269.2 20.75 268.65 19.85 L268.3 20.35 268.1 21.1 M268.05 18.95 Q269.7 17.75 269.7 18.8 275.25 20.6 275.25 22.2 275.25 23.3 274.45 24.45 273.4 26.05 271.35 26.05 268.75 26.05 267.3 23.9 L266.4 21.8 Q266.4 20.15 268.05 18.95 M211.25 16.2 Q212.9 17.75 213.2 25.75 214.05 34.55 218.6 41.3 L220.95 41.25 Q222.35 39.8 223.55 33.65 224.6 28.15 225.8 28.15 227.05 28.15 227.0 31.45 L226.7 34.75 Q226.7 35.55 227.15 36.85 227.75 38.6 228.55 38.6 230.9 38.6 231.45 33.2 232.05 27.75 233.5 27.75 234.4 27.75 234.4 30.4 L234.25 33.25 Q234.25 35.55 234.5 36.05 235.15 37.25 237.95 37.25 239.1 37.25 239.25 38.25 239.25 38.8 238.5 39.45 237.5 40.4 235.8 40.4 234.5 40.4 233.5 39.6 L232.5 38.6 231.05 40.1 Q229.6 41.3 228.7 41.3 227.1 41.3 226.45 40.85 L225.4 39.85 224.3 42.1 Q222.95 43.85 219.6 43.85 215.85 43.85 214.5 40.9 213.65 37.45 213.05 36.3 L211.95 39.6 Q210.45 42.35 207.6 42.35 204.8 42.35 203.4 39.8 L202.6 37.15 202.7 35.65 199.35 35.9 Q199.35 37.6 198.25 39.65 196.7 42.55 194.1 42.55 190.85 42.55 189.45 39.65 L188.8 36.7 Q188.8 34.15 192.15 31.7 195.95 28.9 199.3 32.75 L203.55 32.4 Q205.0 29.6 208.25 29.6 L209.7 29.75 210.9 30.1 210.9 28.95 Q209.95 27.1 209.7 24.8 L209.65 20.75 Q209.65 14.6 211.25 16.2 M205.15 34.7 Q205.0 35.2 205.0 35.75 L205.25 37.8 Q205.7 39.75 206.95 39.75 209.0 39.75 210.05 37.1 L210.9 33.6 210.9 31.7 Q207.8 30.85 206.15 32.9 L206.15 33.25 Q206.15 34.0 205.15 34.7 M181.8 30.65 L175.75 30.5 Q176.4 35.3 174.7 38.4 173.0 41.6 169.5 41.6 164.4 41.6 163.55 38.0 163.4 32.9 162.65 30.0 157.15 28.95 157.15 40.7 157.15 43.95 157.75 46.75 158.35 49.55 158.35 52.85 L158.35 54.9 158.1 55.7 156.4 55.7 Q155.45 54.15 154.65 47.85 L153.05 34.85 152.9 34.6 150.65 38.9 Q148.5 42.15 146.25 42.15 144.35 42.15 143.45 40.95 L142.9 39.75 143.0 39.35 143.05 39.45 143.05 39.3 143.45 39.2 Q143.8 39.2 144.2 39.6 144.55 40.0 145.0 40.0 148.75 40.0 150.65 32.6 151.85 27.85 151.85 23.65 151.85 19.8 153.05 20.45 154.2 21.1 154.65 24.3 155.45 28.2 155.45 32.65 L156.5 29.85 Q158.15 27.35 161.95 27.35 165.85 27.35 165.85 33.15 165.85 36.35 166.05 37.15 166.5 38.95 168.1 38.95 L170.9 38.85 Q172.55 37.4 173.0 35.75 L173.1 32.9 Q173.1 30.75 172.4 28.8 171.65 26.9 171.65 26.4 171.65 24.7 173.05 24.7 174.25 24.7 174.5 25.2 L174.55 26.3 Q174.8 27.85 179.55 27.85 182.7 27.85 183.4 26.4 184.1 24.85 184.85 24.85 185.8 24.85 186.15 25.7 L186.25 26.65 185.1 30.6 Q183.95 34.7 183.95 35.8 183.95 38.0 186.45 38.75 188.95 39.5 188.95 40.0 188.95 40.7 188.25 41.2 187.3 41.9 185.4 41.9 182.4 41.9 181.55 38.95 L181.25 35.9 181.8 30.65 M192.55 34.25 Q191.25 35.9 191.25 36.7 191.25 37.75 191.8 38.7 192.55 40.0 194.0 40.0 195.45 40.0 196.3 38.0 L196.95 35.9 195.6 35.55 Q194.3 35.15 194.3 32.55 193.75 32.6 192.55 34.25 M124.25 36.45 Q126.25 36.45 126.3 37.95 126.3 38.65 124.8 39.45 122.85 40.5 119.95 40.5 117.3 40.5 116.25 39.7 115.15 38.8 114.9 38.8 L113.1 39.7 Q111.3 40.5 110.35 40.5 106.0 40.5 104.3 34.05 103.4 27.6 102.7 27.6 98.85 27.6 99.25 33.75 L99.6 37.95 Q99.5 39.85 98.2 39.85 96.75 39.85 96.05 33.65 95.35 27.4 93.35 27.4 91.75 27.4 90.85 29.15 90.5 29.85 89.5 33.05 87.8 38.7 83.8 38.7 78.6 38.7 77.05 35.3 76.5 34.2 76.4 32.8 L76.35 31.3 Q75.9 33.95 75.0 35.75 73.25 39.05 68.95 39.05 64.2 39.05 62.75 34.65 L62.25 30.15 Q62.25 19.5 65.0 11.2 L65.0 7.85 64.75 7.55 Q62.55 7.1 60.25 9.3 58.3 11.15 58.3 12.0 58.3 12.35 58.6 12.5 L58.85 12.7 Q58.6 13.4 58.15 13.4 56.35 13.4 56.35 11.4 56.35 9.75 58.1 7.9 59.8 6.15 62.0 5.4 64.35 4.55 65.9 5.4 67.65 6.45 67.65 9.65 67.65 10.95 66.3 17.05 65.0 23.2 65.0 30.15 65.0 32.7 65.15 33.3 65.6 35.15 67.5 36.15 L70.25 36.15 Q75.2 30.2 75.3 22.75 75.3 18.1 75.7 14.7 76.35 9.7 77.65 9.7 78.7 9.7 78.9 10.8 L78.9 11.95 78.55 19.05 Q78.2 23.9 78.2 26.15 78.2 28.75 78.95 31.45 80.15 36.1 82.95 36.1 85.1 36.1 86.35 34.35 L88.05 30.4 Q90.05 24.7 93.55 24.7 94.9 24.7 96.15 26.0 L97.55 27.65 98.7 26.25 Q100.15 24.95 102.25 24.95 105.8 24.95 106.6 31.45 107.05 34.9 107.35 35.85 108.05 37.9 109.75 37.9 112.8 37.9 113.35 36.3 L113.05 35.0 Q112.7 34.0 112.7 33.65 112.7 30.05 112.85 29.2 113.45 25.5 115.95 25.5 119.0 25.5 120.15 27.85 120.7 29.05 120.65 30.25 120.65 31.8 119.7 33.3 L117.35 36.6 Q117.7 36.8 117.7 37.15 L120.0 37.4 Q122.2 37.4 123.0 36.9 123.8 36.45 124.25 36.45 M152.2 49.25 L154.15 49.25 Q153.75 49.85 152.9 49.85 152.55 49.85 152.2 49.25 M116.75 28.0 Q115.35 27.65 115.35 29.5 115.35 32.45 115.8 34.05 L117.3 32.0 Q118.1 30.8 118.1 30.0 118.1 28.35 116.75 28.0" fill="#ffffff" fill-rule="evenodd" stroke="none"/>
  </g>
</svg>
