<?xml version="1.0" encoding="UTF-8" standalone="no"?>
<svg xmlns:xlink="http://www.w3.org/1999/xlink" height="9.0px" width="8.0px" xmlns="http://www.w3.org/2000/svg">
  <g transform="matrix(1.0, 0.0, 0.0, 1.0, 7.0, 15.0)">
    <pattern height="9" id="PatternID_190_1" overflow="visible" patternTransform="matrix(1.0, 0.0, 0.0, 1.0, -7.0, -15.0)" patternUnits="userSpaceOnUse" viewBox="0 0 8 9" width="8">
      <image height="9" width="8" xlink:href="data:image/PNG;base64,iVBORw0KGgoAAAANSUhEUgAAAAgAAAAJCAYAAAAPU20uAAAAT0lEQVR42mNggIL/SGD/pZv/GZABSNA9swwFoyhC1w3DGCbAaJBk7aINmCbAJLEqwGsCTBGIxpBUlbTIAeE1h8/+B2GQJAiDxFBMgClExwBRW4xstIxKIgAAAABJRU5ErkJggg=="/>
    </pattern>
    <path d="M1.0 -6.0 L-7.0 -6.0 -7.0 -15.0 1.0 -15.0 1.0 -6.0" style="fill:url(#PatternID_190_1)"/>
  </g>
</svg>
