<?xml version="1.0" encoding="UTF-8" standalone="no"?>
<svg xmlns:xlink="http://www.w3.org/1999/xlink" height="39.55px" width="32.0px" xmlns="http://www.w3.org/2000/svg">
  <g transform="matrix(1.0, 0.0, 0.0, 1.0, 41.0, 15.5)">
    <path d="M-9.0 24.05 L-41.0 8.0 -41.0 -15.5 -9.0 0.5 -9.0 24.05" fill="#0000ff" fill-rule="evenodd" stroke="none"/>
  </g>
</svg>
