<?xml version="1.0" encoding="UTF-8" standalone="no"?>
<svg xmlns:xlink="http://www.w3.org/1999/xlink" height="41.7px" width="322.8px" xmlns="http://www.w3.org/2000/svg">
  <g transform="matrix(1.0, 0.0, 0.0, 1.0, -24.3, 16.0)">
    <path d="M201.0 -13.7 Q202.05 -12.75 202.45 -11.05 202.85 -9.4 201.2 -6.9 199.6 -4.35 197.5 -4.55 195.35 -4.8 195.35 -5.8 L197.0 -7.05 Q198.75 -8.45 199.3 -9.45 200.25 -11.15 200.2 -11.75 L199.95 -13.35 Q199.95 -14.7 201.0 -13.7 M224.2 -0.4 L223.5 -5.3 Q223.5 -7.5 224.1 -8.1 224.65 -8.6 225.4 -7.55 226.95 -5.3 227.2 -0.8 L231.75 -1.85 233.75 -1.95 Q234.4 -1.65 234.4 -0.3 234.4 0.35 232.55 1.35 L231.75 1.7 Q229.15 2.9 227.3 3.0 L227.15 6.4 Q227.05 10.0 228.55 12.25 232.9 11.9 234.85 10.55 L235.8 9.65 Q236.2 9.25 236.55 9.25 L237.0 9.3 Q237.25 7.9 238.0 6.15 239.55 1.9 242.3 1.9 245.4 1.9 246.35 3.9 246.8 4.9 246.7 6.0 246.7 7.0 245.5 8.75 244.05 10.9 242.45 10.9 241.1 10.9 240.0 9.8 239.85 11.35 240.2 12.15 240.85 13.65 243.05 13.65 246.55 13.65 248.55 7.95 L249.85 4.05 Q250.45 2.25 251.05 2.25 252.85 2.25 252.85 5.4 252.9 9.55 253.4 10.25 L255.8 10.25 Q256.85 9.25 258.3 4.5 258.9 2.35 259.7 1.35 260.35 0.5 261.1 0.5 262.0 0.5 262.4 1.35 L262.6 2.05 262.25 4.3 261.85 6.55 261.9 7.95 Q262.15 8.95 262.85 9.6 L266.6 9.6 268.35 7.4 Q269.3 5.9 269.3 5.05 269.3 4.35 268.35 3.2 267.35 2.0 267.35 1.65 L267.4 1.35 Q267.45 0.75 267.9 0.4 268.35 0.05 268.95 0.05 L270.65 0.5 272.4 0.95 Q273.7 0.95 275.45 0.1 L278.05 -1.4 Q279.4 -2.05 279.95 -1.75 280.65 -1.4 280.65 0.6 L280.55 1.35 Q280.25 3.35 278.4 8.95 L280.85 9.4 Q282.25 9.4 284.1 6.1 L285.65 2.75 285.3 1.55 285.2 1.35 284.9 0.35 Q284.9 -1.4 286.4 -1.4 289.35 -1.4 292.65 1.35 L293.85 2.5 Q297.35 5.9 297.35 7.75 297.35 10.0 296.15 11.7 294.2 14.55 289.35 14.55 285.3 14.55 284.45 13.5 284.2 13.15 284.2 12.6 L284.1 11.9 282.3 12.6 280.65 13.0 Q276.6 13.0 275.5 11.25 275.1 10.65 275.1 9.1 L275.3 6.65 276.1 3.65 276.1 3.35 275.5 4.05 272.25 4.5 Q272.25 7.05 271.05 9.25 269.1 12.8 264.85 12.8 261.45 12.8 260.45 11.95 L260.0 10.9 258.3 12.55 Q256.95 13.65 254.45 13.65 251.75 13.65 251.25 13.2 251.15 12.5 250.65 12.1 L248.1 14.75 Q245.8 17.0 243.05 17.0 238.8 17.0 237.4 14.0 237.1 13.4 236.95 12.65 L236.3 13.4 Q234.15 15.5 230.2 15.5 226.3 15.5 225.15 13.95 224.8 13.5 224.7 12.75 L224.55 11.9 222.6 13.85 Q220.8 15.5 219.45 15.5 215.95 15.5 215.0 14.45 214.5 13.25 213.75 13.0 L212.25 14.9 Q210.8 16.55 209.6 16.55 207.4 16.55 206.3 14.3 L205.65 11.95 Q205.65 8.45 206.45 6.85 207.9 3.65 212.55 3.65 L212.9 2.85 Q213.25 1.95 214.25 1.95 215.45 1.95 215.7 3.6 L215.6 7.2 Q215.45 12.35 218.7 12.35 223.85 12.35 224.2 3.45 L224.2 2.85 Q222.55 2.7 222.25 2.25 L221.95 1.65 221.6 1.35 220.9 1.15 Q221.55 0.25 222.25 -0.1 L224.2 -0.4 M294.05 7.75 Q294.05 6.3 292.75 5.55 L288.6 3.65 288.7 4.25 Q288.55 5.45 287.5 7.2 L285.45 10.05 286.1 10.55 287.3 10.9 291.8 10.85 293.75 9.25 Q294.05 8.9 294.05 7.75 M242.6 6.95 L243.5 6.0 Q242.55 4.2 241.55 5.8 240.6 7.2 240.7 7.95 241.7 7.75 242.6 6.95 M212.75 6.1 Q210.4 5.6 209.35 7.2 208.55 8.3 208.55 9.65 208.55 11.5 209.05 12.9 L209.35 13.2 Q211.15 12.15 211.95 9.85 L212.75 6.15 212.75 6.1 M205.45 11.35 Q205.45 12.45 203.85 13.85 201.5 15.95 196.9 15.95 192.95 15.95 191.45 13.7 L190.85 12.35 Q190.6 13.2 189.6 14.0 187.85 15.5 185.0 15.5 179.9 15.5 178.85 12.55 178.55 11.6 178.6 10.1 L178.8 8.0 173.85 8.6 171.7 11.95 Q169.2 14.85 165.15 14.85 158.8 14.85 156.55 10.9 155.9 9.7 155.65 8.2 L155.65 6.9 Q155.65 5.1 156.4 3.35 157.0 1.95 157.95 1.35 158.8 0.75 159.85 0.75 L163.05 1.2 163.4 1.35 165.15 2.35 159.75 4.75 Q158.25 5.4 158.25 7.0 158.25 8.85 159.25 10.1 160.9 12.1 165.15 12.1 168.35 12.1 170.25 9.75 171.25 8.55 171.55 7.3 171.55 7.05 170.75 5.9 L169.95 4.5 170.05 2.25 170.45 1.35 Q170.95 0.6 172.0 0.6 172.85 0.6 173.45 1.35 L174.15 2.7 174.6 5.1 177.3 5.1 180.95 1.35 181.1 1.2 Q183.8 -1.15 184.15 1.35 L184.2 2.1 Q184.2 2.65 183.05 4.6 181.95 6.6 181.95 7.85 181.95 9.45 182.1 9.9 182.45 11.05 183.85 12.25 186.35 11.95 187.65 11.3 188.75 10.7 189.7 10.7 L190.7 10.85 Q190.8 3.15 193.65 1.35 194.25 0.95 195.0 0.85 196.15 0.7 197.15 1.35 L198.0 2.05 Q199.35 3.5 199.35 5.55 199.35 7.5 198.6 8.55 197.35 10.3 193.75 10.15 L193.75 11.2 Q193.85 12.0 194.85 12.45 L199.25 12.45 202.05 10.95 Q203.8 10.0 204.15 10.0 204.95 10.0 205.25 10.6 L205.45 11.35 M195.25 4.05 Q194.85 5.65 194.05 7.3 L194.05 7.4 Q196.35 7.55 196.35 5.7 196.35 4.65 195.25 4.05" fill="#ffffff" fill-rule="evenodd" stroke="none"/>
    <path d="M33.75 -3.5 Q34.2 1.9 34.7 2.75 38.2 -1.0 40.95 -1.0 44.25 -1.0 44.35 2.5 L44.25 5.4 Q44.15 7.1 44.55 7.75 L48.1 7.7 48.65 6.95 Q48.9 6.7 49.55 6.6 L49.6 6.3 Q49.6 4.2 50.9 2.35 53.0 -0.65 57.9 -0.65 58.7 -0.65 59.0 0.8 L59.45 4.0 Q60.0 8.6 62.35 8.6 63.8 8.6 65.2 6.2 L66.3 3.7 64.95 2.3 Q63.65 1.15 63.65 0.3 63.65 -1.85 65.0 -2.1 66.6 -2.4 68.6 0.85 L72.0 0.85 Q73.8 0.1 74.75 -1.05 75.45 -1.85 76.25 -1.85 77.8 -1.85 77.8 -0.35 L77.1 1.85 Q76.35 3.85 76.35 4.35 76.35 5.35 77.35 6.2 78.55 7.2 80.35 7.2 L81.95 6.85 83.55 6.45 Q84.3 6.45 84.65 7.05 L84.8 7.75 Q84.8 8.45 83.2 9.45 81.55 10.4 80.35 10.4 75.85 10.4 74.3 7.3 73.8 6.35 73.55 5.0 L73.35 3.55 Q72.5 4.05 69.25 4.25 L67.4 8.4 Q65.5 11.4 62.7 11.4 60.1 11.4 58.65 9.8 L57.65 8.15 56.45 9.6 Q55.3 10.6 54.1 10.6 51.5 10.6 50.4 9.3 L50.25 9.45 Q48.8 10.65 45.95 10.65 40.45 10.65 40.35 7.45 40.25 6.45 40.8 4.6 L41.3 2.05 41.3 1.75 Q37.25 3.55 36.4 5.05 36.1 5.6 36.1 8.25 36.1 10.9 36.8 15.55 37.5 20.2 37.5 24.1 37.5 24.8 37.05 25.2 36.55 25.7 35.75 25.7 33.95 25.7 33.0 17.2 32.45 12.5 31.8 3.8 L29.6 6.8 Q27.15 9.75 25.85 9.75 L24.9 9.7 24.6 9.6 24.5 9.55 Q24.3 9.45 24.3 8.9 L27.5 5.75 Q30.65 1.95 30.65 -2.55 33.05 -7.3 33.75 -3.5 M110.0 -16.0 Q111.7 -16.0 112.9 -13.0 114.2 -9.75 114.2 -4.3 114.2 -1.75 112.65 1.65 L111.05 5.3 Q111.05 5.9 112.95 8.9 115.0 12.15 116.3 12.7 L118.6 12.7 118.65 12.5 118.95 12.15 117.1 8.9 Q116.9 8.45 116.9 6.4 116.9 4.6 117.25 3.8 117.85 2.05 119.95 2.05 124.3 2.05 124.65 5.6 124.85 7.6 123.65 10.65 L123.9 10.95 Q127.55 11.9 129.3 7.85 130.15 5.85 130.35 3.3 L129.9 1.75 129.5 0.2 Q129.5 -0.65 129.95 -1.15 130.4 -1.75 131.35 -1.75 136.9 -1.75 139.8 2.9 141.3 5.2 141.65 7.6 141.65 9.6 140.05 11.95 137.8 15.4 133.55 15.4 131.3 15.4 129.6 14.55 L127.9 13.7 Q124.2 13.7 121.3 14.9 118.4 16.05 117.2 16.05 112.1 16.05 110.15 12.75 109.5 11.65 109.25 10.2 L108.95 8.5 106.6 9.85 103.65 11.25 101.9 10.95 101.75 10.8 Q101.6 10.65 101.6 10.1 101.6 9.55 104.55 7.9 107.45 6.25 107.45 4.9 L106.6 1.7 Q105.75 -1.4 105.75 -4.15 105.75 -9.8 107.1 -13.1 108.25 -16.0 110.0 -16.0 M108.95 -4.05 Q108.95 -0.9 109.65 0.85 110.95 -1.75 110.95 -7.85 L110.75 -9.85 Q110.5 -11.25 110.1 -11.9 L110.1 -11.85 Q109.25 -10.4 109.0 -7.95 L108.95 -4.05 M323.4 -9.9 L324.1 -1.05 Q324.6 4.15 327.25 7.7 L330.6 7.7 Q331.25 7.45 332.35 6.6 331.75 6.1 331.3 4.8 330.85 3.7 330.85 2.95 330.85 0.7 331.3 -0.95 332.35 -4.55 335.05 -4.55 338.4 -4.55 339.15 -1.15 L339.35 1.25 339.25 2.4 Q339.25 3.55 338.85 4.05 338.1 4.95 337.55 6.6 L342.1 6.7 345.15 6.5 Q346.45 6.5 346.9 7.3 L347.1 8.25 Q347.1 9.3 345.5 10.05 344.05 10.65 341.95 10.65 L338.0 9.95 335.1 9.2 Q334.95 9.2 332.75 10.3 330.5 11.4 328.95 11.4 324.45 11.4 322.65 8.75 322.05 7.85 321.8 6.8 L321.65 5.75 320.1 8.5 Q318.55 10.85 316.1 10.85 313.05 10.85 312.0 7.8 311.45 6.3 311.5 4.65 311.5 1.9 312.15 0.8 313.8 -1.9 319.15 -1.3 320.05 -9.45 320.45 -11.25 321.75 -17.3 323.4 -9.9 M335.35 -1.4 Q334.8 -1.05 334.35 0.05 L333.9 1.3 Q333.9 2.5 334.85 4.35 335.65 4.05 336.0 2.5 L336.2 0.25 335.9 -0.85 335.35 -1.4 M314.8 6.05 Q315.0 7.05 315.9 7.6 317.45 6.8 318.15 4.8 L318.85 1.45 Q315.8 0.65 314.95 2.3 314.7 2.85 314.7 4.6 L314.8 6.05 M132.9 7.25 Q132.55 9.7 131.05 11.4 L132.1 11.95 135.1 11.9 Q138.5 9.2 138.5 7.7 138.5 6.4 137.15 5.15 135.75 3.75 133.5 3.0 L132.9 7.25 M120.75 9.0 L121.0 7.35 120.75 6.1 Q120.45 5.5 120.05 5.45 120.05 7.8 120.75 9.0 M56.6 2.3 Q53.7 1.5 52.6 3.5 51.95 4.55 51.95 6.05 51.95 7.2 52.2 7.45 52.45 7.85 53.25 7.85 55.3 7.85 56.05 6.2 L56.6 3.85 56.6 2.3" fill="#ffffff" fill-rule="evenodd" stroke="none"/>
  </g>
</svg>
