<?xml version="1.0" encoding="UTF-8" standalone="no"?>
<svg xmlns:xlink="http://www.w3.org/1999/xlink" height="3.0px" width="2.0px" xmlns="http://www.w3.org/2000/svg">
  <g transform="matrix(1.0, 0.0, 0.0, 1.0, -0.15, 1.0)">
    <pattern height="3" id="PatternID_504_1" overflow="visible" patternTransform="matrix(1.0, 0.0, 0.0, 1.0, 0.15, -1.0)" patternUnits="userSpaceOnUse" viewBox="0 0 2 3" width="2">
      <image height="3" width="2" xlink:href="data:image/PNG;base64,iVBORw0KGgoAAAANSUhEUgAAAAIAAAADCAIAAAA2iEnWAAAAFklEQVR42mPYysAARAyJbGxAxADhAQAqQgOvdkAy8QAAAABJRU5ErkJggg=="/>
    </pattern>
    <path d="M2.15 -1.0 L2.15 2.0 0.15 2.0 0.15 -1.0 2.15 -1.0" style="fill:url(#PatternID_504_1)"/>
  </g>
</svg>
