<?xml version="1.0" encoding="UTF-8" standalone="no"?>
<svg xmlns:xlink="http://www.w3.org/1999/xlink" height="24.0px" width="14.0px" xmlns="http://www.w3.org/2000/svg">
  <g transform="matrix(1.0, 0.0, 0.0, 1.0, 0.0, 24.0)">
    <pattern height="24" id="PatternID_1246_1" overflow="visible" patternTransform="matrix(1.0, 0.0, 0.0, 1.0, 0.0, -24.0)" patternUnits="userSpaceOnUse" viewBox="0 0 14 24" width="14">
      <image height="24" width="14" xlink:href="data:image/PNG;base64,iVBORw0KGgoAAAANSUhEUgAAAA4AAAAYCAYAAADKx8xXAAAAQUlEQVR42mNgIBHw/Gf4D8IkayBaI7oGghpxacCpkZAGDI3EaoBrJFXDqMZRjUNFI/nZiOwMS3bRQHYhRHZxBwUAWZAB9xoK6UUAAAAASUVORK5CYII="/>
    </pattern>
    <path d="M14.0 -24.0 L14.0 0.0 0.0 0.0 0.0 -24.0 14.0 -24.0" style="fill:url(#PatternID_1246_1)"/>
  </g>
</svg>
