<?xml version="1.0" encoding="UTF-8" standalone="no"?>
<svg xmlns:xlink="http://www.w3.org/1999/xlink" height="15.0px" width="19.0px" xmlns="http://www.w3.org/2000/svg">
  <g transform="matrix(1.0, 0.0, 0.0, 1.0, 0.0, 2.0)">
    <pattern height="15" id="PatternID_1570_1" overflow="visible" patternTransform="matrix(-1.0, 0.0, 0.0, 1.0, 19.0, -2.0)" patternUnits="userSpaceOnUse" viewBox="0 0 19 15" width="19">
      <image height="15" width="19" xlink:href="data:image/PNG;base64,iVBORw0KGgoAAAANSUhEUgAAABMAAAAPCAYAAAAGRPQsAAAAbUlEQVR42mNgwANMneP/wzADOQDZgCefv8MxyQajG4ALEzQUJLl6036iDIMZSBWD0A38n8DwH4QpNgzFIGoYhmEQDJPjTYoNA6klaBgxBmI1CJ+B6Iaiy5FsGC5MMBcQYyDJ2QldI9mZndJSAgA2DT39oZNJJgAAAABJRU5ErkJggg=="/>
    </pattern>
    <path d="M0.0 -2.0 L19.0 -2.0 19.0 13.0 0.0 13.0 0.0 -2.0" style="fill:url(#PatternID_1570_1)"/>
  </g>
</svg>
