<?xml version="1.0" encoding="UTF-8" standalone="no"?>
<svg xmlns:xlink="http://www.w3.org/1999/xlink" height="11.4px" width="534.05px" xmlns="http://www.w3.org/2000/svg">
  <g transform="matrix(1.0, 0.0, 0.0, 1.0, 1.35, 1.35)">
    <path d="M0.7 -0.05 Q0.7 0.85 0.0 0.8 -0.15 0.65 -0.4 0.6 -1.15 0.25 -0.65 -0.25 -0.2 -0.55 0.65 -0.25 L0.7 -0.05 M532.2 0.3 L372.1 0.35 372.0 0.35 371.6 0.15 Q370.85 -0.2 371.35 -0.7 371.8 -1.0 372.65 -0.7 L372.7 -0.5 Q372.7 0.35 372.1 0.35 M0.1 1.35 L394.3 0.9 394.8 1.0 394.9 1.05 395.6 1.55 396.65 2.85 Q397.15 3.6 397.15 4.5 397.2 6.5 397.55 8.35 L397.85 9.55" fill="none" stroke="#393987" stroke-linecap="round" stroke-linejoin="round" stroke-width="1.0"/>
  </g>
</svg>
