<?xml version="1.0" encoding="UTF-8" standalone="no"?>
<svg xmlns:xlink="http://www.w3.org/1999/xlink" height="11.9px" width="83.7px" xmlns="http://www.w3.org/2000/svg">
  <g transform="matrix(1.0, 0.0, 0.0, 1.0, 43.0, 1.95)">
    <path d="M-41.5 -0.75 L-41.55 -0.6 -41.9 -0.5 -42.5 -0.6 -42.35 -0.7 -41.5 -0.75 -41.15 -0.35 -40.9 -0.3 -40.45 -0.25 -38.35 -0.3 -37.9 -0.35 -35.95 -0.45 -34.85 -0.55 -34.15 -0.6 -32.3 -0.7 -31.7 -0.75 -29.05 -0.75 -24.7 -0.75 -19.5 -0.75 -18.4 -0.7 -17.9 -0.65 -16.2 -0.5 -14.9 -0.4 -14.3 -0.35 -13.55 -0.3 -12.1 -0.25 -7.5 -0.2 -5.45 -0.15 -1.2 -0.2 1.0 -0.2 3.3 -0.3 4.0 -0.35 6.8 -0.5 10.3 -0.7 11.05 -0.75 13.45 -0.95 14.3 -1.05 18.65 -1.15 22.55 -1.1 25.3 -1.1 27.4 -1.15 28.35 -1.2 29.05 -1.25 31.25 -1.3 33.7 -1.3 37.2 -1.4 38.5 -1.45 40.2 -1.35 M-8.85 8.95 Q-6.9 8.6 -4.95 8.9 L-3.85 8.95 0.0 9.15 0.6 9.25 3.5 9.35 3.9 9.4 4.5 9.45 6.05 9.4 6.55 9.35 7.5 9.3 8.85 9.1 9.2 9.05 9.7 8.95" fill="none" stroke="#393987" stroke-linecap="round" stroke-linejoin="round" stroke-width="1.0"/>
  </g>
</svg>
