<?xml version="1.0" encoding="UTF-8" standalone="no"?>
<svg xmlns:xlink="http://www.w3.org/1999/xlink" height="147.2px" width="380.0px" xmlns="http://www.w3.org/2000/svg">
  <g transform="matrix(1.0, 0.0, 0.0, 1.0, -57.25, -57.3)">
    <path d="M437.25 86.5 Q437.25 92.8 431.8 100.05 423.7 110.75 408.5 110.75 396.6 110.75 391.55 103.05 390.2 104.35 388.0 105.5 380.9 109.35 372.95 108.45 L369.2 107.55 370.5 107.25 367.95 107.25 366.5 107.0 366.5 107.2 Q353.7 106.8 349.5 103.7 343.05 108.75 332.5 108.75 321.3 108.75 316.6 104.7 312.1 111.0 303.0 111.0 290.65 111.0 285.15 102.75 280.8 110.0 273.0 110.0 269.5 110.0 260.65 98.55 256.1 105.75 247.5 105.75 239.45 105.75 237.45 99.8 232.45 109.0 220.0 109.0 214.4 109.0 211.05 103.0 205.6 109.0 197.5 109.0 187.3 109.0 181.8 103.55 172.25 114.0 147.5 114.0 134.9 114.0 131.15 109.65 L127.0 109.75 Q111.85 109.75 105.55 96.25 103.55 92.0 102.7 86.95 L102.25 82.75 Q102.25 72.6 108.95 66.45 114.85 61.05 123.75 60.25 132.3 59.45 138.55 63.2 L139.15 63.55 139.4 63.4 Q148.55 58.45 159.0 57.8 171.2 57.1 178.6 63.25 180.3 64.7 181.7 66.45 L183.9 64.95 Q190.5 60.9 198.5 60.15 207.5 59.35 213.1 63.6 214.25 64.45 215.2 65.55 219.1 60.55 223.9 58.45 230.8 55.45 235.3 60.45 236.75 62.05 237.8 64.35 L237.95 64.2 Q240.85 61.15 244.55 59.8 254.85 56.05 261.0 68.25 262.0 69.35 262.7 73.75 L277.25 72.8 Q283.3 72.15 285.0 72.75 286.15 73.15 286.9 74.35 L287.7 73.45 Q292.95 67.95 300.75 69.05 307.75 70.0 312.85 75.75 314.55 74.1 317.15 72.55 324.55 68.1 334.0 66.9 344.3 65.55 350.85 69.15 354.7 71.25 356.6 74.8 363.1 68.15 371.75 66.4 381.75 64.4 388.4 70.35 390.75 72.45 392.35 75.3 393.85 72.75 395.9 70.6 402.75 63.4 412.75 62.7 422.65 62.0 429.6 68.0 437.25 74.6 437.25 86.5 M337.2 147.65 Q342.75 152.7 342.75 164.75 342.75 172.55 339.0 181.3 332.75 195.75 319.5 195.75 311.7 195.75 306.1 194.4 L306.0 194.5 Q299.9 202.0 291.5 202.0 276.15 202.0 271.1 186.75 264.65 199.25 252.0 199.25 245.6 199.25 239.75 187.05 L239.1 185.6 Q233.6 194.0 221.5 194.0 217.1 194.0 214.05 190.4 L214.5 190.9 Q212.75 191.6 210.0 191.6 207.4 191.6 205.25 189.5 L204.75 189.0 205.65 188.75 Q199.85 190.5 192.5 190.5 186.45 190.5 182.15 188.5 L180.55 191.0 Q173.05 202.0 160.5 202.0 147.75 202.0 138.7 185.4 L135.75 188.0 Q125.95 195.75 111.5 195.75 104.3 195.75 100.2 193.8 92.5 204.5 78.0 204.5 65.65 204.5 60.2 191.65 58.5 187.6 57.7 182.7 L57.25 178.5 Q57.25 167.25 64.9 160.3 71.8 154.05 81.75 153.6 87.65 153.35 92.5 155.25 94.4 153.75 97.3 152.3 106.0 147.95 116.15 147.9 127.4 147.85 134.45 153.75 L134.5 153.5 Q135.3 149.5 144.75 147.55 156.05 145.2 171.5 149.0 174.35 151.5 176.65 154.15 181.65 151.0 191.5 151.0 194.0 151.0 198.25 148.75 203.7 145.85 205.15 145.4 211.8 143.25 215.75 152.0 L215.75 151.85 Q215.75 147.9 220.05 147.45 223.95 147.05 229.5 149.55 235.15 152.1 238.95 156.1 L241.5 159.3 242.8 158.7 250.5 156.5 Q255.7 155.15 259.0 153.25 269.3 147.35 273.4 153.6 274.45 152.7 275.75 152.05 281.75 149.0 290.0 152.15 297.8 155.1 303.15 162.0 304.9 160.8 306.85 160.1 310.25 158.75 311.6 159.7 L312.75 157.45 Q317.7 148.8 324.95 145.95 332.15 143.1 337.2 147.65 M240.1 73.6 L240.35 76.25 242.5 73.75 242.75 73.0 240.1 73.6 M170.0 175.75 Q169.5 176.0 168.0 180.5 L168.25 180.75 Q168.95 179.85 169.5 178.25 L170.0 175.75 M217.05 155.4 L217.25 155.25 216.9 154.9 217.05 155.4" fill="#00ff00" fill-rule="evenodd" stroke="none"/>
  </g>
</svg>
