<?xml version="1.0" encoding="UTF-8" standalone="no"?>
<svg xmlns:xlink="http://www.w3.org/1999/xlink" height="8.0px" width="12.0px" xmlns="http://www.w3.org/2000/svg">
  <g transform="matrix(1.0, 0.0, 0.0, 1.0, 9.0, 4.0)">
    <pattern height="8" id="PatternID_1221_1" overflow="visible" patternTransform="matrix(1.0, 0.0, 0.0, 1.0, -9.0, -4.0)" patternUnits="userSpaceOnUse" viewBox="0 0 12 8" width="12">
      <image height="8" width="12" xlink:href="data:image/PNG;base64,iVBORw0KGgoAAAANSUhEUgAAAAwAAAAICAYAAADN5B7xAAAAQklEQVR42mNggII/f/6sg2EGQgCk6NevX1kwjFcTsuL/QEBQE7rp6DZh1YjNSTCFs5TV/iNjBkKexqmBGADyI8kaAHw9iqWH8pFhAAAAAElFTkSuQmCC"/>
    </pattern>
    <path d="M3.0 0.0 L-1.95 0.0 -1.95 3.6 -1.85 3.6 -1.85 4.0 -9.0 4.0 -9.0 -4.0 3.0 -4.0 3.0 0.0" style="fill:url(#PatternID_1221_1)"/>
  </g>
</svg>
