<?xml version="1.0" encoding="UTF-8" standalone="no"?>
<svg xmlns:xlink="http://www.w3.org/1999/xlink" height="56.7px" width="217.5px" xmlns="http://www.w3.org/2000/svg">
  <g transform="matrix(1.0, 0.0, 0.0, 1.0, -102.25, -57.3)">
    <path d="M262.7 73.75 L277.25 72.8 Q283.3 72.15 285.0 72.75 286.15 73.15 286.9 74.35 L287.7 73.45 Q292.95 67.95 300.75 69.05 308.4 70.1 313.8 76.85 319.75 84.25 319.75 95.1 319.75 100.1 316.7 104.5 312.25 111.0 303.0 111.0 290.65 111.0 285.15 102.75 280.8 110.0 273.0 110.0 269.5 110.0 260.65 98.55 256.1 105.75 247.5 105.75 239.45 105.75 237.45 99.8 232.45 109.0 220.0 109.0 214.4 109.0 211.05 103.0 205.6 109.0 197.5 109.0 187.3 109.0 181.8 103.55 172.25 114.0 147.5 114.0 134.9 114.0 131.15 109.65 L127.0 109.75 Q111.85 109.75 105.55 96.25 103.55 92.0 102.7 86.95 L102.25 82.75 Q102.25 72.6 108.95 66.45 114.85 61.05 123.75 60.25 132.3 59.45 138.55 63.2 L139.15 63.55 139.4 63.4 Q148.55 58.45 159.0 57.8 171.2 57.1 178.6 63.25 180.3 64.7 181.7 66.45 L183.9 64.95 Q190.5 60.9 198.5 60.15 207.5 59.35 213.1 63.6 214.25 64.45 215.2 65.55 219.1 60.55 223.9 58.45 230.8 55.45 235.3 60.45 236.75 62.05 237.8 64.35 L237.95 64.2 Q240.85 61.15 244.55 59.8 254.85 56.05 261.0 68.25 262.0 69.35 262.7 73.75 M240.1 73.6 L240.35 76.25 242.5 73.75 242.75 73.0 240.1 73.6" fill="#00ff00" fill-rule="evenodd" stroke="none"/>
  </g>
</svg>
