<?xml version="1.0" encoding="UTF-8" standalone="no"?>
<svg xmlns:xlink="http://www.w3.org/1999/xlink" height="3.0px" width="5.0px" xmlns="http://www.w3.org/2000/svg">
  <g transform="matrix(1.0, 0.0, 0.0, 1.0, 0.0, 2.0)">
    <path d="M0.0 0.0 L0.0 -1.0 1.0 -1.0 1.0 0.0 0.0 0.0 M3.0 -1.0 L4.0 -1.0 4.0 0.0 3.0 0.0 3.0 -1.0" fill="#000000" fill-rule="evenodd" stroke="none"/>
    <path d="M1.0 0.0 L1.0 1.0 0.0 1.0 0.0 0.0 1.0 0.0 M3.0 0.0 L4.0 0.0 4.0 1.0 3.0 1.0 3.0 0.0" fill="#732510" fill-opacity="0.9882353" fill-rule="evenodd" stroke="none"/>
    <path d="M4.0 -1.0 L3.0 -1.0 3.0 -2.0 5.0 -2.0 5.0 -1.0 4.0 -1.0" fill="#541504" fill-rule="evenodd" stroke="none"/>
  </g>
</svg>
