<?xml version="1.0" encoding="UTF-8" standalone="no"?>
<svg xmlns:xlink="http://www.w3.org/1999/xlink" height="3.0px" width="10.0px" xmlns="http://www.w3.org/2000/svg">
  <g transform="matrix(1.0, 0.0, 0.0, 1.0, 4.0, 13.0)">
    <path d="M-3.0 -10.0 L-4.0 -10.0 -4.0 -11.0 -3.0 -11.0 -3.0 -10.0" fill="#281c3c" fill-rule="evenodd" stroke="none"/>
    <path d="M5.0 -12.0 L5.0 -13.0 6.0 -13.0 6.0 -12.0 5.0 -12.0" fill="#281c3c" fill-rule="evenodd" stroke="none"/>
  </g>
</svg>
