<?xml version="1.0" encoding="UTF-8" standalone="no"?>
<svg xmlns:xlink="http://www.w3.org/1999/xlink" height="5.0px" width="8.0px" xmlns="http://www.w3.org/2000/svg">
  <g transform="matrix(1.0, 0.0, 0.0, 1.0, 3.0, 13.0)">
    <path d="M-2.0 -8.0 L-3.0 -8.0 -3.0 -9.0 -2.0 -9.0 -2.0 -8.0" fill="#281c3c" fill-rule="evenodd" stroke="none"/>
    <path d="M4.0 -12.0 L4.0 -13.0 5.0 -13.0 5.0 -12.0 4.0 -12.0" fill="#281c3c" fill-rule="evenodd" stroke="none"/>
  </g>
</svg>
