<?xml version="1.0" encoding="UTF-8" standalone="no"?>
<svg xmlns:xlink="http://www.w3.org/1999/xlink" height="3.0px" width="6.0px" xmlns="http://www.w3.org/2000/svg">
  <g transform="matrix(1.0, 0.0, 0.0, 1.0, 1.0, 1.0)">
    <pattern height="3" id="PatternID_797_1" overflow="visible" patternTransform="matrix(1.0, 0.0, 0.0, 1.0, -1.0, -1.0)" patternUnits="userSpaceOnUse" viewBox="0 0 6 3" width="6">
      <image height="3" width="6" xlink:href="data:image/PNG;base64,iVBORw0KGgoAAAANSUhEUgAAAAYAAAADCAYAAACwAX77AAAAI0lEQVR42mPYkOX2H4QZIOA/FEMAVOK/JxSjSMI4f2emgCUA2xMSoeWN1MgAAAAASUVORK5CYII="/>
    </pattern>
    <path d="M-1.0 -1.0 L5.0 -1.0 5.0 2.0 -1.0 2.0 -1.0 -1.0" style="fill:url(#PatternID_797_1)"/>
  </g>
</svg>
