<?xml version="1.0" encoding="UTF-8" standalone="no"?>
<svg xmlns:xlink="http://www.w3.org/1999/xlink" height="3.0px" width="1.5px" xmlns="http://www.w3.org/2000/svg">
  <g transform="matrix(1.0, 0.0, 0.0, 1.0, -0.25, 1.0)">
    <path d="M0.25 0.5 L1.75 0.5 1.75 2.0 0.25 2.0 0.25 0.5" fill="#ffa800" fill-rule="evenodd" stroke="none"/>
    <path d="M0.25 0.5 L0.25 -1.0 1.75 -1.0 1.75 0.5 0.25 0.5" fill="#0087c2" fill-rule="evenodd" stroke="none"/>
  </g>
</svg>
