<?xml version="1.0" encoding="UTF-8" standalone="no"?>
<svg xmlns:xlink="http://www.w3.org/1999/xlink" height="15.35px" width="16.35px" xmlns="http://www.w3.org/2000/svg">
  <g transform="matrix(1.0, 0.0, 0.0, 1.0, 8.15, 6.9)">
    <path d="M-1.2 -0.9 L-1.75 -1.6 -2.15 -2.05 Q-2.9 -2.6 -2.85 -3.45 M-0.25 0.4 L-0.8 -0.3 -1.2 -0.9 M-0.25 0.4 L-0.1 0.7 -0.05 0.75 0.15 1.05 M0.15 1.1 L0.15 1.05 M0.15 1.1 L0.3 1.3 1.1 2.25 1.75 3.0 2.2 3.6 2.45 3.85 2.7 4.1 2.75 4.15 2.95 4.3" fill="none" stroke="url(#gradient0)" stroke-linecap="round" stroke-linejoin="round" stroke-width="1.0"/>
    <path d="M0.05 0.5 L0.2 0.25 1.85 -1.85 2.1 -2.15 2.3 -2.35 2.8 -2.7 2.95 -2.8 3.75 -3.3 3.9 -3.45 4.8 -3.95 M-0.05 0.75 L0.05 0.5 M-0.4 1.25 L-0.2 0.95 -0.15 0.85 -0.05 0.75 M-1.05 2.3 L-0.6 1.55 -0.4 1.25 M-1.35 2.7 L-1.2 2.45 -1.05 2.3 M-2.15 3.7 L-1.35 2.7 M-4.2 6.3 Q-4.1 5.65 -3.6 5.2 L-2.15 3.7" fill="none" stroke="url(#gradient1)" stroke-linecap="round" stroke-linejoin="round" stroke-width="1.0"/>
    <path d="M4.8 -3.95 L5.15 -4.4 M-0.8 -0.3 L-0.25 0.2 0.15 -1.5 1.3 -5.95 M4.8 -3.95 L2.15 -1.0 0.4 0.85 0.85 1.3 2.8 2.1 3.25 1.65 7.4 -2.15 M-4.95 -4.25 L-4.0 -3.5 -1.2 -0.75 -1.2 -0.9 -0.7 -6.4 M-0.8 -0.3 L-1.2 -0.75 -1.25 -0.55 -1.35 0.5 -0.35 0.85 -0.25 0.4 M0.05 0.5 L-0.25 0.2 -0.25 0.4 M0.05 0.5 L0.4 0.85 0.2 1.05 0.85 1.3 2.05 2.35 2.25 2.55 2.8 2.1 4.6 3.0 6.2 3.95 Q7.25 4.7 7.7 5.8 M-0.2 0.95 L-0.35 0.85 -0.4 1.15 -0.4 1.25 -0.5 1.75 0.15 1.1 M0.15 1.05 L-0.1 0.95 -0.2 0.95 M0.15 1.05 L0.2 1.05 0.15 1.1 M1.75 3.0 L2.25 2.55 Q4.25 4.3 5.2 6.85 L5.3 7.4 M-1.35 0.5 L-1.4 1.55 -1.35 2.55 -1.05 2.3 -0.95 2.15 -0.5 1.75 -0.7 4.6 -0.15 4.9 1.75 3.0 M-1.35 2.55 L-1.35 2.7 -1.15 4.35 -0.7 4.6 -0.7 5.55 -0.45 5.2 -0.15 4.9 0.2 5.05 Q2.1 5.9 4.15 6.1 M-1.35 2.55 L-2.35 3.55 -2.15 3.7 -1.7 4.0 Q-1.45 4.2 -1.15 4.35 L-0.8 5.7 -0.7 5.55 -0.7 6.1 -0.25 7.25 0.0 7.95 M-0.8 5.7 L-0.7 6.1 -0.65 7.1 M-7.65 -3.0 Q-5.45 -1.0 -2.65 0.05 L-1.35 0.5 M-2.35 3.55 L-4.7 6.4 -4.5 6.55 M-0.8 5.7 L-1.65 7.1 Q-1.8 7.4 -1.55 7.4 M-5.95 0.55 L-2.35 3.55" fill="none" stroke="#393987" stroke-linecap="round" stroke-linejoin="round" stroke-width="1.0"/>
  </g>
  <defs>
    <linearGradient gradientTransform="matrix(0.0042, 0.0, 0.0, 0.0053, 0.05, 0.4)" gradientUnits="userSpaceOnUse" id="gradient0" spreadMethod="pad" x1="-819.2" x2="819.2">
      <stop offset="0.0" stop-color="#393987"/>
      <stop offset="1.0" stop-color="#393987"/>
    </linearGradient>
    <linearGradient gradientTransform="matrix(0.006, 0.0, 0.0, 0.0069, 0.2, 1.1)" gradientUnits="userSpaceOnUse" id="gradient1" spreadMethod="pad" x1="-819.2" x2="819.2">
      <stop offset="0.0" stop-color="#393987"/>
      <stop offset="1.0" stop-color="#393987"/>
    </linearGradient>
  </defs>
</svg>
