[
xmin -40
ymin -40
xmax 1536
ymax 280
wordwrap 1
multiline 1
readonly 1
noselect 1
html 1
useoutlines 1
font 49
height 120
color #ffb37130
align left
leftmargin 0
rightmargin 0
indent 0
leading -20
]<p align="left"><font face="Consolas" size="6" color="#b37130" letterSpacing="0.000000" kerning="1"><b>CHARLOTTE !</b></font></p>