<?xml version="1.0" encoding="UTF-8" standalone="no"?>
<svg xmlns:xlink="http://www.w3.org/1999/xlink" height="5.85px" width="5.0px" xmlns="http://www.w3.org/2000/svg">
  <g transform="matrix(1.0, 0.0, 0.0, 1.0, -62.5, -93.1)">
    <path d="M62.5 93.1 L67.5 93.1 67.5 98.95 62.5 98.95 62.5 93.1" fill="#ff6666" fill-rule="evenodd" stroke="none"/>
    <path d="M62.5 93.1 L67.5 93.1 67.5 98.95 62.5 98.95 62.5 93.1 Z" fill="none" stroke="#330000" stroke-linecap="round" stroke-linejoin="round" stroke-width="0.05"/>
  </g>
</svg>
