<?xml version="1.0" encoding="UTF-8" standalone="no"?>
<svg xmlns:xlink="http://www.w3.org/1999/xlink" height="6.15px" width="11.15px" xmlns="http://www.w3.org/2000/svg">
  <g transform="matrix(1.0, 0.0, 0.0, 1.0, 5.5, 2.2)">
    <path d="M5.65 1.45 L5.2 2.7 1.15 1.2 1.3 3.95 -5.5 -2.05 3.45 -2.2 1.55 -0.05 5.65 1.45" fill="#000000" fill-rule="evenodd" stroke="none"/>
  </g>
</svg>
