<?xml version="1.0" encoding="UTF-8" standalone="no"?>
<svg xmlns:xlink="http://www.w3.org/1999/xlink" height="5.0px" width="2.0px" xmlns="http://www.w3.org/2000/svg">
  <g transform="matrix(1.0, 0.0, 0.0, 1.0, -14.0, 2.0)">
    <path d="M15.0 -1.0 L16.0 -1.0 16.0 0.0 15.0 0.0 15.0 -1.0 14.0 -1.0 14.0 -2.0 15.0 -2.0 15.0 -1.0" fill="#ff3300" fill-rule="evenodd" stroke="none"/>
    <path d="M16.0 2.0 L16.0 3.0 15.0 3.0 15.0 2.0 16.0 2.0" fill="#ffffff" fill-rule="evenodd" stroke="none"/>
  </g>
</svg>
