<?xml version="1.0" encoding="UTF-8" standalone="no"?>
<svg xmlns:xlink="http://www.w3.org/1999/xlink" height="24.95px" width="32.95px" xmlns="http://www.w3.org/2000/svg">
  <g transform="matrix(1.0, 0.0, 0.0, 1.0, 4.35, 16.4)">
    <path d="M21.25 -12.85 L19.55 -13.15 16.35 -12.4 12.1 -11.3 11.8 -11.25 13.0 -11.45 14.6 -11.7 14.3 -11.5 14.3 -11.45 14.25 -11.3 14.25 -11.2 Q14.3 -11.1 14.35 -11.15 L18.4 -11.1 18.7 -11.1 Q20.9 -11.4 22.7 -10.45 L22.75 -10.4 Q23.15 -10.0 23.6 -9.9 L23.7 -9.9 24.3 -10.05 24.4 -10.35 22.95 -12.0 Q26.0 -10.35 27.15 -7.1 L27.75 -5.05 28.0 -2.95 28.15 -1.75 28.2 -1.3 28.1 2.25 28.05 2.65 28.1 4.85 27.5 5.7 27.25 5.5 27.2 5.45 26.2 4.7 24.5 3.25 24.5 3.2 24.3 2.85 23.05 2.3 22.3 1.95 22.15 2.0 18.45 1.25 18.35 1.25 15.75 0.95 10.7 1.8 Q7.2 2.65 3.75 3.85 L1.9 4.5 Q0.6 4.95 0.65 5.8 L0.5 5.95 0.1 6.15 -3.85 8.55 -4.35 8.45 -4.25 7.85 -3.6 6.85 Q-1.5 5.05 1.15 3.9 -1.45 4.65 -3.45 2.7 L-3.35 2.15 -1.3 -2.35 Q-0.8 -3.5 -0.65 -4.75 -0.3 -7.2 0.75 -9.7 1.25 -10.9 2.25 -11.7 L4.5 -13.85 Q5.7 -15.3 7.55 -15.5 11.7 -15.9 15.45 -14.85 18.5 -14.15 21.25 -12.85 M25.85 -4.2 L26.25 -4.0 26.5 -4.2 26.65 -4.45 26.65 -4.55 Q24.1 -9.05 18.95 -9.65 L15.15 -9.35 Q12.65 -8.85 10.45 -7.65 7.55 -6.1 4.6 -4.95 L4.55 -4.9 4.55 -4.75 4.6 -4.65 4.6 -4.55 Q4.8 -4.4 5.1 -4.35 L4.95 -4.3 4.95 -4.15 5.0 -3.95 5.1 -3.85 6.55 -3.95 Q11.05 -6.15 15.9 -7.35 20.55 -8.5 23.8 -5.2 L24.0 -4.75 Q24.65 -4.05 25.55 -3.9 25.65 -3.9 25.75 -4.0 L25.85 -4.2 M27.2 1.1 L27.35 0.95 Q28.0 -0.2 26.55 -0.95 L26.25 -1.35 Q22.6 -4.05 17.95 -4.15 13.3 -3.1 8.85 -1.25 L1.9 1.3 Q0.6 1.7 -0.25 2.4 L0.0 2.6 Q1.45 2.75 2.85 2.15 8.7 -0.35 14.8 -2.15 L16.85 -2.55 Q21.35 -3.05 25.15 -0.65 L25.85 0.3 Q22.85 -1.4 19.35 -1.75 14.3 -1.85 9.65 0.05 L1.35 3.35 1.45 3.5 Q4.75 3.05 7.85 1.55 13.85 -1.3 20.5 -0.4 L21.6 -0.1 Q24.5 0.6 26.85 2.45 L27.15 2.7 Q27.7 2.9 27.7 2.3 27.7 1.6 27.2 1.1 M28.6 6.6 L28.5 6.5 28.6 6.55 28.6 6.6" fill="#f1926d" fill-rule="evenodd" stroke="none"/>
    <path d="M14.6 -11.7 L13.0 -11.45 11.8 -11.25 12.1 -11.3 16.35 -12.4 19.55 -13.15 21.25 -12.85 Q22.2 -12.6 22.95 -12.0 L24.4 -10.35 24.3 -10.05 23.7 -9.9 23.85 -9.95 23.95 -10.0 24.0 -10.05 24.05 -10.3 24.05 -10.35 23.0 -11.3 Q20.3 -12.1 17.45 -11.95 L15.2 -11.9 14.6 -11.7 M0.65 5.8 Q0.6 4.95 1.9 4.5 L3.75 3.85 Q7.2 2.65 10.7 1.8 L15.75 0.95 18.35 1.25 18.45 1.25 22.15 2.0 22.3 1.95 23.05 2.3 24.3 2.85 24.5 3.2 24.5 3.25 26.2 4.7 27.2 5.45 27.25 5.5 27.3 5.65 Q26.4 6.5 25.2 5.45 L24.45 4.95 22.85 4.05 22.05 3.8 Q20.2 3.0 18.3 2.85 L16.6 3.0 14.65 3.05 Q10.2 3.6 5.95 5.15 L4.3 5.0 Q3.95 4.75 4.25 4.5 5.25 3.6 6.5 3.1 L7.4 2.8 6.3 3.1 2.0 4.7 Q1.3 5.0 0.65 5.8 M23.6 -9.9 Q23.15 -10.0 22.75 -10.4 L22.7 -10.45 23.45 -10.0 23.6 -9.9 M5.1 -4.35 Q4.8 -4.4 4.6 -4.55 L4.6 -4.65 4.55 -4.75 4.55 -4.9 4.6 -4.95 Q7.55 -6.1 10.45 -7.65 12.65 -8.85 15.15 -9.35 L18.95 -9.65 Q24.1 -9.05 26.65 -4.55 L26.65 -4.45 26.5 -4.2 26.25 -4.0 25.85 -4.2 25.9 -4.3 25.85 -4.35 Q23.45 -8.05 19.05 -8.7 14.5 -8.6 10.35 -6.6 L5.1 -4.35 M25.85 0.3 L25.15 -0.65 Q21.35 -3.05 16.85 -2.55 L14.8 -2.15 Q8.7 -0.35 2.85 2.15 1.45 2.75 0.0 2.6 L-0.25 2.4 Q0.6 1.7 1.9 1.3 L8.85 -1.25 Q13.3 -3.1 17.95 -4.15 22.6 -4.05 26.25 -1.35 L26.55 -0.95 Q28.0 -0.2 27.35 0.95 L27.2 1.1 26.5 0.65 26.05 0.4 25.85 0.3" fill="#e07e5a" fill-rule="evenodd" stroke="none"/>
    <path d="M19.85 -16.4 L20.65 -16.05 20.75 -16.0 20.9 -15.8 21.0 -15.35 20.95 -15.25 20.75 -15.15 18.95 -15.95 Q19.0 -16.4 19.55 -16.4 L19.85 -16.4 M23.7 -9.9 L23.6 -9.9 23.45 -10.0 22.7 -10.45 Q20.9 -11.4 18.7 -11.1 L18.4 -11.1 14.35 -11.15 Q14.3 -11.1 14.25 -11.2 L14.25 -11.3 14.3 -11.45 14.3 -11.5 14.6 -11.7 15.2 -11.9 17.45 -11.95 Q20.3 -12.1 23.0 -11.3 L24.05 -10.35 24.05 -10.3 24.0 -10.05 23.95 -10.0 23.85 -9.95 23.7 -9.9 M25.85 -4.2 L25.75 -4.0 Q25.65 -3.9 25.55 -3.9 24.65 -4.05 24.0 -4.75 L23.8 -5.2 Q20.55 -8.5 15.9 -7.35 11.05 -6.15 6.55 -3.95 L5.1 -3.85 5.0 -3.95 4.95 -4.15 4.95 -4.3 5.1 -4.35 10.35 -6.6 Q14.5 -8.6 19.05 -8.7 23.45 -8.05 25.85 -4.35 L25.9 -4.3 25.85 -4.2 M27.2 1.1 Q27.7 1.6 27.7 2.3 27.7 2.9 27.15 2.7 L26.85 2.45 Q24.5 0.6 21.6 -0.1 L20.5 -0.4 Q13.85 -1.3 7.85 1.55 4.75 3.05 1.45 3.5 L1.35 3.35 9.65 0.05 Q14.3 -1.85 19.35 -1.75 22.85 -1.4 25.85 0.3 L26.05 0.4 26.5 0.65 27.2 1.1" fill="#fba97d" fill-rule="evenodd" stroke="none"/>
  </g>
</svg>
