<?xml version="1.0" encoding="UTF-8" standalone="no"?>
<svg xmlns:xlink="http://www.w3.org/1999/xlink" height="15.95px" width="177.65px" xmlns="http://www.w3.org/2000/svg">
  <g transform="matrix(1.0, 0.0, 0.0, 1.0, -9.0, -34.45)">
    <path d="M186.65 35.1 L186.65 49.7 Q186.65 50.4 186.0 50.4 L183.35 50.4 Q182.7 50.4 182.7 49.7 L182.7 35.1 Q182.7 34.45 183.35 34.45 L186.0 34.45 Q186.65 34.45 186.65 35.1 M181.6 37.45 L181.6 49.7 Q181.6 50.4 180.95 50.4 L178.3 50.4 Q177.7 50.4 177.7 49.7 L177.7 38.9 Q177.7 38.45 177.2 38.45 L176.45 38.45 Q176.05 38.45 176.05 38.9 L176.05 49.7 Q176.05 50.4 175.35 50.4 L172.75 50.4 Q172.1 50.4 172.1 49.7 L172.1 38.9 Q172.1 38.45 171.65 38.45 L170.9 38.45 Q170.45 38.45 170.45 38.9 L170.45 49.7 Q170.45 50.4 169.75 50.4 L167.15 50.4 Q166.5 50.4 166.5 49.7 L166.5 37.45 Q166.5 36.25 167.35 35.3 168.25 34.45 169.4 34.45 L173.1 34.45 Q174.45 34.45 175.35 35.5 176.2 34.45 177.55 34.45 L178.7 34.45 Q179.9 34.45 180.75 35.3 181.6 36.25 181.6 37.45 M165.35 49.7 Q165.35 50.4 164.65 50.4 L162.05 50.4 Q161.45 50.4 161.45 49.7 L161.45 46.85 Q161.45 46.4 160.95 46.4 L160.2 46.4 Q159.8 46.4 159.8 46.85 L159.8 49.7 Q159.8 50.4 159.1 50.4 L156.5 50.4 Q155.8 50.4 155.8 49.7 L155.8 36.2 Q155.8 35.45 156.35 34.95 156.8 34.45 157.5 34.45 L163.65 34.45 Q164.35 34.45 164.9 34.95 165.35 35.45 165.35 36.2 L165.35 49.7 M138.45 35.3 Q139.4 34.45 140.55 34.45 L144.25 34.45 Q145.5 34.45 146.35 35.3 147.2 36.25 147.2 37.45 L147.2 49.7 Q147.2 50.4 146.5 50.4 L143.9 50.4 Q143.25 50.4 143.25 49.7 L143.25 38.9 Q143.25 38.45 142.8 38.45 L142.05 38.45 Q141.6 38.45 141.6 38.9 L141.6 49.7 Q141.6 50.4 140.9 50.4 L138.3 50.4 Q137.6 50.4 137.6 49.7 L137.6 37.45 Q137.6 36.25 138.45 35.3 M136.5 35.1 L136.5 47.45 Q136.5 48.7 135.65 49.55 134.8 50.4 133.6 50.4 L129.85 50.4 Q128.7 50.4 127.8 49.55 126.95 48.7 126.95 47.45 L126.95 35.1 Q126.95 34.45 127.65 34.45 L130.25 34.45 Q130.95 34.45 130.95 35.1 L130.95 45.95 Q130.95 46.4 131.35 46.4 L132.1 46.4 132.55 45.95 132.55 35.1 Q132.55 34.45 133.2 34.45 L135.8 34.45 Q136.5 34.45 136.5 35.1 M161.45 43.15 L161.45 38.9 Q161.45 38.45 160.95 38.45 L160.2 38.45 Q159.8 38.45 159.8 38.9 L159.8 43.15 Q159.8 43.65 160.2 43.65 L160.95 43.65 Q161.45 43.65 161.45 43.15 M91.5 35.3 Q92.4 34.45 93.55 34.45 L97.3 34.45 Q98.5 34.45 99.35 35.3 100.2 36.25 100.2 37.45 L100.2 49.7 Q100.2 50.4 99.5 50.4 L96.9 50.4 Q96.3 50.4 96.3 49.7 L96.3 38.9 Q96.3 38.45 95.8 38.45 L95.05 38.45 Q94.65 38.45 94.65 38.9 L94.65 49.7 Q94.65 50.4 93.95 50.4 L91.35 50.4 Q90.65 50.4 90.65 49.7 L90.65 37.45 Q90.65 36.25 91.5 35.3 M89.55 37.45 L89.55 47.45 Q89.55 48.7 88.7 49.55 87.85 50.4 86.6 50.4 L82.9 50.4 Q81.7 50.4 80.8 49.55 79.95 48.7 79.95 47.45 L79.95 37.45 Q79.95 36.25 80.8 35.3 81.7 34.45 82.9 34.45 L86.6 34.45 Q87.85 34.45 88.7 35.3 89.55 36.25 89.55 37.45 M85.1 38.45 L84.4 38.45 Q83.95 38.45 83.95 38.9 L83.95 45.95 Q83.95 46.4 84.4 46.4 L85.1 46.4 85.6 45.95 85.6 38.9 Q85.6 38.45 85.1 38.45 M118.4 36.2 L118.4 49.7 Q118.4 50.4 117.7 50.4 L115.1 50.4 Q114.45 50.4 114.45 49.7 L114.45 46.85 Q114.45 46.4 114.0 46.4 L113.25 46.4 Q112.8 46.4 112.8 46.85 L112.8 49.7 Q112.8 50.4 112.1 50.4 L109.5 50.4 Q108.8 50.4 108.8 49.7 L108.8 36.2 Q108.8 35.45 109.35 34.95 109.85 34.45 110.5 34.45 L116.7 34.45 Q117.4 34.45 117.9 34.95 118.4 35.45 118.4 36.2 M114.45 43.15 L114.45 38.9 Q114.45 38.45 114.0 38.45 L113.25 38.45 Q112.8 38.45 112.8 38.9 L112.8 43.15 Q112.8 43.65 113.25 43.65 L114.0 43.65 Q114.45 43.65 114.45 43.15 M49.85 37.45 L49.85 47.45 Q49.85 48.7 49.0 49.55 48.15 50.4 46.9 50.4 L40.95 50.4 Q40.3 50.4 40.3 49.7 L40.3 35.1 Q40.3 34.45 40.95 34.45 L46.9 34.45 Q48.15 34.45 49.0 35.3 49.85 36.25 49.85 37.45 M56.85 35.3 Q57.75 34.45 58.95 34.45 L62.65 34.45 Q63.35 34.45 63.35 35.1 L63.35 37.75 Q63.35 38.45 62.65 38.45 L60.4 38.45 Q60.0 38.45 60.0 38.9 L60.0 45.95 Q60.0 46.4 60.4 46.4 L62.65 46.4 Q63.35 46.4 63.35 47.05 L63.35 49.7 Q63.35 50.4 62.65 50.4 L58.95 50.4 Q57.75 50.4 56.85 49.55 56.0 48.7 56.0 47.45 L56.0 37.45 Q56.0 36.25 56.85 35.3 M54.2 34.45 Q54.9 34.45 54.9 35.1 L54.9 49.7 Q54.9 50.4 54.2 50.4 L51.6 50.4 Q50.9 50.4 50.9 49.7 L50.9 35.1 Q50.9 34.45 51.6 34.45 L54.2 34.45 M39.15 35.1 L39.15 37.75 Q39.15 38.45 38.45 38.45 L34.7 38.45 Q34.25 38.45 34.25 38.9 L34.25 40.1 Q34.25 40.5 34.7 40.5 L38.45 40.5 Q39.15 40.5 39.15 41.2 L39.15 43.85 Q39.15 44.5 38.45 44.5 L34.7 44.5 Q34.25 44.5 34.25 45.0 L34.25 45.95 Q34.25 46.4 34.7 46.4 L38.45 46.4 Q39.15 46.4 39.15 47.05 L39.15 49.7 Q39.15 50.4 38.45 50.4 L33.2 50.4 Q32.05 50.4 31.15 49.55 30.3 48.7 30.3 47.45 L30.3 37.45 Q30.3 36.25 31.15 35.3 32.05 34.45 33.2 34.45 L38.45 34.45 Q39.15 34.45 39.15 35.1 M45.45 38.45 L44.7 38.45 Q44.25 38.45 44.25 38.9 L44.25 45.95 Q44.25 46.4 44.7 46.4 L45.45 46.4 45.9 45.95 45.9 38.9 Q45.9 38.45 45.45 38.45 M78.9 35.1 L78.9 49.7 Q78.9 50.4 78.2 50.4 L75.6 50.4 Q74.9 50.4 74.9 49.7 L74.9 35.1 Q74.9 34.45 75.6 34.45 L78.2 34.45 Q78.9 34.45 78.9 35.1 M73.8 37.75 Q73.8 38.45 73.1 38.45 L71.5 38.45 Q71.1 38.45 71.1 38.9 L71.1 49.7 Q71.1 50.4 70.4 50.4 L67.8 50.4 Q67.1 50.4 67.1 49.7 L67.1 38.9 Q67.1 38.45 66.7 38.45 L65.1 38.45 Q64.4 38.45 64.4 37.75 L64.4 35.1 Q64.4 34.45 65.1 34.45 L73.1 34.45 Q73.8 34.45 73.8 35.1 L73.8 37.75 M9.65 34.45 L15.6 34.45 Q16.85 34.45 17.7 35.3 18.55 36.25 18.55 37.45 L18.55 43.45 Q18.55 44.65 17.7 45.5 16.85 46.4 15.6 46.4 L13.4 46.4 Q12.95 46.4 12.95 46.85 L12.95 49.7 Q12.95 50.4 12.3 50.4 L9.65 50.4 Q9.0 50.4 9.0 49.7 L9.0 35.1 Q9.0 34.45 9.65 34.45 M12.95 38.9 L12.95 41.95 Q12.95 42.4 13.4 42.4 L14.15 42.4 14.6 41.95 14.6 38.9 Q14.6 38.45 14.15 38.45 L13.4 38.45 Q12.95 38.45 12.95 38.9 M29.15 37.45 L29.15 40.75 Q29.15 41.45 28.7 41.95 L27.55 42.45 Q28.15 42.45 28.7 42.95 L29.15 44.15 29.15 49.7 Q29.15 50.4 28.5 50.4 L25.9 50.4 Q25.25 50.4 25.25 49.7 L25.25 45.35 Q25.25 44.9 24.75 44.9 L24.0 44.9 Q23.6 44.9 23.6 45.35 L23.6 49.7 Q23.6 50.4 22.9 50.4 L20.3 50.4 Q19.6 50.4 19.6 49.7 L19.6 35.1 Q19.6 34.45 20.3 34.45 L26.25 34.45 Q27.45 34.45 28.3 35.3 29.15 36.25 29.15 37.45 M25.25 40.7 L25.25 38.9 Q25.25 38.45 24.75 38.45 L24.0 38.45 Q23.6 38.45 23.6 38.9 L23.6 40.7 Q23.6 41.1 24.0 41.1 L24.75 41.1 Q25.25 41.1 25.25 40.7" fill="#ffffff" fill-rule="evenodd" stroke="none"/>
  </g>
</svg>
