<?xml version="1.0" encoding="UTF-8" standalone="no"?>
<svg xmlns:xlink="http://www.w3.org/1999/xlink" height="9.5px" width="13.85px" xmlns="http://www.w3.org/2000/svg">
  <g transform="matrix(1.0, 0.0, 0.0, 1.0, 6.75, 4.7)">
    <path d="M5.15 -2.25 Q6.1 -1.05 6.05 0.45 L6.05 0.65 Q5.85 1.7 5.05 2.5 2.5 4.85 -1.0 4.7 L-3.55 4.15 Q-5.25 3.5 -6.3 2.0 L-6.75 0.7 -6.75 0.65 Q-6.8 -0.6 -6.0 -1.7 -4.25 -4.1 -1.3 -4.7 L-0.65 -4.5 -0.65 -4.45 Q1.7 -4.35 3.75 -3.35 4.55 -2.95 5.15 -2.25" fill="#000000" fill-opacity="0.2" fill-rule="evenodd" stroke="none"/>
    <path d="M4.6 -1.05 Q3.6 -2.75 1.5 -3.1 -1.85 -3.65 -3.15 -1.1 -3.65 0.0 -3.5 0.95 -3.3 1.95 -2.2 2.9 0.35 4.95 3.3 3.35 5.1 2.4 5.2 0.95 5.25 0.05 4.6 -1.05 M4.15 -2.75 Q5.8 -1.45 5.8 0.35 L5.75 0.95 Q5.5 2.35 4.15 3.4 2.5 4.75 0.15 4.75 -2.2 4.75 -3.9 3.4 -5.25 2.35 -5.45 0.95 L-5.5 0.35 Q-5.5 -1.45 -3.9 -2.75 -2.2 -4.05 0.15 -4.05 2.5 -4.05 4.15 -2.75" fill="#e4eef3" fill-rule="evenodd" stroke="none"/>
    <path d="M4.6 -1.05 Q5.25 0.05 5.2 0.95 5.1 2.4 3.3 3.35 0.35 4.95 -2.2 2.9 -3.3 1.95 -3.5 0.95 -3.65 0.0 -3.15 -1.1 -1.85 -3.65 1.5 -3.1 3.6 -2.75 4.6 -1.05" fill="#ffffff" fill-rule="evenodd" stroke="none"/>
    <path d="M1.0 -3.0 Q2.6 -2.8 2.7 -1.3 L2.7 -0.85 2.45 -0.4 1.5 0.45 0.9 0.5 Q-0.25 0.1 -0.4 -0.85 L-0.4 -1.75 -0.05 -2.4 0.65 -2.9 1.0 -3.0 M1.75 -1.8 L1.75 -1.7 Q1.85 -1.5 2.1 -1.55 L2.15 -1.65 2.15 -1.75 2.15 -1.85 2.05 -1.95 1.95 -1.95 1.8 -1.9 1.75 -1.8 M1.0 -2.4 Q0.3 -2.35 0.15 -1.7 0.05 -1.4 0.25 -1.2 L1.15 -1.25 Q1.75 -2.0 1.0 -2.4" fill="#000000" fill-rule="evenodd" stroke="none"/>
    <path d="M1.0 -2.4 Q1.75 -2.0 1.15 -1.25 L0.25 -1.2 Q0.05 -1.4 0.15 -1.7 0.3 -2.35 1.0 -2.4 M1.75 -1.8 L1.8 -1.9 1.95 -1.95 2.05 -1.95 2.15 -1.85 2.15 -1.75 2.15 -1.65 2.1 -1.55 Q1.85 -1.5 1.75 -1.7 L1.75 -1.8" fill="#ececec" fill-rule="evenodd" stroke="none"/>
    <path d="M-5.2 1.45 Q-5.7 2.15 -4.7 2.6 -0.9 4.45 3.3 3.05 4.75 2.6 5.7 1.6 L5.7 1.55 5.25 1.15 5.45 1.1 5.45 1.05 Q6.15 1.45 5.95 2.0 6.0 2.55 5.25 3.05 L4.4 3.55 Q1.85 4.6 -1.15 4.25 L-4.65 3.5 -5.4 3.05 Q-6.0 2.65 -5.8 2.1 -5.9 1.25 -5.2 1.45" fill="#cc7251" fill-rule="evenodd" stroke="none"/>
    <path d="M5.25 1.15 L5.7 1.55 5.7 1.6 Q4.75 2.6 3.3 3.05 -0.9 4.45 -4.7 2.6 -5.7 2.15 -5.2 1.45 -6.1 0.8 -4.15 1.8 -2.25 2.8 1.25 2.45 4.7 2.1 5.2 1.15 L5.25 1.15 M1.35 3.35 L1.45 3.2 1.45 3.15 1.4 3.0 -0.45 2.7 -0.6 2.7 -0.75 2.7 -0.95 2.8 -1.0 2.85 -1.0 2.9 -1.05 2.9 -1.3 2.95 -1.45 2.9 -1.7 3.0 -1.7 3.05 -1.6 3.1 -1.45 3.25 1.35 3.35" fill="#e07e5a" fill-rule="evenodd" stroke="none"/>
    <path d="M1.35 3.35 L-1.45 3.25 -1.6 3.1 -1.7 3.05 -1.7 3.0 -1.45 2.9 -1.3 2.95 -1.05 2.9 -1.0 2.9 -1.0 2.85 -0.95 2.8 -0.75 2.7 -0.6 2.7 -0.45 2.7 1.4 3.0 1.45 3.15 1.45 3.2 1.35 3.35" fill="#f1926d" fill-rule="evenodd" stroke="none"/>
    <path d="M-4.65 3.5 L-1.15 4.25 Q1.85 4.6 4.4 3.55 2.5 4.65 1.2 4.8 -1.8 5.0 -4.65 3.5" fill="#7d3726" fill-rule="evenodd" stroke="none"/>
    <path d="M3.6 -2.4 L3.8 -2.5 3.85 -2.65 3.85 -2.75 3.8 -2.85 3.8 -2.9 3.7 -2.95 Q2.15 -4.1 0.25 -4.05 L-1.85 -3.85 -2.1 -3.65 -2.15 -3.5 -2.15 -3.4 -2.1 -3.4 -2.15 -3.3 -2.05 -3.25 -1.95 -3.25 0.35 -3.15 -0.25 -3.15 -3.8 -2.45 -3.85 -2.45 Q-4.1 -2.65 -3.85 -2.95 L-3.35 -3.4 -3.3 -3.45 -3.15 -3.55 -3.1 -3.55 -3.0 -3.55 -2.9 -3.7 Q-2.0 -4.3 -1.05 -4.5 0.0 -4.7 1.4 -4.5 L2.5 -4.25 4.0 -3.3 4.25 -3.05 4.4 -2.8 5.3 -1.3 5.6 -0.6 Q5.2 -0.45 4.9 -1.05 L3.6 -2.4" fill="#e07e5a" fill-rule="evenodd" stroke="none"/>
    <path d="M0.35 -3.15 L-1.95 -3.25 -2.05 -3.25 -2.15 -3.3 -2.1 -3.4 -2.15 -3.4 -2.15 -3.5 -2.1 -3.65 -1.85 -3.85 0.25 -4.05 Q2.15 -4.1 3.7 -2.95 L3.8 -2.9 3.8 -2.85 3.85 -2.75 3.85 -2.65 3.8 -2.5 3.6 -2.4 2.9 -2.7 Q1.65 -3.2 0.35 -3.15" fill="#f1926d" fill-rule="evenodd" stroke="none"/>
    <path d="M5.3 -1.3 L4.4 -2.8 4.25 -3.05 4.0 -3.3 5.05 -2.35 5.35 -1.9 Q6.45 -0.05 7.1 2.1 6.75 2.9 6.4 1.8 6.1 0.65 4.8 -0.3 1.6 -2.3 -2.1 -1.8 L-4.8 -1.2 -5.15 -1.05 -5.3 -0.9 -5.4 -0.85 -5.5 -0.75 -5.55 -0.65 -5.65 -0.7 -5.75 -0.75 -5.8 -0.75 -5.8 -0.8 -5.85 -0.9 -5.8 -0.95 -5.55 -1.4 -5.4 -1.55 -5.45 -1.6 -5.5 -1.75 -5.5 -1.85 -5.55 -1.85 -5.55 -2.0 -5.55 -2.15 -3.1 -3.55 -3.15 -3.55 -3.3 -3.45 -3.35 -3.4 -3.85 -2.95 Q-4.1 -2.65 -3.85 -2.45 L-3.8 -2.45 -2.85 -2.25 Q1.15 -3.1 5.9 0.0 L5.3 -1.3" fill="#7d3726" fill-rule="evenodd" stroke="none"/>
    <path d="M3.6 -2.4 L4.9 -1.05 Q5.2 -0.45 5.6 -0.6 L5.3 -1.3 5.9 0.0 Q1.15 -3.1 -2.85 -2.25 L-3.8 -2.45 -0.25 -3.15 0.35 -3.15 Q1.65 -3.2 2.9 -2.7 L3.6 -2.4" fill="#cc7251" fill-rule="evenodd" stroke="none"/>
  </g>
</svg>
