<?xml version="1.0" encoding="UTF-8" standalone="no"?>
<svg xmlns:xlink="http://www.w3.org/1999/xlink" height="31.0px" width="88.0px" xmlns="http://www.w3.org/2000/svg">
  <g transform="matrix(1.0, 0.0, 0.0, 1.0, 0.0, 0.0)">
    <path d="M1.5 1.0 Q1.3 1.0 1.2 1.15 L1.15 1.2 Q1.0 1.3 1.0 1.5 L1.0 29.5 1.15 29.85 1.2 29.85 1.5 30.0 86.5 30.0 86.85 29.85 87.0 29.5 87.0 1.5 86.85 1.2 86.85 1.15 86.5 1.0 1.5 1.0 M0.45 0.45 Q0.9 0.0 1.5 0.0 L86.5 0.0 Q87.1 0.0 87.55 0.45 88.0 0.9 88.0 1.5 L88.0 29.5 87.55 30.55 Q87.1 31.0 86.5 31.0 L1.5 31.0 Q0.9 31.0 0.45 30.55 0.0 30.1 0.0 29.5 L0.0 1.5 Q0.0 0.9 0.45 0.45" fill="#ffffff" fill-rule="evenodd" stroke="none"/>
  </g>
</svg>
