<?xml version="1.0" encoding="UTF-8" standalone="no"?>
<svg xmlns:xlink="http://www.w3.org/1999/xlink" height="59.0px" width="196.0px" xmlns="http://www.w3.org/2000/svg">
  <g transform="matrix(1.0, 0.0, 0.0, 1.0, 0.0, 0.0)">
    <path d="M196.0 59.0 L0.0 59.0 0.0 0.0 196.0 0.0 196.0 59.0" fill="#fdffc8" fill-opacity="0.2" fill-rule="evenodd" stroke="none"/>
  </g>
</svg>
