<?xml version="1.0" encoding="UTF-8" standalone="no"?>
<svg xmlns:xlink="http://www.w3.org/1999/xlink" height="13.85px" width="54.95px" xmlns="http://www.w3.org/2000/svg">
  <g transform="matrix(1.0, 0.0, 0.0, 1.0, -21.0, -78.15)">
    <path d="M22.1 84.0 L22.45 85.1 Q22.65 85.9 22.95 86.15 L24.05 87.3 25.7 88.2 27.8 89.0 33.75 89.7 Q37.75 89.7 40.5 87.1 42.3 84.85 43.0 84.5 L43.85 84.0 44.45 84.1 Q44.15 84.7 44.1 85.65 L41.85 88.8 39.55 90.45 Q36.6 92.0 32.8 92.0 29.2 92.0 25.75 90.05 L25.4 89.85 Q21.0 88.15 21.0 85.0 21.0 82.85 22.1 84.0 M57.95 86.15 Q59.05 87.05 61.15 87.05 63.0 87.05 65.4 86.15 L67.95 84.95 70.0 83.7 71.85 82.35 72.95 81.1 73.95 79.7 74.7 78.45 75.75 78.4 75.95 79.15 Q75.95 80.0 74.3 81.9 73.65 83.05 71.45 84.6 69.95 85.75 67.65 86.9 64.0 88.65 61.1 88.65 L58.7 88.45 57.2 87.3 56.6 86.8 55.9 86.3 55.65 85.7 Q55.65 84.8 56.5 85.25 57.0 85.35 57.95 86.15" fill="#000000" fill-opacity="0.17254902" fill-rule="evenodd" stroke="none"/>
  </g>
</svg>
