<?xml version="1.0" encoding="UTF-8" standalone="no"?>
<svg xmlns:xlink="http://www.w3.org/1999/xlink" height="13.7px" width="15.3px" xmlns="http://www.w3.org/2000/svg">
  <g transform="matrix(1.0, 0.0, 0.0, 1.0, 0.0, 0.0)">
    <path d="M5.55 13.7 Q2.55 13.7 0.95 11.65 -0.6 9.65 0.35 6.85 1.2 4.05 3.95 2.05 6.8 0.0 9.8 0.0 12.8 0.0 14.3 2.05 15.85 4.05 15.0 6.85 14.1 9.65 11.35 11.65 8.6 13.7 5.55 13.7" fill="url(#gradient0)" fill-rule="evenodd" stroke="none"/>
  </g>
  <defs>
    <radialGradient cx="0" cy="0" fx="-1142.4" fy="0" gradientTransform="matrix(0.0122, 0.0, -0.0035, 0.0113, 9.4, 7.0)" gradientUnits="userSpaceOnUse" id="gradient0" r="819.2" spreadMethod="pad">
      <stop offset="0.3058823529411765" stop-color="#ffffff"/>
      <stop offset="0.7843137254901961" stop-color="#ffffff" stop-opacity="0.0"/>
      <stop offset="1.0" stop-color="#ffffff" stop-opacity="0.0"/>
    </radialGradient>
  </defs>
</svg>
