<?xml version="1.0" encoding="UTF-8" standalone="no"?>
<svg xmlns:xlink="http://www.w3.org/1999/xlink" height="4.4px" width="23.8px" xmlns="http://www.w3.org/2000/svg">
  <g transform="matrix(1.0, 0.0, 0.0, 1.0, 10.85, 3.1)">
    <path d="M-4.4 0.1 L-2.8 -0.55 -1.45 -0.65 0.3 -0.45 2.0 -0.9 2.1 -0.4 3.45 -0.4 4.35 -0.45 4.7 -0.2 5.2 0.15 4.6 0.2 4.55 0.35 4.65 0.95 3.9 1.05 3.9 0.35 3.55 0.35 2.1 0.7 Q1.75 0.8 1.85 1.3 L1.15 1.3 1.15 0.65 0.55 0.55 -1.5 0.65 -1.4 1.1 -2.65 0.8 -2.65 0.25 -3.9 0.2 -4.0 0.5 -4.35 0.35 -4.4 0.1" fill="#8a1717" fill-rule="evenodd" stroke="none"/>
    <path d="M2.0 -0.9 L1.95 -1.5 3.1 -1.45 4.7 -1.55 4.75 -1.25 4.65 -0.45 4.35 -0.45 3.45 -0.4 2.1 -0.4 2.0 -0.9 M-1.5 -1.55 L-1.45 -0.85 -3.1 -0.65 -3.2 -1.65 -2.25 -1.55 -1.7 -1.55 -1.5 -1.55 M-4.1 -1.7 L-4.2 -1.4 -4.55 -0.85 -5.85 -1.95 -4.1 -1.7 M-5.35 0.0 L-5.05 -0.25 -4.55 -0.55 -4.5 -0.5 -4.4 0.1 -4.35 0.35 -5.35 0.0 M-4.0 0.5 L-3.9 0.2 -2.65 0.25 -2.65 0.8 -4.0 0.5 M-1.4 1.1 L-1.5 0.65 0.55 0.55 1.15 0.65 1.15 1.3 -1.4 1.1 M1.85 1.3 Q1.75 0.8 2.1 0.7 L3.55 0.35 3.9 0.35 3.9 1.05 1.85 1.3 M4.65 0.95 L4.55 0.35 4.6 0.2 5.2 0.15 6.15 -0.05 6.35 0.55 4.65 0.95 M5.4 -1.65 L7.05 -1.75 7.05 -1.3 5.5 -1.0 5.4 -1.65 M8.1 -0.1 L7.2 0.25 7.1 -0.55 8.1 -0.1" fill="#ccb890" fill-rule="evenodd" stroke="none"/>
    <path d="M2.0 -0.9 L0.3 -0.45 -1.45 -0.65 -2.8 -0.55 -4.4 0.1 -4.5 -0.5 -4.55 -0.55 -5.05 -0.25 -5.35 0.0 Q-5.95 -0.25 -6.45 -0.6 -8.75 -1.55 -10.85 -2.95 L-10.75 -2.95 -6.25 -2.1 -6.0 -2.05 -5.85 -1.95 -4.55 -0.85 -4.2 -1.4 -4.1 -1.7 -4.0 -1.7 -3.2 -1.65 -3.1 -0.65 -1.45 -0.85 -1.5 -1.55 -0.25 -1.5 1.95 -1.5 2.0 -0.9 M5.2 0.15 L4.7 -0.2 4.35 -0.45 4.65 -0.45 4.75 -1.25 4.7 -1.55 5.2 -1.65 5.4 -1.65 5.5 -1.0 7.05 -1.3 7.05 -1.75 7.2 -1.75 7.6 -1.8 7.7 -1.1 8.35 -1.95 9.1 -2.15 10.95 -2.55 12.65 -3.0 12.95 -3.1 12.15 -2.5 Q10.35 -1.0 8.1 -0.1 L7.1 -0.55 7.2 0.25 6.35 0.55 6.15 -0.05 5.2 0.15" fill="#521d1d" fill-rule="evenodd" stroke="none"/>
    <path d="M2.0 -0.9 L1.95 -1.5 M-1.5 -1.55 L-1.45 -0.85 -3.1 -0.65 -3.2 -1.65 M-4.1 -1.7 L-4.2 -1.4 -4.55 -0.85 -5.85 -1.95 M-5.35 0.0 L-5.05 -0.25 -4.55 -0.55 -4.5 -0.5 -4.4 0.1 -4.35 0.35 M-1.4 1.1 L-1.5 0.65 0.55 0.55 1.15 0.65 1.15 1.3 M1.85 1.3 Q1.75 0.8 2.1 0.7 L3.55 0.35 3.9 0.35 3.9 1.05 M4.65 0.95 L4.55 0.35 4.6 0.2 5.2 0.15 6.15 -0.05 6.35 0.55 M4.35 -0.45 L3.45 -0.4 2.1 -0.4 2.0 -0.9 M4.7 -1.55 L4.75 -1.25 4.65 -0.45 4.35 -0.45 M7.6 -1.8 L7.7 -1.1 8.35 -1.95 M7.05 -1.75 L7.05 -1.3 5.5 -1.0 5.4 -1.65" fill="none" stroke="#e3d6c5" stroke-linecap="round" stroke-linejoin="round" stroke-opacity="0.29803923" stroke-width="0.05"/>
  </g>
</svg>
