<?xml version="1.0" encoding="UTF-8" standalone="no"?>
<svg xmlns:xlink="http://www.w3.org/1999/xlink" height="52.3px" width="39.65px" xmlns="http://www.w3.org/2000/svg">
  <g transform="matrix(1.0, 0.0, 0.0, 1.0, 1.7, -0.05)">
    <path d="M0.05 26.7 L0.05 26.75 0.0 26.65 0.05 26.7 M21.6 15.65 L21.6 15.75 21.55 15.8 21.6 15.65 M18.15 17.9 L18.1 17.9 18.1 17.8 18.15 17.9 M16.4 19.65 L16.5 19.65 16.3 19.75 16.4 19.65" fill="url(#gradient0)" fill-rule="evenodd" stroke="none"/>
    <path d="M32.7 21.0 L33.7 21.5 Q36.0 22.55 37.95 22.55 L36.55 22.95 35.25 23.15 35.0 22.95 32.7 21.0 M29.1 20.05 L32.6 22.2 Q35.75 24.35 35.75 25.55 L35.3 29.0 35.15 29.9 33.65 30.05 33.65 29.1 33.45 29.1 32.4 29.75 32.4 29.65 32.95 28.5 34.25 26.7 34.65 26.2 34.55 26.1 32.5 25.15 33.05 24.6 31.0 24.0 29.1 23.4 30.35 22.0 30.25 21.9 28.05 22.1 27.55 22.0 28.45 20.95 29.0 20.0 29.1 20.05" fill="url(#gradient1)" fill-rule="evenodd" stroke="none"/>
    <path d="M24.65 26.5 L22.9 27.35 22.5 27.55 Q20.5 28.45 19.5 28.45 L17.85 28.35 Q18.9 28.1 20.95 26.95 L22.5 26.05 23.7 25.25 23.05 26.2 24.35 25.7 25.65 25.35 24.5 26.4 24.65 26.5 M21.5 49.75 L19.75 52.35 19.05 51.5 Q18.75 51.65 18.85 52.15 L18.65 52.25 17.95 51.55 17.1 50.7 Q17.9 50.7 21.25 49.7 L21.5 49.75" fill="#c29c9c" fill-rule="evenodd" stroke="none"/>
    <path d="M30.95 15.5 L30.6 16.25 29.7 18.05 29.45 18.55 29.3 18.45 29.1 18.3 29.25 18.05 30.2 15.85 30.25 15.65 Q30.8 14.25 31.0 12.25 L31.1 11.25 31.1 11.0 31.1 10.15 31.1 9.65 31.35 9.05 Q31.65 8.4 31.65 6.75 L31.6 5.95 31.75 6.6 31.85 8.1 31.45 11.95 31.2 14.05 30.95 15.5 M34.7 33.6 L33.95 35.8 33.5 37.2 Q32.75 36.45 32.05 36.25 31.7 36.15 31.7 34.9 L31.8 32.95 31.25 32.95 30.45 33.05 30.5 32.95 31.75 30.45 31.85 30.25 32.35 29.4 32.95 28.5 32.4 29.65 32.4 29.75 33.45 29.1 33.65 29.1 33.65 30.05 35.15 29.9 34.75 32.95 34.7 33.6 M1.7 34.7 L1.65 34.55 1.55 34.3 1.3 32.95 0.3 28.05 0.15 27.45 0.05 26.75 0.05 26.7 0.15 26.55 1.15 25.6 1.15 25.55 1.05 26.7 1.25 28.1 Q1.2 27.4 1.45 26.8 1.8 25.6 3.0 24.6 L6.45 22.45 Q7.55 21.85 11.25 21.1 L13.2 20.7 12.65 19.8 12.4 19.45 Q13.3 20.3 13.9 20.3 15.1 20.3 16.25 19.45 L18.8 18.45 17.9 19.65 17.25 20.25 Q20.1 18.7 21.0 17.55 22.2 16.05 22.2 12.85 22.2 8.9 20.7 5.25 L21.0 6.8 20.7 7.95 Q19.95 5.7 18.7 4.25 17.1 2.45 15.15 2.4 L14.75 2.4 15.5 2.0 Q15.9 1.65 16.25 1.55 L17.05 1.25 17.7 1.05 20.55 1.15 Q24.65 1.85 27.25 5.85 L27.55 6.3 28.3 7.7 29.1 9.65 Q30.2 13.35 29.15 17.35 L28.95 18.05 28.1 19.75 27.05 21.15 25.95 22.45 24.7 23.6 23.9 23.95 22.9 24.35 24.55 22.75 25.85 21.1 27.6 18.05 27.7 17.85 27.5 18.05 24.95 20.2 25.95 18.05 26.1 17.65 Q26.65 16.15 26.65 14.7 L26.65 14.65 26.6 12.65 26.0 10.35 25.75 9.7 25.75 10.3 25.8 10.35 26.0 12.3 25.75 14.8 Q25.35 16.55 24.45 18.05 L24.05 18.6 24.05 18.35 24.1 18.05 24.4 16.65 Q24.6 15.6 24.4 14.95 L24.4 14.9 24.3 14.6 24.35 14.95 Q24.5 16.4 23.5 18.05 L22.5 19.35 22.05 19.85 Q20.35 21.6 18.85 22.4 L17.7 22.85 15.2 24.6 14.15 25.05 11.0 25.45 5.7 24.75 5.3 24.8 4.15 24.95 4.15 25.05 5.0 25.15 5.0 25.25 2.35 26.15 2.05 26.0 3.3 28.9 2.5 28.9 3.05 30.25 4.25 32.95 4.55 33.6 Q4.15 33.6 3.4 33.1 L3.35 33.15 4.2 35.25 4.2 35.35 2.75 34.95 1.7 34.7 M24.4 9.65 L24.4 8.7 23.85 6.65 23.75 6.4 22.8 4.75 21.35 3.7 20.55 3.3 20.3 3.15 20.45 3.45 20.55 3.75 20.6 3.8 20.75 3.9 Q21.7 4.65 22.35 6.35 L22.45 6.75 Q22.9 8.3 22.95 9.65 L22.9 10.35 22.8 11.1 23.15 10.35 23.35 9.65 23.4 9.45 23.5 7.55 23.6 7.55 Q23.5 7.85 23.85 8.6 L24.35 9.65 24.4 9.8 24.4 9.65 M15.5 2.0 Q16.2 1.6 17.05 1.25 16.2 1.6 15.5 2.0 M15.05 15.0 L14.7 15.25 Q13.95 15.9 13.3 15.9 12.0 15.9 11.45 14.15 11.15 13.15 11.15 12.0 11.15 10.4 11.85 9.55 12.45 8.85 13.8 8.4 L14.0 8.25 13.2 7.95 12.0 7.95 Q12.3 7.55 13.4 7.15 L15.1 6.8 Q17.5 6.8 18.65 8.55 19.65 10.05 19.65 12.55 L19.6 14.7 18.6 16.5 Q19.2 15.25 19.2 14.05 19.2 11.85 18.85 10.8 18.25 9.05 16.55 9.05 15.1 9.05 14.2 9.5 13.2 10.0 13.2 10.95 13.2 12.65 14.0 15.3 L15.0 15.0 15.05 15.0 M7.35 24.05 L7.25 24.1 11.15 24.35 Q12.15 24.35 13.45 23.8 L14.4 23.35 14.75 23.2 16.7 21.85 Q15.45 22.7 13.15 23.25 L12.9 23.3 12.9 23.4 12.75 23.4 12.65 23.35 7.35 24.05 M7.05 24.2 L6.3 24.65 6.75 24.5 7.05 24.2 M16.4 19.65 L16.3 19.75 16.5 19.65 16.4 19.65" fill="#d2b6b6" fill-rule="evenodd" stroke="none"/>
    <path d="M0.0 26.65 L0.0 26.55 Q0.05 25.35 0.65 24.25 L-0.25 24.2 -1.6 24.25 -1.6 24.2 0.9 23.1 -0.2 22.9 -1.2 22.6 -1.2 22.55 Q0.3 22.6 2.1 21.9 L2.15 21.9 5.85 20.9 Q8.6 19.55 11.4 18.6 8.25 20.4 7.95 20.7 L12.2 19.25 12.4 19.45 12.25 19.25 12.4 19.45 12.2 19.25 12.25 19.25 11.9 18.65 11.75 18.3 11.0 17.2 Q9.3 14.5 9.3 11.85 9.3 8.75 11.0 6.15 L11.25 5.7 11.5 5.35 Q12.75 3.75 14.5 2.6 L14.75 2.4 15.15 2.4 Q17.1 2.45 18.7 4.25 19.95 5.7 20.7 7.95 L21.0 6.8 20.7 5.25 Q22.2 8.9 22.2 12.85 22.2 16.05 21.0 17.55 20.1 18.7 17.25 20.25 L17.9 19.65 18.8 18.45 16.25 19.45 Q15.1 20.3 13.9 20.3 13.3 20.3 12.4 19.45 L12.65 19.8 13.2 20.7 11.25 21.1 Q7.55 21.85 6.45 22.45 L3.0 24.6 Q1.8 25.6 1.45 26.8 1.2 27.4 1.25 28.1 L1.05 26.7 1.15 25.55 1.15 25.6 0.15 26.55 0.05 26.7 0.0 26.65 M24.35 9.65 L23.85 8.6 Q23.5 7.85 23.6 7.55 L23.5 7.55 23.4 9.45 23.35 9.65 23.15 10.35 22.8 11.1 22.9 10.35 22.95 9.65 Q22.9 8.3 22.45 6.75 L22.35 6.35 Q21.7 4.65 20.75 3.9 L20.6 3.8 20.55 3.75 20.45 3.45 20.3 3.15 20.55 3.3 21.35 3.7 22.8 4.75 23.75 6.4 23.85 6.65 24.4 8.7 24.4 9.65 24.35 9.65 M21.6 15.65 L21.55 15.8 21.6 15.75 21.6 15.65 M18.6 16.5 L19.6 14.7 19.65 12.55 Q19.65 10.05 18.65 8.55 17.5 6.8 15.1 6.8 L13.4 7.15 Q12.3 7.55 12.0 7.95 L13.2 7.95 14.0 8.25 13.8 8.4 Q12.45 8.85 11.85 9.55 11.15 10.4 11.15 12.0 11.15 13.15 11.45 14.15 12.0 15.9 13.3 15.9 13.95 15.9 14.7 15.25 L15.05 15.0 15.0 15.0 14.0 15.3 Q13.2 12.65 13.2 10.95 13.2 10.0 14.2 9.5 15.1 9.05 16.55 9.05 18.25 9.05 18.85 10.8 19.2 11.85 19.2 14.05 19.2 15.25 18.6 16.5 L17.55 18.1 16.25 19.45 17.55 18.1 18.6 16.5 M14.35 10.05 L14.3 10.1 14.2 10.3 14.0 11.2 Q14.0 13.65 14.9 13.65 L15.7 13.35 16.05 12.9 16.2 12.9 16.2 13.8 15.6 15.1 15.0 16.5 16.9 14.5 Q17.3 13.75 17.3 12.0 17.3 9.65 15.75 9.65 L14.35 10.05 M15.3 14.15 L15.25 14.15 15.15 14.35 15.1 14.45 15.1 14.4 15.3 14.2 15.3 14.15 M18.15 17.9 L18.1 17.8 18.1 17.9 18.15 17.9" fill="#e0cdcd" fill-rule="evenodd" stroke="none"/>
    <path d="M31.6 5.95 L31.5 5.5 31.35 4.65 31.35 4.55 31.45 4.55 Q32.75 7.2 32.45 10.2 L32.35 10.95 32.1 12.25 30.95 15.5 31.2 14.05 31.45 11.95 31.85 8.1 31.75 6.6 31.6 5.95 M29.9 18.85 L30.05 18.95 30.25 19.1 31.8 20.3 32.7 21.0 35.0 22.95 35.25 23.15 37.3 25.3 36.8 26.75 34.9 32.95 34.7 33.6 34.75 32.95 35.15 29.9 35.3 29.0 35.75 25.55 Q35.75 24.35 32.6 22.2 L29.1 20.05 29.9 18.85 M2.15 21.9 L3.1 21.45 3.8 20.95 Q4.25 20.6 5.05 20.2 L11.0 17.2 11.75 18.3 11.9 18.65 12.25 19.25 12.2 19.25 7.95 20.7 Q8.25 20.4 11.4 18.6 8.6 19.55 5.85 20.9 L2.15 21.9 M17.7 1.05 L19.05 0.6 20.55 0.25 23.7 0.05 Q25.5 0.1 27.25 1.6 L28.85 3.3 Q30.95 5.95 31.1 9.65 L31.1 10.15 31.1 11.0 31.1 11.25 31.0 12.25 Q30.8 14.25 30.25 15.65 L30.2 15.85 29.25 18.05 29.1 18.3 28.1 19.75 28.95 18.05 29.15 17.35 Q30.2 13.35 29.1 9.65 L28.3 7.7 27.55 6.3 27.25 5.85 Q24.65 1.85 20.55 1.15 L17.7 1.05 M32.7 21.0 Q31.25 20.2 30.25 19.1 31.25 20.2 32.7 21.0 M14.35 10.05 L15.75 9.65 Q17.3 9.65 17.3 12.0 17.3 13.75 16.9 14.5 L15.0 16.5 15.6 15.1 16.2 13.8 16.2 12.9 16.05 12.9 15.7 13.35 14.9 13.65 Q14.0 13.65 14.0 11.2 L14.2 10.3 14.3 10.1 14.35 10.05" fill="#f2eaea" fill-rule="evenodd" stroke="none"/>
    <path d="M29.45 18.55 L29.9 18.85 29.1 20.05 29.0 20.0 28.45 20.95 27.55 22.0 28.05 22.1 30.25 21.9 30.35 22.0 29.1 23.4 31.0 24.0 33.05 24.6 32.5 25.15 34.55 26.1 34.65 26.2 34.25 26.7 32.95 28.5 32.35 29.4 31.85 30.25 31.75 30.45 30.5 32.95 30.45 33.05 31.25 32.95 31.8 32.95 31.7 34.9 Q31.7 36.15 32.05 36.25 32.75 36.45 33.5 37.2 L32.8 39.55 31.55 44.8 Q30.6 44.25 30.4 44.9 L31.85 36.35 Q30.4 35.05 29.6 32.95 L29.35 32.35 Q30.6 31.65 31.3 30.6 L31.6 30.2 30.55 28.3 Q29.75 26.9 28.4 26.95 L28.45 26.85 29.85 26.0 28.0 25.75 25.45 26.2 24.9 26.3 24.5 26.4 25.65 25.35 24.35 25.7 23.05 26.2 23.7 25.25 22.5 26.05 20.95 26.95 Q18.9 28.1 17.85 28.35 L17.5 28.35 17.1 28.25 15.2 27.45 13.7 26.75 13.7 26.65 13.55 26.65 Q12.85 26.25 12.55 26.4 L8.7 26.4 Q9.45 26.9 9.7 27.55 L6.25 26.85 5.45 26.85 5.45 26.95 6.1 28.0 5.4 27.75 4.85 27.6 4.85 27.8 6.9 31.25 6.95 31.3 6.45 31.8 5.45 32.95 5.35 33.1 Q5.7 42.5 6.35 44.75 L5.1 45.0 3.3 36.1 1.8 35.1 1.7 34.7 2.75 34.95 4.2 35.35 4.2 35.25 3.35 33.15 3.4 33.1 Q4.15 33.6 4.55 33.6 L4.25 32.95 3.05 30.25 2.5 28.9 3.3 28.9 2.05 26.0 2.35 26.15 5.0 25.25 5.0 25.15 4.15 25.05 4.15 24.95 5.3 24.8 5.7 24.75 11.0 25.45 14.15 25.05 15.2 24.6 17.7 22.85 18.85 22.4 Q20.35 21.6 22.05 19.85 L22.5 19.35 23.5 18.05 Q24.5 16.4 24.35 14.95 L24.3 14.6 24.4 14.9 24.4 14.95 Q24.6 15.6 24.4 16.65 L24.1 18.05 24.05 18.35 24.05 18.6 24.45 18.05 Q25.35 16.55 25.75 14.8 L26.0 12.3 25.8 10.35 25.75 10.3 25.75 9.7 26.0 10.35 26.6 12.65 26.65 14.65 26.65 14.7 Q26.65 16.15 26.1 17.65 L25.95 18.05 24.95 20.2 27.5 18.05 27.7 17.85 27.6 18.05 25.85 21.1 24.55 22.75 22.9 24.35 23.9 23.95 24.7 23.6 25.95 22.45 27.05 21.15 28.1 19.75 29.1 18.3 29.3 18.45 29.45 18.55 M11.0 6.15 L8.0 7.7 Q8.65 6.65 10.45 5.2 12.25 3.75 14.5 2.6 12.75 3.75 11.5 5.35 L11.25 5.7 11.0 6.15 M24.35 9.65 L24.4 9.65 24.4 9.8 24.35 9.65 M7.35 24.05 L12.65 23.35 12.75 23.4 12.9 23.4 12.9 23.3 13.15 23.25 Q15.45 22.7 16.7 21.85 L14.75 23.2 14.4 23.35 13.45 23.8 Q12.15 24.35 11.15 24.35 L7.25 24.1 7.35 24.05 M17.85 28.35 L17.1 28.25 17.85 28.35 M30.6 26.15 L30.6 26.05 30.45 26.15 30.6 26.15 M31.6 30.2 L31.75 30.45 31.6 30.2" fill="#c9a7a7" fill-rule="evenodd" stroke="none"/>
    <path d="M31.6 5.95 L31.5 5.5 31.35 4.65 31.35 4.55 M31.45 4.55 Q32.75 7.2 32.45 10.2 L32.35 10.95 32.1 12.25 30.95 15.5 30.6 16.25 29.7 18.05 29.45 18.55 29.9 18.85 30.05 18.95 30.25 19.1 31.8 20.3 32.7 21.0 33.7 21.5 Q36.0 22.55 37.95 22.55 L36.55 22.95 35.25 23.15 37.3 25.3 36.8 26.75 34.9 32.95 34.7 33.6 33.95 35.8 33.5 37.2 32.8 39.55 31.55 44.8 Q30.6 44.25 30.4 44.9 L31.85 36.35 Q30.4 35.05 29.6 32.95 L29.35 32.35 Q30.6 31.65 31.3 30.6 L31.6 30.2 30.55 28.3 Q29.75 26.9 28.4 26.95 L28.45 26.85 29.85 26.0 28.0 25.75 25.45 26.2 24.9 26.3 24.65 26.5 22.9 27.35 22.5 27.55 Q20.5 28.45 19.5 28.45 L17.85 28.35 17.5 28.35 17.1 28.25 15.2 27.45 13.7 26.75 13.55 26.65 12.8 26.4 12.55 26.4 8.7 26.4 Q9.45 26.9 9.7 27.55 L6.25 26.85 5.45 26.85 5.45 26.95 6.1 28.0 5.4 27.75 4.85 27.6 4.85 27.8 6.9 31.25 6.95 31.3 6.45 31.8 5.45 32.95 5.35 33.1 Q5.7 42.5 6.35 44.75 L5.1 45.0 3.3 36.1 1.8 35.1 1.7 34.7 M1.65 34.55 L1.55 34.3 1.3 32.95 0.3 28.05 0.15 27.45 0.0 26.8 0.0 26.75 0.0 26.65 0.0 26.55 Q0.05 25.35 0.65 24.25 L-0.25 24.2 -1.6 24.25 -1.7 24.25 -1.6 24.2 0.9 23.1 -0.2 22.9 -1.2 22.6 -1.2 22.55 Q0.3 22.6 2.1 21.9 L2.15 21.9 3.1 21.45 3.8 20.95 Q4.25 20.6 5.05 20.2 L11.0 17.2 Q9.3 14.5 9.3 11.85 9.3 8.75 11.0 6.15 L8.0 7.7 7.95 7.8 7.8 7.8 8.0 7.7 Q8.65 6.65 10.45 5.2 12.25 3.75 14.5 2.6 L14.75 2.4 15.5 2.0 M17.05 1.25 L17.7 1.05 19.05 0.6 20.55 0.25 23.7 0.05 Q25.5 0.1 27.25 1.6 L28.85 3.3 Q30.95 5.95 31.1 9.65 L31.35 9.05 Q31.65 8.4 31.65 6.75 L31.6 5.95 M16.25 19.45 Q15.1 20.3 13.9 20.3 13.3 20.3 12.4 19.45 L12.2 19.25 M0.05 26.75 L0.15 27.45 M30.25 19.1 Q31.25 20.2 32.7 21.0 M17.05 1.25 Q16.2 1.6 15.5 2.0 M15.05 15.0 L15.0 15.0 14.0 15.3 Q13.2 12.65 13.2 10.95 13.2 10.0 14.2 9.5 15.1 9.05 16.55 9.05 18.25 9.05 18.85 10.8 19.2 11.85 19.2 14.05 19.2 15.25 18.6 16.5 L17.55 18.1 16.25 19.45 M11.0 17.2 L11.75 18.3 11.9 18.65 12.25 19.25 12.4 19.45 M17.1 28.25 L17.85 28.35 M24.5 26.4 L24.9 26.3 M12.55 26.4 Q12.85 26.25 13.55 26.65 L13.7 26.65 13.7 26.75 M0.0 26.65 L0.05 26.75 M31.75 30.45 L31.6 30.2 M21.25 49.7 L21.5 49.7 21.5 49.75 19.75 52.35 19.05 51.5 Q18.75 51.65 18.85 52.15 L18.65 52.25 17.95 51.55 17.1 50.7 Q17.9 50.7 21.25 49.7" fill="none" stroke="#a36a6a" stroke-linecap="round" stroke-linejoin="round" stroke-opacity="0.6" stroke-width="0.05"/>
  </g>
  <defs>
    <radialGradient cx="0" cy="0" gradientTransform="matrix(0.0279, 0.0, 0.0, 0.0279, 22.65, 2.45)" gradientUnits="userSpaceOnUse" id="gradient0" r="819.2" spreadMethod="pad">
      <stop offset="0.0" stop-color="#ffffff"/>
      <stop offset="0.3137254901960784" stop-color="#f2eaea"/>
      <stop offset="0.6823529411764706" stop-color="#e0cbcb"/>
      <stop offset="0.7607843137254902" stop-color="#cca9a9"/>
      <stop offset="1.0" stop-color="#e0cbcb"/>
    </radialGradient>
    <radialGradient cx="0" cy="0" gradientTransform="matrix(0.0474, 0.0, 0.0, 0.038, -3.4, 19.55)" gradientUnits="userSpaceOnUse" id="gradient1" r="819.2" spreadMethod="pad">
      <stop offset="0.0" stop-color="#ffffff"/>
      <stop offset="0.3137254901960784" stop-color="#f2eaea"/>
      <stop offset="0.6823529411764706" stop-color="#e0cbcb"/>
      <stop offset="0.7607843137254902" stop-color="#cca9a9"/>
      <stop offset="1.0" stop-color="#e0cbcb"/>
    </radialGradient>
  </defs>
</svg>
