<?xml version="1.0" encoding="UTF-8" standalone="no"?>
<svg xmlns:xlink="http://www.w3.org/1999/xlink" height="34.0px" width="260.45px" xmlns="http://www.w3.org/2000/svg">
  <g transform="matrix(1.0, 0.0, 0.0, 1.0, 16.0, 17.0)">
    <path d="M-16.0 0.0 Q-16.0 -7.05 -11.05 -12.05 -6.2 -16.85 0.6 -17.0 L0.6 17.0 Q-6.2 16.85 -11.05 12.0 -16.0 7.05 -16.0 0.0" fill="#ffffff" fill-rule="evenodd" stroke="none"/>
    <path d="M6.5 -15.4 L7.15 -14.6 6.55 -14.2 11.05 -14.4 11.0 -14.45 11.05 -14.45 16.05 -14.15 Q19.5 -13.6 21.35 -12.85 L20.7 -12.4 29.45 -12.3 29.5 -12.3 47.8 -12.0 54.65 -11.9 57.8 -11.05 61.65 -11.05 62.55 -11.75 92.85 -11.25 93.25 -11.2 Q117.45 -11.05 139.5 -10.55 L155.15 -9.75 161.3 -9.35 161.6 -9.35 161.95 -9.3 161.95 -8.8 137.3 -8.6 137.3 -8.5 Q148.05 -7.95 163.95 -7.95 L175.65 -8.15 187.2 -8.6 190.0 -8.5 Q190.75 -8.4 192.4 -7.5 L191.7 -6.3 Q191.1 -5.8 190.1 -5.6 L186.9 -5.5 170.1 -4.65 182.45 -4.2 192.15 -4.75 199.45 -5.25 204.9 -4.35 Q204.6 -3.55 202.95 -3.45 L202.8 -3.3 204.1 -3.25 Q206.6 -3.1 207.15 -2.2 206.6 -1.25 198.75 -0.9 L186.45 -0.45 200.1 -0.35 Q206.95 -0.2 206.95 -0.45 L205.95 -0.65 215.2 -0.85 218.15 -0.75 222.6 0.0 Q221.1 1.45 216.85 1.8 L216.0 1.85 210.25 2.2 212.75 2.6 213.15 2.7 Q214.7 3.05 215.3 3.55 214.65 4.8 212.7 4.9 L209.35 4.85 202.5 5.5 193.15 5.05 182.9 5.5 182.85 5.55 185.8 6.2 187.8 6.85 188.4 7.3 Q186.75 7.95 183.95 8.1 L178.7 8.15 160.95 7.7 152.95 7.95 158.6 8.55 163.1 9.25 139.55 10.55 109.95 11.05 107.5 11.1 93.55 11.25 90.95 11.25 90.0 11.25 89.8 11.25 84.8 11.35 84.2 11.25 76.0 11.2 75.9 11.3 75.9 11.5 75.45 11.5 47.8 11.95 47.75 11.95 29.5 12.25 29.45 12.25 25.45 12.3 25.6 12.5 Q17.9 14.6 6.65 14.2 7.15 14.25 7.7 14.6 L7.5 15.2 6.9 15.75 Q4.15 16.9 0.9 17.0 L0.4 17.0 0.0 17.0 0.0 -17.0 0.4 -17.0 0.9 -17.0 3.7 -16.7 4.3 -16.5 Q5.75 -16.0 6.5 -15.4 M0.5 -12.95 L0.35 -12.95 0.5 -12.85 0.5 -12.95 M19.05 -5.6 L19.05 -5.4 19.2 -5.4 19.4 -5.6 19.05 -5.6 M46.95 1.55 L46.95 1.5 46.6 1.5 46.95 1.55 M48.85 8.15 L47.25 8.45 48.9 8.45 48.85 8.15" fill="#ffffff" fill-rule="evenodd" stroke="none"/>
    <path d="M7.5 15.2 L7.7 14.6 Q7.15 14.25 6.65 14.2 17.9 14.6 25.6 12.5 L25.45 12.3 29.45 12.25 29.5 12.25 47.75 11.95 47.8 11.95 75.45 11.5 75.9 11.5 75.9 11.3 76.0 11.2 84.2 11.25 84.8 11.35 89.8 11.25 90.0 11.25 90.95 11.25 93.55 11.25 107.5 11.1 109.95 11.05 139.55 10.55 163.1 9.25 158.6 8.55 152.95 7.95 160.95 7.7 178.7 8.15 183.95 8.1 Q186.75 7.95 188.4 7.3 L187.8 6.85 185.8 6.2 182.85 5.55 182.9 5.5 193.15 5.05 202.5 5.5 209.35 4.85 212.7 4.9 Q214.65 4.8 215.3 3.55 214.7 3.05 213.15 2.7 L212.75 2.6 210.25 2.2 216.0 1.85 216.85 1.8 Q221.1 1.45 222.6 0.0 L218.15 -0.75 215.2 -0.85 205.95 -0.65 206.95 -0.45 Q206.95 -0.2 200.1 -0.35 L186.45 -0.45 198.75 -0.9 Q206.6 -1.25 207.15 -2.2 206.6 -3.1 204.1 -3.25 L202.8 -3.3 202.95 -3.45 Q204.6 -3.55 204.9 -4.35 L199.45 -5.25 192.15 -4.75 182.45 -4.2 170.1 -4.65 186.9 -5.5 190.1 -5.6 Q191.1 -5.8 191.7 -6.3 L192.4 -7.5 Q190.75 -8.4 190.0 -8.5 L187.2 -8.6 175.65 -8.15 163.95 -7.95 Q148.05 -7.95 137.3 -8.5 L137.3 -8.6 161.95 -8.8 161.95 -9.3 161.6 -9.35 161.3 -9.35 155.15 -9.75 139.5 -10.55 Q117.45 -11.05 93.25 -11.2 L92.85 -11.25 62.55 -11.75 61.65 -11.05 57.8 -11.05 54.65 -11.9 47.8 -12.0 29.5 -12.3 29.45 -12.3 20.7 -12.4 21.35 -12.85 Q19.5 -13.6 16.05 -14.15 L11.05 -14.45 11.0 -14.45 11.05 -14.4 6.55 -14.2 7.15 -14.6 6.5 -15.4 6.9 -15.25 7.1 -15.2 37.4 -14.8 57.15 -14.5 106.0 -13.75 106.15 -13.7 Q132.3 -13.55 156.15 -13.05 L168.95 -12.5 171.0 -11.7 Q170.5 -11.25 167.45 -11.0 L163.5 -10.8 165.45 -10.6 177.2 -11.35 182.25 -11.7 196.35 -10.55 196.3 -10.45 198.55 -9.7 Q198.4 -9.0 197.3 -8.65 L197.3 -8.6 204.95 -8.8 210.65 -8.45 216.4 -7.5 Q216.05 -7.15 215.45 -6.95 L215.35 -6.8 220.45 -6.8 Q224.6 -6.65 225.7 -4.85 224.15 -3.45 219.55 -2.9 L213.1 -2.2 222.3 -2.8 230.4 -2.85 236.05 -2.85 Q240.9 -2.6 240.9 -1.3 240.9 0.25 233.65 1.3 L224.8 2.2 Q233.85 2.25 233.85 3.4 233.85 4.8 221.05 6.15 L207.6 6.4 210.05 6.95 Q211.75 7.1 212.25 7.5 211.55 8.45 209.15 8.45 L205.2 8.15 196.15 8.15 198.4 8.8 Q199.55 9.15 199.65 10.15 L199.65 10.25 198.8 10.35 194.3 10.75 156.15 13.05 106.25 13.75 106.1 13.7 57.15 14.45 37.4 14.75 7.5 15.2 M48.85 8.15 L48.9 8.45 47.25 8.45 48.85 8.15 M46.95 1.55 L46.6 1.5 46.95 1.5 46.95 1.55 M19.05 -5.6 L19.4 -5.6 19.2 -5.4 19.05 -5.4 19.05 -5.6" fill="#fefd81" fill-rule="evenodd" stroke="none"/>
    <path d="M6.5 -15.4 Q5.75 -16.0 4.3 -16.5 L3.7 -16.7 7.1 -15.7 37.4 -15.3 57.15 -15.0 106.15 -14.25 106.15 -14.2 Q132.35 -14.05 156.15 -13.55 L161.1 -13.35 166.55 -13.1 186.2 -11.9 196.55 -11.0 205.75 -10.1 Q244.45 -5.9 244.45 0.0 244.45 5.9 205.75 10.1 183.7 12.55 156.15 13.55 L106.1 14.25 106.1 14.2 57.15 14.95 37.4 15.25 7.1 15.7 6.9 15.75 7.5 15.2 37.4 14.75 57.15 14.45 106.1 13.7 106.25 13.75 156.15 13.05 194.3 10.75 198.8 10.35 199.65 10.25 199.65 10.15 Q199.55 9.15 198.4 8.8 L196.15 8.15 205.2 8.15 209.15 8.45 Q211.55 8.45 212.25 7.5 211.75 7.1 210.05 6.95 L207.6 6.4 221.05 6.15 Q233.85 4.8 233.85 3.4 233.85 2.25 224.8 2.2 L233.65 1.3 Q240.9 0.25 240.9 -1.3 240.9 -2.6 236.05 -2.85 L230.4 -2.85 222.3 -2.8 213.1 -2.2 219.55 -2.9 Q224.15 -3.45 225.7 -4.85 224.6 -6.65 220.45 -6.8 L215.35 -6.8 215.45 -6.95 Q216.05 -7.15 216.4 -7.5 L210.65 -8.45 204.95 -8.8 197.3 -8.6 197.3 -8.65 Q198.4 -9.0 198.55 -9.7 L196.3 -10.45 196.35 -10.55 182.25 -11.7 177.2 -11.35 165.45 -10.6 163.5 -10.8 167.45 -11.0 Q170.5 -11.25 171.0 -11.7 L168.95 -12.5 156.15 -13.05 Q132.3 -13.55 106.15 -13.7 L106.0 -13.75 57.15 -14.5 37.4 -14.8 7.1 -15.2 6.9 -15.25 6.5 -15.4 M0.5 -12.95 L0.5 -12.85 0.35 -12.95 0.5 -12.95" fill="#f7de09" fill-rule="evenodd" stroke="none"/>
  </g>
</svg>
