<?xml version="1.0" encoding="UTF-8" standalone="no"?>
<svg xmlns:xlink="http://www.w3.org/1999/xlink" height="29.05px" width="45.25px" xmlns="http://www.w3.org/2000/svg">
  <g transform="matrix(1.0, 0.0, 0.0, 1.0, 22.65, 14.5)">
    <path d="M1.3 -8.85 L13.9 -13.9 14.45 -13.3 Q14.45 -13.3 14.55 -13.25 L19.65 -6.45 19.9 -6.1 19.9 -6.05 21.4 -3.8 21.55 -3.55 22.0 -2.85 21.55 -2.15 21.45 -1.95 21.4 -1.9 21.35 -1.85 21.25 -1.7 21.2 -1.65 18.7 1.7 14.8 5.95 13.7 7.0 Q10.95 7.15 8.45 8.0 L8.35 8.05 Q5.1 9.15 2.5 11.35 L2.4 11.45 1.0 12.75 0.95 12.8 0.0 13.8 -0.75 13.05 -0.9 12.85 -2.35 11.55 -2.4 11.5 -2.55 11.3 -2.55 11.35 Q-5.25 9.05 -8.5 8.0 -11.1 7.15 -13.75 7.0 L-14.9 5.95 -18.75 1.75 -18.75 1.7 -21.25 -1.65 -21.4 -1.85 -21.55 -2.1 -21.6 -2.1 -21.65 -2.2 -21.7 -2.2 -22.05 -2.85 -21.7 -3.45 -21.7 -3.4 -21.55 -3.6 -21.5 -3.65 -19.95 -6.05 -19.7 -6.5 -14.6 -13.25 -14.5 -13.3 -14.0 -13.9 -1.4 -8.85 Q-0.05 -8.25 1.35 -8.85 L1.3 -8.85" fill="url(#gradient0)" fill-rule="evenodd" stroke="none"/>
    <path d="M1.3 -8.85 L1.35 -8.85 Q-0.05 -8.25 -1.4 -8.85 L-14.0 -13.9 -14.5 -13.3 -14.6 -13.25 -19.7 -6.5 -19.95 -6.05 -21.5 -3.65 -21.55 -3.6 -21.7 -3.4 -21.7 -3.45 -22.05 -2.85 -21.7 -2.2 -21.65 -2.2 -21.6 -2.1 -21.55 -2.1 -21.4 -1.85 -21.25 -1.65 -18.75 1.7 -18.75 1.75 -14.9 5.95 -13.75 7.0 Q-11.1 7.15 -8.5 8.0 -5.25 9.05 -2.55 11.35 L-2.55 11.3 -2.4 11.5 -2.35 11.55 -0.9 12.85 -0.75 13.05 0.0 13.8 0.95 12.8 1.0 12.75 2.4 11.45 2.5 11.35 Q5.1 9.15 8.35 8.05 L8.45 8.0 Q10.95 7.15 13.7 7.0 L14.8 5.95 18.7 1.7 21.2 -1.65 21.25 -1.7 21.35 -1.85 21.4 -1.9 21.45 -1.95 21.55 -2.15 22.0 -2.85 21.55 -3.55 21.4 -3.8 19.9 -6.05 19.9 -6.1 19.65 -6.45 14.55 -13.25 Q14.45 -13.3 14.45 -13.3 L13.9 -13.9 1.3 -8.85 M14.75 -13.75 L20.1 -6.7 20.3 -6.35 21.85 -4.05 21.95 -3.8 22.6 -2.85 21.95 -1.85 21.9 -1.75 21.85 -1.6 21.8 -1.6 21.75 -1.5 21.6 -1.4 19.1 2.05 19.05 2.05 15.15 6.3 13.9 7.5 Q11.15 7.6 8.6 8.5 L8.65 8.5 Q5.4 9.5 2.85 11.7 L2.7 11.85 1.25 13.25 1.3 13.15 0.15 14.35 0.0 14.55 -0.05 14.5 -1.15 13.35 -1.3 13.2 -2.75 11.85 -2.9 11.7 Q-5.5 9.5 -8.65 8.5 -11.25 7.6 -14.0 7.5 L-15.25 6.3 -19.15 2.05 -21.7 -1.4 -21.8 -1.55 -22.0 -1.8 -22.05 -1.85 -22.1 -1.9 -22.65 -2.85 -22.1 -3.7 -21.95 -3.9 -20.35 -6.35 -20.15 -6.7 -14.85 -13.75 -14.9 -13.65 -14.1 -14.5 -1.2 -9.3 Q-0.05 -8.8 1.15 -9.3 L14.05 -14.5 14.8 -13.65 14.75 -13.75" fill="#fa8b04" fill-rule="evenodd" stroke="none"/>
  </g>
  <defs>
    <radialGradient cx="0" cy="0" gradientTransform="matrix(0.0374, 0.0, 0.0, 0.0374, -0.15, 10.6)" gradientUnits="userSpaceOnUse" id="gradient0" r="819.2" spreadMethod="pad">
      <stop offset="0.0" stop-color="#fa8b04"/>
      <stop offset="0.5254901960784314" stop-color="#fab404"/>
      <stop offset="1.0" stop-color="#ffe100"/>
    </radialGradient>
  </defs>
</svg>
