<?xml version="1.0" encoding="UTF-8" standalone="no"?>
<svg xmlns:xlink="http://www.w3.org/1999/xlink" height="128.25px" width="198.9px" xmlns="http://www.w3.org/2000/svg">
  <g transform="matrix(1.0, 0.0, 0.0, 1.0, 73.1, -120.6)">
    <path d="M4.0 134.05 L3.9 133.85 4.05 133.1 4.1 132.9 Q4.6 130.95 4.9 127.05 L5.0 124.05 5.05 121.7 5.05 120.6 45.85 120.6 45.9 121.7 45.95 123.7 46.0 124.05 46.6 127.05 48.5 137.75 47.4 134.9 46.15 136.65 42.35 141.2 39.9 144.0 40.7 142.65 40.65 142.7 39.35 143.65 39.3 143.65 39.55 143.85 39.9 144.0 35.25 151.5 26.85 164.05 26.65 163.95 33.15 147.95 33.8 146.4 Q29.8 147.75 25.05 147.75 19.75 147.75 15.2 145.35 L15.5 146.85 Q17.2 154.0 18.9 157.7 L17.45 155.4 13.7 149.35 Q11.75 145.9 10.5 142.05 8.15 139.95 6.1 137.15 L5.7 136.6 4.0 134.05 M115.6 194.7 L115.9 195.55 115.6 195.55 115.6 194.7 M83.25 245.45 L83.2 245.65 82.9 248.85 47.85 248.85 Q46.15 246.55 44.55 243.5 41.75 238.1 39.75 231.2 38.9 228.45 38.4 225.8 20.0 230.6 10.25 233.3 L9.85 232.8 9.85 233.4 Q9.6 237.7 6.45 243.0 4.45 246.4 1.65 248.85 L-15.55 248.85 Q-3.6 248.25 5.55 237.25 L6.75 235.7 8.1 233.85 9.9 231.15 27.55 226.15 Q33.55 224.45 38.25 223.3 L39.8 222.9 40.0 223.4 40.65 225.2 41.15 226.45 Q43.25 231.9 46.05 236.05 54.8 249.3 69.8 248.75 74.8 248.5 80.5 246.8 81.8 246.4 83.0 245.65 L83.25 245.45 M-19.1 248.85 L-31.75 248.85 -32.45 244.5 -31.65 245.25 Q-30.4 246.1 -29.0 246.55 -23.8 248.4 -19.1 248.8 L-19.1 248.85 M-45.3 248.5 L-45.4 248.85 -73.1 248.85 -73.05 248.5 -70.1 248.5 -54.9 248.5 -45.3 248.5 M-55.75 174.4 L-55.3 173.45 -54.7 173.4 -55.75 174.4 M-23.8 161.35 L-23.25 161.1 -23.6 161.55 -23.8 161.35 M63.5 155.15 Q65.65 157.35 68.9 161.5 70.9 164.0 72.45 166.9 L73.1 168.3 74.05 170.55 Q75.15 173.3 75.9 176.4 77.95 185.15 78.15 192.6 L74.35 191.1 74.35 191.0 Q74.35 188.4 73.3 180.0 72.2 171.25 71.5 169.3 L70.55 166.9 Q69.25 164.05 67.2 160.85 L63.5 155.15 M80.0 194.2 L80.2 194.35 80.2 194.4 80.0 194.2 M39.35 219.55 L39.45 219.65 39.4 219.8 34.45 220.95 34.3 221.0 25.65 217.85 19.05 221.65 11.45 226.1 11.75 224.35 11.8 224.15 Q12.1 223.95 12.35 223.85 L21.45 217.65 22.8 216.7 26.5 214.25 Q27.1 214.4 27.65 214.75 L29.55 215.5 39.35 219.55 M38.9 207.15 L38.9 209.75 34.95 212.2 32.7 211.55 31.25 211.15 38.0 207.1 38.9 207.15 M34.7 206.0 L32.9 207.05 25.3 207.05 19.45 207.25 16.75 206.0 34.7 206.0 M13.05 208.75 L17.15 210.4 17.25 210.45 23.05 212.8 19.05 215.25 12.85 212.75 12.95 211.2 13.05 208.75 M16.1 205.65 L16.1 206.0 13.35 203.95 15.95 205.6 16.1 205.65 M-17.7 158.85 L-17.45 158.95 -21.8 166.9 -23.45 169.8 Q-26.75 176.75 -26.75 185.6 L-26.7 191.45 -26.65 192.05 -29.1 194.65 Q-29.85 187.5 -28.65 180.9 -27.6 174.95 -24.85 169.5 L-24.05 167.9 -23.0 166.05 -22.6 165.4 Q-20.5 162.0 -17.7 158.85" fill="#c98962" fill-rule="evenodd" stroke="none"/>
    <path d="M39.55 143.85 L39.3 143.65 39.35 143.65 39.55 143.85" fill="#ba7d5b" fill-rule="evenodd" stroke="none"/>
    <path d="M61.05 153.25 L60.75 153.15 60.95 152.85 61.1 152.6 Q63.05 149.7 68.0 154.35 L70.2 156.75 70.4 156.95 71.55 158.45 72.75 160.35 73.1 161.35 73.1 161.55 75.75 166.9 76.15 167.85 77.1 170.1 79.25 176.1 Q82.1 185.45 82.1 193.75 L82.05 195.65 82.05 195.8 82.0 195.8 80.25 194.4 80.2 194.35 80.0 194.2 78.15 192.6 Q77.95 185.15 75.9 176.4 75.15 173.3 74.05 170.55 L73.1 168.3 72.45 166.9 Q70.9 164.0 68.9 161.5 65.65 157.35 63.5 155.15 L62.25 153.9 61.35 153.4 61.15 153.3 61.05 153.25 M-23.25 161.1 L-23.0 160.75 -22.65 160.25 -20.25 157.5 Q-16.35 153.45 -15.25 155.1 L-15.0 155.9 Q-15.9 155.95 -16.2 156.65 L-16.4 157.75 -16.65 157.7 -17.1 158.2 -17.7 158.85 Q-20.5 162.0 -22.6 165.4 L-23.0 166.05 -24.05 167.9 -24.85 169.5 Q-27.6 174.95 -28.65 180.9 -29.85 187.5 -29.1 194.65 L-29.1 194.95 -33.05 198.75 -33.2 197.6 -33.35 196.3 Q-34.6 186.5 -32.1 177.8 -30.85 173.25 -28.5 169.05 L-27.45 167.25 -27.25 166.85 -25.0 163.55 -24.0 162.05 -23.6 161.55 -23.25 161.1 M39.4 219.8 L39.8 222.6 39.8 222.9 38.25 223.3 Q33.55 224.45 27.55 226.15 L9.9 231.15 11.15 227.5 Q20.3 224.45 34.3 221.0 L34.45 220.95 39.4 219.8 M40.1 202.9 L38.9 206.0 34.7 206.0 16.75 206.0 16.1 206.0 16.1 205.65 15.95 205.6 13.35 203.95 16.1 206.0 12.95 206.0 11.7 202.8 40.15 202.8 40.1 202.9 M-17.3 157.65 Q-17.55 157.65 -18.0 158.1 L-17.2 157.65 -17.3 157.65" fill="#bb86df" fill-rule="evenodd" stroke="none"/>
    <path d="M72.9 219.9 Q80.85 226.5 80.85 232.35 80.85 238.35 77.25 241.35 73.85 244.25 67.55 244.25 59.85 244.25 52.5 240.5 48.4 238.4 46.05 236.05 43.25 231.9 41.15 226.45 L42.55 227.95 47.5 232.4 48.2 232.4 48.2 230.6 Q47.45 229.4 44.5 227.5 42.1 225.9 41.4 225.6 L41.4 225.25 44.95 225.6 51.1 224.85 Q53.95 224.1 53.95 222.9 53.95 222.4 53.35 221.9 52.6 221.25 51.1 220.55 47.95 219.1 44.45 219.1 42.3 219.1 40.7 219.9 L39.85 220.35 Q40.3 216.85 42.55 214.85 45.35 212.3 50.75 212.3 56.8 212.3 66.95 217.15 L72.9 219.9 M40.65 201.75 L42.6 200.15 Q46.5 197.0 48.25 196.0 L45.05 199.55 Q41.85 202.65 40.3 203.0 L40.3 203.35 Q44.1 201.0 45.9 200.3 48.15 199.4 50.9 199.4 L54.3 199.75 Q53.85 200.8 49.15 202.75 L43.9 204.8 47.05 204.3 49.8 204.05 Q50.7 204.05 52.15 204.8 52.15 206.8 46.4 208.85 41.7 210.5 38.9 210.3 L38.9 209.75 38.9 207.15 38.9 206.55 38.9 206.0 40.1 202.9 40.3 203.0 40.15 202.8 40.65 201.75 M11.75 224.35 L11.45 226.1 11.15 227.5 9.9 231.15 8.1 233.85 6.75 235.7 5.55 237.25 Q3.25 239.45 -2.0 241.6 -8.6 244.25 -13.25 244.25 -17.6 244.25 -20.25 241.35 -22.75 238.7 -22.75 234.85 -22.75 226.1 -13.8 218.75 -8.8 214.7 -3.9 213.05 -0.95 212.3 1.4 212.3 L4.75 212.6 Q7.75 213.15 9.6 214.85 11.95 216.95 12.35 220.7 L12.0 223.1 8.8 221.65 6.25 221.65 Q6.2 222.5 7.1 223.05 L9.15 224.15 9.2 224.35 9.5 224.5 Q6.85 224.65 2.95 227.95 -0.55 230.9 -1.95 233.45 0.8 233.0 6.35 228.8 L6.9 228.4 11.75 224.35 M11.2 201.7 L11.35 202.05 11.7 202.8 12.95 206.0 12.7 206.2 5.55 206.95 2.5 206.7 -1.25 206.2 Q2.35 204.4 5.0 203.95 7.85 203.4 11.25 204.05 9.8 203.5 6.95 201.7 3.95 199.8 3.05 199.4 L5.2 199.4 8.75 200.65 11.2 201.7 M12.95 206.2 L13.05 208.75 12.95 211.2 4.1 211.2 Q5.55 209.9 8.05 208.55 L8.3 208.4 12.7 206.2 12.95 206.2" fill="#ddc2ef" fill-rule="evenodd" stroke="none"/>
    <path d="M78.15 192.6 L80.0 194.2 80.2 194.4 80.25 194.4 82.0 195.8 82.05 195.8 Q86.9 199.9 89.85 206.2 L91.0 209.15 91.0 209.25 91.05 210.7 Q91.05 216.2 87.85 219.1 84.7 222.0 78.9 222.0 77.7 222.0 72.9 219.9 L66.95 217.15 Q56.8 212.3 50.75 212.3 45.35 212.3 42.55 214.85 40.3 216.85 39.85 220.35 L39.8 220.7 39.8 222.6 39.4 219.8 39.45 219.65 39.35 219.55 38.9 213.35 38.9 210.3 Q41.7 210.5 46.4 208.85 52.15 206.8 52.15 204.8 50.7 204.05 49.8 204.05 L47.05 204.3 43.9 204.8 49.15 202.75 Q53.85 200.8 54.3 199.75 L50.9 199.4 Q48.15 199.4 45.9 200.3 44.1 201.0 40.3 203.35 L40.3 203.0 Q41.85 202.65 45.05 199.55 L48.25 196.0 Q46.5 197.0 42.6 200.15 L40.65 201.75 41.2 200.8 Q52.8 183.3 74.35 191.1 L78.15 192.6 M51.45 194.45 L51.45 196.55 60.3 198.75 Q66.8 200.3 69.35 201.55 L62.4 201.95 Q58.75 202.85 57.9 204.8 62.9 206.95 70.35 208.35 L71.4 208.55 Q67.6 208.25 64.75 210.05 67.25 211.35 79.75 213.55 L81.8 213.0 Q80.15 210.65 74.9 209.2 L73.95 208.95 84.4 209.8 85.85 209.8 Q86.95 209.6 86.95 208.55 86.95 208.2 85.6 207.15 L84.05 205.85 85.5 205.75 86.55 204.8 81.35 198.85 78.35 196.0 Q76.45 194.3 74.15 193.25 70.35 191.5 65.6 191.5 57.65 191.5 51.45 194.45 M40.15 202.8 L40.3 203.0 40.1 202.9 40.15 202.8 M11.2 201.7 L8.75 200.65 5.2 199.4 3.05 199.4 Q3.95 199.8 6.95 201.7 9.8 203.5 11.25 204.05 7.85 203.4 5.0 203.95 2.35 204.4 -1.25 206.2 L2.5 206.7 5.55 206.95 12.7 206.2 12.95 206.0 12.95 206.2 12.7 206.2 8.3 208.4 8.05 208.55 Q5.55 209.9 4.1 211.2 L12.95 211.2 12.85 212.75 12.55 219.35 12.35 220.7 Q11.95 216.95 9.6 214.85 7.75 213.15 4.75 212.6 L1.4 212.3 Q-0.95 212.3 -3.9 213.05 -8.55 214.2 -14.75 217.15 -24.85 222.0 -26.75 222.0 -32.55 222.0 -35.7 219.1 -38.9 216.2 -38.9 210.7 L-38.45 207.3 -38.0 206.2 Q-35.9 202.05 -33.05 198.75 L-29.1 194.95 -26.55 193.15 -25.85 192.7 -24.8 192.1 -24.1 191.7 -22.8 191.1 -19.6 189.8 Q-0.9 183.15 10.7 200.8 L11.2 201.7 M-27.0 197.2 Q-30.95 200.0 -33.55 202.25 L-33.55 203.0 -29.6 203.0 -24.9 202.0 Q-24.85 202.3 -24.65 202.1 L-24.45 202.3 -23.85 202.35 -22.55 202.1 -21.7 201.8 -21.8 201.9 -23.4 202.85 Q-24.3 203.4 -24.3 203.95 L-24.25 204.5 -29.25 205.85 -29.25 206.95 -27.1 206.95 Q-23.65 206.3 -16.15 204.25 L-6.3 201.2 -10.25 200.8 -11.1 200.8 -11.35 200.4 Q-11.85 199.8 -13.1 199.8 -14.0 199.8 -15.5 200.35 L-15.45 200.15 Q-15.35 199.7 -15.4 198.95 L-13.2 198.1 Q-6.8 195.65 -1.65 196.9 -1.65 196.55 -1.3 196.55 -1.9 193.55 -8.55 192.6 L-17.6 192.2 Q-20.35 193.2 -23.0 194.7 L-23.75 195.15 Q-24.95 195.8 -26.1 196.6 L-27.0 197.2 M-34.25 211.95 L-34.1 212.55 -33.8 212.75 -32.8 212.85 Q-30.75 212.85 -25.1 210.5 -18.25 207.65 -15.8 207.05 -18.65 206.0 -26.4 208.05 -34.25 210.1 -34.25 211.95" fill="#f4e3ff" fill-rule="evenodd" stroke="none"/>
    <path d="M51.45 194.45 Q57.65 191.5 65.6 191.5 70.35 191.5 74.15 193.25 76.45 194.3 78.35 196.0 L81.35 198.85 86.55 204.8 85.5 205.75 84.05 205.85 85.6 207.15 Q86.95 208.2 86.95 208.55 86.95 209.6 85.85 209.8 L84.4 209.8 73.95 208.95 74.9 209.2 Q80.15 210.65 81.8 213.0 L79.75 213.55 Q67.25 211.35 64.75 210.05 67.6 208.25 71.4 208.55 L70.35 208.35 Q62.9 206.95 57.9 204.8 58.75 202.85 62.4 201.95 L69.35 201.55 Q66.8 200.3 60.3 198.75 L51.45 196.55 51.45 194.45 M-27.0 197.2 L-26.1 196.6 Q-24.95 195.8 -23.75 195.15 L-23.0 194.7 Q-20.35 193.2 -17.6 192.2 L-8.55 192.6 Q-1.9 193.55 -1.3 196.55 -1.65 196.55 -1.65 196.9 -6.8 195.65 -13.2 198.1 L-15.4 198.95 Q-15.35 199.7 -15.45 200.15 L-15.5 200.35 Q-14.0 199.8 -13.1 199.8 -11.85 199.8 -11.35 200.4 L-11.1 200.8 -10.25 200.8 -6.3 201.2 -16.15 204.25 Q-23.65 206.3 -27.1 206.95 L-29.25 206.95 -29.25 205.85 -24.25 204.5 -24.3 203.95 Q-24.3 203.4 -23.4 202.85 L-21.8 201.9 -21.7 201.8 -22.55 202.1 -23.85 202.35 -24.45 202.3 -24.65 202.1 Q-24.85 202.3 -24.9 202.0 L-29.6 203.0 -33.55 203.0 -33.55 202.25 Q-30.95 200.0 -27.0 197.2 M-34.25 211.95 Q-34.25 210.1 -26.4 208.05 -18.65 206.0 -15.8 207.05 -18.25 207.65 -25.1 210.5 -30.75 212.85 -32.8 212.85 L-33.8 212.75 -34.1 212.55 -34.25 211.95" fill="#faf2ff" fill-rule="evenodd" stroke="none"/>
    <path d="M80.2 194.35 L80.25 194.4 80.2 194.4 80.2 194.35" fill="#f8dcdc" fill-rule="evenodd" stroke="none"/>
    <path d="M91.45 233.8 L91.35 234.0 91.25 234.2 Q90.25 236.7 88.85 239.2 L87.05 240.75 87.1 241.45 83.25 245.45 83.0 245.65 Q81.8 246.4 80.5 246.8 74.8 248.5 69.8 248.75 54.8 249.3 46.05 236.05 48.4 238.4 52.5 240.5 59.85 244.25 67.55 244.25 73.85 244.25 77.25 241.35 80.85 238.35 80.85 232.35 80.85 226.5 72.9 219.9 77.7 222.0 78.9 222.0 84.7 222.0 87.85 219.1 91.05 216.2 91.05 210.7 L91.0 209.25 91.05 209.4 Q95.65 222.3 91.45 233.8 M-15.55 248.85 L-17.3 248.85 -19.1 248.8 Q-23.8 248.4 -29.0 246.55 -30.4 246.1 -31.65 245.25 L-32.45 244.5 -35.2 241.8 -36.0 240.6 -35.95 240.5 -35.95 240.4 -35.9 239.8 Q-35.9 238.95 -36.1 240.45 L-36.8 239.25 -38.15 236.55 Q-44.8 222.3 -38.45 207.3 L-38.9 210.7 Q-38.9 216.2 -35.7 219.1 -32.55 222.0 -26.75 222.0 -24.85 222.0 -14.75 217.15 -8.55 214.2 -3.9 213.05 -8.8 214.7 -13.8 218.75 -22.75 226.1 -22.75 234.85 -22.75 238.7 -20.25 241.35 -17.6 244.25 -13.25 244.25 -8.6 244.25 -2.0 241.6 3.25 239.45 5.55 237.25 -3.6 248.25 -15.55 248.85 M39.85 220.35 L40.7 219.9 Q42.3 219.1 44.45 219.1 47.95 219.1 51.1 220.55 52.6 221.25 53.35 221.9 53.95 222.4 53.95 222.9 53.95 224.1 51.1 224.85 L44.95 225.6 41.4 225.25 41.4 225.6 Q42.1 225.9 44.5 227.5 47.45 229.4 48.2 230.6 L48.2 232.4 47.5 232.4 42.55 227.95 41.15 226.45 40.65 225.2 40.0 223.4 39.8 222.9 39.8 222.6 39.8 220.7 39.85 220.35 M11.8 224.15 L11.75 224.35 6.9 228.4 6.35 228.8 Q0.8 233.0 -1.95 233.45 -0.55 230.9 2.95 227.95 6.85 224.65 9.5 224.5 L9.2 224.35 9.15 224.15 7.1 223.05 Q6.2 222.5 6.25 221.65 L8.8 221.65 12.0 223.1 11.8 224.15" fill="#ccaae3" fill-rule="evenodd" stroke="none"/>
    <path d="M38.9 206.0 L38.9 206.55 38.0 207.1 31.25 211.15 Q29.3 210.55 27.55 210.1 30.4 208.4 32.9 207.05 L34.7 206.0 38.9 206.0 M26.5 214.25 L22.8 216.7 21.45 217.65 12.35 223.85 Q12.1 223.95 11.8 224.15 L12.0 223.1 12.35 220.7 12.55 219.35 Q14.95 217.75 17.6 216.2 L19.05 215.25 23.05 212.8 26.5 214.25" fill="#923ccc" fill-rule="evenodd" stroke="none"/>
    <path d="M38.9 213.35 L39.35 219.55 29.55 215.5 27.65 214.75 Q27.1 214.4 26.5 214.25 L23.05 212.8 17.25 210.45 17.15 210.4 13.05 208.75 12.95 206.2 12.95 206.0 16.1 206.0 16.75 206.0 19.45 207.25 Q23.05 208.85 27.55 210.1 29.3 210.55 31.25 211.15 L32.7 211.55 34.95 212.2 38.9 213.35" fill="#a057d2" fill-rule="evenodd" stroke="none"/>
    <path d="M5.7 136.6 L6.1 137.15 Q8.15 139.95 10.5 142.05 11.75 145.9 13.7 149.35 L17.45 155.4 18.9 157.7 Q17.2 154.0 15.5 146.85 L15.2 145.35 Q19.75 147.75 25.05 147.75 29.8 147.75 33.8 146.4 L33.15 147.95 26.65 163.95 26.85 164.05 35.25 151.5 39.9 144.0 39.55 143.85 39.35 143.65 40.65 142.7 40.7 142.65 39.9 144.0 42.35 141.2 46.15 136.65 Q47.05 140.95 47.65 146.1 L48.8 157.9 49.15 157.9 Q49.15 156.2 49.7 151.65 L50.15 145.8 50.7 148.15 51.2 148.55 51.4 151.45 Q52.05 155.45 54.25 156.2 L58.7 157.65 Q61.7 158.7 63.05 159.6 L63.35 159.55 61.55 154.05 61.35 153.4 62.25 153.9 63.5 155.15 67.2 160.85 Q69.25 164.05 70.55 166.9 L71.5 169.3 Q72.2 171.25 73.3 180.0 74.35 188.4 74.35 191.0 L74.35 191.1 Q52.8 183.3 41.2 200.8 L40.65 201.75 40.15 202.8 11.7 202.8 11.35 202.05 11.2 201.7 10.7 200.8 Q-0.9 183.15 -19.6 189.8 -15.2 184.65 -8.0 177.75 L-8.1 177.65 Q-13.6 180.8 -21.45 187.35 L-26.65 192.05 -26.7 191.45 -26.75 185.6 Q-26.75 176.75 -23.45 169.8 L-21.8 166.9 -17.45 158.95 -17.7 158.85 -17.1 158.2 -16.65 157.7 -16.4 157.75 -16.2 156.65 Q-15.9 155.95 -15.0 155.9 L-14.8 155.9 -14.4 155.9 -14.25 155.8 -16.9 161.0 -16.75 161.25 -12.15 158.4 -7.2 155.85 Q-2.5 153.15 -1.25 148.95 L0.55 148.1 0.2 150.6 -0.35 155.5 -0.35 157.2 3.25 145.75 5.7 136.6 M70.4 156.95 L70.55 156.8 72.35 157.6 75.05 159.6 76.0 160.3 Q79.95 165.6 87.5 169.15 96.8 173.5 100.0 176.9 106.1 183.4 108.25 189.1 110.95 196.2 110.05 206.75 L111.85 205.0 115.0 215.6 Q117.1 222.8 117.95 227.05 119.3 233.75 120.55 237.95 121.8 242.0 124.4 248.85 L110.0 248.85 Q106.35 241.6 102.25 230.8 95.9 214.05 95.9 212.1 95.9 211.45 96.45 209.4 L96.95 207.0 Q96.95 206.65 90.85 202.9 84.7 199.2 84.7 196.85 84.7 195.8 86.05 192.6 L87.15 189.4 Q85.45 190.6 83.55 192.35 L82.1 193.75 Q82.1 185.45 79.25 176.1 L77.1 170.1 76.15 167.85 75.75 166.9 73.1 161.55 73.1 161.35 72.75 160.35 71.55 158.45 70.4 156.95 M47.85 248.85 L1.65 248.85 Q4.45 246.4 6.45 243.0 9.6 237.7 9.85 233.4 L9.85 232.8 10.25 233.3 Q20.0 230.6 38.4 225.8 38.9 228.45 39.75 231.2 41.75 238.1 44.55 243.5 46.15 246.55 47.85 248.85 M-17.3 248.85 L-19.1 248.85 -19.1 248.8 -17.3 248.85 M-28.15 163.6 L-28.2 163.6 -28.15 163.6 -28.05 163.55 -27.85 163.5 -27.25 163.15 -27.05 163.1 -27.0 163.05 -26.7 162.9 -23.8 161.35 -23.6 161.55 -24.0 162.05 -25.0 163.55 -27.25 166.85 -27.45 167.25 -28.5 169.05 Q-30.85 173.25 -32.1 177.8 -34.6 186.5 -33.35 196.3 L-33.2 197.6 -34.55 195.5 -36.95 191.3 -37.15 191.3 -36.55 194.55 -36.15 197.3 Q-36.15 198.7 -39.4 199.15 L-45.25 199.95 Q-45.25 200.4 -44.45 201.85 -43.65 203.25 -43.65 203.9 L-45.75 208.3 Q-48.2 213.4 -49.6 217.35 L-51.1 221.5 -52.35 227.6 -54.3 243.2 -54.9 248.5 -70.1 248.5 -67.4 238.9 Q-64.95 231.15 -64.75 227.7 -64.15 218.5 -61.0 207.4 L-59.85 208.55 Q-59.4 208.9 -58.05 209.05 L-59.05 204.15 -59.3 200.8 Q-59.3 178.05 -49.1 173.15 -38.65 169.1 -34.1 167.05 L-28.1 163.65 -28.15 163.6 M38.9 210.3 L38.9 213.35 34.95 212.2 38.9 209.75 38.9 210.3 M38.9 206.55 L38.9 207.15 38.0 207.1 38.9 206.55 M19.45 207.25 L25.3 207.05 32.9 207.05 Q30.4 208.4 27.55 210.1 23.05 208.85 19.45 207.25 M11.45 226.1 L19.05 221.65 25.65 217.85 34.3 221.0 Q20.3 224.45 11.15 227.5 L11.45 226.1 M19.05 215.25 L17.6 216.2 Q14.95 217.75 12.55 219.35 L12.85 212.75 19.05 215.25" fill="url(#gradient0)" fill-rule="evenodd" stroke="none"/>
    <path d="M4.0 134.05 L5.7 136.6 3.25 145.75 -0.35 157.2 -0.35 155.5 0.2 150.6 0.55 148.1 1.2 147.75 Q2.85 141.55 3.5 137.8 L4.0 134.05 M46.15 136.65 L47.4 134.9 48.5 137.75 48.85 139.6 49.95 144.75 50.15 145.8 49.7 151.65 Q49.15 156.2 49.15 157.9 L48.8 157.9 47.65 146.1 Q47.05 140.95 46.15 136.65 M51.2 148.55 Q52.95 149.9 55.85 151.15 L60.7 153.15 61.05 153.25 61.15 153.3 61.35 153.4 61.55 154.05 63.35 159.55 63.05 159.6 Q61.7 158.7 58.7 157.65 L54.25 156.2 Q52.05 155.45 51.4 151.45 L51.2 148.55 M76.0 160.3 L79.7 163.05 79.9 163.15 80.55 163.5 80.8 163.6 Q82.8 164.5 86.05 165.35 L86.9 165.5 89.0 166.0 89.2 166.05 92.9 166.9 Q98.35 168.25 101.2 169.5 104.7 171.0 107.35 173.4 L108.4 174.4 Q113.4 179.5 114.95 188.1 L115.1 189.0 115.4 191.25 115.6 194.7 115.6 195.55 115.9 195.55 115.85 199.8 115.6 203.7 Q115.6 208.2 118.2 218.95 L125.8 248.85 124.4 248.85 Q121.8 242.0 120.55 237.95 119.3 233.75 117.95 227.05 117.1 222.8 115.0 215.6 L111.85 205.0 110.05 206.75 Q110.95 196.2 108.25 189.1 106.1 183.4 100.0 176.9 96.8 173.5 87.5 169.15 79.95 165.6 76.0 160.3 M-73.05 248.5 L-65.55 218.95 Q-62.95 208.2 -62.95 203.7 L-63.15 199.8 -63.2 196.2 -63.0 192.0 -63.0 191.95 -62.7 189.0 -62.25 188.1 Q-60.75 179.5 -55.75 174.4 L-54.7 173.4 Q-52.05 171.0 -48.55 169.5 -44.8 167.85 -36.55 166.05 L-32.6 165.1 -28.2 163.65 -28.15 163.6 -28.1 163.65 -34.1 167.05 Q-38.65 169.1 -49.1 173.15 -59.3 178.05 -59.3 200.8 L-59.05 204.15 -58.05 209.05 Q-59.4 208.9 -59.85 208.55 L-61.0 207.4 Q-64.15 218.5 -64.75 227.7 -64.95 231.15 -67.4 238.9 L-70.1 248.5 -73.05 248.5 M-14.25 155.8 L-13.9 155.6 -13.85 155.55 -12.9 154.95 -12.45 154.65 Q-7.0 151.75 -1.25 148.95 -2.5 153.15 -7.2 155.85 L-12.15 158.4 -16.75 161.25 -16.9 161.0 -14.25 155.8 M-26.65 192.05 L-21.45 187.35 Q-13.6 180.8 -8.1 177.65 L-8.0 177.75 Q-15.2 184.65 -19.6 189.8 L-22.8 191.1 -24.1 191.7 -24.8 192.1 -25.85 192.7 -26.55 193.15 -29.1 194.95 -29.1 194.65 -26.65 192.05" fill="#f6cca2" fill-rule="evenodd" stroke="none"/>
    <path d="M110.0 248.85 L96.35 248.85 94.9 244.75 91.55 234.15 91.55 234.1 91.45 233.8 Q95.65 222.3 91.05 209.4 L91.0 209.25 91.0 209.15 89.85 206.2 Q86.9 199.9 82.05 195.8 L82.05 195.65 82.1 193.75 83.55 192.35 Q85.45 190.6 87.15 189.4 L86.05 192.6 Q84.7 195.8 84.7 196.85 84.7 199.2 90.85 202.9 96.95 206.65 96.95 207.0 L96.45 209.4 Q95.9 211.45 95.9 212.1 95.9 214.05 102.25 230.8 106.35 241.6 110.0 248.85 M-38.15 236.55 L-38.8 238.4 -39.45 240.2 -42.15 248.4 -42.15 248.5 -45.3 248.5 -54.9 248.5 -54.3 243.2 -52.35 227.6 -51.1 221.5 -49.6 217.35 Q-48.2 213.4 -45.75 208.3 L-43.65 203.9 Q-43.65 203.25 -44.45 201.85 -45.25 200.4 -45.25 199.95 L-39.4 199.15 Q-36.15 198.7 -36.15 197.3 L-36.55 194.55 -37.15 191.3 -36.95 191.3 -34.55 195.5 -33.2 197.6 -33.05 198.75 Q-35.9 202.05 -38.0 206.2 L-38.45 207.3 Q-44.8 222.3 -38.15 236.55" fill="#de986c" fill-rule="evenodd" stroke="none"/>
    <path d="M23.1 171.8 Q25.55 174.8 28.0 174.8 30.85 174.8 33.75 172.25 L33.85 172.15 Q40.2 172.1 53.95 169.85 L71.7 167.45 61.25 169.9 34.4 174.55 33.9 174.6 33.65 174.65 Q32.65 178.5 28.3 178.85 23.9 178.5 22.9 174.65 L22.65 174.6 22.1 174.55 -4.7 169.9 -16.9 167.75 -16.6 167.55 -15.2 167.85 -3.7 168.95 14.05 171.15 23.1 171.8" fill="#c98962" fill-rule="evenodd" stroke="none"/>
  </g>
  <defs>
    <radialGradient cx="0" cy="0" fx="444.8" fy="0" gradientTransform="matrix(0.0662, 0.0, 0.0, 0.0662, 24.85, 189.4)" gradientUnits="userSpaceOnUse" id="gradient0" r="819.2" spreadMethod="pad">
      <stop offset="0.0196078431372549" stop-color="#fff0de"/>
      <stop offset="0.16470588235294117" stop-color="#f9d9b3"/>
      <stop offset="0.36470588235294116" stop-color="#f6cba0"/>
      <stop offset="0.6823529411764706" stop-color="#f2b68c"/>
      <stop offset="1.0" stop-color="#f0a475"/>
    </radialGradient>
  </defs>
</svg>
