[
xmin -40
ymin -40
xmax 4018
ymax 1616
wordwrap 1
multiline 1
readonly 1
noselect 1
useoutlines 1
font 311
height 280
color #ffffcc00
align left
leftmargin 0
rightmargin 0
indent 0
leading -60
]ligne 1ligne 2ligne3ligne 4