<?xml version="1.0" encoding="UTF-8" standalone="no"?>
<svg xmlns:xlink="http://www.w3.org/1999/xlink" height="37.85px" width="19.5px" xmlns="http://www.w3.org/2000/svg">
  <g transform="matrix(1.0, 0.0, 0.0, 1.0, 9.75, 18.9)">
    <path d="M4.8 -15.95 L5.0 -10.0 5.15 -5.2 5.25 -3.05 5.55 0.85 Q5.7 1.15 6.55 1.2 L6.85 5.45 6.95 6.75 7.25 7.35 Q9.0 11.1 9.55 13.35 L9.75 14.85 9.7 15.85 8.85 14.05 6.6 8.6 3.9 1.35 Q3.35 0.15 3.35 -1.95 L3.45 -4.65 3.45 -5.7 3.15 -14.45 4.8 -15.95" fill="#e0cdcd" fill-rule="evenodd" stroke="none"/>
    <path d="M4.8 -15.95 L7.65 -18.5 6.85 -9.9 6.6 -5.7 6.5 -0.75 6.55 1.2 Q5.7 1.15 5.55 0.85 L5.25 -3.05 5.15 -5.2 5.0 -10.0 4.8 -15.95" fill="#f2eaea" fill-rule="evenodd" stroke="none"/>
    <path d="M7.65 -18.5 L7.7 -18.9 M6.55 1.2 L6.5 -0.75 6.6 -5.7 6.85 -9.9 7.65 -18.5 M9.7 15.85 L9.75 14.85 9.55 13.35 M7.25 7.35 L6.95 6.75 6.85 5.45 6.55 1.2 M-9.6 -15.2 L-9.75 -12.1 Q-9.75 -9.3 -9.2 -7.0 -8.55 -4.25 -6.75 -0.5 L-4.5 4.5 Q-2.75 7.8 -1.45 7.8 L-0.7 7.6 0.05 7.25 Q0.5 8.6 2.0 9.45 L3.8 10.5 Q5.45 11.4 5.7 11.65 7.1 13.05 7.5 15.3 L7.65 18.55 8.3 18.95 9.1 17.55 9.7 15.85" fill="none" stroke="#a36a6a" stroke-linecap="round" stroke-linejoin="round" stroke-opacity="0.4" stroke-width="0.05"/>
  </g>
</svg>
