<?xml version="1.0" encoding="UTF-8" standalone="no"?>
<svg xmlns:xlink="http://www.w3.org/1999/xlink" height="68.7px" width="77.9px" xmlns="http://www.w3.org/2000/svg">
  <g transform="matrix(1.0, 0.0, 0.0, 1.0, 48.95, 68.15)">
    <path d="M21.35 -4.05 L21.3 -4.0 21.15 -8.75 21.15 -9.05 21.05 -8.75 20.6 -6.8 20.15 -5.3 20.1 -5.35 19.9 -13.1 19.85 -13.75 19.7 -14.55 19.25 -16.25 19.7 -16.35 19.7 -16.25 19.85 -15.45 19.9 -14.8 20.1 -7.05 20.15 -7.0 20.6 -8.5 21.05 -10.45 21.15 -10.75 21.3 -5.25 21.35 -4.05 M22.15 -19.7 L21.4 -21.1 20.55 -21.85 20.1 -22.1 19.95 -22.25 19.95 -22.15 19.25 -20.15 Q18.9 -19.15 17.35 -16.8 L15.75 -14.4 16.15 -16.7 17.35 -18.5 Q18.9 -20.85 19.25 -21.85 L19.95 -23.95 20.1 -23.8 20.55 -23.55 21.4 -22.8 Q22.2 -21.9 22.2 -20.7 L22.15 -19.7 M16.35 -20.5 L14.85 -18.85 12.95 -16.55 12.9 -16.6 Q13.3 -17.25 14.1 -19.65 L14.85 -20.55 16.45 -22.3 16.35 -20.5 M14.35 -22.2 Q7.5 -14.55 -5.2 -4.95 L-5.25 -5.0 -2.0 -9.1 Q9.05 -17.75 15.05 -24.75 L14.35 -22.2 M-2.15 -10.6 Q-10.2 -6.75 -11.9 -7.1 L-9.0 -9.35 Q-5.95 -10.45 0.05 -13.4 L0.1 -13.5 0.2 -13.5 0.05 -13.4 -2.15 -10.6 M-1.35 -17.1 Q-4.1 -16.55 -8.35 -14.9 -13.05 -13.1 -15.25 -11.9 L-11.15 -15.45 -8.35 -16.6 Q-1.85 -19.1 1.2 -19.1 L-1.35 -17.1 M-6.95 -20.95 L-9.0 -20.0 -17.95 -15.45 -18.0 -15.45 Q-17.7 -16.55 -15.6 -17.95 L-13.35 -19.55 -9.0 -21.7 -2.85 -24.6 -5.75 -22.1 -6.95 -20.95 M-17.5 -18.0 L-21.8 -16.35 -21.7 -16.65 -19.6 -18.9 -14.0 -21.1 -13.25 -21.4 -13.25 -21.45 -13.15 -21.45 -13.25 -21.4 -13.5 -21.15 -15.6 -19.65 Q-16.9 -18.8 -17.5 -18.0 M-22.15 -15.2 L-21.5 -15.4 -22.4 -12.4 -22.5 -13.45 -22.55 -13.45 -22.5 -13.6 -22.45 -14.0 -22.15 -15.2 M-22.2 -6.1 L-22.2 -4.95 -22.2 -4.65 -22.3 -4.8 -22.2 -6.1 M-27.1 -20.45 L-27.1 -19.9 -27.05 -19.1 -27.35 -22.4 -27.25 -21.65 -27.2 -21.4 -27.1 -20.45 M-24.4 -18.25 L-24.55 -19.4 Q-24.55 -20.2 -23.4 -21.35 L-21.15 -23.15 -20.75 -23.35 Q-18.3 -24.6 -15.15 -25.55 L-15.6 -25.1 -17.35 -23.1 -20.75 -21.65 -21.15 -21.45 -23.4 -19.65 -24.4 -18.25 M-23.1 0.15 L-22.85 0.4 -22.9 0.55 -23.15 0.15 -23.1 0.15" fill="#a36a6a" fill-opacity="0.29803923" fill-rule="evenodd" stroke="none"/>
    <path d="M4.7 -49.4 L7.4 -49.05 11.25 -48.0 11.8 -47.8 11.9 -47.75 12.9 -47.3 17.35 -44.9 17.25 -43.95 17.15 -43.5 Q16.75 -41.35 16.35 -40.8 18.45 -40.85 19.55 -41.45 L19.8 -41.45 Q18.15 -39.1 17.85 -38.1 L22.65 -37.2 22.5 -37.2 18.15 -36.45 20.7 -34.65 Q16.35 -33.9 15.3 -33.35 L15.25 -33.35 15.3 -33.3 17.75 -33.2 21.0 -32.85 22.4 -32.45 24.9 -31.75 Q25.55 -28.05 25.75 -27.6 26.55 -25.6 27.0 -22.9 L27.35 -19.0 Q27.35 -16.75 27.0 -15.3 25.0 -13.65 24.65 -12.8 24.4 -12.15 24.05 -9.05 L23.75 -9.25 23.45 -11.7 23.4 -11.9 23.4 -11.75 Q23.2 -4.5 22.8 -1.6 22.2 -2.2 22.2 -4.45 L21.7 -3.15 21.5 -1.85 21.35 -4.05 21.3 -5.25 21.15 -10.75 21.05 -10.45 20.6 -8.5 20.15 -7.0 20.1 -7.05 19.9 -14.8 19.85 -15.45 19.7 -16.25 19.7 -16.35 19.25 -17.95 Q21.35 -18.45 21.7 -18.7 L22.15 -19.7 22.2 -20.7 Q22.2 -21.9 21.4 -22.8 L20.55 -23.55 20.1 -23.8 19.95 -23.95 19.25 -21.85 Q18.9 -20.85 17.35 -18.5 L16.15 -16.7 15.75 -16.1 16.2 -18.85 16.35 -20.5 16.45 -22.3 14.85 -20.55 14.1 -19.65 12.95 -18.25 12.9 -18.3 Q13.35 -19.05 14.25 -21.95 L14.35 -22.2 15.05 -24.75 Q9.05 -17.75 -2.0 -9.1 L-5.2 -6.65 -5.25 -6.7 -2.15 -10.6 0.05 -13.4 0.2 -13.5 0.1 -13.5 0.05 -13.4 Q-5.95 -10.45 -9.0 -9.35 -11.15 -8.65 -11.9 -8.8 L-1.35 -17.1 1.2 -19.1 Q-1.85 -19.1 -8.35 -16.6 L-11.15 -15.45 -15.25 -13.6 -6.95 -20.95 -5.75 -22.1 -2.85 -24.6 -9.0 -21.7 -13.35 -19.55 -17.95 -17.15 -18.0 -17.15 -17.5 -18.0 Q-16.9 -18.8 -15.6 -19.65 L-13.5 -21.15 -13.25 -21.4 -13.15 -21.45 -13.15 -21.35 Q-9.8 -23.5 -4.85 -25.65 L-4.6 -25.75 1.95 -28.7 -1.25 -27.9 Q-4.5 -26.95 -6.15 -26.2 L-6.45 -26.1 -6.4 -26.3 -5.85 -27.8 -5.85 -28.05 -8.7 -27.1 -11.05 -26.3 -10.05 -27.6 -9.2 -28.65 -6.9 -31.2 -6.95 -31.35 -8.85 -31.35 -14.6 -30.35 -15.95 -30.25 -18.45 -30.15 -17.95 -30.3 -18.3 -30.45 -18.85 -30.4 -22.5 -29.55 -25.65 -28.35 -21.2 -28.7 -17.85 -29.1 -21.6 -27.1 -24.6 -25.65 -10.5 -29.55 -11.65 -28.3 -18.45 -21.05 -18.45 -21.0 Q-15.4 -22.65 -7.35 -26.1 L-7.25 -26.1 -14.0 -21.1 -19.6 -18.9 -22.1 -17.95 -17.35 -23.1 -15.6 -25.1 -15.15 -25.55 Q-18.3 -24.6 -20.75 -23.35 L-21.15 -23.15 -23.4 -21.35 Q-24.55 -20.2 -24.55 -19.4 L-24.4 -18.25 Q-24.05 -16.9 -22.5 -16.9 L-21.5 -17.1 -21.7 -16.65 -21.8 -16.35 -22.15 -15.2 -22.45 -14.0 -22.5 -13.6 -22.55 -13.45 -22.5 -13.45 -22.4 -12.4 -22.2 -6.65 -22.2 -6.1 -22.3 -4.8 -22.5 -3.15 Q-22.8 -0.7 -23.05 0.0 -23.05 -0.6 -23.6 -2.4 -24.1 -4.2 -24.45 -4.65 L-24.85 -3.6 -25.35 -2.4 -25.35 -2.35 -25.4 -2.45 Q-26.1 -9.1 -26.2 -13.25 L-26.35 -14.15 -26.9 -18.35 -27.1 -20.45 -27.2 -21.4 -27.25 -21.65 -27.35 -23.55 Q-27.35 -28.75 -25.5 -33.05 L-25.1 -33.0 -22.55 -32.7 -20.7 -32.8 -20.55 -32.85 -19.2 -33.05 -19.15 -33.1 -23.85 -36.15 -23.6 -36.5 -22.65 -36.15 -22.05 -36.15 -22.6 -37.85 Q-20.95 -40.0 -18.65 -41.8 L-18.9 -40.15 -18.75 -38.7 Q-18.65 -39.85 -16.9 -40.9 L-14.75 -41.85 Q-13.45 -42.3 -12.35 -44.05 -11.5 -45.35 -11.35 -46.1 L-11.35 -46.2 Q-11.6 -45.75 -14.05 -44.25 -16.15 -42.95 -16.55 -42.75 L-16.6 -42.75 -16.6 -43.35 -15.75 -43.9 -15.5 -44.05 Q-12.35 -46.0 -9.1 -47.2 L-7.65 -46.05 -2.9 -42.3 -2.85 -42.3 -2.9 -42.3 Q-4.9 -42.8 -9.15 -41.55 -12.25 -40.6 -14.05 -39.65 L-14.45 -39.5 -14.0 -39.6 -5.25 -38.95 3.35 -37.05 3.45 -37.05 0.85 -38.35 -2.7 -40.05 -0.35 -40.2 3.35 -39.9 6.3 -39.5 6.4 -39.5 5.5 -40.25 4.25 -41.45 4.1 -41.7 6.2 -41.85 Q3.15 -45.25 0.3 -49.35 L2.9 -49.45 4.25 -49.4 4.7 -49.4 M22.1 -39.6 L22.8 -38.35 22.5 -38.55 21.15 -39.3 21.3 -39.3 22.1 -39.6 M24.05 -35.65 L24.15 -35.35 24.65 -33.05 23.5 -34.3 22.8 -35.25 24.05 -35.65 M-24.9 -34.35 L-24.8 -34.55 -24.75 -34.5 -24.9 -34.35 M-7.7 -47.7 L-4.4 -48.65 Q-2.3 -46.4 0.0 -45.35 L0.15 -45.2 Q-0.75 -45.2 -5.65 -46.95 L-7.7 -47.7 M21.1 -41.2 L21.55 -40.5 20.45 -40.55 21.1 -41.2 M21.35 -26.1 L21.45 -26.1 19.65 -28.0 Q18.2 -29.45 17.7 -29.6 L17.7 -28.7 17.45 -28.65 Q17.15 -28.65 16.7 -28.95 L16.3 -29.15 15.9 -29.4 16.05 -29.05 16.05 -28.85 Q15.5 -26.25 15.5 -25.35 L15.55 -25.25 16.8 -26.6 18.05 -27.6 Q18.75 -27.6 21.35 -26.1 M17.65 -44.75 L18.0 -44.6 18.6 -44.2 18.75 -44.05 20.15 -42.5 18.5 -42.15 18.0 -43.65 17.85 -44.05 17.65 -44.75 M13.7 -40.3 Q12.6 -41.1 11.45 -42.65 L11.1 -43.1 Q10.2 -44.4 10.05 -45.2 L10.0 -44.6 Q10.0 -44.1 10.45 -42.95 L10.55 -42.6 10.15 -42.85 8.4 -44.25 7.65 -45.25 Q7.75 -44.2 8.75 -42.6 L9.05 -42.2 10.1 -40.55 10.2 -40.45 10.0 -41.5 10.0 -41.85 Q10.65 -41.35 12.0 -40.85 L13.55 -40.3 13.7 -40.3 M7.45 -32.15 L6.35 -31.05 4.25 -28.95 Q1.8 -26.85 -0.05 -25.95 L-0.15 -25.85 Q4.55 -26.35 11.35 -31.85 11.85 -31.3 14.85 -30.6 L17.5 -30.15 Q17.85 -30.15 17.85 -30.3 L18.05 -30.3 Q15.7 -31.2 13.1 -32.7 L9.95 -35.0 Q10.0 -34.65 10.75 -33.65 11.5 -32.55 11.8 -32.4 L10.6 -32.7 10.05 -33.05 5.85 -29.8 5.5 -29.5 5.5 -29.55 5.85 -29.8 Q8.65 -32.45 9.05 -33.75 L8.35 -33.45 4.7 -32.65 1.25 -32.15 1.15 -32.1 1.2 -32.15 1.25 -32.15 2.85 -32.85 4.6 -33.5 4.7 -33.6 1.8 -34.4 -1.9 -34.75 -4.4 -34.55 -0.9 -35.35 2.3 -35.6 3.7 -35.55 2.8 -35.8 -1.9 -36.3 -8.45 -35.5 -9.4 -35.3 -14.35 -34.55 -8.5 -33.95 -7.9 -33.85 -1.15 -33.2 2.4 -33.3 Q1.55 -33.2 -1.25 -31.7 L-2.3 -31.2 -3.6 -30.85 -5.7 -30.6 -5.65 -30.55 -0.05 -30.8 Q6.35 -31.25 7.2 -32.1 L7.35 -32.15 7.45 -32.15 M3.9 -25.05 L-0.5 -23.15 Q-0.6 -23.95 -0.05 -24.8 -0.8 -24.0 -3.25 -21.9 L-6.75 -19.1 -0.25 -20.6 Q5.5 -22.0 6.05 -22.35 L6.8 -22.35 1.15 -17.45 Q-3.1 -14.0 -4.5 -13.05 L-4.45 -12.95 Q3.55 -16.8 8.25 -21.6 11.1 -24.45 12.9 -27.85 L14.05 -30.45 Q12.4 -28.95 6.15 -26.1 L3.9 -25.05 M-11.25 -26.25 L-11.05 -26.3 -11.1 -26.25 -11.25 -26.25" fill="#e0cbcb" fill-rule="evenodd" stroke="none"/>
    <path d="M7.4 -49.05 L5.85 -50.55 Q5.25 -51.25 4.45 -53.6 L4.25 -54.15 3.45 -56.1 3.45 -56.25 3.35 -55.25 3.45 -54.05 Q3.6 -52.45 4.2 -50.65 L4.7 -49.4 4.25 -49.4 1.25 -53.6 -1.1 -57.55 Q-3.45 -61.95 -4.85 -63.3 -2.8 -62.75 -0.75 -59.8 1.25 -56.5 2.05 -55.55 L2.1 -55.35 2.1 -55.5 2.05 -55.55 Q1.95 -56.3 2.2 -59.2 L2.55 -62.45 Q2.6 -61.15 4.65 -57.7 L6.8 -54.4 8.55 -52.1 9.2 -54.45 9.6 -55.65 9.85 -54.4 10.1 -53.4 10.7 -51.2 Q10.9 -51.7 13.05 -54.05 L14.25 -55.35 14.0 -53.85 13.55 -52.35 Q12.8 -50.2 12.8 -48.65 L12.9 -47.3 11.9 -47.75 11.4 -48.9 11.25 -48.9 11.25 -48.0 7.4 -49.05 M21.55 -40.5 L21.6 -40.45 21.6 -40.5 24.45 -40.8 24.45 -40.7 22.1 -39.6 21.3 -39.3 21.15 -39.3 22.5 -38.55 22.8 -38.35 Q24.0 -37.75 24.9 -37.65 L25.55 -37.55 Q27.1 -37.4 28.8 -37.5 L28.95 -37.5 26.2 -36.5 24.4 -35.75 24.05 -35.65 22.8 -35.25 23.5 -34.3 24.65 -33.05 24.8 -32.3 24.9 -31.75 22.4 -32.45 21.0 -32.85 17.75 -33.2 15.3 -33.3 15.25 -33.35 15.3 -33.35 Q16.35 -33.9 20.7 -34.65 L18.15 -36.45 22.5 -37.2 22.65 -37.2 17.85 -38.1 Q18.15 -39.1 19.8 -41.45 L19.55 -41.45 Q18.45 -40.85 16.35 -40.8 16.75 -41.35 17.15 -43.5 L17.25 -43.95 17.35 -44.9 17.65 -44.75 17.85 -44.05 18.0 -43.65 18.5 -42.15 20.15 -42.5 23.15 -43.4 21.55 -41.8 21.1 -41.2 20.45 -40.55 21.55 -40.5 M-25.5 -33.05 L-24.9 -34.35 -24.75 -34.5 -24.8 -34.55 -25.5 -35.7 -26.0 -36.6 -27.05 -39.0 -26.65 -38.7 -26.1 -38.35 -24.9 -37.7 -24.6 -37.7 Q-24.6 -39.0 -23.8 -42.0 -23.05 -44.8 -22.15 -45.85 L-22.6 -44.6 Q-23.15 -42.8 -23.15 -41.1 L-22.95 -39.05 -22.75 -38.2 -22.6 -37.85 -22.05 -36.15 -22.65 -36.15 -23.6 -36.5 -24.6 -36.8 -24.6 -36.65 -23.85 -36.15 -19.15 -33.1 -19.2 -33.05 -20.55 -32.85 -20.7 -32.8 -22.55 -32.7 -25.1 -33.0 -25.5 -33.05 M-18.65 -41.8 Q-18.35 -43.1 -17.45 -44.35 L-17.3 -44.55 -16.0 -45.9 -14.9 -47.0 -15.75 -45.65 -16.6 -43.5 -16.6 -43.35 -16.6 -42.75 -16.55 -42.75 Q-16.15 -42.95 -14.05 -44.25 -11.6 -45.75 -11.35 -46.2 L-11.35 -46.1 Q-11.5 -45.35 -12.35 -44.05 -13.45 -42.3 -14.75 -41.85 L-16.9 -40.9 Q-18.65 -39.85 -18.75 -38.7 L-18.9 -40.15 -18.65 -41.8 M-9.1 -47.2 L-10.75 -48.65 -12.1 -49.9 -12.0 -49.95 -10.35 -48.85 -7.7 -47.7 -5.65 -46.95 Q-0.75 -45.2 0.15 -45.2 L0.0 -45.35 Q-2.3 -46.4 -4.4 -48.65 L-6.35 -50.95 -7.75 -53.0 Q-11.95 -59.7 -12.75 -68.15 -8.65 -64.55 -4.85 -57.65 L-1.95 -52.7 0.3 -49.35 Q3.15 -45.25 6.2 -41.85 L4.1 -41.7 4.25 -41.45 5.5 -40.25 6.4 -39.5 6.3 -39.5 3.35 -39.9 -0.35 -40.2 -2.7 -40.05 0.85 -38.35 3.45 -37.05 3.35 -37.05 -5.25 -38.95 -14.0 -39.6 -14.45 -39.5 -14.05 -39.65 Q-12.25 -40.6 -9.15 -41.55 -4.9 -42.8 -2.9 -42.3 L-2.85 -42.3 -2.9 -42.3 -7.65 -46.05 -9.1 -47.2 M21.35 -26.1 Q18.75 -27.6 18.05 -27.6 L16.8 -26.6 15.55 -25.25 15.5 -25.35 Q15.5 -26.25 16.05 -28.85 L16.05 -29.05 15.9 -29.4 16.3 -29.15 16.7 -28.95 Q17.15 -28.65 17.45 -28.65 L17.7 -28.7 17.7 -29.6 Q18.2 -29.45 19.65 -28.0 L21.45 -26.1 21.35 -26.1 M3.9 -25.05 L6.15 -26.1 Q12.4 -28.95 14.05 -30.45 L12.9 -27.85 Q11.1 -24.45 8.25 -21.6 3.55 -16.8 -4.45 -12.95 L-4.5 -13.05 Q-3.1 -14.0 1.15 -17.45 L6.8 -22.35 6.05 -22.35 Q5.5 -22.0 -0.25 -20.6 L-6.75 -19.1 -3.25 -21.9 Q-0.8 -24.0 -0.05 -24.8 -0.6 -23.95 -0.5 -23.15 L3.9 -25.05 M7.45 -32.15 L7.35 -32.15 7.2 -32.1 Q6.35 -31.25 -0.05 -30.8 L-5.65 -30.55 -5.7 -30.6 -3.6 -30.85 -2.3 -31.2 -1.25 -31.7 Q1.55 -33.2 2.4 -33.3 L-1.15 -33.2 -7.9 -33.85 -8.5 -33.95 -14.35 -34.55 -9.4 -35.3 -8.45 -35.5 -1.9 -36.3 2.8 -35.8 3.7 -35.55 2.3 -35.6 -0.9 -35.35 -4.4 -34.55 -1.9 -34.75 1.8 -34.4 4.7 -33.6 4.6 -33.5 2.85 -32.85 1.25 -32.15 1.2 -32.15 1.15 -32.1 1.25 -32.15 4.7 -32.65 8.35 -33.45 9.05 -33.75 Q8.65 -32.45 5.85 -29.8 L5.5 -29.55 5.5 -29.5 5.85 -29.8 10.05 -33.05 10.6 -32.7 11.8 -32.4 Q11.5 -32.55 10.75 -33.65 10.0 -34.65 9.95 -35.0 L13.1 -32.7 Q15.7 -31.2 18.05 -30.3 L17.85 -30.3 Q17.85 -30.15 17.5 -30.15 L14.85 -30.6 Q11.85 -31.3 11.35 -31.85 4.55 -26.35 -0.15 -25.85 L-0.05 -25.95 Q1.8 -26.85 4.25 -28.95 L6.35 -31.05 7.45 -32.15 M13.7 -40.3 L13.55 -40.3 12.0 -40.85 Q10.65 -41.35 10.0 -41.85 L10.0 -41.5 10.2 -40.45 10.1 -40.55 9.05 -42.2 8.75 -42.6 Q7.75 -44.2 7.65 -45.25 L8.4 -44.25 10.15 -42.85 10.55 -42.6 10.45 -42.95 Q10.0 -44.1 10.0 -44.6 L10.05 -45.2 Q10.2 -44.4 11.1 -43.1 L11.45 -42.65 Q12.6 -41.1 13.7 -40.3 M-48.95 -40.25 L-48.95 -40.3 -48.85 -40.35 -48.85 -40.3 -48.95 -40.25 M-48.95 -41.1 L-48.9 -41.0 -48.95 -40.95 -48.95 -41.1 M-14.0 -21.1 L-7.25 -26.1 -7.35 -26.1 Q-15.4 -22.65 -18.45 -21.0 L-18.45 -21.05 -11.65 -28.3 -10.5 -29.55 -24.6 -25.65 -21.6 -27.1 -17.85 -29.1 -21.2 -28.7 -25.65 -28.35 -22.5 -29.55 -18.85 -30.4 -18.3 -30.45 -17.95 -30.3 -18.45 -30.15 -15.95 -30.25 -14.6 -30.35 -8.85 -31.35 -6.95 -31.35 -6.9 -31.2 -9.2 -28.65 -10.05 -27.6 -11.05 -26.3 -8.7 -27.1 -5.85 -28.05 -5.85 -27.8 -6.4 -26.3 -6.45 -26.1 -6.15 -26.2 Q-4.5 -26.95 -1.25 -27.9 L1.95 -28.7 -4.6 -25.75 -4.85 -25.65 Q-9.8 -23.5 -13.15 -21.35 L-13.15 -21.45 -13.25 -21.45 -13.25 -21.4 -14.0 -21.1 M-11.25 -26.25 L-11.1 -26.25 -11.05 -26.3 -11.25 -26.25" fill="#f2eaea" fill-rule="evenodd" stroke="none"/>
    <path d="M24.05 -9.05 L23.75 -9.25 23.45 -11.7 23.4 -11.9 23.4 -11.75 Q23.2 -4.5 22.8 -1.6 22.2 -2.2 22.2 -4.45 L21.7 -3.15 21.5 -1.85 21.35 -4.05 21.3 -5.25 21.15 -10.75 21.05 -10.45 20.6 -8.5 20.15 -7.0 20.1 -7.05 19.9 -14.8 19.85 -15.45 19.7 -16.25 19.7 -16.35 19.25 -17.95 Q21.35 -18.45 21.7 -18.7 L22.15 -19.7 22.2 -20.7 Q22.2 -21.9 21.4 -22.8 L20.55 -23.55 20.1 -23.8 19.95 -23.95 19.25 -21.85 Q18.9 -20.85 17.35 -18.5 L16.15 -16.7 15.75 -16.1 16.2 -18.85 16.35 -20.5 16.45 -22.3 14.85 -20.55 14.1 -19.65 12.95 -18.25 12.9 -18.3 Q13.35 -19.05 14.25 -21.95 L14.35 -22.2 15.05 -24.75 Q9.05 -17.75 -2.0 -9.1 L-5.2 -6.65 -5.25 -6.7 -2.15 -10.6 M-9.0 -9.35 Q-11.15 -8.65 -11.9 -8.8 L-1.35 -17.1 1.2 -19.1 Q-1.85 -19.1 -8.35 -16.6 L-11.15 -15.45 -15.25 -13.6 -6.95 -20.95 -5.75 -22.1 -2.85 -24.6 -9.0 -21.7 -13.35 -19.55 -17.95 -17.15 -18.0 -17.15 -17.5 -18.0 M-21.8 -16.35 L-22.15 -15.2 -22.45 -14.0 -22.5 -13.6 -22.55 -13.45 -22.5 -13.45 -22.4 -12.4 -22.2 -6.65 -22.2 -6.1 -22.3 -4.8 -22.5 -3.15 Q-22.8 -0.7 -23.05 0.0 -23.05 -0.6 -23.6 -2.4 -24.1 -4.2 -24.45 -4.65 L-24.85 -3.6 -25.35 -2.4 -25.35 -2.35 -25.4 -2.45 M0.05 -13.4 L0.2 -13.5 0.1 -13.5 0.05 -13.4 -2.15 -10.6 M-13.15 -21.45 L-13.25 -21.4 -13.5 -21.15 -15.6 -19.65 Q-16.9 -18.8 -17.5 -18.0 M-17.35 -23.1 L-15.6 -25.1 -15.15 -25.55 Q-18.3 -24.6 -20.75 -23.35 L-21.15 -23.15 -23.4 -21.35 Q-24.55 -20.2 -24.55 -19.4 L-24.4 -18.25 Q-24.05 -16.9 -22.5 -16.9 L-21.5 -17.1 -21.7 -16.65 -21.8 -16.35 M-17.35 -23.1 L-22.1 -17.95 -19.6 -18.9 -14.0 -21.1 -13.25 -21.4 -13.25 -21.45 -13.15 -21.45 M0.05 -13.4 Q-5.95 -10.45 -9.0 -9.35" fill="none" stroke="#a36a6a" stroke-linecap="round" stroke-linejoin="round" stroke-opacity="0.69411767" stroke-width="0.05"/>
  </g>
</svg>
