<?xml version="1.0" encoding="UTF-8" standalone="no"?>
<svg xmlns:xlink="http://www.w3.org/1999/xlink" height="42.25px" width="21.8px" xmlns="http://www.w3.org/2000/svg">
  <g transform="matrix(1.0, 0.0, 0.0, 1.0, 10.9, 21.1)">
    <path d="M1.1 -8.65 Q1.85 -11.4 2.85 -13.6 3.3 -14.65 4.95 -15.95 L6.4 -17.0 7.1 -17.45 9.2 -18.8 9.4 -18.9 8.3 -17.35 8.05 -17.0 7.55 -16.3 6.5 -15.05 5.8 -14.35 5.15 -13.45 1.85 -9.55 1.1 -8.65" fill="#b89d86" fill-rule="evenodd" stroke="none"/>
    <path d="M-3.35 -2.8 L-3.3 -3.0 -2.85 -4.85 -2.5 -6.05 -0.75 -11.8 Q-0.1 -13.85 1.3 -15.65 L2.7 -17.0 3.45 -17.5 Q4.6 -18.25 6.3 -18.95 9.9 -20.45 10.9 -21.1 L9.6 -19.15 9.4 -18.9 9.2 -18.8 7.1 -17.45 6.4 -17.0 4.95 -15.95 Q3.3 -14.65 2.85 -13.6 1.85 -11.4 1.1 -8.65 L0.15 -7.5 0.05 -7.35 -0.95 -6.05 -1.4 -5.25 -1.55 -4.8 -1.55 -4.7 -0.6 -1.95 Q-1.6 -0.3 -2.5 0.7 L-2.8 1.05 -3.75 1.75 -4.5 2.0 -3.35 -2.8 M-7.85 16.4 L-7.85 16.45 -10.25 20.1 -10.9 21.15 -10.55 19.85 -9.85 15.8 -9.55 13.95 -9.1 14.8 -8.75 15.35 -7.85 16.4" fill="#c2a68d" fill-rule="evenodd" stroke="none"/>
    <path d="M-3.35 -2.8 L-4.5 2.0 -4.9 2.05 -5.0 2.05 -5.25 2.05 Q-5.85 1.9 -6.25 1.3 L-6.5 0.9 -6.65 0.5 -6.7 -0.15 -3.8 -2.55 -3.35 -2.8" fill="#747a47" fill-rule="evenodd" stroke="none"/>
    <path d="M-2.8 1.05 L-2.5 0.7 Q-1.6 -0.3 -0.6 -1.95 L-0.35 -1.2 -0.25 -1.0 -0.2 -0.8 0.45 0.85 0.65 1.4 0.6 1.45 1.0 2.1 0.6 2.5 0.35 2.85 1.4 3.4 0.45 3.55 -0.1 3.65 -0.2 3.85 -0.95 5.25 -1.15 5.55 -1.9 7.45 -1.85 7.5 -1.65 8.2 -2.1 9.05 -2.25 9.3 -2.35 9.45 -2.5 9.65 -4.15 11.7 -4.65 12.3 -4.7 12.3 -4.65 12.35 -6.6 14.7 -6.7 14.75 -6.8 14.9 -6.7 14.65 -6.55 14.25 -5.8 12.1 -6.9 11.5 -7.25 11.15 -7.9 10.35 -8.45 9.15 -9.0 8.35 -9.5 6.8 -8.55 7.55 -8.25 7.75 -6.7 8.5 -5.65 8.4 -3.9 7.8 -2.3 6.9 -2.65 3.3 -2.8 1.05" fill="#93995a" fill-rule="evenodd" stroke="none"/>
    <path d="M-3.75 1.75 L-2.8 1.05 -2.65 3.3 -2.3 6.9 -3.9 7.8 -5.65 8.4 -4.9 5.45 -4.3 3.5 -4.05 2.75 -3.75 1.75 M-6.8 14.9 L-7.8 16.35 -7.85 16.4 -8.75 15.35 -8.1 14.0 -6.9 11.5 -5.8 12.1 -6.55 14.25 -6.7 14.65 -6.8 14.9" fill="#b1bd6d" fill-rule="evenodd" stroke="none"/>
    <path d="M-4.5 2.0 L-3.75 1.75 -4.05 2.75 -4.3 3.5 -4.9 5.45 -5.65 8.4 -6.7 8.5 -8.25 7.75 -7.05 5.0 -6.6 4.25 -5.25 2.05 -5.0 2.05 -4.9 2.05 -4.5 2.0 M-9.55 13.95 L-9.6 13.75 -9.95 12.8 -9.5 12.2 -9.4 12.05 -7.9 10.35 -7.25 11.15 -6.9 11.5 -8.1 14.0 -8.75 15.35 -9.1 14.8 -9.55 13.95" fill="#c8d17a" fill-rule="evenodd" stroke="none"/>
    <path d="M-9.95 12.8 L-10.1 11.65 -10.1 11.55 -9.65 9.8 -9.0 8.35 -8.45 9.15 -7.9 10.35 -9.4 12.05 -9.5 12.2 -9.95 12.8 M-9.5 6.8 L-9.6 6.7 -9.9 6.2 -9.9 5.6 -9.9 5.35 -9.8 5.15 -8.75 2.4 -7.2 0.4 -6.7 -0.15 -6.65 0.5 Q-6.65 1.05 -6.25 1.3 -5.85 1.9 -5.25 2.05 L-6.6 4.25 -7.05 5.0 -8.25 7.75 -8.55 7.55 -9.5 6.8" fill="#ddeb88" fill-rule="evenodd" stroke="none"/>
  </g>
</svg>
