<?xml version="1.0" encoding="UTF-8" standalone="no"?>
<svg xmlns:xlink="http://www.w3.org/1999/xlink" height="364.55px" width="241.9px" xmlns="http://www.w3.org/2000/svg">
  <g transform="matrix(1.0, 0.0, 0.0, 1.0, 18.8, 36.6)">
    <path d="M-10.35 197.05 Q-11.9 198.35 -11.9 200.55 L-11.9 201.5 Q-11.85 202.0 -12.1 202.2 L-12.55 202.65 -12.8 203.2 -12.8 -1.9 217.15 -1.9 217.15 203.8 214.75 203.0 214.8 202.95 215.15 202.2 215.1 201.75 215.05 201.65 Q214.25 201.6 213.65 202.1 L213.35 202.45 213.3 202.5 212.4 202.2 212.45 202.15 213.0 201.3 212.9 200.6 212.75 200.3 Q211.85 199.85 211.35 200.55 211.0 201.0 211.0 201.65 L211.0 201.75 210.2 201.5 210.25 201.45 210.35 200.65 Q210.35 199.65 208.9 199.15 L207.75 198.85 208.0 196.85 208.2 196.95 Q209.2 196.55 209.3 195.75 L210.4 195.9 210.2 196.15 210.1 196.4 210.3 196.9 210.9 197.35 Q211.45 197.45 211.9 196.95 212.4 196.5 212.5 195.6 212.5 194.5 211.8 194.4 L211.6 194.55 211.4 194.7 211.2 194.45 210.9 194.2 Q210.35 194.15 210.1 195.2 L210.2 195.3 210.05 195.25 209.2 195.1 209.1 194.85 209.45 194.55 209.8 194.0 Q209.9 193.2 209.3 192.75 209.0 192.45 207.75 191.9 208.95 189.15 205.25 188.6 203.65 188.35 202.5 188.95 L202.15 189.2 201.95 189.35 201.85 189.2 Q201.5 188.55 200.65 188.4 199.15 187.95 198.55 189.2 L198.2 190.0 Q198.05 190.7 198.2 191.4 L198.5 192.0 197.8 192.6 Q197.25 193.2 197.25 193.9 197.25 194.55 197.75 194.85 L198.55 195.1 199.75 194.75 Q199.65 195.3 200.1 195.8 200.4 196.2 201.05 196.45 L201.0 196.9 200.25 196.7 Q199.85 196.7 199.6 197.05 L199.35 197.4 199.0 196.45 Q198.7 195.75 198.35 195.75 L197.9 195.85 197.8 196.0 Q197.8 196.7 197.6 196.7 L197.45 196.3 Q197.35 196.05 196.95 196.05 196.5 196.05 196.4 196.35 L196.3 196.7 195.55 195.75 Q196.05 194.9 195.8 194.15 195.0 194.15 194.0 194.7 192.9 195.25 192.9 195.9 L192.95 196.45 192.95 196.55 191.4 196.15 191.45 195.6 190.85 194.45 190.1 193.5 Q188.6 193.5 188.55 195.5 L186.5 195.0 187.3 193.75 Q186.85 193.5 186.35 192.85 L189.35 188.3 188.3 188.3 189.35 185.1 189.05 184.85 188.95 184.8 189.35 183.55 190.6 184.15 Q190.8 184.2 190.95 184.35 191.25 183.8 191.7 183.35 L192.7 182.1 192.9 182.1 Q193.0 182.9 192.4 184.85 L192.35 185.05 192.9 185.35 194.25 185.9 194.4 185.75 195.45 184.85 195.15 186.4 195.55 186.55 197.75 187.8 197.75 185.35 196.35 182.25 Q195.25 180.1 194.4 179.65 L193.1 179.65 193.75 179.4 Q197.45 178.25 199.0 178.2 L197.45 175.8 Q196.65 174.7 195.2 174.7 193.2 174.7 191.0 176.85 189.4 178.45 188.6 180.15 L188.4 180.0 Q187.7 179.4 186.95 179.4 185.0 179.4 182.65 181.4 180.4 183.4 180.4 185.05 L180.4 185.6 Q181.15 184.65 183.05 183.75 L183.55 183.55 183.95 181.9 184.6 183.05 186.2 182.4 187.65 182.25 Q188.4 182.15 188.7 181.8 L188.2 184.6 187.7 184.6 187.4 188.3 186.85 188.3 186.0 190.15 185.2 191.35 183.95 190.0 184.35 194.5 182.7 194.15 182.75 194.0 182.75 193.9 182.3 193.0 Q181.75 192.45 181.0 192.45 L181.1 191.0 180.95 189.75 Q180.45 189.9 180.05 191.25 179.75 192.45 178.7 192.4 L178.65 192.0 178.4 191.75 178.2 191.95 178.1 192.6 178.1 193.0 178.15 193.0 178.15 192.95 178.35 193.1 178.75 193.3 177.0 192.95 177.15 191.4 177.2 190.35 176.55 189.45 177.0 187.0 Q177.5 184.45 177.9 183.2 L176.95 183.65 177.2 181.5 177.5 179.35 177.1 179.4 177.45 177.55 177.7 175.85 178.8 176.2 Q179.85 176.7 180.4 176.7 L181.1 176.2 181.85 175.5 182.05 177.7 182.25 177.7 183.05 176.15 183.9 174.65 183.95 174.5 183.95 174.75 Q183.5 176.1 183.5 177.2 183.5 177.75 184.75 178.2 L186.4 178.9 186.45 178.7 186.65 175.95 Q186.65 173.65 185.65 172.05 L185.4 171.75 Q184.1 170.05 181.9 170.05 180.7 170.05 179.3 170.8 L178.1 171.55 Q177.6 171.9 177.2 172.2 L176.75 170.3 176.3 169.35 Q175.2 167.45 173.25 167.1 L173.95 169.8 174.0 169.8 174.0 170.0 174.4 171.5 173.15 171.25 Q170.5 171.25 168.95 172.95 168.05 174.0 167.25 176.1 L166.55 178.45 167.35 178.15 169.05 177.55 Q170.5 176.8 171.0 174.75 L171.15 176.95 Q171.9 176.0 173.7 175.85 L173.25 176.7 172.85 178.05 173.05 178.95 Q173.3 179.4 173.75 179.4 174.65 179.4 175.35 178.7 175.95 178.0 175.95 177.2 175.95 176.5 175.35 175.95 L174.9 175.7 176.4 175.2 177.0 174.5 177.05 174.5 176.95 175.2 176.7 177.35 176.3 179.35 176.25 179.35 175.8 179.25 176.2 183.45 176.15 184.0 176.1 184.05 176.05 184.0 175.35 184.3 175.25 187.9 174.3 186.7 174.0 190.05 173.7 192.3 172.15 192.05 172.2 191.9 172.25 191.9 172.25 191.45 Q172.25 190.55 171.6 190.3 L171.0 190.95 170.7 191.5 170.7 191.6 170.7 191.8 170.35 191.7 170.35 191.55 170.4 190.65 170.5 189.35 170.4 188.7 169.95 188.55 169.3 189.6 Q168.85 190.35 167.9 190.35 167.6 190.35 167.6 190.0 167.55 189.6 166.95 189.45 L166.35 190.55 166.3 190.85 166.25 191.0 165.95 190.95 165.95 190.8 166.05 189.8 Q166.4 188.0 165.9 187.5 165.45 187.55 164.95 188.5 164.55 189.4 163.5 189.4 L163.25 188.85 162.75 188.3 Q162.3 188.3 162.25 188.45 L162.25 188.6 Q162.1 189.55 162.4 190.25 L162.45 190.4 162.5 190.45 154.55 189.35 152.95 188.5 152.9 188.6 152.8 188.55 152.7 187.95 153.25 187.9 153.2 184.55 153.0 184.55 152.55 182.3 152.55 182.25 153.1 183.0 152.95 183.3 154.15 183.75 154.1 183.9 154.25 184.05 153.65 184.7 153.8 184.95 153.5 185.35 153.75 185.65 154.1 185.2 154.25 185.35 154.9 184.55 155.25 184.85 155.95 183.65 155.75 183.5 155.9 183.3 156.8 184.3 157.25 183.7 156.85 183.25 164.65 173.3 164.55 169.65 155.25 181.5 154.85 181.1 154.4 181.65 155.3 182.6 155.05 182.95 154.8 182.7 154.6 183.05 153.75 182.4 153.25 181.65 153.5 181.4 152.1 180.0 152.1 180.05 151.5 179.9 151.5 179.6 152.55 179.3 153.0 179.0 153.0 179.25 153.05 179.2 153.75 179.1 Q153.8 178.65 154.0 178.35 154.25 177.85 154.7 177.9 154.85 177.9 155.0 178.05 L155.3 178.25 155.3 178.2 155.0 177.5 154.65 177.1 155.3 176.4 155.65 175.8 155.2 175.85 154.6 175.3 Q154.3 174.8 154.35 174.3 154.4 173.6 154.8 173.35 154.25 173.6 154.05 173.8 L153.7 174.35 153.6 174.1 153.6 174.0 153.55 173.85 153.55 173.25 153.7 172.5 154.05 171.8 153.95 171.8 Q153.2 171.75 152.6 172.25 152.15 172.65 151.9 173.4 L151.5 172.5 Q150.95 171.25 150.05 171.0 L150.2 171.2 Q150.5 171.7 150.4 172.25 L150.15 173.4 149.6 173.35 Q149.1 173.35 148.75 173.6 L148.6 173.65 148.3 173.6 147.45 173.3 147.5 173.75 148.05 174.7 147.45 174.55 146.85 174.05 147.2 175.15 148.5 176.7 148.75 176.65 Q148.05 177.85 148.8 178.6 149.8 179.5 150.8 179.6 L150.8 179.8 149.6 179.65 149.6 179.75 149.1 179.6 148.25 180.95 148.1 180.6 146.75 181.4 147.35 182.8 147.95 182.45 148.65 182.9 149.1 181.9 149.25 182.0 149.55 181.35 149.4 183.1 149.4 183.4 149.35 183.7 149.35 183.9 149.0 183.85 149.05 185.7 149.15 185.75 149.05 186.3 148.5 187.4 148.4 188.0 149.3 188.05 149.35 188.2 149.2 188.25 149.15 188.1 147.85 188.6 144.5 188.25 144.75 188.0 Q144.15 187.1 142.6 186.45 140.65 185.6 140.65 187.75 L140.65 187.9 139.3 187.8 141.05 185.05 Q141.55 184.8 142.6 184.45 144.2 183.65 144.2 182.3 144.2 181.6 143.75 181.2 143.35 180.85 142.75 180.85 L141.6 181.65 141.5 181.7 141.5 181.5 Q141.85 180.65 141.5 179.95 141.1 179.2 140.3 179.2 139.75 179.2 139.35 179.8 139.05 180.45 139.05 181.25 139.05 181.75 139.5 182.7 L139.95 184.2 139.95 184.3 139.1 185.65 137.8 187.7 135.3 187.5 134.55 185.9 134.5 185.9 134.75 185.1 134.9 184.15 Q134.9 183.65 134.55 183.25 134.1 182.75 133.55 182.75 133.0 182.75 132.65 183.15 132.3 183.6 132.6 184.5 L132.45 184.35 132.1 184.2 Q131.65 184.2 131.5 184.4 131.35 184.6 131.35 185.1 131.35 186.4 132.5 186.4 L133.25 186.15 133.95 187.35 134.0 187.45 130.95 187.25 130.95 187.15 130.9 186.8 130.8 186.8 130.1 186.9 129.9 187.2 129.8 187.0 130.15 186.45 131.35 184.65 131.2 184.45 Q130.75 184.55 129.75 186.0 L129.55 186.45 128.95 185.5 127.9 183.9 Q128.55 182.9 129.75 181.45 L127.55 183.2 127.35 182.05 127.9 180.8 128.75 180.3 131.45 178.6 Q130.8 178.45 129.1 179.35 L129.95 178.45 130.2 178.15 131.55 177.7 132.8 176.9 Q132.55 176.85 131.35 177.35 L130.65 177.65 131.7 176.7 Q131.3 176.45 129.9 177.8 128.9 178.8 128.25 179.8 L127.75 180.05 127.05 180.45 127.0 179.3 Q127.0 178.25 128.1 176.6 L129.25 175.85 Q128.95 175.9 128.45 176.2 L129.4 174.95 129.55 174.85 130.1 174.45 133.1 172.45 Q133.15 172.7 133.25 172.45 L133.4 172.05 133.45 171.9 134.0 170.1 135.15 168.55 136.0 166.8 134.8 168.3 134.3 168.95 135.1 165.35 135.05 164.95 134.95 165.05 134.2 166.7 Q133.8 164.55 133.4 163.8 L133.25 163.8 133.5 165.05 133.75 165.75 133.95 167.4 133.6 169.05 Q133.2 170.6 133.15 171.6 L131.2 172.9 131.4 172.6 131.0 172.55 Q131.8 170.75 131.85 168.75 L131.75 166.8 132.3 165.0 132.75 163.5 133.85 162.7 135.35 161.25 Q134.45 161.2 132.85 163.05 L133.15 161.45 Q132.65 161.9 131.85 164.55 L131.7 165.1 131.65 164.75 131.4 160.9 131.1 160.85 131.1 164.1 130.45 162.6 129.2 160.0 129.7 158.85 130.35 156.7 Q130.05 157.05 129.65 158.3 L129.15 159.85 128.55 158.65 128.4 158.8 129.6 161.85 Q128.55 160.5 126.85 159.25 L126.7 159.25 129.7 162.25 129.8 162.35 129.95 162.7 130.4 163.75 130.4 163.8 Q130.5 164.45 130.8 164.65 L131.05 165.8 Q130.95 168.05 130.2 169.35 L130.25 168.75 130.0 166.3 129.8 166.3 129.7 170.05 129.65 170.15 129.65 170.1 128.75 168.85 128.65 168.85 129.45 170.35 128.7 171.15 128.7 170.95 128.55 170.2 128.35 170.2 128.35 170.9 Q128.3 171.25 128.4 171.4 L128.1 171.75 127.45 171.2 126.75 170.75 126.2 169.75 125.8 169.0 126.0 167.4 Q125.8 167.4 125.65 167.7 L125.6 168.65 124.65 166.85 124.6 166.85 124.5 166.8 124.5 167.1 125.5 169.4 125.3 169.3 123.85 168.15 Q122.75 167.55 122.4 167.0 121.95 166.1 121.95 164.15 L122.05 163.4 Q121.6 163.75 121.6 165.0 L121.65 166.1 121.15 164.8 Q120.8 164.0 120.25 163.75 L120.2 163.7 120.2 163.75 121.0 165.3 Q121.4 166.25 121.75 166.6 L121.75 166.55 122.7 168.25 122.75 168.35 122.7 168.3 122.3 168.2 119.1 167.2 119.05 167.35 Q120.55 168.3 123.6 169.2 L123.85 169.5 123.6 169.5 Q122.55 169.65 121.75 170.65 L124.2 169.8 125.1 170.55 Q126.4 171.75 127.05 172.95 L125.6 174.8 124.3 176.7 Q124.35 175.95 124.65 175.65 123.8 175.4 123.6 176.6 L123.2 173.25 123.05 173.25 123.0 174.55 123.35 176.8 123.15 176.7 122.4 175.65 122.2 175.7 122.5 176.45 122.4 176.4 121.25 174.6 120.8 174.0 120.55 173.55 118.6 170.7 118.6 170.85 119.85 173.1 118.6 172.55 119.15 173.1 119.2 173.15 119.15 173.15 118.55 172.7 117.95 172.55 118.25 172.45 116.95 172.3 115.3 172.4 115.5 172.45 115.3 172.5 115.6 172.6 115.85 172.65 118.0 173.55 118.1 173.55 117.95 173.6 116.35 174.65 116.4 174.85 118.8 173.65 119.85 174.05 121.35 176.15 122.85 178.15 122.7 178.1 119.7 178.1 Q120.25 178.55 121.7 178.65 L122.05 178.65 121.55 179.25 Q121.5 179.8 121.65 179.6 L123.0 178.7 123.25 178.7 123.1 179.55 123.1 179.75 123.0 179.75 122.7 180.0 122.75 180.35 123.1 180.15 123.25 181.95 123.15 182.95 122.6 182.6 122.5 183.25 Q122.5 183.5 123.2 184.15 L123.45 184.45 123.25 184.7 122.95 184.55 122.4 184.55 122.6 185.35 122.65 185.45 122.3 185.75 122.15 184.85 Q121.95 184.25 121.2 184.2 L121.2 185.15 121.8 186.45 121.85 186.6 121.85 186.8 121.8 186.9 121.6 186.9 121.2 186.25 120.9 186.15 120.45 185.45 Q119.85 184.8 118.8 184.8 L117.85 184.95 117.65 185.0 116.3 181.85 Q116.85 181.4 117.55 180.85 L117.6 180.85 117.25 180.1 117.05 179.8 115.85 180.8 115.35 179.7 114.05 180.55 114.6 181.8 112.7 183.25 113.05 183.9 113.3 184.2 115.05 182.85 115.2 183.3 116.1 185.1 115.25 185.2 114.85 186.3 Q114.85 186.0 114.5 186.0 114.15 186.0 113.75 186.3 L113.45 186.8 112.5 186.8 112.4 186.8 112.35 186.55 112.2 185.8 111.35 185.75 110.95 185.8 110.85 186.1 110.8 186.35 Q110.15 185.4 109.15 185.4 L109.0 185.95 109.2 186.6 109.3 186.8 107.95 186.8 107.65 185.9 Q107.15 184.8 106.3 184.8 105.65 184.8 105.35 185.1 L105.3 185.1 105.3 184.95 Q105.0 183.0 103.6 182.7 L103.6 179.05 106.0 178.55 106.0 177.0 103.6 177.5 103.6 175.5 102.1 175.75 102.25 177.75 99.65 178.25 100.1 179.75 102.4 179.3 102.7 182.7 Q102.15 182.8 101.65 183.35 L100.85 184.45 100.5 184.15 Q99.9 184.15 99.7 184.55 99.5 184.85 99.45 186.0 99.15 185.65 98.8 185.65 98.1 185.65 97.75 186.35 L97.55 186.85 96.4 186.45 96.45 186.4 96.35 186.3 95.75 185.95 95.45 185.8 95.25 185.75 95.3 185.7 95.7 184.35 96.05 182.5 92.9 181.75 93.3 180.35 93.95 181.0 Q94.6 181.6 95.45 181.6 95.8 181.6 96.35 181.25 96.5 181.2 96.75 181.1 L97.1 180.95 97.15 181.35 97.45 181.65 97.05 182.0 96.85 182.5 96.95 182.6 97.45 182.6 97.85 181.65 98.15 182.3 98.35 182.6 98.95 182.25 98.5 181.55 98.15 180.95 98.9 181.0 99.4 180.75 Q99.2 180.45 98.1 180.3 L96.8 180.1 96.6 180.0 96.15 180.3 95.3 180.55 94.65 180.3 94.1 179.8 93.65 179.2 93.9 178.3 94.65 178.45 95.0 178.4 95.3 177.85 94.5 177.0 93.8 175.85 93.9 175.85 94.65 176.8 Q95.1 177.2 95.85 177.25 L96.1 175.85 96.3 174.4 95.4 173.75 Q94.9 173.4 94.5 173.4 93.6 173.4 93.25 175.5 L92.85 178.0 92.75 178.25 91.95 180.3 90.85 182.25 91.25 182.3 89.75 186.8 Q88.95 187.1 87.9 187.65 L80.85 188.2 80.5 187.8 82.25 186.2 81.75 185.25 83.25 185.85 85.0 186.45 85.15 186.45 85.75 183.7 85.3 183.6 85.3 183.7 84.65 185.25 81.6 184.2 81.35 183.7 80.4 182.5 83.75 180.85 Q83.75 180.25 84.0 180.0 L84.35 179.65 84.5 179.35 84.35 179.25 83.5 179.35 83.5 179.25 84.3 178.45 84.2 178.4 83.55 178.4 83.1 178.65 Q83.0 178.4 83.25 178.05 L83.65 177.6 83.55 177.25 Q82.45 177.25 82.45 178.05 82.45 178.8 82.9 180.1 81.45 180.6 79.95 181.75 L79.55 181.05 80.15 180.85 80.6 180.6 80.7 180.55 80.4 180.1 Q80.15 180.1 79.85 180.35 L79.55 180.25 79.35 180.25 79.35 180.2 80.5 179.0 79.35 175.2 77.5 176.2 76.25 177.7 78.0 181.65 78.55 181.4 79.55 184.55 80.95 186.2 79.55 187.8 79.95 188.3 76.6 188.6 76.7 188.45 76.7 188.2 Q76.7 187.65 76.5 187.6 L76.0 187.4 75.55 188.05 75.55 188.75 74.8 188.85 74.75 188.8 74.45 188.5 74.1 188.4 73.45 188.35 73.4 187.9 73.4 187.2 73.7 185.6 73.8 185.4 Q73.85 185.0 74.05 184.7 L74.25 184.05 74.3 184.05 74.65 183.25 75.1 181.0 75.1 180.4 75.1 180.2 75.1 179.6 Q74.95 178.3 74.25 177.3 73.4 176.15 72.45 176.3 L72.15 176.4 71.6 177.1 Q71.2 177.8 71.3 178.45 L71.5 179.4 71.8 180.05 72.15 181.15 72.2 181.45 72.3 182.05 72.15 182.4 72.1 182.6 71.45 183.0 Q69.9 183.2 69.75 181.95 L69.85 181.45 70.0 181.0 69.85 180.45 Q69.65 180.1 69.2 180.15 68.75 180.2 68.5 180.6 L68.4 180.95 68.35 181.05 68.2 181.75 68.2 182.0 Q68.25 182.3 68.45 182.6 L68.55 182.9 69.15 183.35 69.55 183.65 69.85 183.85 70.2 184.15 70.55 184.6 70.9 185.65 70.95 185.8 70.95 186.0 70.9 186.75 70.95 187.2 70.95 187.25 70.95 187.55 71.15 188.25 71.15 188.35 71.2 188.5 Q70.9 188.65 70.9 188.9 L70.95 189.0 70.6 189.0 70.4 189.0 70.05 189.25 69.95 189.35 69.85 189.4 66.35 189.9 66.45 189.7 66.55 189.2 66.4 188.85 Q66.55 188.4 66.85 188.3 67.45 188.0 67.85 188.9 68.25 189.65 68.35 189.6 L68.5 189.45 68.6 188.95 68.2 187.5 Q67.85 185.75 66.7 186.1 65.4 186.35 65.65 188.1 L65.8 188.5 65.7 189.25 65.7 190.0 61.8 190.55 61.7 190.3 Q61.25 189.4 60.85 189.6 L60.45 190.0 60.1 190.35 59.55 190.3 58.45 188.15 Q57.5 186.75 56.6 186.45 55.55 185.0 54.45 185.9 53.4 186.7 53.3 187.9 53.25 188.6 53.65 189.0 L53.8 190.2 53.8 190.45 53.8 191.65 53.6 191.75 53.2 192.0 38.35 195.0 38.05 194.55 Q37.7 194.15 36.95 194.05 L36.85 194.15 36.85 194.65 37.05 195.35 35.3 195.75 35.35 195.6 35.4 195.45 Q35.4 194.05 34.75 194.55 34.15 194.95 34.05 195.9 L34.05 196.05 26.55 198.0 26.5 197.9 26.4 197.6 25.4 197.5 25.35 198.0 25.35 198.2 25.35 198.35 25.1 198.4 25.1 198.3 25.1 198.25 Q25.1 197.75 24.9 197.6 L24.55 197.4 Q24.05 197.65 24.05 198.4 L24.05 198.45 23.45 197.85 Q22.85 197.5 22.35 197.5 L22.25 197.75 22.25 198.25 Q22.25 198.7 22.4 198.95 L22.45 199.05 22.5 199.15 21.8 199.35 21.8 199.25 Q21.7 198.2 21.25 197.8 20.7 198.05 20.7 199.1 L20.75 199.55 20.8 199.65 20.1 199.85 20.1 199.75 19.0 198.45 18.8 198.6 Q18.55 198.8 18.55 199.25 L18.9 200.1 18.95 200.2 10.2 203.0 Q3.7 205.2 -2.75 207.7 L-2.7 206.65 -2.75 204.15 -2.85 203.25 -2.8 203.15 Q-1.95 201.65 -1.95 200.3 -1.95 198.25 -3.5 197.0 -4.9 195.9 -6.9 195.9 -8.95 195.9 -10.35 197.05 M182.6 161.6 L182.45 160.65 179.9 160.6 178.1 160.45 171.25 160.3 170.2 160.4 169.0 160.3 168.6 159.2 168.25 157.8 161.05 159.35 158.5 159.35 159.05 157.25 159.6 154.95 Q159.2 154.95 158.35 154.3 L157.35 153.5 Q156.6 153.5 155.4 154.35 L153.05 156.15 152.05 154.8 154.25 152.15 156.25 149.45 Q155.3 148.85 151.75 147.7 L148.05 146.6 147.9 148.45 147.65 150.15 146.35 149.45 145.25 149.05 144.45 149.25 143.7 149.45 143.3 149.45 143.45 146.3 143.6 144.6 133.1 144.8 120.65 145.25 121.15 147.55 121.75 149.85 121.75 150.7 121.55 150.7 Q121.35 149.5 121.05 149.3 L119.8 149.25 117.75 149.45 118.75 151.8 119.8 154.2 119.8 154.45 116.85 154.2 114.4 154.05 113.7 154.2 113.65 154.25 113.8 152.75 113.9 151.05 113.9 148.3 Q113.9 145.55 114.05 145.1 L114.05 143.35 113.3 143.35 106.25 145.8 99.35 148.3 101.65 151.3 95.3 153.6 88.5 155.95 89.35 157.75 90.45 159.2 84.45 159.6 80.3 160.0 89.3 160.8 97.75 161.45 95.7 159.1 93.75 156.9 Q109.0 152.4 110.75 152.4 111.6 152.4 111.5 155.15 111.45 157.8 112.3 157.8 L114.05 157.25 117.1 156.5 123.8 155.75 Q124.2 154.35 124.95 152.7 126.05 150.55 126.75 150.55 139.85 150.55 145.05 152.3 148.7 153.55 149.25 156.3 L149.65 158.3 Q149.9 159.5 150.7 160.2 152.8 161.95 160.5 161.95 L179.15 161.6 182.6 161.6 M205.25 180.55 Q205.05 181.5 206.0 182.8 206.8 183.95 206.6 184.55 L206.7 184.55 Q207.25 183.85 208.2 183.8 208.85 183.75 209.15 183.35 L209.45 182.65 209.5 182.2 Q209.5 181.25 208.7 181.0 208.25 180.85 207.75 181.2 L207.3 181.75 207.0 180.75 Q206.65 180.15 206.2 180.0 L205.6 180.1 Q205.35 180.25 205.25 180.55 M39.0 187.0 L37.8 189.35 37.8 189.5 39.1 188.6 41.4 188.95 Q42.8 188.95 44.3 187.65 45.95 186.05 45.95 183.9 45.95 179.9 43.5 179.9 42.35 179.9 41.45 181.35 40.6 182.55 40.6 184.3 40.6 185.05 40.85 185.8 L40.85 186.0 Q39.8 186.0 39.0 187.0 M35.2 176.05 Q33.9 174.05 31.95 174.05 28.45 174.05 28.45 178.0 28.45 179.6 29.9 181.8 31.25 184.0 31.25 185.1 31.25 186.4 30.35 187.5 L29.25 188.3 30.5 188.55 Q33.0 188.55 34.7 186.15 36.3 183.6 36.3 180.1 36.3 177.9 35.2 176.05" fill="url(#gradient0)" fill-rule="evenodd" stroke="none"/>
    <path d="M182.6 161.6 L179.15 161.6 160.5 161.95 Q152.8 161.95 150.7 160.2 149.9 159.5 149.65 158.3 L149.25 156.3 Q148.7 153.55 145.05 152.3 139.85 150.55 126.75 150.55 126.05 150.55 124.95 152.7 124.2 154.35 123.8 155.75 L117.1 156.5 114.05 157.25 112.3 157.8 Q111.45 157.8 111.5 155.15 111.6 152.4 110.75 152.4 109.0 152.4 93.75 156.9 L95.7 159.1 97.75 161.45 89.3 160.8 80.3 160.0 84.45 159.6 90.45 159.2 89.35 157.75 88.5 155.95 95.3 153.6 101.65 151.3 99.35 148.3 106.25 145.8 113.3 143.35 114.05 143.35 114.05 145.1 Q113.9 145.55 113.9 148.3 L113.9 151.05 113.8 152.75 113.65 154.25 113.7 154.2 114.4 154.05 116.85 154.2 119.8 154.45 119.8 154.2 118.75 151.8 117.75 149.45 119.8 149.25 121.05 149.3 Q121.35 149.5 121.55 150.7 L121.75 150.7 121.75 149.85 121.15 147.55 120.65 145.25 133.1 144.8 143.6 144.6 143.45 146.3 143.3 149.45 143.7 149.45 144.45 149.25 145.25 149.05 146.35 149.45 147.65 150.15 147.9 148.45 148.05 146.6 151.75 147.7 Q155.3 148.85 156.25 149.45 L154.25 152.15 152.05 154.8 153.05 156.15 155.4 154.35 Q156.6 153.5 157.35 153.5 L158.35 154.3 Q159.2 154.95 159.6 154.95 L159.05 157.25 158.5 159.35 161.05 159.35 168.25 157.8 168.6 159.2 169.0 160.3 170.2 160.4 171.25 160.3 178.1 160.45 179.9 160.6 182.45 160.65 182.6 161.6" fill="#ffffff" fill-rule="evenodd" stroke="none"/>
    <path d="M28.5 -36.6 L97.75 175.35 -18.8 27.7 -18.8 22.05 88.8 158.35 25.15 -36.6 28.5 -36.6 M-18.8 40.2 L92.95 181.75 -18.8 123.15 -18.8 118.85 79.5 170.4 -18.8 45.9 -18.8 40.2 M-18.8 132.7 L90.1 189.8 -18.8 189.8 -18.8 185.85 74.35 185.85 -18.8 137.0 -18.8 132.7 M-18.8 198.6 L90.7 198.6 83.5 202.4 132.2 202.4 124.95 198.6 223.1 198.6 223.1 202.6 135.25 202.6 135.35 202.9 135.3 203.15 Q135.1 204.5 134.3 205.4 L134.25 205.5 134.2 205.5 Q133.35 206.4 132.2 206.4 L83.5 206.4 Q82.35 206.4 81.5 205.5 L81.45 205.5 81.4 205.4 Q80.6 204.5 80.4 203.15 L80.35 202.9 80.4 202.6 80.5 202.35 Q80.65 201.95 80.95 201.75 L81.15 201.65 80.65 200.7 80.5 201.25 Q80.3 201.9 80.35 202.6 L-18.8 202.6 -18.8 198.6 M223.1 189.8 L125.55 189.8 223.1 138.65 223.1 143.0 141.35 185.85 223.1 185.85 223.1 189.8 M223.1 129.1 L122.5 181.85 223.1 54.45 223.1 60.1 135.95 170.5 223.1 124.8 223.1 129.1 M223.1 41.95 L117.85 175.3 187.1 -36.6 190.5 -36.6 126.8 158.3 223.1 36.35 223.1 41.95 M179.55 -36.6 L111.25 172.25 111.25 -36.6 114.4 -36.6 114.4 152.3 176.2 -36.6 179.55 -36.6 M104.3 -36.6 L104.3 172.35 36.05 -36.6 39.45 -36.6 101.15 152.4 101.15 -36.6 104.3 -36.6" fill="url(#gradient1)" fill-rule="evenodd" stroke="none"/>
    <path d="M28.5 -36.6 L36.05 -36.6 104.3 172.35 104.3 -36.6 111.25 -36.6 111.25 172.25 179.55 -36.6 187.1 -36.6 117.85 175.3 223.1 41.95 223.1 54.45 122.5 181.85 223.1 129.1 223.1 138.65 125.55 189.8 223.1 189.8 223.1 198.6 124.95 198.6 132.2 202.4 83.5 202.4 90.7 198.6 -18.8 198.6 -18.8 189.8 90.1 189.8 -18.8 132.7 -18.8 123.15 92.95 181.75 -18.8 40.2 -18.8 27.7 97.75 175.35 28.5 -36.6" fill="url(#gradient2)" fill-rule="evenodd" stroke="none"/>
    <path d="M182.6 161.6 L179.15 161.6 160.5 161.95 Q152.8 161.95 150.7 160.2 149.9 159.5 149.65 158.3 L149.25 156.3 Q148.7 153.55 145.05 152.3 139.85 150.55 126.75 150.55 126.05 150.55 124.95 152.7 124.2 154.35 123.8 155.75 L117.1 156.5 114.05 157.25 112.3 157.8 Q111.45 157.8 111.5 155.15 111.6 152.4 110.75 152.4 109.0 152.4 93.75 156.9 L95.7 159.1 97.75 161.45 89.3 160.8 80.3 160.0 84.45 159.6 90.45 159.2 89.35 157.75 88.5 155.95 95.3 153.6 101.65 151.3 99.35 148.3 106.25 145.8 113.3 143.35 114.05 143.35 114.05 145.1 Q113.9 145.55 113.9 148.3 L113.9 151.05 113.8 152.75 113.65 154.25 113.7 154.2 114.4 154.05 116.85 154.2 119.8 154.45 119.8 154.2 118.75 151.8 117.75 149.45 119.8 149.25 121.05 149.3 Q121.35 149.5 121.55 150.7 L121.75 150.7 121.75 149.85 121.15 147.55 120.65 145.25 133.1 144.8 143.6 144.6 143.45 146.3 143.3 149.45 143.7 149.45 144.45 149.25 145.25 149.05 146.35 149.45 147.65 150.15 147.9 148.45 148.05 146.6 151.75 147.7 Q155.3 148.85 156.25 149.45 L154.25 152.15 152.05 154.8 153.05 156.15 155.4 154.35 Q156.6 153.5 157.35 153.5 L158.35 154.3 Q159.2 154.95 159.6 154.95 L159.05 157.25 158.5 159.35 161.05 159.35 168.25 157.8 168.6 159.2 169.0 160.3 170.2 160.4 171.25 160.3 178.1 160.45 179.9 160.6 182.45 160.65 182.6 161.6 M158.5 159.35 L158.35 159.35 158.45 159.5 158.5 159.35" fill="#ffffff" fill-opacity="0.7607843" fill-rule="evenodd" stroke="none"/>
    <path d="M173.7 192.3 L174.0 190.05 174.3 186.7 175.25 187.9 175.35 184.3 176.05 184.0 176.1 184.05 176.15 184.0 176.2 183.45 175.8 179.25 176.25 179.35 176.3 179.35 176.7 177.35 176.95 175.2 177.05 174.5 177.0 174.5 176.4 175.2 174.9 175.7 175.35 175.95 Q175.95 176.5 175.95 177.2 175.95 178.0 175.35 178.7 174.65 179.4 173.75 179.4 173.3 179.4 173.05 178.95 L172.85 178.05 173.25 176.7 173.7 175.85 Q171.9 176.0 171.15 176.95 L171.0 174.75 Q170.5 176.8 169.05 177.55 L167.35 178.15 166.55 178.45 167.25 176.1 Q168.05 174.0 168.95 172.95 170.5 171.25 173.15 171.25 L174.4 171.5 174.0 170.0 174.0 169.8 173.95 169.8 173.25 167.1 Q175.2 167.45 176.3 169.35 L176.75 170.3 177.2 172.2 Q177.6 171.9 178.1 171.55 L179.3 170.8 Q180.7 170.05 181.9 170.05 184.1 170.05 185.4 171.75 L185.65 172.05 Q186.65 173.65 186.65 175.95 L186.45 178.7 186.4 178.9 184.75 178.2 Q183.5 177.75 183.5 177.2 183.5 176.1 183.95 174.75 L183.95 174.5 183.9 174.65 183.05 176.15 182.25 177.7 182.05 177.7 181.85 175.5 181.1 176.2 180.4 176.7 Q179.85 176.7 178.8 176.2 L177.7 175.85 177.45 177.55 177.1 179.4 177.5 179.35 177.2 181.5 176.95 183.65 177.9 183.2 Q177.5 184.45 177.0 187.0 L176.55 189.45 177.2 190.35 177.15 191.4 177.0 192.95 173.7 192.3 M177.1 179.4 L177.05 179.4 177.1 179.45 177.1 179.4 M87.9 187.65 Q88.95 187.1 89.75 186.8 L91.25 182.3 90.85 182.25 91.95 180.3 92.75 178.25 92.85 178.0 93.25 175.5 Q93.6 173.4 94.5 173.4 94.9 173.4 95.4 173.75 L96.3 174.4 96.1 175.85 95.85 177.25 Q95.1 177.2 94.65 176.8 L93.9 175.85 93.8 175.85 94.5 177.0 95.3 177.85 95.0 178.4 94.65 178.45 93.9 178.3 93.65 179.2 94.1 179.8 94.65 180.3 95.3 180.55 96.15 180.3 96.6 180.0 96.8 180.1 98.1 180.3 Q99.2 180.45 99.4 180.75 L98.9 181.0 98.15 180.95 98.5 181.55 98.95 182.25 98.35 182.6 98.15 182.3 97.85 181.65 97.45 182.6 96.95 182.6 96.85 182.5 97.05 182.0 97.45 181.65 97.15 181.35 97.1 180.95 96.75 181.1 Q96.5 181.2 96.35 181.25 95.8 181.6 95.45 181.6 94.6 181.6 93.95 181.0 L93.3 180.35 92.9 181.75 96.05 182.5 95.7 184.35 95.3 185.7 95.25 185.75 95.45 185.8 95.75 185.95 96.35 186.3 96.45 186.4 96.4 186.45 97.55 186.85 97.75 186.35 Q98.1 185.65 98.8 185.65 99.15 185.65 99.45 186.0 99.5 184.85 99.7 184.55 99.9 184.15 100.5 184.15 L100.85 184.45 101.65 183.35 Q102.15 182.8 102.7 182.7 L102.4 179.3 100.1 179.75 99.65 178.25 102.25 177.75 102.1 175.75 103.6 175.5 103.6 177.5 106.0 177.0 106.0 178.55 103.6 179.05 103.6 182.7 Q105.0 183.0 105.3 184.95 L105.3 185.1 105.35 185.1 Q105.65 184.8 106.3 184.8 107.15 184.8 107.65 185.9 L107.95 186.8 87.9 187.65 M113.45 186.8 L113.75 186.3 Q114.15 186.0 114.5 186.0 114.85 186.0 114.85 186.3 L115.25 185.2 116.1 185.1 115.2 183.3 115.05 182.85 113.3 184.2 113.05 183.9 112.7 183.25 114.6 181.8 114.05 180.55 115.35 179.7 115.85 180.8 117.05 179.8 117.25 180.1 117.6 180.85 117.55 180.85 Q116.85 181.4 116.3 181.85 L117.65 185.0 117.85 184.95 118.8 184.8 Q119.85 184.8 120.45 185.45 L120.9 186.15 121.2 186.25 121.6 186.9 113.45 186.8 M121.8 186.9 L121.85 186.8 121.85 186.6 121.8 186.45 121.2 185.15 121.2 184.2 Q121.95 184.25 122.15 184.85 L122.3 185.75 122.65 185.45 122.6 185.35 122.4 184.55 122.95 184.55 123.25 184.7 123.45 184.45 123.2 184.15 Q122.5 183.5 122.5 183.25 L122.6 182.6 123.15 182.95 123.25 181.95 123.1 180.15 122.75 180.35 122.7 180.0 123.0 179.75 123.1 179.75 123.1 179.55 123.25 178.7 123.0 178.7 121.65 179.6 Q121.5 179.8 121.55 179.25 L122.05 178.65 121.7 178.65 Q120.25 178.55 119.7 178.1 L122.7 178.1 122.85 178.15 121.35 176.15 119.85 174.05 118.8 173.65 116.4 174.85 116.35 174.65 117.95 173.6 118.1 173.55 118.0 173.55 115.85 172.65 115.6 172.6 115.3 172.5 115.5 172.45 115.3 172.4 116.95 172.3 118.25 172.45 117.95 172.55 118.55 172.7 119.15 173.15 119.2 173.15 119.15 173.1 118.6 172.55 119.85 173.1 118.6 170.85 118.6 170.7 120.55 173.55 120.8 174.0 121.25 174.6 122.4 176.4 122.5 176.45 122.2 175.7 122.4 175.65 123.15 176.7 123.35 176.8 123.0 174.55 123.05 173.25 123.2 173.25 123.6 176.6 Q123.8 175.4 124.65 175.65 124.35 175.95 124.3 176.7 L125.6 174.8 127.05 172.95 Q126.4 171.75 125.1 170.55 L124.2 169.8 121.75 170.65 Q122.55 169.65 123.6 169.5 L123.85 169.5 123.6 169.2 Q120.55 168.3 119.05 167.35 L119.1 167.2 122.3 168.2 122.7 168.3 122.75 168.35 122.7 168.25 121.75 166.55 121.75 166.6 Q121.4 166.25 121.0 165.3 L120.2 163.75 120.2 163.7 120.25 163.75 Q120.8 164.0 121.15 164.8 L121.65 166.1 121.6 165.0 Q121.6 163.75 122.05 163.4 L121.95 164.15 Q121.95 166.1 122.4 167.0 122.75 167.55 123.85 168.15 L125.3 169.3 125.5 169.4 124.5 167.1 124.5 166.8 124.6 166.85 124.65 166.85 125.6 168.65 125.65 167.7 Q125.8 167.4 126.0 167.4 L125.8 169.0 126.2 169.75 126.75 170.75 127.45 171.2 128.1 171.75 128.4 171.4 Q128.3 171.25 128.35 170.9 L128.35 170.2 128.55 170.2 128.7 170.95 128.7 171.15 129.45 170.35 128.65 168.85 128.75 168.85 129.65 170.1 129.65 170.15 129.7 170.05 129.8 166.3 130.0 166.3 130.25 168.75 130.2 169.35 Q130.95 168.05 131.05 165.8 L130.8 164.65 Q130.5 164.45 130.4 163.8 L130.4 163.75 129.95 162.7 129.8 162.35 129.7 162.25 126.7 159.25 126.85 159.25 Q128.55 160.5 129.6 161.85 L128.4 158.8 128.55 158.65 129.15 159.85 129.65 158.3 Q130.05 157.05 130.35 156.7 L129.7 158.85 129.2 160.0 130.45 162.6 131.1 164.1 131.1 160.85 131.4 160.9 131.65 164.75 131.7 165.1 131.85 164.55 Q132.65 161.9 133.15 161.45 L132.85 163.05 Q134.45 161.2 135.35 161.25 L133.85 162.7 132.75 163.5 132.3 165.0 131.75 166.8 131.85 168.75 Q131.8 170.75 131.0 172.55 L131.4 172.6 131.2 172.9 133.15 171.6 Q133.2 170.6 133.6 169.05 L133.95 167.4 133.75 165.75 133.5 165.05 133.25 163.8 133.4 163.8 Q133.8 164.55 134.2 166.7 L134.95 165.05 135.05 164.95 135.1 165.35 134.3 168.95 134.8 168.3 136.0 166.8 135.15 168.55 134.0 170.1 133.45 171.9 133.4 172.05 133.25 172.45 Q133.15 172.7 133.1 172.45 L130.1 174.45 129.55 174.85 129.4 174.95 128.45 176.2 Q128.95 175.9 129.25 175.85 L128.1 176.6 Q127.0 178.25 127.0 179.3 L127.05 180.45 127.75 180.05 128.25 179.8 Q128.9 178.8 129.9 177.8 131.3 176.45 131.7 176.7 L130.65 177.65 131.35 177.35 Q132.55 176.85 132.8 176.9 L131.55 177.7 130.2 178.15 129.95 178.45 129.1 179.35 Q130.8 178.45 131.45 178.6 L128.75 180.3 127.9 180.8 127.35 182.05 127.55 183.2 129.75 181.45 Q128.55 182.9 127.9 183.9 L128.95 185.5 129.55 186.45 129.75 186.0 Q130.75 184.55 131.2 184.45 L131.35 184.65 130.15 186.45 129.8 187.0 129.9 187.2 130.1 186.9 130.8 186.8 130.9 186.8 130.95 187.15 130.95 187.25 129.9 187.2 121.8 186.9 M94.55 174.7 Q94.4 174.8 94.4 175.0 94.4 175.6 94.65 175.85 L95.35 175.8 94.6 174.7 94.55 174.7 M91.9 182.95 L91.35 184.8 90.85 186.4 91.3 186.3 94.4 186.35 94.4 186.15 94.2 185.5 94.0 185.5 94.25 184.4 94.7 183.3 93.55 183.3 Q92.85 183.25 92.75 182.95 L91.9 182.95 M125.6 169.6 L125.55 169.6 125.6 169.65 125.6 169.6 M130.7 173.05 L130.55 173.35 Q130.65 173.25 130.8 173.2 L130.7 173.05 M127.35 181.2 L127.25 181.3 127.25 181.4 127.35 181.2" fill="url(#gradient3)" fill-rule="evenodd" stroke="none"/>
    <path d="M177.1 179.4 L177.1 179.45 177.05 179.4 177.1 179.4 M188.7 181.8 L188.75 181.65 188.85 181.65 188.9 181.5 188.9 181.4 188.95 181.65 188.85 181.65 188.7 181.8 M-12.75 327.95 L-12.8 327.95 -12.75 326.6 -12.75 327.95 M-12.8 211.8 L-12.8 210.55 -11.75 210.8 -10.45 210.35 -10.35 210.25 -10.1 210.65 -12.8 211.8 M202.35 197.2 L201.7 197.15 201.8 196.55 202.45 196.55 202.35 197.2 M198.3 192.75 L199.0 192.0 199.5 191.9 199.5 192.05 198.95 192.55 198.3 192.75 M200.15 192.3 L200.7 192.05 200.9 192.1 200.75 192.75 200.45 192.9 199.5 193.35 199.25 193.1 199.95 192.45 200.15 192.3 M203.85 196.15 L204.2 196.55 205.0 196.4 205.2 197.05 206.15 197.25 206.35 197.25 206.0 198.3 205.4 197.85 Q204.4 197.0 204.0 197.0 L203.05 197.1 203.15 196.45 203.25 196.4 203.85 196.15 M207.55 197.2 L207.25 198.85 206.75 198.7 206.75 198.6 207.15 197.25 207.55 197.2 M34.85 178.15 Q34.85 179.0 34.5 179.0 34.1 179.0 33.75 177.65 L33.55 176.15 Q34.0 176.0 34.5 176.65 34.85 177.25 34.85 178.15 M30.75 177.1 Q31.2 177.1 31.6 178.0 32.15 178.85 32.15 179.65 L31.8 180.5 Q30.75 179.65 30.35 177.5 30.5 177.1 30.75 177.1 M42.6 182.35 Q43.2 182.35 43.45 184.0 43.6 185.7 42.75 185.7 41.9 185.7 41.9 184.0 41.9 182.35 42.6 182.35 M44.9 182.55 Q45.2 183.0 45.2 183.8 L45.1 185.15 Q44.45 185.05 44.45 183.45 L44.9 182.55 M60.85 190.0 L61.1 190.65 60.2 190.8 60.85 190.0 M66.0 188.0 L66.05 187.2 Q66.15 186.6 66.55 186.5 67.45 186.15 67.7 187.1 L67.7 187.15 Q67.15 187.0 66.3 187.75 L66.0 188.1 66.0 188.0 M78.85 176.95 L79.35 177.35 79.55 177.7 79.75 178.45 Q79.75 178.9 79.35 178.9 L78.75 178.45 78.45 177.6 Q78.45 176.95 78.85 176.95 M54.5 189.4 Q55.05 189.65 55.0 190.0 54.95 190.55 54.5 191.05 L54.5 189.4 M54.3 187.2 L53.8 188.2 53.7 187.8 53.95 187.1 54.65 186.2 55.3 186.0 55.85 186.35 55.55 186.4 Q54.8 186.5 54.3 187.2 M58.3 189.7 Q58.5 190.5 58.95 191.0 L54.45 191.75 54.45 191.5 54.85 191.2 Q55.35 190.7 55.4 189.85 55.45 189.2 54.55 188.8 L54.5 188.8 Q54.6 187.35 55.65 187.25 57.55 186.95 58.3 189.7 M91.9 182.95 L92.75 182.95 Q92.85 183.25 93.55 183.3 L94.7 183.3 94.25 184.4 94.0 185.5 94.2 185.5 94.4 186.15 94.4 186.35 91.3 186.3 90.85 186.4 91.35 184.8 91.9 182.95 M94.55 174.7 L94.6 174.7 95.35 175.8 94.65 175.85 Q94.4 175.6 94.4 175.0 94.4 174.8 94.55 174.7 M158.5 159.35 L158.45 159.5 158.35 159.35 158.5 159.35 M130.7 173.05 L130.8 173.2 Q130.65 173.25 130.55 173.35 L130.7 173.05 M125.6 169.6 L125.6 169.65 125.55 169.6 125.6 169.6 M132.6 184.5 L132.65 184.55 132.65 184.7 132.6 184.5 M127.35 181.2 L127.25 181.4 127.25 181.3 127.35 181.2 M152.6 177.6 L152.5 177.9 152.15 178.0 151.55 178.1 151.3 178.0 151.2 177.75 151.35 177.5 151.6 177.4 152.25 177.25 152.5 177.35 152.6 177.6 M149.5 177.05 L149.75 177.15 149.85 177.25 149.85 177.5 149.85 177.55 149.8 177.8 149.7 177.85 149.45 177.8 149.35 177.65 149.35 177.35 149.4 177.1 149.5 177.05 M150.1 188.85 L149.9 188.3 149.9 188.15 150.55 188.15 151.15 186.0 151.45 188.1 152.1 188.0 152.25 188.5 152.1 189.05 150.1 188.85 M204.85 199.75 L204.85 199.85 204.3 199.65 204.45 199.65 204.8 199.6 204.85 199.75 M-3.5 205.2 L-3.7 204.6 -3.45 204.3 -3.45 205.35 -3.5 205.2 M-3.5 208.0 L-4.55 208.4 Q-3.7 207.35 -3.4 206.5 L-3.5 208.0" fill="url(#gradient4)" fill-rule="evenodd" stroke="none"/>
    <path d="M188.7 181.8 Q188.4 182.15 187.65 182.25 L186.2 182.4 184.6 183.05 183.95 181.9 183.55 183.55 183.05 183.75 Q181.15 184.65 180.4 185.6 L180.4 185.05 Q180.4 183.4 182.65 181.4 185.0 179.4 186.95 179.4 187.7 179.4 188.4 180.0 L188.6 180.15 Q189.4 178.45 191.0 176.85 193.2 174.7 195.2 174.7 196.65 174.7 197.45 175.8 L199.0 178.2 Q197.45 178.25 193.75 179.4 L193.1 179.65 194.4 179.65 Q195.25 180.1 196.35 182.25 L197.75 185.35 197.75 187.8 195.55 186.55 195.15 186.4 195.45 184.85 194.4 185.75 194.25 185.9 192.9 185.35 192.35 185.05 192.4 184.85 Q193.0 182.9 192.9 182.1 L192.7 182.1 191.7 183.35 Q191.25 183.8 190.95 184.35 190.8 184.2 190.6 184.15 L189.35 183.55 188.95 184.8 189.05 184.85 189.35 185.1 188.3 188.3 189.35 188.3 186.35 192.85 Q186.85 193.5 187.3 193.75 L186.5 195.0 184.35 194.5 183.95 190.0 185.2 191.35 186.0 190.15 186.85 188.3 187.4 188.3 187.7 184.6 188.2 184.6 188.7 181.8 188.85 181.65 188.95 181.65 188.9 181.4 188.9 181.5 188.85 181.65 188.75 181.65 188.7 181.8 M188.55 195.5 Q188.6 193.5 190.1 193.5 L190.85 194.45 191.45 195.6 191.4 196.15 188.55 195.5 M147.85 188.6 L149.15 188.1 149.2 188.25 149.35 188.2 149.3 188.05 148.4 188.0 148.5 187.4 149.05 186.3 149.15 185.75 149.05 185.7 149.0 183.85 149.35 183.9 149.35 183.7 149.4 183.4 149.4 183.1 149.55 181.35 149.25 182.0 149.1 181.9 148.65 182.9 147.95 182.45 147.35 182.8 146.75 181.4 148.1 180.6 148.25 180.95 149.1 179.6 149.6 179.75 149.6 179.65 150.8 179.8 150.8 179.6 Q149.8 179.5 148.8 178.6 148.05 177.85 148.75 176.65 L148.5 176.7 147.2 175.15 146.85 174.05 147.45 174.55 148.05 174.7 147.5 173.75 147.45 173.3 148.3 173.6 148.6 173.65 148.75 173.6 Q149.1 173.35 149.6 173.35 L150.15 173.4 150.4 172.25 Q150.5 171.7 150.2 171.2 L150.05 171.0 Q150.95 171.25 151.5 172.5 L151.9 173.4 Q152.15 172.65 152.6 172.25 153.2 171.75 153.95 171.8 L154.05 171.8 153.7 172.5 153.55 173.25 153.55 173.85 153.6 174.0 153.6 174.1 153.7 174.35 154.05 173.8 Q154.25 173.6 154.8 173.35 154.4 173.6 154.35 174.3 154.3 174.8 154.6 175.3 L155.2 175.85 155.65 175.8 155.3 176.4 154.65 177.1 155.0 177.5 155.3 178.2 155.3 178.25 155.0 178.05 Q154.85 177.9 154.7 177.9 154.25 177.85 154.0 178.35 153.8 178.65 153.75 179.1 L153.05 179.2 153.0 179.25 153.0 179.0 152.55 179.3 151.5 179.6 151.5 179.9 152.1 180.05 152.1 180.0 153.5 181.4 153.25 181.65 153.75 182.4 154.6 183.05 154.8 182.7 155.05 182.95 155.3 182.6 154.4 181.65 154.85 181.1 155.25 181.5 164.55 169.65 164.65 173.3 156.85 183.25 157.25 183.7 156.8 184.3 155.9 183.3 155.75 183.5 155.95 183.65 155.25 184.85 154.9 184.55 154.25 185.35 154.1 185.2 153.75 185.65 153.5 185.35 153.8 184.95 153.65 184.7 154.25 184.05 154.1 183.9 154.15 183.75 152.95 183.3 153.1 183.0 152.55 182.25 152.55 182.3 153.0 184.55 153.2 184.55 153.25 187.9 152.7 187.95 152.8 188.55 152.9 188.6 152.95 188.5 154.55 189.35 153.95 189.25 153.85 189.25 152.1 189.05 152.25 188.5 152.1 188.0 151.45 188.1 151.15 186.0 150.55 188.15 149.9 188.15 149.9 188.3 150.1 188.85 147.85 188.6 M149.5 177.05 L149.4 177.1 149.35 177.35 149.35 177.65 149.45 177.8 149.7 177.85 149.8 177.8 149.85 177.55 149.85 177.5 149.85 177.25 149.75 177.15 149.5 177.05 M152.6 177.6 L152.5 177.35 152.25 177.25 151.6 177.4 151.35 177.5 151.2 177.75 151.3 178.0 151.55 178.1 152.15 178.0 152.5 177.9 152.6 177.6" fill="url(#gradient5)" fill-rule="evenodd" stroke="none"/>
    <path d="M173.7 192.3 L177.0 192.95 178.75 193.3 178.35 193.1 178.15 192.95 178.15 193.0 178.1 193.0 178.1 192.6 178.2 191.95 178.4 191.75 178.65 192.0 178.7 192.4 Q179.75 192.45 180.05 191.25 180.45 189.9 180.95 189.75 L181.1 191.0 181.0 192.45 Q181.75 192.45 182.3 193.0 L182.75 193.9 182.75 194.0 182.7 194.15 184.35 194.5 186.5 195.0 188.55 195.5 191.4 196.15 192.95 196.55 192.95 196.45 192.9 195.9 Q192.9 195.25 194.0 194.7 195.0 194.15 195.8 194.15 196.05 194.9 195.55 195.75 L196.3 196.7 196.4 196.35 Q196.5 196.05 196.95 196.05 197.35 196.05 197.45 196.3 L197.6 196.7 Q197.8 196.7 197.8 196.0 L197.9 195.85 198.35 195.75 Q198.7 195.75 199.0 196.45 L199.35 197.4 199.6 197.05 Q199.85 196.7 200.25 196.7 L201.0 196.9 201.05 196.45 Q200.4 196.2 200.1 195.8 199.65 195.3 199.75 194.75 L198.55 195.1 197.75 194.85 Q197.25 194.55 197.25 193.9 197.25 193.2 197.8 192.6 L198.5 192.0 198.2 191.4 Q198.05 190.7 198.2 190.0 L198.55 189.2 Q199.15 187.95 200.65 188.4 201.5 188.55 201.85 189.2 L201.95 189.35 202.15 189.2 202.5 188.95 Q203.65 188.35 205.25 188.6 208.95 189.15 207.75 191.9 209.0 192.45 209.3 192.75 209.9 193.2 209.8 194.0 L209.45 194.55 209.1 194.85 209.2 195.1 210.05 195.25 210.2 195.3 210.1 195.2 Q210.35 194.15 210.9 194.2 L211.2 194.45 211.4 194.7 211.6 194.55 211.8 194.4 Q212.5 194.5 212.5 195.6 212.4 196.5 211.9 196.95 211.45 197.45 210.9 197.35 L210.3 196.9 210.1 196.4 210.2 196.15 210.4 195.9 209.3 195.75 Q209.2 196.55 208.2 196.95 L208.0 196.85 207.75 198.85 208.9 199.15 Q210.35 199.65 210.35 200.65 L210.25 201.45 210.2 201.5 211.0 201.75 211.0 201.65 Q211.0 201.0 211.35 200.55 211.85 199.85 212.75 200.3 L212.9 200.6 213.0 201.3 212.45 202.15 212.4 202.2 213.3 202.5 213.35 202.45 213.65 202.1 Q214.25 201.6 215.05 201.65 L215.1 201.75 215.15 202.2 214.8 202.95 214.75 203.0 217.15 203.8 217.15 327.95 -12.75 327.95 -12.75 326.6 -12.8 211.8 -10.1 210.65 -10.35 210.25 -9.65 209.65 -9.2 210.0 -8.85 210.15 -4.55 208.4 -3.5 208.0 -2.75 207.7 Q3.7 205.2 10.2 203.0 L18.95 200.2 18.9 200.1 18.55 199.25 Q18.55 198.8 18.8 198.6 L19.0 198.45 20.1 199.75 20.1 199.85 20.8 199.65 20.75 199.55 20.7 199.1 Q20.7 198.05 21.25 197.8 21.7 198.2 21.8 199.25 L21.8 199.35 22.5 199.15 22.45 199.05 22.4 198.95 Q22.25 198.7 22.25 198.25 L22.25 197.75 22.35 197.5 Q22.85 197.5 23.45 197.85 L24.05 198.45 24.05 198.4 Q24.05 197.65 24.55 197.4 L24.9 197.6 Q25.1 197.75 25.1 198.25 L25.1 198.3 25.1 198.4 25.35 198.35 25.35 198.2 25.35 198.0 25.4 197.5 26.4 197.6 26.5 197.9 26.55 198.0 34.05 196.05 34.05 195.9 Q34.15 194.95 34.75 194.55 35.4 194.05 35.4 195.45 L35.35 195.6 35.3 195.75 37.05 195.35 38.35 195.0 53.2 192.0 53.6 191.75 53.8 191.65 53.8 190.45 53.8 190.2 53.65 189.0 Q53.25 188.6 53.3 187.9 53.4 186.7 54.45 185.9 55.55 185.0 56.6 186.45 57.5 186.75 58.45 188.15 L59.55 190.3 60.1 190.35 60.45 190.0 60.85 189.6 Q61.25 189.4 61.7 190.3 L61.8 190.55 65.7 190.0 65.7 189.25 65.8 188.5 65.65 188.1 Q65.4 186.35 66.7 186.1 67.85 185.75 68.2 187.5 L68.6 188.95 68.5 189.45 68.35 189.6 Q68.25 189.65 67.85 188.9 67.45 188.0 66.85 188.3 66.55 188.4 66.4 188.85 L66.55 189.2 66.45 189.7 66.35 189.9 69.85 189.4 69.95 189.35 70.05 189.25 70.4 189.0 70.6 189.0 70.95 189.0 70.9 188.9 Q70.9 188.65 71.2 188.5 L71.15 188.35 71.15 188.25 70.95 187.55 70.95 187.25 70.95 187.2 70.9 186.75 70.95 186.0 70.95 185.8 70.9 185.65 70.55 184.6 70.2 184.15 69.85 183.85 69.55 183.65 69.15 183.35 68.55 182.9 68.45 182.6 Q68.25 182.3 68.2 182.0 L68.2 181.75 68.35 181.05 68.4 180.95 68.5 180.6 Q68.75 180.2 69.2 180.15 69.65 180.1 69.85 180.45 L70.0 181.0 69.85 181.45 69.75 181.95 Q69.9 183.2 71.45 183.0 L72.1 182.6 72.3 182.05 72.2 181.45 71.8 180.05 71.5 179.4 71.3 178.45 Q71.2 177.8 71.6 177.1 71.95 176.4 72.45 176.3 73.4 176.15 74.25 177.3 74.95 178.3 75.1 179.6 L75.1 180.2 75.1 180.4 75.1 181.0 74.65 183.25 74.3 184.05 74.25 184.05 74.05 184.7 Q73.85 185.0 73.8 185.4 L73.7 185.6 73.4 187.2 73.4 187.9 73.45 188.35 74.1 188.4 74.45 188.5 74.75 188.8 74.8 188.85 75.55 188.75 75.55 188.05 76.0 187.4 76.5 187.6 Q76.7 187.65 76.7 188.2 L76.7 188.45 76.6 188.6 79.95 188.3 79.55 187.8 80.95 186.2 79.55 184.55 78.55 181.4 78.0 181.65 76.25 177.7 77.5 176.2 79.35 175.2 80.5 179.0 79.35 180.2 79.35 180.25 79.55 180.25 79.85 180.35 Q80.15 180.1 80.4 180.1 L80.7 180.55 80.6 180.6 80.15 180.85 79.55 181.05 79.95 181.75 Q81.45 180.6 82.9 180.1 82.45 178.8 82.45 178.05 82.45 177.25 83.55 177.25 L83.65 177.6 83.25 178.05 Q83.0 178.4 83.1 178.65 L83.55 178.4 84.2 178.4 84.3 178.45 83.5 179.25 83.5 179.35 84.35 179.25 84.5 179.35 84.35 179.65 84.0 180.0 Q83.75 180.25 83.75 180.85 L80.4 182.5 81.35 183.7 81.6 184.2 84.65 185.25 85.3 183.7 85.3 183.6 85.75 183.7 85.15 186.45 85.0 186.45 83.25 185.85 81.75 185.25 82.25 186.2 80.5 187.8 80.85 188.2 87.9 187.65 107.95 186.8 109.3 186.8 109.2 186.6 109.0 185.95 109.15 185.4 Q110.15 185.4 110.8 186.35 L110.85 186.1 110.95 185.8 111.35 185.75 112.2 185.8 112.35 186.55 112.4 186.8 112.5 186.8 113.45 186.8 121.6 186.9 121.8 186.9 129.9 187.2 130.95 187.25 134.0 187.45 133.95 187.35 133.25 186.15 132.5 186.4 Q131.35 186.4 131.35 185.1 131.35 184.6 131.5 184.4 131.65 184.2 132.1 184.2 L132.45 184.35 132.6 184.5 Q132.3 183.6 132.65 183.15 133.0 182.75 133.55 182.75 134.1 182.75 134.55 183.25 134.9 183.65 134.9 184.15 L134.75 185.1 134.5 185.9 134.55 185.9 135.3 187.5 137.8 187.7 139.1 185.65 139.95 184.3 139.95 184.2 139.5 182.7 Q139.05 181.75 139.05 181.25 139.05 180.45 139.35 179.8 139.75 179.2 140.3 179.2 141.1 179.2 141.5 179.95 141.85 180.65 141.5 181.5 L141.5 181.7 141.6 181.65 142.75 180.85 Q143.35 180.85 143.75 181.2 144.2 181.6 144.2 182.3 144.2 183.65 142.6 184.45 141.55 184.8 141.05 185.05 L139.3 187.8 140.65 187.9 140.65 187.75 Q140.65 185.6 142.6 186.45 144.15 187.1 144.75 188.0 L144.5 188.25 147.85 188.6 150.1 188.85 152.1 189.05 153.85 189.25 153.95 189.25 154.55 189.35 162.5 190.45 162.45 190.4 162.4 190.25 Q162.1 189.55 162.25 188.6 L162.25 188.45 Q162.3 188.3 162.75 188.3 L163.25 188.85 163.5 189.4 Q164.55 189.4 164.95 188.5 165.45 187.55 165.9 187.5 166.4 188.0 166.05 189.8 L165.95 190.8 165.95 190.95 166.25 191.0 166.3 190.85 166.35 190.55 166.95 189.45 Q167.55 189.6 167.6 190.0 167.6 190.35 167.9 190.35 168.85 190.35 169.3 189.6 L169.95 188.55 170.4 188.7 170.5 189.35 170.4 190.65 170.35 191.55 170.35 191.7 170.7 191.8 170.7 191.6 170.7 191.5 171.0 190.95 171.6 190.3 Q172.25 190.55 172.25 191.45 L172.25 191.9 172.2 191.9 172.15 192.05 173.7 192.3 M200.15 192.3 L199.95 192.45 199.25 193.1 199.5 193.35 200.45 192.9 200.75 192.75 200.9 192.1 200.7 192.05 200.15 192.3 M198.3 192.75 L198.95 192.55 199.5 192.05 199.5 191.9 199.0 192.0 198.3 192.75 M202.35 197.2 L202.45 196.55 201.8 196.55 201.7 197.15 202.35 197.2 M206.7 184.55 L206.6 184.55 Q206.8 183.95 206.0 182.8 205.05 181.5 205.25 180.55 205.35 180.25 205.6 180.1 L206.2 180.0 Q206.65 180.15 207.0 180.75 L207.3 181.75 207.75 181.2 Q208.25 180.85 208.7 181.0 209.5 181.25 209.5 182.2 L209.45 182.65 209.15 183.35 Q208.85 183.75 208.2 183.8 207.25 183.85 206.7 184.55 M207.55 197.2 L207.15 197.25 206.75 198.6 206.75 198.7 207.25 198.85 207.55 197.2 M203.85 196.15 L203.25 196.4 203.15 196.45 203.05 197.1 204.0 197.0 Q204.4 197.0 205.4 197.85 L206.0 198.3 206.35 197.25 206.15 197.25 205.2 197.05 205.0 196.4 204.2 196.55 203.85 196.15 M58.3 189.7 Q57.55 186.95 55.65 187.25 54.6 187.35 54.5 188.8 L54.55 188.8 Q55.45 189.2 55.4 189.85 55.35 190.7 54.85 191.2 L54.45 191.5 54.45 191.75 58.95 191.0 Q58.5 190.5 58.3 189.7 M54.3 187.2 Q54.8 186.5 55.55 186.4 L55.85 186.35 55.3 186.0 54.65 186.2 53.95 187.1 53.7 187.8 53.8 188.2 54.3 187.2 M54.5 189.4 L54.5 191.05 Q54.95 190.55 55.0 190.0 55.05 189.65 54.5 189.4 M78.85 176.95 Q78.45 176.95 78.45 177.6 L78.75 178.45 79.35 178.9 Q79.75 178.9 79.75 178.45 L79.55 177.7 79.35 177.35 78.85 176.95 M66.0 188.0 L66.0 188.1 66.3 187.75 Q67.15 187.0 67.7 187.15 L67.7 187.1 Q67.45 186.15 66.55 186.5 66.15 186.6 66.05 187.2 L66.0 188.0 M60.85 190.0 L60.2 190.8 61.1 190.65 60.85 190.0 M132.6 184.5 L132.65 184.7 132.65 184.55 132.6 184.5 M204.85 199.75 L204.8 199.6 204.45 199.65 204.3 199.65 204.85 199.85 204.85 199.75 M-8.85 208.6 L-8.75 208.45 -8.25 208.95 -8.85 208.6 M-7.7 208.6 Q-7.25 208.15 -6.75 208.35 L-6.6 208.6 -7.65 208.9 -7.7 208.6 M-10.35 208.8 L-10.8 209.3 -10.9 209.15 Q-10.9 208.25 -10.2 208.45 L-10.35 208.8" fill="url(#gradient6)" fill-rule="evenodd" stroke="none"/>
    <path d="M35.2 176.05 Q36.3 177.9 36.3 180.1 36.3 183.6 34.7 186.15 33.0 188.55 30.5 188.55 L29.25 188.3 30.35 187.5 Q31.25 186.4 31.25 185.1 31.25 184.0 29.9 181.8 28.45 179.6 28.45 178.0 28.45 174.05 31.95 174.05 33.9 174.05 35.2 176.05 M30.75 177.1 Q30.5 177.1 30.35 177.5 30.75 179.65 31.8 180.5 L32.15 179.65 Q32.15 178.85 31.6 178.0 31.2 177.1 30.75 177.1 M34.85 178.15 Q34.85 177.25 34.5 176.65 34.0 176.0 33.55 176.15 L33.75 177.65 Q34.1 179.0 34.5 179.0 34.85 179.0 34.85 178.15 M37.8 189.35 L39.0 187.0 Q39.8 186.0 40.85 186.0 L40.85 185.8 Q40.6 185.05 40.6 184.3 40.6 182.55 41.45 181.35 42.35 179.9 43.5 179.9 45.95 179.9 45.95 183.9 45.95 186.05 44.3 187.65 42.8 188.95 41.4 188.95 L39.1 188.6 37.8 189.5 37.8 189.35 M44.9 182.55 L44.45 183.45 Q44.45 185.05 45.1 185.15 L45.2 183.8 Q45.2 183.0 44.9 182.55 M42.6 182.35 Q41.9 182.35 41.9 184.0 41.9 185.7 42.75 185.7 43.6 185.7 43.45 184.0 43.2 182.35 42.6 182.35" fill="url(#gradient7)" fill-rule="evenodd" stroke="none"/>
    <path d="M37.05 195.35 L36.85 194.65 36.85 194.15 36.95 194.05 Q37.7 194.15 38.05 194.55 L38.35 195.0 37.05 195.35" fill="url(#gradient8)" fill-rule="evenodd" stroke="none"/>
    <path d="M-12.8 210.55 L-12.8 203.2 -12.55 202.65 -12.1 202.2 Q-11.85 202.0 -11.9 201.5 L-11.9 200.55 Q-11.9 198.35 -10.35 197.05 -8.95 195.9 -6.9 195.9 -4.9 195.9 -3.5 197.0 -1.95 198.25 -1.95 200.3 -1.95 201.65 -2.8 203.15 L-2.85 203.25 -2.75 204.15 -2.7 206.65 -2.75 207.7 -3.5 208.0 -3.4 206.5 Q-3.7 207.35 -4.55 208.4 L-8.85 210.15 -9.2 210.0 -9.65 209.65 -10.35 210.25 -10.45 210.35 -11.75 210.8 -12.8 210.55 M-7.7 208.6 L-7.65 208.9 -6.6 208.6 -6.75 208.35 Q-7.25 208.15 -7.7 208.6 M-8.85 208.6 L-8.25 208.95 -8.75 208.45 -8.85 208.6 M-3.5 205.2 L-3.45 205.35 -3.45 204.3 -3.7 204.6 -3.5 205.2 M-10.35 208.8 L-10.2 208.45 Q-10.9 208.25 -10.9 209.15 L-10.8 209.3 -10.35 208.8" fill="url(#gradient9)" fill-rule="evenodd" stroke="none"/>
    <path d="M92.9 20.35 Q95.35 22.8 95.35 25.7 95.35 27.05 93.75 30.1 L94.7 32.6 95.35 34.4 Q94.6 33.2 92.9 31.75 L92.65 31.5 Q90.5 29.75 87.5 28.35 84.35 26.85 80.85 25.95 75.9 24.7 70.2 24.7 L55.8 25.85 43.15 28.35 31.2 30.9 19.15 32.0 Q12.0 32.0 6.75 30.5 4.5 29.85 3.05 29.05 5.15 30.05 7.95 30.05 15.65 30.05 23.4 26.9 26.45 25.65 30.15 23.7 L36.7 20.0 Q45.25 15.05 50.5 13.05 58.75 9.9 67.4 9.9 75.6 9.9 79.7 13.3 82.5 15.65 82.95 19.1 L83.25 18.9 Q85.2 17.9 87.5 17.9 90.4 17.9 92.9 20.35 M93.0 28.35 L93.1 28.6 93.2 28.6 92.9 27.85 92.9 28.1 93.0 28.35" fill="#ffffff" fill-rule="evenodd" stroke="none"/>
    <path d="M19.9 188.15 L18.1 191.15 18.2 191.45 18.65 193.2 18.8 193.7 18.35 194.3 17.6 195.1 18.35 195.6 18.9 195.4 18.9 196.0 18.9 196.35 18.8 197.15 18.3 197.4 17.2 197.85 Q16.2 197.85 15.35 197.45 L15.25 197.4 14.55 197.95 14.55 197.05 14.5 197.0 Q13.45 196.4 13.15 195.45 13.5 197.15 14.0 197.95 L14.15 198.15 Q14.75 198.75 16.35 198.75 17.3 198.75 19.3 197.7 19.8 197.7 21.05 198.95 21.45 199.15 21.65 199.45 L3.35 205.9 Q4.1 204.1 7.05 202.1 8.55 201.15 9.4 200.05 10.15 198.95 10.25 197.85 L10.25 196.45 Q10.25 190.55 14.45 189.7 L15.6 187.5 15.45 189.05 15.4 189.6 15.85 189.55 Q16.85 189.55 17.5 190.25 L18.5 189.3 19.9 188.15 M13.85 193.9 Q13.85 194.5 14.25 195.2 L14.55 195.6 Q15.1 196.35 15.6 196.35 L16.6 195.7 14.0 193.55 13.85 193.9" fill="url(#gradient10)" fill-rule="evenodd" stroke="none"/>
  </g>
  <defs>
    <radialGradient cx="0" cy="0" gradientTransform="matrix(0.4388, 0.0, 0.0, 0.5303, 118.1, 252.45)" gradientUnits="userSpaceOnUse" id="gradient0" r="819.2" spreadMethod="pad">
      <stop offset="0.0" stop-color="#ffffcc"/>
      <stop offset="0.42745098039215684" stop-color="#bdf3ff"/>
      <stop offset="0.6980392156862745" stop-color="#8acdff"/>
      <stop offset="1.0" stop-color="#8a93ff"/>
    </radialGradient>
    <radialGradient cx="0" cy="0" gradientTransform="matrix(0.2529, 0.0, 0.0, 0.3204, 107.35, 192.95)" gradientUnits="userSpaceOnUse" id="gradient1" r="819.2" spreadMethod="pad">
      <stop offset="0.0" stop-color="#ffffff"/>
      <stop offset="1.0" stop-color="#ffffff" stop-opacity="0.0"/>
    </radialGradient>
    <radialGradient cx="0" cy="0" gradientTransform="matrix(0.4034, 0.0, 0.0, 0.5109, 107.35, 192.95)" gradientUnits="userSpaceOnUse" id="gradient2" r="819.2" spreadMethod="pad">
      <stop offset="0.0" stop-color="#ffffff"/>
      <stop offset="1.0" stop-color="#ffffff" stop-opacity="0.0"/>
    </radialGradient>
    <radialGradient cx="0" cy="0" gradientTransform="matrix(0.4676, 0.0, 0.0, 0.5508, 117.1, 328.35)" gradientUnits="userSpaceOnUse" id="gradient3" r="819.2" spreadMethod="pad">
      <stop offset="0.0" stop-color="#015b65"/>
      <stop offset="0.40784313725490196" stop-color="#02d5ec"/>
      <stop offset="1.0" stop-color="#708cfe"/>
    </radialGradient>
    <radialGradient cx="0" cy="0" gradientTransform="matrix(0.4388, 0.0, 0.0, 0.5303, 118.1, 252.45)" gradientUnits="userSpaceOnUse" id="gradient4" r="819.2" spreadMethod="pad">
      <stop offset="0.0" stop-color="#ffffcc"/>
      <stop offset="0.42745098039215684" stop-color="#bdf3ff"/>
      <stop offset="0.6980392156862745" stop-color="#8acdff"/>
      <stop offset="1.0" stop-color="#8a93ff"/>
    </radialGradient>
    <radialGradient cx="0" cy="0" gradientTransform="matrix(0.4676, 0.0, 0.0, 0.5508, 117.1, 328.1)" gradientUnits="userSpaceOnUse" id="gradient5" r="819.2" spreadMethod="pad">
      <stop offset="0.0" stop-color="#015b65"/>
      <stop offset="0.40784313725490196" stop-color="#02d5ec"/>
      <stop offset="1.0" stop-color="#708cfe"/>
    </radialGradient>
    <radialGradient cx="0" cy="0" gradientTransform="matrix(0.4676, 0.0, 0.0, 0.5508, 117.1, 327.95)" gradientUnits="userSpaceOnUse" id="gradient6" r="819.2" spreadMethod="pad">
      <stop offset="0.0" stop-color="#015b65"/>
      <stop offset="0.40784313725490196" stop-color="#02d5ec"/>
      <stop offset="1.0" stop-color="#708cfe"/>
    </radialGradient>
    <radialGradient cx="0" cy="0" gradientTransform="matrix(0.4676, 0.0, 0.0, 0.5508, 123.3, 324.95)" gradientUnits="userSpaceOnUse" id="gradient7" r="819.2" spreadMethod="pad">
      <stop offset="0.0" stop-color="#015b65"/>
      <stop offset="0.40784313725490196" stop-color="#02d5ec"/>
      <stop offset="1.0" stop-color="#708cfe"/>
    </radialGradient>
    <radialGradient cx="0" cy="0" gradientTransform="matrix(0.4676, 0.0, 0.0, 0.5508, 118.4, 327.8)" gradientUnits="userSpaceOnUse" id="gradient8" r="819.2" spreadMethod="pad">
      <stop offset="0.0" stop-color="#015b65"/>
      <stop offset="0.40784313725490196" stop-color="#02d5ec"/>
      <stop offset="1.0" stop-color="#708cfe"/>
    </radialGradient>
    <radialGradient cx="0" cy="0" gradientTransform="matrix(0.4676, 0.0, 0.0, 0.5508, 113.85, 325.8)" gradientUnits="userSpaceOnUse" id="gradient9" r="819.2" spreadMethod="pad">
      <stop offset="0.0" stop-color="#015b65"/>
      <stop offset="0.40784313725490196" stop-color="#02d5ec"/>
      <stop offset="1.0" stop-color="#708cfe"/>
    </radialGradient>
    <radialGradient cx="0" cy="0" gradientTransform="matrix(0.4676, 0.0, 0.0, 0.5508, 121.95, 326.7)" gradientUnits="userSpaceOnUse" id="gradient10" r="819.2" spreadMethod="pad">
      <stop offset="0.0" stop-color="#015b65"/>
      <stop offset="0.40784313725490196" stop-color="#02d5ec"/>
      <stop offset="1.0" stop-color="#708cfe"/>
    </radialGradient>
  </defs>
</svg>
