<?xml version="1.0" encoding="UTF-8" standalone="no"?>
<svg xmlns:xlink="http://www.w3.org/1999/xlink" height="34.6px" width="39.6px" xmlns="http://www.w3.org/2000/svg">
  <g transform="matrix(1.0, 0.0, 0.0, 1.0, 126.2, 33.1)">
    <path d="M-117.05 -28.35 L-116.9 -28.55 -116.5 -28.95 -116.25 -28.6 -115.4 -27.25 -115.55 -27.6 -115.65 -27.75 -115.95 -28.2 -116.45 -29.0 -116.35 -29.05 -116.0 -29.3 -115.05 -28.2 -114.6 -27.45 -114.3 -27.05 -113.9 -26.55 -111.9 -24.5 Q-110.75 -23.55 -108.1 -23.3 L-108.0 -23.3 -107.65 -23.3 -103.2 -23.15 -99.1 -22.4 Q-97.65 -21.9 -95.0 -20.6 L-92.05 -18.45 Q-90.2 -17.1 -87.75 -17.1 L-86.85 -17.15 -87.75 -16.35 Q-88.5 -15.8 -89.6 -15.95 L-88.4 -15.05 -90.1 -14.0 -90.1 -13.9 Q-89.7 -12.45 -89.9 -10.85 L-90.05 -7.55 Q-89.95 -6.05 -89.25 -5.1 -90.1 -5.75 -90.55 -7.1 L-90.95 -8.9 -91.0 -7.0 Q-91.15 -5.15 -91.7 -4.2 -93.05 -1.6 -92.85 0.7 L-93.2 -1.1 -93.4 -3.3 -93.1 -7.75 Q-92.8 -10.9 -92.8 -12.6 L-92.85 -15.8 Q-93.1 -17.55 -93.95 -18.5 L-96.85 -20.15 Q-101.55 -22.45 -105.1 -21.85 L-109.4 -22.0 -110.95 -22.35 Q-111.9 -22.6 -112.55 -23.0 L-114.85 -26.4 -115.4 -27.25 -115.35 -27.15 Q-114.15 -25.0 -114.15 -21.8 L-114.15 -21.45 Q-114.25 -19.6 -115.35 -17.3 L-115.4 -17.25 Q-116.15 -15.8 -117.1 -14.6 -115.95 -7.2 -115.95 -5.15 L-116.15 -2.1 -116.4 1.05 -116.55 1.05 Q-116.6 -1.25 -117.45 -4.45 L-118.7 -9.4 -118.75 -9.5 -118.75 -9.35 -118.5 -6.2 -118.15 -4.6 -117.6 -3.15 -117.75 -3.15 -120.25 -8.9 -120.05 -8.6 -120.05 -9.65 -120.35 -12.5 -120.2 -14.4 -120.05 -15.7 -120.05 -15.8 -119.9 -14.55 -119.85 -13.4 -119.3 -11.0 -118.85 -15.15 -117.45 -9.25 -118.0 -13.65 -118.2 -15.5 -118.85 -20.4 -119.0 -21.2 -119.0 -21.35 -117.9 -18.0 -117.75 -17.85 Q-116.65 -19.5 -116.15 -20.95 L-116.05 -21.45 Q-115.65 -23.0 -115.65 -25.85 -115.65 -26.5 -116.35 -27.45 L-117.05 -28.35 M-115.75 -29.5 L-114.3 -30.4 -114.05 -30.2 -114.25 -30.45 -111.65 -31.8 Q-107.35 -30.65 -104.2 -29.3 L-102.95 -28.75 -102.0 -28.3 -98.65 -26.25 Q-95.95 -24.25 -94.4 -21.65 -96.35 -24.25 -99.35 -26.0 L-100.7 -26.7 -100.8 -26.75 Q-102.4 -27.5 -104.25 -28.05 L-104.75 -28.1 -110.85 -29.0 Q-112.9 -29.3 -114.05 -30.2 L-113.55 -29.6 Q-112.0 -28.05 -110.4 -27.75 L-106.65 -27.0 -105.55 -26.65 -103.75 -25.85 -103.8 -25.8 -105.75 -26.3 -110.55 -26.85 Q-113.6 -27.05 -115.05 -28.2 L-115.75 -29.5 M-122.35 -14.55 Q-122.2 -14.8 -121.85 -13.55 L-121.85 -13.5 -122.85 -12.3 Q-123.9 -11.3 -125.35 -11.3 L-125.8 -11.45 -126.1 -11.65 -126.2 -11.75 Q-124.75 -12.05 -123.6 -13.1 -122.85 -13.75 -122.4 -14.5 L-122.35 -14.55 M-117.45 -16.7 L-117.35 -16.05 -117.1 -14.6 -117.35 -16.05 -117.45 -16.7 M-93.95 -18.5 L-91.0 -16.55 -90.95 -16.35 -90.3 -14.5 -90.2 -14.25 -90.15 -14.15 -90.1 -14.0 -90.15 -14.15 -90.2 -14.25 -90.3 -14.5 -90.95 -16.35 -91.0 -16.55 -93.95 -18.5 M-92.45 -22.1 L-92.6 -22.1 -92.45 -22.15 -92.45 -22.1 M-98.75 -24.05 L-99.3 -24.35 -99.15 -24.35 -98.75 -24.05 M-90.95 -8.9 L-90.95 -9.95 -91.1 -9.95 -90.95 -8.9" fill="#d2b6b6" fill-rule="evenodd" stroke="none"/>
    <path d="M-126.2 -11.75 Q-124.0 -12.25 -123.65 -15.8 -123.3 -19.6 -122.65 -20.65 L-122.55 -20.85 -122.5 -20.95 -122.45 -21.0 -122.45 -19.2 -122.3 -19.2 -122.05 -20.45 -121.85 -21.35 -121.7 -21.35 -121.7 -16.35 -121.05 -20.25 -120.8 -22.55 -120.65 -22.55 -120.55 -20.25 -120.1 -15.85 -120.05 -15.9 -119.6 -20.3 Q-119.2 -23.5 -119.45 -24.8 L-119.45 -24.95 Q-119.2 -24.75 -119.0 -23.65 L-118.85 -21.95 -117.9 -23.45 Q-117.25 -24.6 -117.45 -25.2 -117.3 -24.8 -117.3 -24.15 -117.3 -22.9 -118.25 -20.9 L-118.15 -20.85 -117.05 -22.7 Q-116.7 -23.6 -116.7 -24.8 -116.7 -25.7 -117.35 -27.1 L-117.65 -27.7 -117.05 -28.35 -116.35 -27.45 Q-115.65 -26.5 -115.65 -25.85 -115.65 -23.0 -116.05 -21.45 L-116.15 -20.95 Q-116.65 -19.5 -117.75 -17.85 L-117.9 -18.0 -119.0 -21.35 -119.0 -21.2 -118.85 -20.4 -118.2 -15.5 -118.0 -13.65 -117.45 -9.25 -118.85 -15.15 -119.3 -11.0 -119.85 -13.4 -119.9 -14.55 -120.05 -15.8 -120.05 -15.7 -120.2 -14.4 -120.35 -12.5 -120.05 -9.65 -120.05 -8.6 -120.25 -8.9 -121.3 -11.55 -121.45 -11.95 -121.55 -12.3 -121.85 -13.5 -121.85 -13.55 Q-122.2 -14.8 -122.35 -14.55 L-122.4 -14.5 Q-122.85 -13.75 -123.6 -13.1 -124.75 -12.05 -126.2 -11.75 M-116.0 -29.3 L-115.75 -29.5 -115.05 -28.2 Q-113.6 -27.05 -110.55 -26.85 L-105.75 -26.3 -103.8 -25.8 -103.75 -25.85 -105.55 -26.65 -106.65 -27.0 -110.4 -27.75 Q-112.0 -28.05 -113.55 -29.6 L-114.05 -30.2 Q-112.9 -29.3 -110.85 -29.0 L-104.75 -28.1 -104.25 -28.05 Q-102.4 -27.5 -100.8 -26.75 L-100.7 -26.7 -99.35 -26.0 Q-96.35 -24.25 -94.4 -21.65 -95.95 -24.25 -98.65 -26.25 L-102.0 -28.3 -102.95 -28.75 -104.2 -29.3 Q-107.35 -30.65 -111.65 -31.8 -107.45 -33.6 -103.4 -32.9 -98.65 -32.1 -94.15 -27.85 L-93.75 -27.45 -92.4 -26.0 Q-91.95 -25.3 -91.85 -24.7 L-90.95 -21.4 -89.55 -18.25 Q-88.55 -16.9 -86.75 -17.45 L-86.7 -17.35 -86.85 -17.15 -87.75 -17.1 Q-90.2 -17.1 -92.05 -18.45 L-95.0 -20.6 Q-97.65 -21.9 -99.1 -22.4 L-103.2 -23.15 -107.65 -23.3 -108.0 -23.3 -108.1 -23.3 Q-110.75 -23.55 -111.9 -24.5 L-113.9 -26.55 -114.3 -27.05 -114.6 -27.45 -115.05 -28.2 -116.0 -29.3 M-114.3 -30.4 L-114.25 -30.45 -114.05 -30.2 -114.3 -30.4 M-95.75 -25.35 L-94.25 -23.25 -92.6 -20.6 -92.45 -20.6 -92.45 -20.65 Q-93.4 -24.5 -96.55 -27.0 -99.65 -29.4 -104.75 -30.6 L-103.8 -29.55 Q-100.8 -28.7 -98.15 -26.4 -95.75 -24.4 -93.65 -21.2 L-94.6 -23.2 Q-95.45 -24.85 -96.0 -25.35 L-95.75 -25.35 M-112.3 -25.75 Q-111.35 -24.55 -109.7 -24.2 L-106.25 -24.05 -105.2 -24.0 Q-101.9 -23.85 -98.7 -22.7 L-102.15 -24.5 -101.1 -24.5 Q-99.55 -24.2 -96.75 -22.25 -97.7 -23.3 -98.75 -24.1 L-100.75 -25.5 Q-103.3 -27.05 -106.25 -27.6 -104.6 -27.0 -102.65 -24.85 L-102.6 -24.8 -102.6 -24.65 -102.95 -24.75 -104.6 -25.3 -107.1 -25.95 -111.65 -25.65 -112.3 -25.75 M-92.45 -22.1 L-92.45 -22.15 -92.6 -22.1 -92.45 -22.1" fill="#e0cdcd" fill-rule="evenodd" stroke="none"/>
    <path d="M-122.45 -21.0 L-119.25 -25.6 -117.65 -27.7 -117.35 -27.1 Q-116.7 -25.7 -116.7 -24.8 -116.7 -23.6 -117.05 -22.7 L-118.15 -20.85 -118.25 -20.9 Q-117.3 -22.9 -117.3 -24.15 -117.3 -24.8 -117.45 -25.2 -117.25 -24.6 -117.9 -23.45 L-118.85 -21.95 -119.0 -23.65 Q-119.2 -24.75 -119.45 -24.95 L-119.45 -24.8 Q-119.2 -23.5 -119.6 -20.3 L-120.05 -15.9 -120.1 -15.85 -120.55 -20.25 -120.65 -22.55 -120.8 -22.55 -121.05 -20.25 -121.7 -16.35 -121.7 -21.35 -121.85 -21.35 -122.05 -20.45 -122.3 -19.2 -122.45 -19.2 -122.45 -21.0 M-95.75 -25.35 L-96.0 -25.35 Q-95.45 -24.85 -94.6 -23.2 L-93.65 -21.2 Q-95.75 -24.4 -98.15 -26.4 -100.8 -28.7 -103.8 -29.55 L-104.75 -30.6 Q-99.65 -29.4 -96.55 -27.0 -93.4 -24.5 -92.45 -20.65 L-92.45 -20.6 -92.6 -20.6 -94.25 -23.25 -95.75 -25.35 M-112.3 -25.75 L-111.65 -25.65 -107.1 -25.95 -104.6 -25.3 -102.95 -24.75 -102.6 -24.65 -102.6 -24.8 -102.65 -24.85 Q-104.6 -27.0 -106.25 -27.6 -103.3 -27.05 -100.75 -25.5 L-98.75 -24.1 Q-97.7 -23.3 -96.75 -22.25 -99.55 -24.2 -101.1 -24.5 L-102.15 -24.5 -98.7 -22.7 Q-101.9 -23.85 -105.2 -24.0 L-106.25 -24.05 -109.7 -24.2 Q-111.35 -24.55 -112.3 -25.75 M-98.75 -24.05 L-99.15 -24.35 -99.3 -24.35 -98.75 -24.05" fill="#f2eaea" fill-rule="evenodd" stroke="none"/>
    <path d="M-126.2 -11.75 Q-124.0 -12.25 -123.65 -15.8 -123.3 -19.6 -122.65 -20.65 L-122.55 -20.85 -122.5 -20.95 -122.45 -21.0 -119.25 -25.6 -117.65 -27.7 -117.05 -28.35 -116.9 -28.55 -116.5 -28.95 -116.45 -29.0 -116.35 -29.05 -116.0 -29.3 -115.75 -29.5 -114.3 -30.4 -114.25 -30.45 -111.65 -31.8 Q-107.45 -33.6 -103.4 -32.9 -98.65 -32.1 -94.15 -27.85 L-93.75 -27.45 -92.4 -26.0 Q-91.95 -25.3 -91.85 -24.7 L-90.95 -21.4 -89.55 -18.25 Q-88.55 -16.9 -86.75 -17.45 L-86.6 -17.45 -86.7 -17.35 -86.85 -17.15 -87.75 -16.35 Q-88.5 -15.8 -89.6 -15.95 L-88.4 -15.05 -90.1 -14.0 -90.1 -13.9 Q-89.7 -12.45 -89.9 -10.85 L-90.05 -7.55 Q-89.95 -6.05 -89.25 -5.1 L-89.0 -4.95 -89.0 -4.8 -89.25 -5.1 Q-90.1 -5.75 -90.55 -7.1 L-90.95 -8.9 -91.0 -7.0 Q-91.15 -5.15 -91.7 -4.2 -93.05 -1.6 -92.85 0.7 L-92.75 1.5 M-121.85 -13.5 L-121.85 -13.55 Q-122.2 -14.8 -122.35 -14.55 M-126.2 -11.75 L-126.1 -11.65 -125.8 -11.45 -125.35 -11.3 Q-123.9 -11.3 -122.85 -12.3 L-121.85 -13.5 -121.55 -12.3 -121.45 -11.95 -121.3 -11.55 -120.25 -8.9 M-92.85 0.7 L-93.2 -1.1 -93.4 -3.3 -93.1 -7.75 Q-92.8 -10.9 -92.8 -12.6 L-92.85 -15.8 Q-93.1 -17.55 -93.95 -18.5 L-96.85 -20.15 Q-101.55 -22.45 -105.1 -21.85 L-109.4 -22.0 -110.95 -22.35 Q-111.9 -22.6 -112.55 -23.0 L-114.85 -26.4 -115.4 -27.25 -115.35 -27.15 Q-114.15 -25.0 -114.15 -21.8 L-114.15 -21.45 Q-114.25 -19.6 -115.35 -17.3 L-115.4 -17.25 Q-116.15 -15.8 -117.1 -14.6 -115.95 -7.2 -115.95 -5.15 L-116.15 -2.1 -116.4 1.05 -116.55 1.05 Q-116.6 -1.25 -117.45 -4.45 L-118.7 -9.4 -118.75 -9.5 -118.75 -9.35 -118.5 -6.2 -118.15 -4.6 -117.6 -3.15 -117.75 -3.15 -120.25 -8.9 M-116.5 -28.95 L-116.25 -28.6 -115.4 -27.25 -115.55 -27.6 -115.65 -27.75 M-115.95 -28.2 L-116.45 -29.0 M-117.1 -14.6 L-117.35 -16.05 -117.45 -16.7 M-90.1 -14.0 L-90.15 -14.15 -90.2 -14.25 -90.3 -14.5 -90.95 -16.35 -91.0 -16.55 -93.95 -18.5 M-90.95 -8.9 L-91.1 -9.95 -90.95 -9.95 -90.95 -8.9" fill="none" stroke="#a36a6a" stroke-linecap="butt" stroke-linejoin="miter" stroke-miterlimit="3.0" stroke-opacity="0.4" stroke-width="0.05"/>
  </g>
</svg>
