<?xml version="1.0" encoding="UTF-8" standalone="no"?>
<svg xmlns:xlink="http://www.w3.org/1999/xlink" height="44.55px" width="34.0px" xmlns="http://www.w3.org/2000/svg">
  <g transform="matrix(1.0, 0.0, 0.0, 1.0, 3.1, 11.45)">
    <path d="M18.7 18.6 L20.5 18.9 20.85 19.9 19.8 20.55 19.8 20.65 20.0 22.9 20.05 23.25 19.55 22.7 19.4 22.5 19.0 22.0 18.9 21.05 18.7 18.6 M9.5 21.1 Q9.1 21.4 8.8 21.95 L8.25 23.0 8.25 22.85 8.15 21.7 6.85 20.95 7.2 18.85 9.55 18.5 9.5 21.1" fill="#1f3a47" fill-rule="evenodd" stroke="none"/>
    <path d="M9.45 22.2 L9.5 21.1 9.55 18.5 13.45 18.2 15.65 18.3 18.7 18.6 18.9 21.05 18.75 21.1 Q15.55 22.6 12.6 22.6 L9.45 22.2 M15.6 19.1 Q15.3 18.4 14.05 18.55 12.85 18.7 12.5 19.55 12.35 19.9 12.35 20.35 L12.35 21.05 Q12.55 21.65 13.75 21.65 14.75 21.65 15.3 20.75 L15.65 19.6 15.6 19.1" fill="#244354" fill-rule="evenodd" stroke="none"/>
    <path d="M21.35 21.95 L21.4 22.2 21.75 24.0 21.35 24.15 21.3 24.15 21.15 24.15 20.9 23.6 20.7 22.6 Q20.7 21.9 21.2 21.9 L21.35 21.95 M19.0 22.0 L19.05 22.75 19.1 23.95 18.95 24.5 19.05 26.25 18.75 29.45 18.45 30.3 18.45 29.8 Q18.45 25.3 17.3 23.7 L16.2 24.25 14.45 24.85 14.6 24.6 14.95 23.85 14.8 23.4 14.4 23.0 13.65 22.7 13.55 22.7 13.25 22.8 13.3 23.0 13.15 23.1 12.95 23.35 Q12.7 23.6 12.7 23.9 12.7 24.35 13.15 24.7 L13.55 24.95 12.7 25.0 10.7 24.65 10.35 24.55 Q9.85 27.1 9.85 28.5 9.85 31.05 10.7 31.9 L10.65 31.9 Q10.05 31.9 9.75 30.7 9.5 29.8 9.5 28.9 L9.45 24.05 9.4 24.0 9.4 23.85 9.45 22.7 9.45 22.2 12.6 22.6 Q15.55 22.6 18.75 21.1 L18.9 21.05 19.0 22.0 M6.8 24.2 Q6.4 24.0 6.3 23.35 L6.4 22.7 6.45 22.45 6.5 22.2 6.75 22.1 Q7.15 22.1 7.15 22.85 L6.8 24.2" fill="#2a4d63" fill-rule="evenodd" stroke="none"/>
    <path d="M15.6 19.1 L15.55 19.3 15.3 20.15 14.65 20.8 Q14.15 21.2 13.85 21.2 L13.4 21.1 12.9 20.7 Q12.7 20.6 12.65 20.2 L12.5 19.55 Q12.85 18.7 14.05 18.55 15.3 18.4 15.6 19.1" fill="#000000" fill-rule="evenodd" stroke="none"/>
    <path d="M12.95 23.35 L13.15 23.1 13.3 23.0 13.25 22.8 13.55 22.7 13.65 22.7 14.4 23.0 14.8 23.4 Q14.6 24.45 13.85 24.45 12.9 24.45 12.9 23.5 L12.95 23.35 M12.5 19.55 L12.65 20.2 Q12.7 20.6 12.9 20.7 L13.4 21.1 13.85 21.2 Q14.15 21.2 14.65 20.8 L15.3 20.15 15.55 19.3 15.6 19.1 15.65 19.6 15.3 20.75 Q14.75 21.65 13.75 21.65 12.55 21.65 12.35 21.05 L12.35 20.35 Q12.35 19.9 12.5 19.55" fill="#162a36" fill-rule="evenodd" stroke="none"/>
    <path d="M20.85 19.9 L21.35 21.95 21.2 21.9 Q20.7 21.9 20.7 22.6 L20.9 23.6 21.15 24.15 20.05 23.25 20.0 22.9 19.8 20.65 19.8 20.55 20.85 19.9 M8.25 23.0 L7.9 23.65 Q7.5 24.25 7.15 24.25 L6.8 24.2 7.15 22.85 Q7.15 22.1 6.75 22.1 L6.5 22.2 6.55 21.9 6.85 20.95 8.15 21.7 8.25 22.85 8.25 23.0" fill="#274759" fill-rule="evenodd" stroke="none"/>
    <path d="M16.2 30.1 L16.15 29.65 16.05 28.8 15.6 27.35 15.55 27.25 Q15.1 25.8 14.25 25.8 13.05 25.8 12.35 26.75 11.75 27.55 11.7 28.9 L11.55 29.8 11.5 30.55 11.4 31.2 11.25 31.45 10.7 31.9 10.65 31.9 10.7 31.9 Q9.85 31.05 9.85 28.5 9.85 27.1 10.35 24.55 L10.7 24.65 12.7 25.0 13.55 24.95 14.0 25.05 14.45 24.85 16.2 24.25 17.3 23.7 Q18.45 25.3 18.45 29.8 L18.45 30.3 18.2 30.8 17.35 31.85 Q16.9 31.85 16.55 31.15 L16.2 30.1" fill="#335a78" fill-rule="evenodd" stroke="none"/>
    <path d="M19.1 23.95 L19.15 24.9 19.15 26.5 19.1 28.8 18.75 31.1 18.25 31.65 Q17.65 32.15 16.75 32.25 16.3 31.55 16.2 30.1 L16.55 31.15 Q16.9 31.85 17.35 31.85 L18.2 30.8 18.45 30.3 18.75 29.45 19.05 26.25 18.95 24.5 19.1 23.95 M15.6 27.35 Q15.15 26.55 14.35 26.55 12.25 26.55 11.75 28.8 L11.7 28.9 Q11.75 27.55 12.35 26.75 13.05 25.8 14.25 25.8 15.1 25.8 15.55 27.25 L15.6 27.35 M11.4 31.2 L11.15 32.15 11.15 32.2 10.8 32.9 Q10.25 32.5 9.45 31.35 9.2 31.0 9.1 30.45 L9.15 28.85 9.15 28.8 9.35 25.0 9.4 24.0 9.45 24.05 9.5 28.9 Q9.5 29.8 9.75 30.7 10.05 31.9 10.65 31.9 L10.7 31.9 11.25 31.45 11.4 31.2" fill="#5894cc" fill-rule="evenodd" stroke="none"/>
    <path d="M18.75 31.1 Q18.45 32.25 17.95 32.6 L17.5 32.75 16.75 32.25 Q17.65 32.15 18.25 31.65 L18.75 31.1 M10.8 32.9 L10.35 33.1 Q9.05 33.1 9.05 30.75 L9.1 30.45 Q9.2 31.0 9.45 31.35 10.25 32.5 10.8 32.9" fill="#6eb0ff" fill-rule="evenodd" stroke="none"/>
    <path d="M13.55 24.95 L13.15 24.7 Q12.7 24.35 12.7 23.9 12.7 23.6 12.95 23.35 L12.9 23.5 Q12.9 24.45 13.85 24.45 14.6 24.45 14.8 23.4 L14.95 23.85 14.6 24.6 14.45 24.85 14.0 25.05 13.55 24.95" fill="#213e52" fill-rule="evenodd" stroke="none"/>
    <path d="M5.75 -1.0 L5.95 -3.8 6.1 -3.75 8.85 -3.5 9.2 -0.65 6.65 -0.9 6.1 -0.95 5.75 -1.0 M11.45 -3.4 L13.9 -3.35 14.6 -3.35 14.4 -2.3 14.25 -0.6 14.25 -0.5 13.9 -0.5 11.4 -0.55 11.45 -3.4 M24.8 -4.3 L25.85 -4.55 26.75 -4.75 26.55 -1.85 25.85 -1.7 25.35 -1.55 24.75 -1.4 24.65 -2.05 Q24.65 -3.4 24.8 -4.3 M27.7 -5.0 L28.65 -5.35 29.05 -5.5 29.15 -5.55 29.35 -2.8 29.05 -2.65 28.9 -2.6 28.65 -2.5 27.45 -2.1 27.7 -5.0 M6.65 1.3 L7.75 1.4 9.3 1.55 9.4 2.9 9.55 5.35 6.55 5.1 6.1 5.05 5.3 4.9 5.4 2.9 5.5 1.6 4.6 1.4 3.85 1.2 2.8 0.95 1.85 0.7 -0.05 0.25 -0.7 0.0 -1.3 -0.3 -1.2 3.3 -1.45 3.2 -1.95 2.9 -2.2 2.7 -2.05 0.5 -2.4 -1.2 -1.95 -0.85 -1.8 -0.8 -1.45 -0.6 -1.45 -0.7 -0.6 -0.25 -0.25 -0.15 -0.05 -0.05 0.8 0.2 1.35 0.35 1.85 0.45 2.45 0.6 2.8 0.7 3.85 0.9 4.85 1.05 5.5 1.15 6.1 1.25 6.65 1.3 M29.05 -0.5 L29.55 -0.7 29.65 1.3 29.6 2.9 29.6 3.05 29.2 3.25 29.05 3.3 28.65 3.45 27.35 3.9 27.3 2.9 27.15 0.6 27.15 0.25 27.15 0.15 27.35 0.1 28.65 -0.35 28.75 -0.4 29.05 -0.5 M-1.95 -5.9 L-1.45 -5.6 -1.3 -5.55 -1.35 -5.5 -1.3 -2.7 -1.45 -2.75 -2.4 -3.35 -2.2 -4.2 -1.95 -5.8 -1.95 -5.9 M-1.3 22.7 L-2.25 22.0 Q-2.7 21.55 -2.7 20.2 L-2.75 17.9 -2.3 8.9 -2.6 6.05 -2.5 4.75 -2.2 4.95 -1.8 5.2 -1.45 5.4 -1.45 5.3 -0.25 5.7 -0.25 5.85 0.2 6.0 0.6 6.15 0.9 6.2 1.55 6.4 1.85 6.45 2.8 6.7 3.7 6.85 4.45 6.95 5.15 7.1 5.95 7.2 6.1 7.2 6.5 7.25 9.55 7.55 9.55 8.05 9.5 9.85 9.4 9.9 9.25 10.0 Q8.0 10.9 7.75 12.05 L7.75 12.25 7.6 12.85 Q7.6 13.85 8.25 14.7 L8.25 15.6 Q8.6 16.3 9.25 16.8 L9.2 18.8 6.1 19.3 5.7 19.45 5.4 19.6 5.6 17.55 5.45 16.05 5.4 15.7 7.35 13.45 7.3 13.3 7.15 13.3 5.35 15.0 5.3 14.55 5.5 14.25 6.55 13.0 6.5 12.85 6.3 12.8 5.25 13.9 5.0 11.35 5.15 7.4 3.7 7.2 2.8 7.1 0.65 6.65 0.3 6.6 -0.85 6.2 -1.15 6.1 -0.9 10.9 -0.9 14.85 -0.9 15.4 -1.35 14.65 -1.6 15.1 Q-1.6 16.1 -1.1 16.1 L-0.9 16.1 -0.9 18.65 -1.35 22.15 -1.3 22.7 M-1.6 10.35 L-2.15 11.9 -2.2 12.25 -2.3 13.4 -2.25 13.95 -2.2 14.25 -1.8 14.65 Q-1.45 12.9 -1.45 10.6 L-1.6 10.35 M-1.75 16.95 L-1.45 16.4 Q-1.45 16.1 -1.85 15.95 L-2.15 16.3 -1.75 16.95 M27.35 24.1 L27.05 24.2 26.55 24.3 25.85 24.45 25.35 24.6 25.35 23.8 25.35 23.1 Q25.2 21.3 24.0 20.25 24.15 19.1 24.6 18.1 L25.3 16.05 25.3 15.75 Q25.3 14.55 24.95 13.9 24.65 13.25 24.65 12.25 24.65 11.7 25.1 9.9 L25.45 7.3 25.45 7.1 25.8 7.0 26.65 6.7 26.7 7.35 26.85 9.8 Q26.6 11.05 26.85 14.5 L27.0 16.05 27.0 16.6 26.5 17.4 25.45 19.15 25.8 19.25 27.05 17.9 27.05 18.05 Q26.5 18.45 26.5 19.2 L26.7 19.5 27.1 19.3 27.15 20.85 27.35 24.0 27.35 24.1 M15.5 18.8 L11.85 18.8 11.85 18.0 11.85 17.7 13.8 17.8 15.5 17.75 15.5 18.8 M28.6 1.75 L28.25 1.0 Q27.75 1.1 27.75 1.6 27.75 1.95 28.3 1.95 L28.6 1.85 28.6 1.75 M26.4 0.65 L26.5 4.1 25.85 4.25 25.75 4.3 25.3 4.4 25.25 3.75 25.1 2.9 25.1 2.85 24.95 1.85 24.9 1.15 25.0 1.1 26.4 0.65 M27.55 6.05 L28.65 5.65 29.0 5.55 29.05 5.5 29.45 5.35 29.35 6.2 29.1 8.65 28.85 8.45 28.45 8.95 28.25 9.35 28.55 9.7 28.9 9.25 29.05 8.95 28.9 10.5 Q28.55 10.5 28.55 10.75 L28.85 11.2 29.05 13.8 29.25 16.05 29.25 17.4 29.45 22.55 29.2 22.75 28.25 23.45 28.25 22.65 28.05 16.8 28.05 16.75 28.15 16.0 28.0 15.8 Q27.8 13.35 27.75 9.95 L27.6 6.25 27.6 6.2 27.55 6.05 M26.2 16.2 Q26.7 16.2 26.7 15.8 26.65 14.95 25.9 15.0 L25.65 15.8 25.7 16.0 Q25.8 16.2 26.2 16.2 M14.25 2.15 L14.25 2.9 14.35 5.45 13.9 5.45 11.2 5.4 11.25 2.9 11.3 1.6 11.45 1.6 13.3 2.0 14.25 2.15 M14.7 8.85 L13.65 8.75 13.15 8.75 13.1 8.75 12.5 8.85 12.15 8.9 12.0 8.9 11.15 9.15 11.2 7.6 11.6 7.65 13.0 7.65 13.9 7.65 14.85 7.65 15.0 7.85 15.2 8.25 15.3 8.9 15.0 8.85 14.7 8.85 M7.9 2.9 L7.6 2.5 7.35 2.9 7.75 3.35 7.9 3.25 7.9 2.9 M9.1 2.9 L8.85 2.85 8.6 2.9 8.45 2.95 8.65 3.2 8.9 3.4 9.2 3.35 9.2 3.25 9.1 2.9 M6.7 2.9 L5.45 2.8 5.45 2.9 5.4 3.25 5.4 3.65 Q5.5 4.0 5.95 4.0 6.3 4.0 6.5 3.7 L6.75 4.1 6.9 4.05 7.0 3.55 6.7 2.9 M8.85 4.0 L8.35 3.45 7.85 3.3 7.8 3.45 8.0 3.85 Q8.4 4.15 8.8 4.1 L8.85 4.0 M7.6 10.4 Q7.75 10.6 8.0 10.6 8.6 10.6 8.6 10.2 8.6 9.85 8.0 9.85 7.5 9.85 7.5 10.2 L7.6 10.4 M6.8 12.3 Q6.95 12.0 6.75 11.8 6.5 11.5 6.05 11.55 6.05 12.4 6.65 12.4 L6.8 12.3 M6.8 10.0 L6.65 9.8 5.95 10.45 Q5.6 10.95 5.6 11.2 L5.8 11.45 6.1 11.15 6.55 11.2 6.8 10.0 M7.0 15.15 L6.95 15.0 Q6.65 15.05 6.35 15.35 L6.1 15.65 6.35 15.9 7.0 15.15 M8.45 16.25 L8.2 16.25 8.0 17.05 Q8.0 17.75 8.45 17.9 L8.6 17.05 8.45 16.25" fill="#6a6a6a" fill-rule="evenodd" stroke="none"/>
    <path d="M3.95 -4.1 L4.1 -4.1 5.95 -3.8 5.75 -1.0 4.9 -1.1 3.95 -1.25 3.95 -4.05 3.95 -4.1 M-0.25 -5.15 L-0.25 -5.05 -0.2 -3.25 -0.15 -2.25 -0.6 -2.4 -0.25 -0.15 -0.6 -0.25 -1.45 -0.7 -1.45 -2.3 -1.45 -2.75 -1.3 -2.7 -1.35 -5.5 -1.3 -5.55 -1.0 -5.4 -0.25 -5.15 M6.65 -0.9 L9.2 -0.65 8.85 -3.5 11.45 -3.4 11.4 -0.55 13.9 -0.5 14.25 -0.5 15.2 -0.5 15.25 1.65 14.25 1.65 13.9 1.65 11.45 1.6 11.3 1.6 11.25 2.9 11.2 5.4 13.9 5.45 14.35 5.45 15.45 5.45 15.5 5.45 15.8 6.2 16.1 7.65 14.85 7.65 13.9 7.65 13.0 7.65 11.6 7.65 11.2 7.6 11.15 9.15 Q10.2 9.4 9.5 9.85 L9.55 8.05 9.55 7.55 6.5 7.25 6.55 6.2 6.55 5.1 9.55 5.35 9.4 2.9 9.3 1.55 11.3 1.6 11.3 0.6 11.4 -0.55 11.15 -0.55 9.2 -0.65 9.25 0.6 9.3 1.55 7.75 1.4 6.65 1.3 6.65 0.6 6.65 -0.9 M29.15 -5.55 L29.85 -5.9 30.55 -6.5 30.55 -3.65 30.45 -3.55 29.35 -2.8 29.15 -5.55 M23.7 -1.25 L23.8 -1.25 24.75 -1.4 25.35 -1.55 25.35 0.6 24.9 0.7 23.8 0.9 23.8 0.6 23.7 -1.25 M26.55 -1.85 L27.45 -2.1 28.65 -2.5 28.9 -2.6 29.05 -2.65 29.05 -0.5 28.75 -0.4 28.65 -0.35 27.35 0.1 27.15 0.15 26.4 0.35 26.55 -1.85 M27.35 3.9 L28.65 3.45 29.05 3.3 29.05 5.5 29.0 5.55 28.65 5.65 27.55 6.05 27.0 6.2 26.6 6.3 26.6 6.2 26.5 4.95 26.5 4.1 27.35 3.9 M29.6 3.05 L29.6 2.9 29.65 1.3 29.55 -0.7 30.55 -1.5 30.55 2.3 30.45 2.4 29.85 2.9 29.6 3.05 M-1.45 3.2 L-1.2 3.3 -1.3 -0.3 -0.7 0.0 -0.05 0.25 -0.2 3.2 -0.15 3.7 -0.1 3.7 -0.25 5.7 -1.45 5.3 -1.45 3.4 -1.45 3.2 M3.85 1.2 L4.6 1.4 5.5 1.6 5.4 2.9 5.3 4.9 4.6 4.8 3.75 4.65 3.85 2.9 3.85 1.2 M-0.5 23.25 L-0.6 23.2 -1.3 22.7 -1.35 22.15 -0.9 18.65 -0.9 16.1 -0.85 16.0 -0.85 15.5 -0.9 15.4 -0.9 14.85 -0.9 10.9 -1.15 6.1 -0.85 6.2 0.3 6.6 0.75 9.75 0.15 16.05 -0.1 17.45 -0.5 23.25 M3.7 7.2 L5.15 7.4 5.0 11.35 5.25 13.9 6.3 12.8 6.5 12.85 6.55 13.0 5.5 14.25 5.3 14.55 5.35 15.0 7.15 13.3 7.3 13.3 7.35 13.45 5.4 15.7 5.45 16.05 5.6 17.55 5.4 19.6 5.7 19.45 5.4 19.8 5.4 19.6 Q3.25 20.65 3.1 23.1 L3.1 21.75 3.25 16.05 3.6 9.15 3.65 8.7 3.7 7.2 M9.2 18.8 L9.25 16.8 10.05 17.25 11.85 17.7 11.85 18.0 11.85 18.8 9.5 18.8 9.2 18.8 M30.65 4.35 L30.9 3.85 30.9 5.95 30.6 9.1 Q30.25 13.75 30.25 16.35 L30.45 19.65 Q30.45 21.45 29.45 22.55 L29.25 17.4 29.25 16.05 29.05 13.8 28.85 11.2 28.55 10.75 Q28.55 10.5 28.9 10.5 L29.05 8.95 28.9 9.25 28.55 9.7 28.25 9.35 28.45 8.95 28.85 8.45 29.1 8.65 29.35 6.2 29.45 5.35 30.65 4.35 M25.75 4.3 L26.05 6.1 26.05 6.2 26.1 6.45 25.85 6.45 25.45 6.55 24.3 6.8 24.2 4.65 24.35 4.6 25.3 4.4 25.75 4.3 M11.2 5.4 L9.55 5.35 9.55 6.2 9.55 7.55 11.2 7.6 11.2 6.2 11.2 5.4 M9.1 2.9 L9.2 3.25 9.2 3.35 8.9 3.4 8.65 3.2 8.45 2.95 8.6 2.9 8.85 2.85 9.1 2.9 M8.85 4.0 L8.8 4.1 Q8.4 4.15 8.0 3.85 L7.8 3.45 7.85 3.3 8.35 3.45 8.85 4.0 M7.0 15.15 L6.35 15.9 6.1 15.65 6.35 15.35 Q6.65 15.05 6.95 15.0 L7.0 15.15" fill="#4d4d4d" fill-rule="evenodd" stroke="none"/>
    <path d="M29.05 -0.5 L29.05 -2.65 29.35 -2.8 Q30.25 -2.65 30.55 -2.1 L30.75 -1.75 30.55 -1.5 29.55 -0.7 29.05 -0.5 M29.05 3.3 L29.2 3.25 29.6 3.3 29.9 3.4 30.25 3.6 Q30.55 3.85 30.65 4.35 L29.45 5.35 29.05 5.5 29.05 3.3 M-1.45 -2.3 L-1.45 -0.7 -1.45 -0.6 -1.8 -0.8 -1.95 -0.85 -2.4 -1.2 -2.6 -1.4 -2.9 -1.8 -2.5 -1.95 -1.45 -2.3 M-2.5 4.75 L-3.0 4.05 -2.3 3.65 -2.2 3.55 -1.45 3.4 -1.45 5.3 -1.45 5.4 -1.8 5.2 -2.2 4.95 -2.5 4.75" fill="#8c8c8c" fill-rule="evenodd" stroke="none"/>
    <path d="M-3.1 -7.25 L-3.05 -7.0 -1.95 -5.9 -1.95 -5.8 -2.2 -4.2 -2.4 -3.35 -2.6 -3.55 -3.1 -4.45 -3.1 -7.25 M16.25 -3.35 L22.6 -3.9 22.6 -1.05 21.1 -0.85 16.95 -0.55 Q16.25 -1.3 16.25 -3.35 M30.55 -6.5 L30.8 -6.85 30.9 -7.2 30.9 -4.4 30.55 -3.65 30.55 -6.5 M15.25 1.65 L18.1 1.55 18.35 1.55 21.15 1.3 22.8 1.1 23.8 0.9 24.9 0.7 25.35 0.6 25.85 0.45 26.4 0.35 27.15 0.15 27.15 0.25 26.5 0.6 26.4 0.65 25.0 1.1 24.9 1.15 22.85 1.6 22.75 4.9 21.0 5.1 20.85 5.1 17.75 5.35 16.4 5.4 16.25 2.95 16.25 2.9 Q16.3 2.3 17.15 2.05 L15.25 2.15 14.25 2.15 13.3 2.0 11.45 1.6 13.9 1.65 14.25 1.65 15.25 1.65 M18.8 -1.2 L19.75 -1.15 Q20.2 -1.15 20.2 -1.5 L20.6 -2.0 21.0 -2.4 21.15 -2.65 21.35 -2.85 21.2 -3.05 17.4 -2.8 Q17.75 -2.4 19.45 -2.3 L19.3 -2.25 18.8 -1.8 Q18.95 -1.7 19.05 -1.65 L19.0 -1.6 18.65 -1.35 18.8 -1.2 M30.55 -1.5 L30.75 -1.75 30.9 -2.15 30.9 1.5 30.55 2.3 30.55 -1.5 M-2.9 -1.8 L-2.6 -1.4 -2.4 -1.2 -2.05 0.5 -2.2 2.7 -2.6 2.4 -3.1 1.5 -3.1 -2.25 -2.9 -1.8 M1.35 24.35 L-0.55 23.75 -1.3 23.45 -1.95 23.1 -2.2 22.95 Q-3.1 22.35 -3.1 21.6 L-3.1 3.7 -3.0 4.05 -2.5 4.75 -2.6 6.05 -2.3 8.9 -2.75 17.9 -2.7 20.2 Q-2.7 21.55 -2.25 22.0 L-1.3 22.7 -0.6 23.2 -0.5 23.25 1.35 24.35 M30.9 5.95 L30.9 21.6 Q30.9 22.4 29.7 23.1 L29.45 23.3 28.25 23.8 27.35 24.1 27.35 24.0 28.25 23.45 29.2 22.75 29.45 22.55 Q30.45 21.45 30.45 19.65 L30.25 16.35 Q30.25 13.75 30.6 9.1 L30.9 5.95 M21.4 19.05 L18.95 18.8 17.35 18.8 17.65 17.1 17.7 16.95 18.05 16.6 17.75 16.75 17.6 16.85 15.5 17.6 15.15 17.6 14.45 17.55 14.35 17.25 15.45 16.75 15.5 16.75 16.6 16.35 17.25 16.1 18.0 15.85 18.6 15.6 18.8 15.35 Q19.9 14.7 19.9 13.55 L19.9 12.9 20.15 12.85 Q20.05 12.45 20.2 12.2 L20.5 11.75 Q20.5 10.95 19.8 11.45 L19.65 11.65 19.25 10.8 19.65 10.85 20.05 10.75 Q20.05 10.25 20.2 9.95 L20.4 9.35 20.7 8.95 21.0 8.55 20.95 8.3 18.65 8.45 18.45 8.7 18.55 8.9 18.65 9.05 18.45 9.4 Q18.25 9.55 19.25 9.7 L19.25 9.75 Q18.95 10.0 18.95 10.3 L18.95 10.35 Q18.2 9.35 16.95 8.65 L16.95 8.55 16.85 8.25 16.8 8.0 15.0 7.85 14.85 7.65 16.1 7.65 16.7 7.6 18.35 7.55 21.0 7.3 22.6 7.1 24.3 6.8 25.45 6.55 25.85 6.45 26.1 6.45 26.6 6.3 27.0 6.2 27.55 6.05 27.6 6.2 27.6 6.25 26.65 6.7 25.8 7.0 25.45 7.1 22.4 7.75 22.0 8.7 Q21.45 9.9 21.45 10.6 L22.0 12.75 21.65 14.25 Q21.35 15.5 21.4 15.75 L21.45 16.05 21.4 19.05 M20.4 2.2 L20.5 1.9 19.05 2.2 Q18.0 2.55 18.0 2.8 L18.05 2.9 18.25 3.2 19.0 3.7 19.0 4.1 19.3 4.15 20.4 3.85 21.15 3.25 20.95 2.9 20.4 2.2 M21.4 4.35 L20.95 4.1 Q20.05 4.1 20.05 4.45 L20.1 4.7 20.55 4.75 Q21.0 4.75 21.4 4.35 M20.35 14.05 L20.25 13.15 20.05 13.15 19.75 15.85 19.9 16.05 20.1 16.15 20.15 16.05 20.35 14.05 M18.5 3.95 Q17.9 3.95 17.9 4.35 L18.0 4.55 Q18.1 4.8 18.5 4.8 18.7 4.8 18.95 4.6 L19.05 4.35 Q19.05 3.95 18.5 3.95" fill="#c7c7c7" fill-rule="evenodd" stroke="none"/>
    <path d="M18.1 1.55 L18.15 1.3 18.05 0.6 Q17.8 0.0 17.15 -0.45 L16.95 -0.55 21.1 -0.85 21.1 0.6 21.15 1.3 18.35 1.55 18.1 1.55 M20.85 5.1 L20.75 6.05 20.75 6.2 21.0 7.3 18.35 7.55 18.05 6.2 17.75 5.35 20.85 5.1" fill="#b0b0b0" fill-rule="evenodd" stroke="none"/>
    <path d="M14.6 -3.35 L16.25 -3.35 Q16.25 -1.3 16.95 -0.55 L16.75 -0.55 15.25 -0.5 15.2 -0.5 14.25 -0.5 14.25 -0.6 14.4 -2.3 14.6 -3.35 M22.6 -3.9 L24.8 -4.3 Q24.65 -3.4 24.65 -2.05 L24.75 -1.4 23.8 -1.25 23.7 -1.25 22.6 -1.05 22.6 -3.9 M9.25 16.8 Q8.6 16.3 8.25 15.6 L8.25 14.7 9.25 15.65 9.4 15.7 9.85 15.95 Q10.75 16.45 11.75 16.7 L13.65 16.9 15.45 16.75 14.35 17.25 14.45 17.55 15.15 17.6 15.5 17.6 17.6 16.85 17.75 16.75 18.05 16.6 17.7 16.95 17.65 17.1 17.35 18.8 15.5 18.8 15.5 17.75 13.8 17.8 11.85 17.7 10.05 17.25 9.25 16.8 M22.75 19.45 L21.4 19.05 21.45 16.05 21.4 15.75 Q21.35 15.5 21.65 14.25 L22.0 12.75 21.45 10.6 Q21.45 9.9 22.0 8.7 L22.4 7.75 25.45 7.1 25.45 7.3 25.1 9.9 Q24.65 11.7 24.65 12.25 24.65 13.25 24.95 13.9 25.3 14.55 25.3 15.75 L25.3 16.05 24.6 18.1 Q24.15 19.1 24.0 20.25 L22.75 19.45 M25.3 4.4 L24.35 4.6 24.2 4.65 22.75 4.9 22.85 1.6 24.9 1.15 24.95 1.85 25.1 2.85 25.1 2.9 25.25 3.75 25.3 4.4 M19.25 10.8 L19.65 11.65 19.5 11.7 Q19.1 10.7 17.9 9.9 L17.3 9.55 16.25 9.1 15.8 9.0 15.3 8.9 15.2 8.25 15.0 7.85 16.8 8.0 16.85 8.25 16.95 8.55 16.95 8.65 Q18.2 9.35 18.95 10.35 L19.25 10.8 M19.9 12.9 L19.9 13.55 Q19.9 14.7 18.8 15.35 L18.6 15.6 18.0 15.85 17.25 16.1 Q17.55 15.9 17.8 15.75 L17.9 15.7 18.0 15.7 19.05 14.75 19.7 13.55 19.7 12.9 19.9 12.9 M14.25 2.15 L15.25 2.15 17.15 2.05 Q16.3 2.3 16.25 2.9 L16.25 2.95 16.4 5.4 15.5 5.45 15.45 5.45 14.35 5.45 14.25 2.9 14.25 2.15" fill="#949494" fill-rule="evenodd" stroke="none"/>
    <path d="M15.2 -0.5 L15.25 -0.5 16.75 -0.55 16.95 -0.55 17.15 -0.45 Q17.8 0.0 18.05 0.6 L18.15 1.3 18.1 1.55 15.25 1.65 15.2 -0.5 M21.1 -0.85 L22.6 -1.05 23.7 -1.25 23.8 0.6 23.8 0.9 22.8 1.1 21.15 1.3 21.1 0.6 21.1 -0.85 M24.2 4.65 L24.3 6.8 22.6 7.1 21.0 7.3 20.75 6.2 20.75 6.05 20.85 5.1 21.0 5.1 22.75 4.9 24.2 4.65 M17.75 5.35 L18.05 6.2 18.35 7.55 16.7 7.6 16.1 7.65 15.8 6.2 15.5 5.45 16.4 5.4 17.75 5.35" fill="#707070" fill-rule="evenodd" stroke="none"/>
    <path d="M3.95 -1.25 L4.9 -1.1 4.85 0.6 4.85 1.05 3.85 0.9 2.8 0.7 2.45 0.6 1.85 0.45 1.35 0.35 1.2 -1.85 1.85 -1.7 2.45 -1.55 3.95 -1.25 M1.55 4.15 L1.85 4.25 2.8 4.5 3.75 4.65 4.6 4.8 4.5 6.2 4.45 6.95 3.7 6.85 2.8 6.7 1.85 6.45 1.55 6.4 1.55 6.2 1.55 4.15" fill="#242424" fill-rule="evenodd" stroke="none"/>
    <path d="M3.95 -4.1 L3.95 -4.05 3.95 -1.25 2.45 -1.55 1.85 -1.7 1.2 -1.85 -0.15 -2.25 -0.2 -3.25 -0.25 -5.05 -0.25 -5.15 0.4 -4.9 1.85 -4.55 2.0 -4.5 2.5 -4.4 3.95 -4.1 M-0.05 0.25 L1.85 0.7 2.8 0.95 3.85 1.2 3.85 2.9 3.75 4.65 2.8 4.5 1.85 4.25 1.55 4.15 -0.1 3.7 -0.15 3.7 -0.2 3.2 -0.05 0.25 M1.35 24.35 L-0.5 23.25 -0.1 17.45 0.15 16.05 0.75 9.75 0.3 6.6 0.65 6.65 2.8 7.1 3.7 7.2 3.65 8.7 3.6 9.15 3.25 16.05 3.1 21.75 3.1 23.1 3.05 23.8 3.05 24.3 3.05 24.7 1.85 24.45 1.35 24.35" fill="#383838" fill-rule="evenodd" stroke="none"/>
    <path d="M25.35 24.6 L25.25 24.6 24.9 24.4 24.75 24.3 24.05 23.95 23.75 23.8 23.75 22.35 Q23.75 20.5 22.75 19.45 L24.0 20.25 Q25.2 21.3 25.35 23.1 L25.35 23.8 25.35 24.6 M3.05 24.7 L3.05 24.3 3.05 23.8 3.1 23.1 Q3.25 20.65 5.4 19.6 L5.4 19.8 Q4.6 20.8 4.6 22.35 L4.6 24.25 4.4 24.3 3.7 24.5 3.1 24.75 3.05 24.7" fill="#292929" fill-rule="evenodd" stroke="none"/>
    <path d="M4.9 -1.1 L5.75 -1.0 6.1 -0.95 6.65 -0.9 6.65 0.6 6.65 1.3 6.1 1.25 5.5 1.15 4.85 1.05 4.85 0.6 4.9 -1.1 M-0.15 -2.25 L1.2 -1.85 1.35 0.35 0.8 0.2 -0.05 -0.05 -0.25 -0.15 -0.6 -2.4 -0.15 -2.25 M9.3 1.55 L9.25 0.6 9.2 -0.65 11.15 -0.55 11.4 -0.55 11.3 0.6 11.3 1.6 9.3 1.55 M25.35 -1.55 L25.85 -1.7 26.55 -1.85 26.4 0.35 25.85 0.45 25.35 0.6 25.35 -1.55 M5.3 4.9 L6.1 5.05 6.55 5.1 6.55 6.2 6.5 7.25 6.1 7.2 5.95 7.2 5.15 7.1 4.45 6.95 4.5 6.2 4.6 4.8 5.3 4.9 M-0.1 3.7 L1.55 4.15 1.55 6.2 1.55 6.4 0.9 6.2 0.6 6.15 0.2 6.0 -0.25 5.85 -0.25 5.7 -0.1 3.7 M26.1 6.45 L26.05 6.2 26.05 6.1 25.75 4.3 25.85 4.25 26.5 4.1 26.5 4.95 26.6 6.2 26.6 6.3 26.1 6.45 M11.2 5.4 L11.2 6.2 11.2 7.6 9.55 7.55 9.55 6.2 9.55 5.35 11.2 5.4" fill="#303030" fill-rule="evenodd" stroke="none"/>
    <path d="M8.25 14.7 Q7.6 13.85 7.6 12.85 L7.75 12.25 7.75 12.05 7.8 12.25 8.25 13.1 9.3 14.05 9.4 14.1 9.6 14.25 10.9 14.9 13.65 15.35 16.45 14.9 17.7 14.25 17.9 14.1 19.25 12.85 19.55 12.05 19.7 12.85 19.7 12.9 19.7 13.55 19.05 14.75 18.0 15.7 17.9 15.7 17.8 15.75 Q17.55 15.9 17.25 16.1 L16.6 16.35 15.5 16.75 15.45 16.75 13.65 16.9 11.75 16.7 Q10.75 16.45 9.85 15.95 L9.4 15.7 9.25 15.65 8.25 14.7" fill="#1f1f1f" fill-rule="evenodd" stroke="none"/>
    <path d="M26.75 -4.75 L27.3 -4.9 27.7 -5.0 27.45 -2.1 26.55 -1.85 26.75 -4.75 M27.15 0.25 L27.15 0.6 27.3 2.9 27.35 3.9 26.5 4.1 26.4 0.65 26.5 0.6 27.15 0.25 M-1.6 10.35 L-1.45 10.6 Q-1.45 12.9 -1.8 14.65 L-2.2 14.25 -2.25 13.95 -2.3 13.4 -2.2 12.25 -2.15 11.9 -1.6 10.35 M-0.9 16.1 L-1.1 16.1 Q-1.6 16.1 -1.6 15.1 L-1.35 14.65 -0.9 15.4 -0.85 15.5 -0.85 16.0 -0.9 16.1 M-1.75 16.95 L-2.15 16.3 -1.85 15.95 Q-1.45 16.1 -1.45 16.4 L-1.75 16.95 M28.6 1.75 L28.6 1.85 28.3 1.95 Q27.75 1.95 27.75 1.6 27.75 1.1 28.25 1.0 L28.6 1.75 M26.65 6.7 L27.6 6.25 27.75 9.95 Q27.8 13.35 28.0 15.8 L28.15 16.0 28.05 16.75 28.05 16.8 28.25 22.65 28.25 23.45 27.35 24.0 27.15 20.85 27.1 19.3 26.7 19.5 26.5 19.2 Q26.5 18.45 27.05 18.05 L27.05 17.9 25.8 19.25 25.45 19.15 26.5 17.4 27.0 16.6 27.0 16.05 26.85 14.5 Q26.6 11.05 26.85 9.8 L26.7 7.35 26.65 6.7 M26.2 16.2 Q25.8 16.2 25.7 16.0 L25.65 15.8 25.9 15.0 Q26.65 14.95 26.7 15.8 26.7 16.2 26.2 16.2 M12.45 13.2 Q13.0 13.05 13.15 12.6 L13.45 13.25 14.3 12.25 14.8 12.2 15.55 12.1 Q15.15 13.9 13.95 14.2 L13.65 14.2 13.35 14.2 12.85 13.95 13.0 13.9 13.1 13.55 Q13.1 13.1 12.65 13.2 12.55 13.2 12.5 13.3 L12.25 13.4 12.15 13.2 12.45 13.2 M7.9 2.9 L7.9 3.25 7.75 3.35 7.35 2.9 7.6 2.5 7.9 2.9 M6.7 2.9 L7.0 3.55 6.9 4.05 6.75 4.1 6.5 3.7 Q6.3 4.0 5.95 4.0 5.5 4.0 5.4 3.65 L5.4 3.25 5.45 2.9 5.45 2.8 6.7 2.9 M6.8 10.0 L6.55 11.2 6.1 11.15 5.8 11.45 5.6 11.2 Q5.6 10.95 5.95 10.45 L6.65 9.8 6.8 10.0 M6.8 12.3 L6.65 12.4 Q6.05 12.4 6.05 11.55 6.5 11.5 6.75 11.8 6.95 12.0 6.8 12.3 M7.6 10.4 L7.5 10.2 Q7.5 9.85 8.0 9.85 8.6 9.85 8.6 10.2 8.6 10.6 8.0 10.6 7.75 10.6 7.6 10.4 M8.45 16.25 L8.6 17.05 8.45 17.9 Q8.0 17.75 8.0 17.05 L8.2 16.25 8.45 16.25" fill="#5e5e5e" fill-rule="evenodd" stroke="none"/>
    <path d="M18.8 -1.2 L18.65 -1.35 19.0 -1.6 19.05 -1.65 Q18.95 -1.7 18.8 -1.8 L19.3 -2.25 19.45 -2.3 Q17.75 -2.4 17.4 -2.8 L21.2 -3.05 21.35 -2.85 21.15 -2.65 21.0 -2.4 20.6 -2.0 20.2 -1.5 Q20.2 -1.15 19.75 -1.15 L18.8 -1.2 M20.4 2.2 L20.95 2.9 21.15 3.25 20.4 3.85 19.3 4.15 19.0 4.1 19.0 3.7 18.25 3.2 18.05 2.9 18.0 2.8 Q18.0 2.55 19.05 2.2 L20.5 1.9 20.4 2.2 M21.4 4.35 Q21.0 4.75 20.55 4.75 L20.1 4.7 20.05 4.45 Q20.05 4.1 20.95 4.1 L21.4 4.35 M18.95 10.35 L18.95 10.3 Q18.95 10.0 19.25 9.75 L19.25 9.7 Q18.25 9.55 18.45 9.4 L18.65 9.05 18.55 8.9 18.45 8.7 18.65 8.45 20.95 8.3 21.0 8.55 20.7 8.95 20.4 9.35 20.2 9.95 Q20.05 10.25 20.05 10.75 L19.65 10.85 19.25 10.8 18.95 10.35 M19.65 11.65 L19.8 11.45 Q20.5 10.95 20.5 11.75 L20.2 12.2 Q20.05 12.45 20.15 12.85 L19.9 12.9 19.7 12.9 19.7 12.85 19.55 12.05 19.55 11.85 19.5 11.7 19.65 11.65 M20.35 14.05 L20.15 16.05 20.1 16.15 19.9 16.05 19.75 15.85 20.05 13.15 20.25 13.15 20.35 14.05 M18.5 3.95 Q19.05 3.95 19.05 4.35 L18.95 4.6 Q18.7 4.8 18.5 4.8 18.1 4.8 18.0 4.55 L17.9 4.35 Q17.9 3.95 18.5 3.95" fill="#fcfcfc" fill-rule="evenodd" stroke="none"/>
    <path d="M5.95 -3.8 L4.1 -4.1 7.8 -4.3 12.15 -4.05 15.05 -3.85 17.75 -4.1 17.7 -4.15 19.1 -4.7 20.85 -4.85 20.35 -4.5 20.75 -4.6 22.5 -4.9 23.35 -5.2 26.7 -6.3 26.95 -6.15 26.85 -5.9 26.4 -5.7 Q27.95 -6.1 29.0 -7.0 L29.45 -7.35 30.5 -8.3 30.85 -7.85 30.85 -7.75 30.9 -7.4 30.9 -7.3 30.9 -7.2 30.8 -6.85 30.55 -6.5 29.85 -5.9 29.15 -5.55 29.05 -5.5 28.65 -5.35 27.7 -5.0 27.3 -4.9 26.75 -4.75 25.85 -4.55 24.8 -4.3 22.6 -3.9 16.25 -3.35 14.6 -3.35 13.9 -3.35 11.45 -3.4 8.85 -3.5 6.1 -3.75 5.95 -3.8 M17.75 -4.65 L17.6 -4.7 17.55 -4.75 18.25 -5.0 19.05 -5.1 19.2 -5.0 Q18.65 -4.65 17.75 -4.65 M25.3 -6.2 Q25.3 -6.05 23.95 -5.5 L22.05 -4.9 21.95 -5.15 25.25 -6.3 25.3 -6.2 M22.4 -5.75 L22.05 -5.4 21.5 -5.1 21.35 -5.2 Q21.2 -5.5 22.4 -5.75" fill="#ffffff" fill-rule="evenodd" stroke="none"/>
    <path d="M4.1 -4.1 L3.95 -4.1 2.5 -4.4 5.0 -4.75 7.6 -4.8 13.8 -5.3 18.6 -6.0 23.95 -7.1 Q24.65 -7.2 25.8 -7.6 L27.55 -7.95 29.45 -7.35 29.0 -7.0 Q27.95 -6.1 26.4 -5.7 L26.85 -5.9 26.95 -6.15 26.7 -6.3 23.35 -5.2 22.5 -4.9 20.75 -4.6 20.35 -4.5 20.85 -4.85 19.1 -4.7 17.7 -4.15 17.75 -4.1 15.05 -3.85 12.15 -4.05 7.8 -4.3 4.1 -4.1 M17.75 -4.65 Q18.65 -4.65 19.2 -5.0 L19.05 -5.1 18.25 -5.0 17.55 -4.75 17.6 -4.7 17.75 -4.65 M22.4 -5.75 Q21.2 -5.5 21.35 -5.2 L21.5 -5.1 22.05 -5.4 22.4 -5.75 M25.3 -6.2 L25.25 -6.3 21.95 -5.15 22.05 -4.9 23.95 -5.5 Q25.3 -6.05 25.3 -6.2" fill="#e8e8e8" fill-rule="evenodd" stroke="none"/>
    <path d="M-1.95 -8.9 L1.65 -9.75 6.5 -10.45 7.2 -10.4 3.95 -9.35 3.95 -8.95 4.1 -8.9 5.75 -9.3 5.8 -9.2 5.95 -9.15 7.0 -9.4 7.35 -9.25 Q8.1 -9.25 10.7 -10.15 L13.0 -9.85 17.55 -10.45 18.8 -10.7 19.0 -10.7 26.15 -10.05 28.0 -9.7 28.65 -9.45 28.7 -9.4 25.45 -8.4 Q23.95 -7.85 22.05 -7.85 L19.4 -8.0 16.25 -6.95 15.9 -6.95 15.85 -7.05 Q15.85 -7.2 17.9 -8.0 L18.15 -8.1 18.0 -8.1 17.4 -7.95 13.95 -6.95 13.85 -7.0 Q14.3 -7.45 17.1 -8.15 L13.85 -8.3 2.0 -6.25 -1.95 -6.65 -3.05 -7.0 -3.1 -7.25 -3.1 -7.4 -3.05 -7.75 -2.4 -8.55 -2.05 -8.85 -1.95 -8.9" fill="#b8b8b8" fill-rule="evenodd" stroke="none"/>
    <path d="M28.0 -9.7 L26.15 -10.05 19.0 -10.7 18.8 -10.7 17.55 -10.45 13.0 -9.85 10.7 -10.15 Q8.1 -9.25 7.35 -9.25 L7.0 -9.4 5.95 -9.15 5.8 -9.2 5.75 -9.3 4.1 -8.9 3.95 -8.95 3.95 -9.35 7.2 -10.4 6.5 -10.45 1.65 -9.75 -1.95 -8.9 -1.45 -9.2 1.85 -10.3 6.1 -11.0 13.9 -11.45 20.85 -11.1 25.85 -10.3 28.0 -9.7" fill="#a6a6a6" fill-rule="evenodd" stroke="none"/>
    <path d="M-3.05 -7.0 L-1.95 -6.65 2.0 -6.25 13.85 -8.3 17.1 -8.15 Q14.3 -7.45 13.85 -7.0 L13.95 -6.95 17.4 -7.95 18.0 -8.1 18.15 -8.1 17.9 -8.0 Q15.85 -7.2 15.85 -7.05 L15.9 -6.95 16.25 -6.95 19.4 -8.0 22.05 -7.85 Q23.95 -7.85 25.45 -8.4 L28.7 -9.4 29.05 -9.25 29.15 -9.2 24.85 -8.0 23.2 -7.7 21.65 -7.55 16.8 -6.2 Q14.95 -5.6 13.55 -5.6 L10.0 -5.9 6.55 -5.45 2.5 -5.05 -0.9 -5.4 -1.0 -5.4 -1.3 -5.55 -1.45 -5.6 -1.95 -5.9 -3.05 -7.0 M18.55 -7.4 L18.6 -7.25 Q19.7 -7.4 19.7 -7.75 L19.65 -7.9 Q18.55 -7.6 18.55 -7.4" fill="#c9c9c9" fill-rule="evenodd" stroke="none"/>
    <path d="M29.45 -7.35 L27.55 -7.95 25.8 -7.6 Q24.65 -7.2 23.95 -7.1 L18.6 -6.0 13.8 -5.3 7.6 -4.8 5.0 -4.75 2.5 -4.4 2.0 -4.5 1.85 -4.55 0.4 -4.9 -0.25 -5.15 -1.0 -5.4 -0.9 -5.4 2.5 -5.05 6.55 -5.45 10.0 -5.9 13.55 -5.6 Q14.95 -5.6 16.8 -6.2 L21.65 -7.55 23.2 -7.7 24.85 -8.0 29.15 -9.2 29.9 -8.85 30.5 -8.3 29.45 -7.35 M18.55 -7.4 Q18.55 -7.6 19.65 -7.9 L19.7 -7.75 Q19.7 -7.4 18.6 -7.25 L18.55 -7.4" fill="#d9d9d9" fill-rule="evenodd" stroke="none"/>
    <path d="M9.55 12.45 L9.6 12.75 10.2 13.05 10.7 13.05 11.05 12.95 11.85 13.2 12.15 13.2 12.25 13.4 12.15 13.6 Q12.15 13.95 12.65 13.95 L12.85 13.95 13.35 14.2 13.65 14.2 13.95 14.2 Q15.15 13.9 15.55 12.1 L15.65 12.1 15.9 12.1 15.8 12.25 Q15.8 12.7 16.75 12.7 L17.4 12.7 17.9 12.65 18.05 12.6 17.9 13.15 16.95 13.8 16.25 14.1 13.15 14.55 Q11.75 14.55 10.5 13.95 L9.3 13.25 8.6 12.6 8.65 12.45 9.4 12.45 9.55 12.45 M16.9 13.55 Q16.9 13.05 16.1 13.05 15.55 13.05 15.55 13.35 15.55 13.85 16.45 13.85 L16.9 13.55 M11.4 13.75 L11.65 13.45 Q11.65 13.2 11.05 13.2 L10.55 13.2 10.55 13.7 11.05 13.9 11.4 13.75" fill="#5db4d6" fill-rule="evenodd" stroke="none"/>
    <path d="M9.55 12.45 Q9.55 11.95 10.15 11.85 L10.35 11.85 11.05 11.95 10.55 12.55 10.9 12.9 11.05 12.95 10.7 13.05 10.2 13.05 9.6 12.75 9.55 12.45 M15.9 12.1 Q16.1 11.75 17.35 11.75 L17.6 11.75 17.9 11.8 Q18.45 11.85 18.45 12.2 L18.05 12.6 17.9 12.65 17.4 12.7 16.75 12.7 Q15.8 12.7 15.8 12.25 L15.9 12.1 M16.9 13.55 L16.45 13.85 Q15.55 13.85 15.55 13.35 15.55 13.05 16.1 13.05 16.9 13.05 16.9 13.55 M11.4 13.75 L11.05 13.9 10.55 13.7 10.55 13.2 11.05 13.2 Q11.65 13.2 11.65 13.45 L11.4 13.75" fill="#70d3ff" fill-rule="evenodd" stroke="none"/>
    <path d="M11.05 12.95 L10.9 12.9 10.55 12.55 11.05 11.95 11.85 11.75 Q12.0 12.5 12.45 13.2 L12.15 13.2 11.85 13.2 11.05 12.95 M12.85 13.95 L12.65 13.95 Q12.15 13.95 12.15 13.6 L12.25 13.4 12.5 13.3 13.0 13.9 12.85 13.95" fill="#ddf5ff" fill-rule="evenodd" stroke="none"/>
    <path d="M7.8 12.25 L9.4 11.7 10.3 11.45 10.35 11.4 11.7 11.2 11.7 11.3 11.75 11.6 11.85 11.75 11.05 11.95 10.35 11.85 10.15 11.85 Q9.55 11.95 9.55 12.45 L9.4 12.45 8.65 12.45 8.6 12.6 9.3 13.25 10.5 13.95 Q11.75 14.55 13.15 14.55 L16.25 14.1 16.95 13.8 17.9 13.15 18.05 12.6 18.45 12.2 Q18.45 11.85 17.9 11.8 L17.6 11.75 17.35 11.75 Q16.1 11.75 15.9 12.1 L15.65 12.1 15.55 12.1 15.65 11.4 15.65 11.1 17.2 11.25 17.9 11.4 19.45 11.8 19.55 11.85 19.55 12.05 19.25 12.85 17.9 14.1 17.7 14.25 16.45 14.9 13.65 15.35 10.9 14.9 9.6 14.25 9.4 14.1 9.3 14.05 8.25 13.1 7.8 12.25" fill="#56a5c4" fill-rule="evenodd" stroke="none"/>
    <path d="M7.75 12.05 Q8.0 10.9 9.25 10.0 L9.4 9.9 9.5 9.85 Q10.2 9.4 11.15 9.15 L12.0 8.9 11.7 10.9 11.7 11.2 10.35 11.4 10.3 11.45 9.4 11.7 7.8 12.25 7.75 12.05 M15.8 9.0 L16.25 9.1 17.3 9.55 17.9 9.9 Q19.1 10.7 19.5 11.7 L19.55 11.85 19.45 11.8 17.9 11.4 17.2 11.25 15.65 11.1 15.7 10.8 15.8 9.95 15.8 9.0" fill="#4789a3" fill-rule="evenodd" stroke="none"/>
    <path d="M14.7 11.05 L14.6 11.3 14.6 11.05 14.7 11.05" fill="#a18060" fill-rule="evenodd" stroke="none"/>
    <path d="M13.1 8.75 L13.15 8.75 13.65 8.75 14.7 8.85 14.7 10.1 14.6 10.75 13.75 10.85 12.95 11.0 12.85 11.05 12.85 10.95 Q12.9 9.55 13.1 8.75" fill="#474747" fill-rule="evenodd" stroke="none"/>
    <path d="M12.95 11.0 L13.75 10.85 14.6 10.75 14.7 11.05 14.6 11.05 14.6 11.3 14.3 12.25 13.45 13.25 13.15 12.6 13.15 12.35 13.0 11.9 12.85 11.15 12.95 11.0" fill="#525252" fill-rule="evenodd" stroke="none"/>
    <path d="M14.7 8.85 L15.0 8.85 15.3 8.9 15.8 9.0 15.8 9.95 15.7 10.8 15.65 11.1 15.0 11.05 14.7 11.05 14.6 10.75 14.7 10.1 14.7 8.85 M12.0 8.9 L12.15 8.9 12.5 8.85 13.1 8.75 Q12.9 9.55 12.85 10.95 L12.85 11.05 12.95 11.0 12.85 11.15 12.85 11.1 12.55 11.1 12.35 11.1 11.7 11.2 11.7 10.9 12.0 8.9" fill="#262626" fill-rule="evenodd" stroke="none"/>
    <path d="M11.85 11.75 L11.75 11.6 11.7 11.3 11.7 11.2 12.35 11.1 12.55 11.1 12.85 11.1 12.85 11.15 13.0 11.9 12.0 11.7 11.85 11.75 M15.55 12.1 L14.8 12.2 14.3 12.25 14.6 11.3 14.7 11.05 15.0 11.05 15.65 11.1 15.65 11.4 15.55 12.1" fill="#3d3d3d" fill-rule="evenodd" stroke="none"/>
    <path d="M11.85 11.75 L12.0 11.7 13.0 11.9 13.15 12.35 13.15 12.6 Q13.0 13.05 12.45 13.2 12.0 12.5 11.85 11.75 M12.5 13.3 Q12.55 13.2 12.65 13.2 13.1 13.1 13.1 13.55 L13.0 13.9 12.5 13.3" fill="#b8cad4" fill-rule="evenodd" stroke="none"/>
  </g>
</svg>
