<?xml version="1.0" encoding="UTF-8" standalone="no"?>
<svg xmlns:xlink="http://www.w3.org/1999/xlink" height="71.4px" width="242.3px" xmlns="http://www.w3.org/2000/svg">
  <g transform="matrix(1.0, 0.0, 0.0, 1.0, 0.0, 0.0)">
    <path d="M0.0 0.0 L242.3 0.0 242.3 71.4 0.0 71.4 0.0 0.0" fill="#006666" fill-rule="evenodd" stroke="none"/>
  </g>
</svg>
