<?xml version="1.0" encoding="UTF-8" standalone="no"?>
<svg xmlns:xlink="http://www.w3.org/1999/xlink" height="59.3px" width="78.1px" xmlns="http://www.w3.org/2000/svg">
  <g transform="matrix(1.0, 0.0, 0.0, 1.0, 40.5, 47.95)">
    <path d="M-36.75 4.1 L-36.8 4.15 -36.85 4.15 -36.75 4.1" fill="#e0cbcb" fill-rule="evenodd" stroke="none"/>
    <path d="M30.2 2.8 Q27.4 7.8 26.95 7.65 26.45 7.5 26.5 7.0 26.5 6.75 26.65 6.55 27.25 4.55 29.0 2.9 30.65 1.3 30.2 2.8 M23.0 3.05 Q22.6 3.7 21.1 3.65 L18.35 3.5 17.95 2.85 Q18.15 2.25 20.3 2.35 22.35 2.45 23.0 3.05 M24.7 1.15 L18.25 1.85 Q17.7 1.65 17.9 1.15 18.1 0.4 21.65 0.25 25.05 0.1 24.7 1.15 M22.9 6.0 L20.0 6.05 18.8 5.5 18.45 5.15 Q19.15 4.35 20.85 4.9 22.35 5.35 22.9 6.0 M23.55 8.45 L23.1 8.9 21.2 8.4 Q19.65 7.95 19.4 7.55 L19.4 7.15 21.65 7.25 Q23.8 7.75 23.55 8.45" fill="#b98d8d" fill-rule="evenodd" stroke="none"/>
    <path d="M-8.3 -26.2 L-10.9 -23.35 -14.5 -9.7 -15.2 -7.35 Q-16.05 -6.9 -16.85 -6.6 -21.7 -5.15 -26.6 -6.95 L-28.0 -7.45 Q-31.05 -8.75 -33.2 -11.5 L-32.5 -14.05 -32.05 -15.7 -30.1 -16.35 -31.15 -18.7 -26.9 -33.65 -26.6 -34.8 Q-23.9 -33.75 -17.3 -31.6 -12.7 -29.9 -8.5 -27.9 L-7.3 -27.35 -8.3 -26.2" fill="url(#gradient0)" fill-rule="evenodd" stroke="none"/>
    <path d="M24.9 -34.6 L24.95 -34.5 25.0 -34.2 25.15 -33.4 29.55 -12.3 30.15 -9.8 30.2 -9.35 Q30.15 -8.3 29.35 -7.45 28.45 -6.45 26.55 -5.65 22.95 -4.1 18.65 -4.05 L16.2 -4.15 14.25 -5.4 13.85 -7.45 13.85 -7.5 10.6 -26.0 10.1 -28.7 10.2 -28.75 16.6 -31.4 24.9 -34.6" fill="url(#gradient1)" fill-rule="evenodd" stroke="none"/>
    <path d="M-24.6 -41.3 L-23.1 -44.75 -22.1 -46.7 -21.15 -46.7 -21.15 -47.25 Q11.35 -47.6 23.5 -47.95 L23.7 -46.5 24.55 -38.9 24.95 -34.6 24.95 -34.5 24.95 -34.55 24.9 -34.6 16.6 -31.4 10.2 -28.75 10.1 -28.7 10.6 -26.0 9.65 -26.65 8.55 -27.3 Q4.7 -29.55 1.7 -29.55 -2.1 -29.55 -5.55 -27.9 -7.25 -27.1 -8.3 -26.2 L-7.3 -27.35 -8.5 -27.9 Q-12.7 -29.9 -17.3 -31.6 -23.9 -33.75 -26.6 -34.8 L-26.9 -33.65 -27.65 -35.0 -27.65 -35.15 Q-26.85 -35.1 -26.55 -35.65 L-26.1 -37.1 -24.6 -41.3" fill="#b78989" fill-rule="evenodd" stroke="none"/>
    <path d="M24.9 -34.6 L24.95 -34.5 25.0 -34.2 M25.15 -33.4 L29.55 -12.3 M13.85 -7.5 L10.6 -26.0 9.65 -26.65 8.55 -27.3 Q4.7 -29.55 1.7 -29.55 -2.1 -29.55 -5.55 -27.9 -7.25 -27.1 -8.3 -26.2 L-10.9 -23.35 -14.5 -9.7 M-32.5 -14.05 L-32.05 -15.7 -30.1 -16.35 -31.15 -18.7 -26.9 -33.65 -27.65 -35.0 -27.65 -35.15 Q-26.85 -35.1 -26.55 -35.65 L-26.1 -37.1 -24.6 -41.3 M10.6 -26.0 L10.1 -28.7 10.2 -28.75 M-7.3 -27.35 L-8.3 -26.2 M-26.9 -33.65 L-26.6 -34.8 M-36.75 4.1 L-36.8 4.15 M-34.95 3.3 L-34.0 -4.2" fill="none" stroke="#a36a6a" stroke-linecap="round" stroke-linejoin="round" stroke-opacity="0.49803922" stroke-width="0.05"/>
    <path d="M-37.95 -13.25 L-38.1 -13.75 -32.5 -14.05 -33.2 -11.45 Q-30.6 -8.15 -26.6 -6.95 -21.75 -5.15 -16.9 -6.6 -16.05 -6.9 -15.25 -7.35 L-14.55 -9.7 -11.9 -7.9 -9.65 -6.6 Q-10.5 -5.75 -11.35 -5.25 -12.9 -4.35 -16.05 -3.45 -19.7 -2.35 -22.2 -2.8 L-24.25 -3.4 -25.95 -2.15 -26.1 -2.7 -26.1 -3.9 -28.55 -5.2 -31.85 -7.05 -35.25 -10.4 -37.95 -13.25" fill="url(#gradient2)" fill-rule="evenodd" stroke="none"/>
    <path d="M-9.65 -6.6 L-9.45 -6.45 Q-10.35 -5.0 -11.15 -2.4 L-12.45 4.0 -13.3 9.6 -17.95 10.75 -26.65 11.1 -31.2 9.55 Q-34.65 8.2 -35.55 7.2 L-35.0 3.35 -34.05 -4.15 -36.8 4.1 -36.9 4.15 -36.85 4.15 -37.45 6.0 -37.9 5.75 -39.45 4.6 Q-40.55 3.55 -40.5 2.9 L-40.0 2.1 -39.7 1.55 -39.55 1.3 Q-38.4 -1.2 -37.9 -3.9 -37.1 -7.95 -37.15 -8.7 -37.05 -10.15 -37.95 -13.25 L-35.25 -10.4 -31.85 -7.05 -28.55 -5.2 -26.1 -3.9 -26.1 -2.7 -25.95 -2.15 -24.25 -3.4 -22.2 -2.8 Q-19.7 -2.35 -16.05 -3.45 -12.9 -4.35 -11.35 -5.25 -10.5 -5.75 -9.65 -6.6" fill="url(#gradient3)" fill-rule="evenodd" stroke="none"/>
    <path d="M-35.0 3.35 Q-36.15 3.6 -36.8 4.1 L-34.05 -4.15 -35.0 3.35" fill="#a36a6a" fill-rule="evenodd" stroke="none"/>
    <path d="M-37.95 -13.25 L-38.1 -13.75 -32.5 -14.05 -33.2 -11.45 Q-30.6 -8.15 -26.6 -6.95 -21.75 -5.15 -16.9 -6.6 -16.05 -6.9 -15.25 -7.35 L-14.55 -9.7 -11.9 -7.9 -9.65 -6.6 -9.45 -6.45 Q-10.35 -5.0 -11.15 -2.4 L-12.45 4.0 -13.3 9.6 -17.95 10.75 -26.65 11.1 -31.2 9.55 Q-34.65 8.2 -35.55 7.2 L-35.0 3.35 M-36.85 4.15 L-37.45 6.0 -37.9 5.75 -39.45 4.6 Q-40.55 3.55 -40.5 2.9 L-40.0 2.1 -39.7 1.55 -39.55 1.3 Q-38.4 -1.2 -37.9 -3.9 -37.1 -7.95 -37.15 -8.7 -37.05 -10.15 -37.95 -13.25 M-34.05 -4.15 L-36.8 4.1" fill="none" stroke="#a36a6a" stroke-linecap="round" stroke-linejoin="round" stroke-opacity="0.49803922" stroke-width="0.05"/>
    <path d="M35.0 -10.5 Q33.95 -6.8 28.35 -3.85 21.95 -0.55 16.25 -2.4 11.55 -3.85 10.5 -6.2 L13.85 -7.5 14.25 -5.4 16.2 -4.15 18.65 -4.05 Q22.95 -4.1 26.55 -5.65 30.1 -7.15 30.2 -9.35 L30.15 -9.8 29.55 -12.3 Q33.05 -12.45 34.95 -10.55 L35.0 -10.5" fill="url(#gradient4)" fill-rule="evenodd" stroke="none"/>
    <path d="M10.5 -6.2 Q11.55 -3.85 16.25 -2.4 21.95 -0.55 28.35 -3.85 33.95 -6.8 35.0 -10.5 L35.15 -10.35 34.1 -5.9 33.8 -3.75 Q33.8 -3.1 35.55 0.15 L37.6 4.35 35.75 5.55 34.7 3.8 34.5 3.45 31.2 -2.05 33.1 2.95 34.4 6.4 29.95 8.5 Q25.55 10.2 20.85 10.1 16.65 10.0 12.75 8.05 13.05 7.25 12.85 4.0 12.7 0.65 10.3 -6.2 L10.5 -6.2" fill="url(#gradient5)" fill-rule="evenodd" stroke="none"/>
    <path d="M33.1 2.95 L31.2 -2.05 34.5 3.45 33.95 3.2 34.0 3.25 33.1 2.95" fill="#a36a6a" fill-rule="evenodd" stroke="none"/>
    <path d="M34.95 -10.55 Q33.05 -12.45 29.55 -12.3 L30.15 -9.8 30.2 -9.35 Q30.1 -7.15 26.55 -5.65 22.95 -4.1 18.65 -4.05 L16.2 -4.15 14.25 -5.4 13.85 -7.5 10.5 -6.2 10.3 -6.2 Q12.7 0.65 12.85 4.0 13.05 7.25 12.75 8.05 16.65 10.0 20.85 10.1 25.55 10.2 29.95 8.5 L34.4 6.4 33.1 2.95 31.2 -2.05 34.5 3.45 M34.7 3.8 L35.75 5.55 37.6 4.35 35.55 0.15 Q33.8 -3.1 33.8 -3.75 L34.1 -5.9 35.15 -10.35 35.0 -10.5" fill="none" stroke="#a36a6a" stroke-linecap="round" stroke-linejoin="round" stroke-opacity="0.49803922" stroke-width="0.05"/>
    <path d="M34.5 3.45 L34.7 3.8" fill="none" stroke="#84ab27" stroke-linecap="round" stroke-linejoin="round" stroke-opacity="0.49803922" stroke-width="0.05"/>
    <path d="M19.45 -4.1 Q23.25 -4.3 26.55 -5.65 30.1 -7.15 30.2 -9.35 L30.15 -9.8 30.1 -10.05 31.0 -9.8 Q31.2 -9.6 31.0 -8.95 30.25 -6.55 25.2 -4.55 22.25 -3.4 19.7 -3.2 17.45 -3.05 15.5 -3.65 L14.5 -4.05 13.9 -4.4 Q12.45 -5.15 12.65 -5.7 L13.25 -6.25 14.05 -6.35 14.25 -5.4 16.2 -4.15 18.65 -4.05 19.45 -4.1 M-22.45 -6.0 Q-19.65 -5.8 -16.85 -6.6 -16.05 -6.9 -15.2 -7.35 L-14.8 -8.7 -13.6 -7.4 -13.7 -7.3 -16.0 -6.3 Q-18.2 -5.35 -19.9 -4.9 L-22.5 -4.65 Q-26.05 -4.75 -29.85 -7.45 -31.9 -8.95 -33.25 -10.55 L-34.9 -12.9 -33.75 -12.7 -32.9 -12.8 -32.85 -12.75 -33.2 -11.5 Q-30.6 -8.15 -26.6 -6.95 -24.85 -6.3 -23.05 -6.05 L-22.8 -6.0 -22.45 -6.0" fill="#a36a6a" fill-opacity="0.6509804" fill-rule="evenodd" stroke="none"/>
    <path d="M14.05 -6.35 L10.1 -28.7 10.2 -28.75 11.45 -29.25 Q16.45 -18.6 17.8 -16.05 L19.45 -13.0 15.75 -15.85 15.65 -15.6 17.45 -14.15 19.65 -12.7 19.85 -12.3 20.75 -10.35 Q19.8 -10.65 18.5 -11.6 L16.15 -12.85 Q19.2 -7.85 20.35 -6.6 L18.75 -5.9 Q18.65 -5.6 19.0 -4.8 L19.45 -4.1 18.65 -4.05 16.2 -4.15 14.25 -5.4 14.05 -6.35 M16.3 -14.3 Q16.15 -13.95 17.15 -13.15 L18.6 -12.15 18.75 -12.25 16.4 -14.45 16.35 -14.5 16.3 -14.3 M22.25 7.2 L22.4 7.55 Q22.8 8.45 25.1 9.7 L25.15 9.8 20.85 10.1 16.45 9.45 17.05 8.35 16.4 6.55 Q15.7 4.8 16.3 2.85 L17.0 1.1 Q17.15 0.65 15.4 -2.5 L16.7 -2.1 17.95 -1.55 20.55 -1.4 22.15 -1.35 21.65 -1.0 20.35 -0.1 21.8 5.15 22.05 6.45 21.8 6.75 22.25 7.2 M-17.7 -18.85 L-16.15 -21.35 -16.35 -21.3 Q-16.45 -21.2 -18.25 -20.25 L-20.2 -19.35 -15.75 -25.95 Q-13.95 -28.75 -13.7 -29.6 L-13.6 -30.25 -9.5 -28.65 -14.8 -8.7 -15.2 -7.35 Q-16.05 -6.9 -16.85 -6.6 -19.65 -5.8 -22.45 -6.0 -19.2 -7.35 -18.4 -8.4 L-20.85 -9.2 Q-18.95 -10.0 -18.55 -10.3 -18.0 -10.7 -17.1 -12.1 L-16.3 -13.4 -17.55 -14.45 -19.75 -15.55 -18.8 -17.0 -15.2 -21.5 -17.7 -18.85 M-21.85 5.2 Q-21.45 4.25 -21.55 3.8 -21.75 3.0 -22.15 2.6 L-22.7 1.7 -21.0 -1.25 -21.85 -2.4 -20.15 -1.85 -18.6 -2.15 -15.35 -3.1 Q-16.9 -1.05 -18.4 0.5 -19.6 1.6 -19.5 1.9 L-17.8 4.9 Q-17.6 5.75 -18.05 6.85 L-18.5 8.3 -16.7 10.55 -17.95 10.75 -26.55 11.1 Q-24.05 9.4 -23.75 8.85 L-22.8 6.95 -21.9 8.0 -21.8 7.8 -21.85 7.6 -22.55 6.45 -22.3 6.0 -21.35 7.1 -21.1 6.85 -21.1 6.55 Q-21.25 6.0 -21.85 5.2" fill="#a36a6a" fill-opacity="0.3647059" fill-rule="evenodd" stroke="none"/>
    <path d="M22.05 6.45 L23.05 6.35 24.0 6.5 Q23.0 6.15 22.7 5.7 L22.65 5.3 22.75 5.05 25.85 6.15 25.95 6.45 Q25.8 6.95 24.7 6.7 L24.85 6.75 25.7 7.1 25.6 7.45 Q25.55 7.75 24.8 7.8 L22.75 7.45 22.25 7.2 21.8 6.75 22.05 6.45 M28.0 2.75 Q27.75 3.6 26.8 3.8 L26.9 3.35 Q27.2 2.3 27.85 2.1 L28.0 2.75 M27.65 3.45 L28.25 3.0 Q27.9 4.05 27.25 4.25 L27.3 3.95 27.65 3.45 M22.2 3.65 L22.35 3.35 23.25 3.6 Q24.0 3.75 24.15 4.1 L23.85 4.35 23.1 4.25 22.25 3.95 Q22.15 3.9 22.2 3.65 M-22.8 6.95 L-23.05 6.6 -24.15 5.1 -24.2 4.85 Q-23.75 4.95 -22.85 6.1 L-22.55 6.45 -21.85 7.6 -21.8 7.8 -21.9 8.0 -22.8 6.95 M-22.3 6.0 L-23.7 3.9 -23.7 3.7 -23.6 3.65 -22.1 4.95 -21.85 5.2 Q-21.25 6.0 -21.1 6.55 L-21.1 6.85 -21.35 7.1 -22.3 6.0 M-13.95 2.55 Q-13.9 5.05 -14.7 8.1 L-14.85 8.05 -15.0 7.8 -14.65 5.45 -13.95 2.55 M-16.2 1.65 Q-16.35 2.25 -18.0 3.3 L-18.05 3.35 -18.15 3.2 -17.35 2.3 -16.25 1.55 -16.2 1.65 M-16.2 3.0 L-16.9 3.75 -17.4 3.7 Q-17.4 3.25 -16.8 2.6 -16.1 1.9 -15.35 1.75 L-16.2 3.0 M-15.5 6.25 L-15.35 5.05 -15.1 5.5 -15.1 6.6 -15.4 7.5 -15.5 6.25" fill="#b98d8d" fill-rule="evenodd" stroke="none"/>
    <path d="M13.95 -1.95 L14.6 0.0 15.3 2.15 15.1 2.3 Q14.35 1.45 14.05 0.2 L13.85 -2.0 13.95 -1.95 M24.75 -0.9 Q24.85 -1.25 26.55 -2.3 28.4 -3.6 29.45 -3.5 L29.55 -3.2 27.55 -1.5 Q25.45 -0.05 25.1 -0.15 24.65 -0.3 24.65 -0.55 L24.75 -0.9 M27.8 -0.15 L26.15 1.25 25.95 0.7 27.2 -0.7 Q28.45 -1.8 29.05 -1.9 L29.15 -1.9 29.1 -1.6 27.8 -0.15 M29.85 1.4 Q30.25 1.95 30.35 3.6 L30.25 5.55 30.0 5.95 29.85 6.0 Q29.35 5.85 29.4 4.1 L29.7 1.45 29.85 1.4 M28.4 5.9 Q28.05 6.35 27.6 6.45 L27.45 6.4 27.5 6.05 27.95 5.6 28.85 5.2 28.4 5.9 M24.35 1.2 L24.65 2.0 24.5 2.15 24.25 2.25 Q23.7 2.05 23.55 1.45 L23.6 0.75 Q24.05 0.75 24.35 1.2 M14.6 5.25 L13.6 6.55 13.45 6.5 13.5 6.35 14.05 5.65 14.6 5.25 M13.55 0.8 Q13.55 0.7 13.7 0.75 14.55 3.65 14.25 4.6 L14.05 4.65 14.0 2.85 13.55 0.8 M13.85 7.35 Q14.25 6.35 14.95 5.95 15.55 5.55 15.25 6.45 L14.8 7.05 13.95 7.45 13.85 7.35 M-23.8 2.2 L-24.8 4.05 -26.2 6.35 -26.5 6.3 -25.35 4.0 -24.0 2.0 Q-23.85 1.9 -23.8 2.2 M-25.6 1.9 L-24.7 0.45 Q-25.2 2.3 -26.25 3.35 L-26.6 3.45 -25.6 1.9 M-26.4 0.45 L-24.65 -0.15 -25.1 0.2 -26.45 0.8 Q-26.5 0.65 -26.8 0.55 L-26.4 0.45 M-29.85 3.9 L-29.7 3.85 -28.85 6.7 -28.8 7.5 -28.95 7.55 -29.65 5.4 -29.85 3.9 M-31.0 2.4 Q-30.65 5.75 -30.65 7.5 L-30.8 7.5 -30.9 7.3 -31.25 2.5 -31.0 2.4 M-31.5 1.4 Q-31.45 2.6 -32.15 6.3 L-32.3 6.35 Q-32.5 5.25 -32.3 3.65 -32.0 1.95 -31.5 1.4" fill="#d4b7b7" fill-rule="evenodd" stroke="none"/>
    <path d="M19.45 -13.0 L20.15 -12.5 19.65 -12.7 17.45 -14.15 15.65 -15.6 15.75 -15.85 19.45 -13.0 M16.3 -14.3 L16.35 -14.5 16.4 -14.45 18.75 -12.25 18.6 -12.15 17.15 -13.15 Q16.15 -13.95 16.3 -14.3 M27.05 -14.55 L26.95 -14.2 26.4 -12.85 25.45 -10.95 25.25 -10.95 26.9 -14.6 27.05 -14.55 M26.85 -16.0 Q25.9 -13.0 25.0 -12.15 L24.9 -12.15 24.9 -12.4 26.8 -16.2 26.85 -16.2 26.85 -16.0 M27.4 -10.75 L27.85 -12.2 28.0 -12.15 27.55 -10.7 27.4 -10.75 M-17.7 -18.85 L-15.2 -21.5 -18.8 -17.0 -19.6 -16.15 -19.65 -16.1 -19.75 -16.35 -17.95 -18.65 -17.7 -18.85 M-25.3 -22.15 Q-24.3 -20.15 -24.05 -19.15 L-24.05 -18.8 -24.1 -18.75 -25.4 -22.0 -26.95 -20.35 -27.0 -20.35 -25.55 -22.3 -24.9 -23.1 -22.45 -25.45 -24.75 -22.8 -25.3 -22.15 M-23.95 -22.7 L-23.85 -22.7 -22.75 -20.45 -22.7 -20.0 -22.95 -19.95 -23.75 -21.95 -23.95 -22.7 M-27.95 -19.55 L-28.15 -19.55 Q-26.0 -24.2 -23.65 -25.4 -25.0 -24.2 -26.15 -22.3 L-27.95 -19.55 M-29.15 -12.75 L-28.6 -11.25 -28.6 -11.05 Q-29.1 -11.35 -29.2 -11.85 L-29.3 -12.7 -29.15 -12.75 M-30.1 -14.35 L-29.95 -14.4 -30.25 -11.75 -30.35 -12.05 Q-30.45 -12.45 -30.15 -13.25 -29.95 -13.95 -30.1 -14.35 M-30.65 -14.85 Q-30.8 -13.35 -31.4 -12.2 L-31.5 -12.35 -31.35 -13.5 -30.65 -14.85 M-29.55 -10.85 L-28.8 -10.25 -28.8 -10.15 -28.7 -10.1 -28.9 -10.05 Q-29.35 -9.95 -29.5 -10.25 L-29.6 -10.85 -29.55 -10.85" fill="#a56c6c" fill-rule="evenodd" stroke="none"/>
    <path d="M-10.9 -23.2 L-12.8 -16.15 -19.45 -15.65 Q-21.15 -15.95 -23.8 -17.45 L-26.6 -18.7 -26.0 -10.6 Q-25.75 -8.0 -25.9 -6.65 -25.95 -5.6 -26.2 -5.5 L-29.1 -5.8 Q-29.55 -5.7 -29.65 -3.85 -29.75 -1.7 -29.2 1.6 L-29.3 1.65 -34.1 -3.45 -34.0 -4.2 -34.2 -3.6 Q-36.05 -5.7 -37.15 -7.5 L-37.1 -8.75 Q-37.05 -10.15 -37.9 -13.3 L-38.1 -13.8 -32.5 -14.05 -32.05 -15.7 -30.1 -16.35 -31.15 -18.7 -26.75 -34.25 -26.6 -34.8 Q-23.9 -33.75 -17.3 -31.6 L-15.3 -30.85 -9.5 -28.65 -9.55 -28.4 -7.3 -27.35 -11.9 -22.2 -10.9 -23.2" fill="url(#gradient6)" fill-rule="evenodd" stroke="none"/>
    <path d="M-26.75 -34.25 L-26.9 -33.65 -27.65 -35.0 -27.65 -35.15 Q-26.85 -35.1 -26.55 -35.65 L-26.1 -37.1 -24.6 -41.3 -23.1 -44.75 -22.1 -46.7 -21.15 -46.7 -21.15 -47.25 Q11.35 -47.6 23.5 -47.95 L24.55 -38.9 24.95 -34.6 24.9 -34.6 29.55 -12.3 Q33.05 -12.45 35.0 -10.5 L35.15 -10.35 34.1 -5.9 33.8 -3.75 Q33.8 -3.2 34.9 -1.1 L32.2 -0.35 31.5 -1.55 32.05 -2.95 Q32.2 -3.5 31.85 -4.1 L31.85 -5.45 31.1 -5.85 29.4 -6.25 28.6 -6.8 28.5 -6.95 27.8 -8.35 26.75 -9.5 21.7 -8.45 18.1 -8.85 13.45 -9.7 10.6 -26.0 9.65 -26.65 8.55 -27.3 Q4.7 -29.55 1.7 -29.55 -2.1 -29.55 -5.55 -27.9 -7.05 -27.2 -10.9 -23.2 L-11.9 -22.2 -7.3 -27.35 -9.55 -28.4 -9.5 -28.65 -15.3 -30.85 -17.3 -31.6 Q-23.9 -33.75 -26.6 -34.8 L-26.75 -34.25" fill="url(#gradient7)" fill-rule="evenodd" stroke="none"/>
  </g>
  <defs>
    <linearGradient gradientTransform="matrix(0.0098, 0.0023, -0.0038, 0.0162, -21.6, -19.65)" gradientUnits="userSpaceOnUse" id="gradient0" spreadMethod="pad" x1="-819.2" x2="819.2">
      <stop offset="0.0" stop-color="#c29b9b"/>
      <stop offset="0.34509803921568627" stop-color="#e0cbcb"/>
      <stop offset="0.6039215686274509" stop-color="#cca9a9"/>
      <stop offset="0.7568627450980392" stop-color="#b68888"/>
      <stop offset="1.0" stop-color="#cca9a9"/>
    </linearGradient>
    <linearGradient gradientTransform="matrix(-0.0085, 0.0019, -0.0036, -0.0164, 19.95, -17.75)" gradientUnits="userSpaceOnUse" id="gradient1" spreadMethod="pad" x1="-819.2" x2="819.2">
      <stop offset="0.0" stop-color="#c29b9b"/>
      <stop offset="0.34509803921568627" stop-color="#e0cbcb"/>
      <stop offset="0.6039215686274509" stop-color="#cca9a9"/>
      <stop offset="0.7568627450980392" stop-color="#b68888"/>
      <stop offset="1.0" stop-color="#cca9a9"/>
    </linearGradient>
    <radialGradient cx="0" cy="0" gradientTransform="matrix(0.0278, -0.0083, 0.0083, 0.0278, -32.6, -9.45)" gradientUnits="userSpaceOnUse" id="gradient2" r="819.2" spreadMethod="pad">
      <stop offset="0.0" stop-color="#ffffff"/>
      <stop offset="0.3137254901960784" stop-color="#f2eaea"/>
      <stop offset="0.6823529411764706" stop-color="#e0cbcb"/>
      <stop offset="1.0" stop-color="#a36a6a"/>
    </radialGradient>
    <linearGradient gradientTransform="matrix(0.0164, 0.0039, -0.0033, 0.0139, -26.5, -1.1)" gradientUnits="userSpaceOnUse" id="gradient3" spreadMethod="pad" x1="-819.2" x2="819.2">
      <stop offset="0.0" stop-color="#c29b9b"/>
      <stop offset="0.34509803921568627" stop-color="#e0cbcb"/>
      <stop offset="0.6039215686274509" stop-color="#cca9a9"/>
      <stop offset="0.7568627450980392" stop-color="#b68888"/>
      <stop offset="1.0" stop-color="#cca9a9"/>
    </linearGradient>
    <radialGradient cx="0" cy="0" gradientTransform="matrix(0.0273, 0.0086, -0.0086, 0.0273, 33.55, -10.3)" gradientUnits="userSpaceOnUse" id="gradient4" r="819.2" spreadMethod="pad">
      <stop offset="0.0" stop-color="#ffffff"/>
      <stop offset="0.3137254901960784" stop-color="#f2eaea"/>
      <stop offset="0.6823529411764706" stop-color="#e0cbcb"/>
      <stop offset="1.0" stop-color="#a36a6a"/>
    </radialGradient>
    <linearGradient gradientTransform="matrix(-0.0201, 0.0028, -0.0019, -0.0135, 27.8, 1.7)" gradientUnits="userSpaceOnUse" id="gradient5" spreadMethod="pad" x1="-819.2" x2="819.2">
      <stop offset="0.0" stop-color="#c29b9b"/>
      <stop offset="0.34509803921568627" stop-color="#e0cbcb"/>
      <stop offset="0.6039215686274509" stop-color="#cca9a9"/>
      <stop offset="0.7568627450980392" stop-color="#b68888"/>
      <stop offset="1.0" stop-color="#cca9a9"/>
    </linearGradient>
    <linearGradient gradientTransform="matrix(0.0046, -0.0223, 0.0149, 0.0031, -25.65, -11.1)" gradientUnits="userSpaceOnUse" id="gradient6" spreadMethod="pad" x1="-819.2" x2="819.2">
      <stop offset="0.0" stop-color="#a36a6a" stop-opacity="0.0"/>
      <stop offset="1.0" stop-color="#a36a6a"/>
    </linearGradient>
    <linearGradient gradientTransform="matrix(-0.0059, -0.0195, 0.0122, -0.0037, 24.5, -8.7)" gradientUnits="userSpaceOnUse" id="gradient7" spreadMethod="pad" x1="-819.2" x2="819.2">
      <stop offset="0.0" stop-color="#a36a6a" stop-opacity="0.0"/>
      <stop offset="1.0" stop-color="#a36a6a"/>
    </linearGradient>
  </defs>
</svg>
