<?xml version="1.0" encoding="UTF-8" standalone="no"?>
<svg xmlns:xlink="http://www.w3.org/1999/xlink" height="22.0px" width="29.75px" xmlns="http://www.w3.org/2000/svg">
  <g transform="matrix(1.0, 0.0, 0.0, 1.0, 11.45, 7.25)">
    <path d="M0.05 -0.15 L-0.05 2.15 -0.1 2.7 Q-0.1 2.95 -0.6 2.95 -1.6 2.95 -2.7 -0.15 L-3.45 -1.7 -3.45 -1.65 -3.0 2.7 -3.05 3.45 Q-3.2 4.0 -3.8 4.0 -4.45 4.0 -6.65 0.75 L-6.75 0.9 Q-7.0 1.25 -7.8 1.7 L-8.0 1.8 Q-7.8 2.55 -7.85 4.1 L-7.6 10.05 Q-7.35 13.0 -6.55 14.75 L-7.4 14.75 -8.0 10.8 -8.65 7.35 -8.6 5.55 Q-8.6 4.45 -8.95 3.75 -11.45 0.65 -11.45 0.15 -11.45 -1.55 -8.9 -2.9 L-8.85 -3.2 -8.0 -3.4 -7.9 -3.4 Q-5.5 -4.45 -5.5 -2.75 -5.5 -2.35 -6.2 -1.8 L-5.25 -0.35 -5.35 -4.6 -5.1 -6.7 Q-4.85 -7.55 -4.45 -7.1 -4.05 -6.65 -4.0 -6.0 L-3.7 -3.55 -3.4 -3.6 Q-2.9 -3.6 -2.3 -2.45 -2.15 -3.05 -1.75 -2.75 L-1.5 -2.5 Q-1.5 -3.95 -1.0 -4.45 0.0 -3.5 0.05 -1.35 L0.8 -0.6 Q0.8 -1.7 1.05 -2.4 1.45 -3.7 2.45 -2.1 L3.95 1.15 4.0 1.0 4.5 -0.15 4.65 -1.3 4.75 -1.35 4.8 -1.75 Q5.4 -2.0 5.6 -1.5 L5.85 -1.45 5.95 -1.0 5.55 1.6 5.8 2.2 5.4 2.9 5.35 3.0 5.4 4.4 Q5.35 5.5 4.6 5.95 4.0 5.0 3.25 2.75 L1.95 -0.45 1.65 0.25 1.2 0.65 0.1 -0.1 0.05 -0.15 M6.9 -1.95 L7.95 -1.0 8.0 -4.5 8.05 -5.0 9.1 -4.95 9.4 -3.6 Q9.2 3.0 8.4 3.0 7.8 3.0 7.25 0.8 6.95 -0.25 6.8 -1.4 L6.9 -1.95 M14.45 -0.35 L11.8 2.0 11.2 1.3 Q11.2 0.95 13.4 -2.15 L13.7 -1.55 14.4 -2.3 15.35 -3.0 Q16.3 -3.25 16.4 -2.75 16.5 -2.25 16.8 -2.25 17.6 -2.25 18.3 0.55 18.3 1.3 17.5 1.3 16.9 1.3 16.65 1.0 L16.2 0.45 Q15.5 1.05 15.2 1.05 14.55 1.05 14.55 -0.1 L14.45 -0.35" fill="#000000" fill-opacity="0.17254902" fill-rule="evenodd" stroke="none"/>
  </g>
</svg>
