<?xml version="1.0" encoding="UTF-8" standalone="no"?>
<svg xmlns:xlink="http://www.w3.org/1999/xlink" height="80.0px" width="80.0px" xmlns="http://www.w3.org/2000/svg">
  <g transform="matrix(1.0, 0.0, 0.0, 1.0, 40.0, 40.0)">
    <path d="M15.15 -13.45 L15.9 -12.5 16.1 -12.25 16.65 -11.6 Q17.9 -9.8 20.1 -9.35 22.2 -8.95 24.1 -10.2 L24.2 -10.25 Q21.95 -14.9 17.8 -18.6 L17.7 -18.65 16.5 -19.65 Q14.85 -18.3 14.7 -16.2 14.55 -14.7 15.15 -13.45 M2.7 -25.05 L2.55 -25.05 2.0 -25.05 Q1.75 -23.4 2.65 -21.8 3.8 -19.9 5.85 -19.35 L6.75 -19.05 Q8.15 -19.05 9.45 -19.7 11.35 -20.7 11.95 -22.55 L11.55 -22.75 2.7 -25.05 M26.75 -29.95 L26.25 -27.9 Q26.1 -25.2 27.05 -23.05 L28.5 -21.45 28.85 -20.95 29.8 -19.7 Q31.85 -16.55 35.65 -15.95 L37.4 -15.65 Q39.2 -11.35 40.0 -6.3 L38.7 -5.2 Q36.0 -2.55 36.15 1.4 L36.15 1.7 36.15 2.5 Q36.65 5.05 38.55 7.05 L39.85 8.2 Q38.7 12.9 36.65 17.5 L34.9 17.6 Q32.15 18.1 30.4 20.0 L29.3 21.45 Q26.9 24.4 27.55 28.2 L27.7 29.3 Q23.85 32.75 19.4 35.25 L18.6 34.8 Q15.4 33.1 11.9 34.0 8.2 35.25 6.45 38.75 L6.15 39.7 -0.1 40.0 -4.25 39.85 -4.75 39.1 Q-6.5 35.6 -10.15 34.5 L-12.7 33.7 Q-15.25 33.4 -17.8 34.65 L-19.1 35.45 Q-23.25 33.25 -26.95 30.1 L-26.6 28.35 Q-26.15 25.5 -27.25 23.15 L-28.2 22.05 Q-30.6 19.05 -34.45 18.4 -35.4 18.25 -36.2 18.4 -38.45 14.15 -39.55 9.75 L-37.95 8.35 Q-35.4 5.65 -35.4 1.7 L-35.4 -0.35 Q-35.9 -3.3 -38.1 -5.5 -39.05 -6.45 -40.0 -6.95 -39.2 -11.7 -37.3 -15.95 L-35.05 -16.1 Q-31.25 -16.7 -29.0 -19.9 L-28.35 -20.5 Q-27.25 -23.05 -27.9 -25.85 -28.05 -27.1 -28.5 -28.05 -25.2 -31.7 -21.2 -34.05 -20.2 -33.4 -19.1 -32.95 -16.4 -31.55 -13.5 -32.0 L-11.1 -32.95 Q-7.6 -34.2 -5.85 -37.65 L-5.05 -39.7 -0.1 -40.0 4.4 -39.7 Q4.5 -38.8 5.2 -37.65 7.25 -34.35 10.75 -33.4 L12.4 -32.8 13.15 -32.8 Q15.25 -32.95 17.15 -34.05 L19.1 -35.3 Q23.1 -33.1 26.75 -29.95 M7.1 -9.7 L11.4 -3.7 11.4 3.7 7.1 9.7 0.0 12.0 -7.1 9.7 -11.4 3.7 -11.4 -3.7 -7.1 -9.7 0.0 -12.0 7.1 -9.7 M-10.5 19.55 Q-12.5 20.5 -13.1 22.6 L-13.2 22.85 Q-8.65 25.55 -3.0 26.3 L-2.65 26.35 -2.55 26.05 Q-1.9 23.9 -3.0 22.0 -4.0 20.05 -6.15 19.4 L-7.6 18.95 Q-9.05 18.75 -10.5 19.55 M-16.4 12.3 Q-17.8 10.55 -20.0 10.2 -22.0 10.0 -23.65 11.1 L-23.5 11.45 -20.45 16.4 -20.4 16.5 -17.7 19.45 -17.55 19.4 Q-15.8 18.1 -15.45 15.85 -15.25 14.3 -15.9 12.95 L-16.4 12.3 M-25.3 -4.95 L-25.65 -2.7 -25.8 -1.35 Q-26.15 2.5 -25.3 6.15 -23.35 5.95 -21.95 4.5 -20.5 2.9 -20.5 0.7 L-20.5 -0.45 Q-20.75 -2.15 -22.05 -3.45 -23.45 -4.8 -25.3 -4.95 M-20.95 -14.5 L-21.15 -14.2 -23.5 -10.2 -23.6 -9.95 Q-22.1 -9.2 -20.3 -9.5 -18.15 -9.8 -16.85 -11.6 L-16.5 -12.05 Q-15.9 -13.45 -16.2 -15.05 -16.5 -16.85 -17.8 -18.0 L-18.45 -17.35 -19.25 -16.55 -20.35 -15.3 -20.95 -14.5 M-3.15 -24.9 L-3.55 -24.85 -13.1 -21.7 -13.2 -21.6 -13.35 -21.5 -13.55 -21.35 -13.7 -21.25 Q-12.9 -19.8 -11.2 -19.1 -9.65 -18.3 -8.0 -18.6 L-6.7 -19.1 Q-4.65 -19.85 -3.7 -21.8 -2.9 -23.35 -3.15 -24.9 M6.45 19.15 Q4.4 19.85 3.35 21.85 2.35 23.75 3.05 25.8 L3.35 26.4 Q8.5 25.85 13.2 23.35 L13.0 22.6 Q12.3 20.55 10.3 19.55 8.45 18.65 6.45 19.15 M24.5 11.1 L23.7 10.55 Q21.9 9.3 19.65 9.75 18.1 10.05 17.0 11.1 L16.4 11.9 Q15.1 13.7 15.45 15.8 15.7 18.0 17.45 19.3 L18.25 19.75 19.55 18.45 19.9 18.1 Q22.8 14.8 24.5 11.1 M25.6 -4.95 Q23.4 -4.95 21.8 -3.3 20.25 -1.7 20.35 0.5 L20.35 0.65 20.3 1.1 Q20.6 2.6 21.75 3.8 23.25 5.35 25.55 5.35 L26.25 5.35 Q26.75 2.45 26.6 -0.65 L26.6 -1.0 26.0 -4.95 25.6 -4.95 M14.85 -0.7 Q14.5 -6.8 9.9 -10.9 5.25 -15.0 -0.95 -14.6 -7.2 -14.35 -11.35 -9.75 -13.05 -7.85 -14.0 -5.65 -14.75 -3.9 -15.0 -1.8 -15.75 4.25 -11.9 9.15 -8.1 13.9 -1.95 14.7 4.15 15.4 9.1 11.8 L11.0 10.0 Q15.15 5.45 14.85 -0.7" fill="#000000" fill-rule="evenodd" stroke="none"/>
  </g>
</svg>
