<?xml version="1.0" encoding="UTF-8" standalone="no"?>
<svg xmlns:xlink="http://www.w3.org/1999/xlink" height="35.75px" width="32.2px" xmlns="http://www.w3.org/2000/svg">
  <g transform="matrix(1.0, 0.0, 0.0, 1.0, 26.0, 45.6)">
    <path d="M-26.0 -19.25 L-13.7 -45.6 6.2 -40.35 -7.45 -9.85 -26.0 -19.25" fill="#00ff00" fill-rule="evenodd" stroke="none"/>
  </g>
</svg>
