<?xml version="1.0" encoding="UTF-8" standalone="no"?>
<svg xmlns:xlink="http://www.w3.org/1999/xlink" height="15.95px" width="33.3px" xmlns="http://www.w3.org/2000/svg">
  <g transform="matrix(1.0, 0.0, 0.0, 1.0, 12.95, 33.45)">
    <path d="M20.35 -17.5 L-12.95 -17.5 -12.95 -33.45 20.35 -33.45 20.35 -17.5" fill="#00ff00" fill-rule="evenodd" stroke="none"/>
  </g>
</svg>
