<?xml version="1.0" encoding="UTF-8" standalone="no"?>
<svg xmlns:xlink="http://www.w3.org/1999/xlink" height="271.0px" width="158.8px" xmlns="http://www.w3.org/2000/svg">
  <g transform="matrix(1.0, 0.0, 0.0, 1.0, 156.45, 271.0)">
    <path d="M-18.3 -98.75 L-17.8 -98.15 Q-13.05 -91.8 -9.5 -84.75 -4.35 -74.5 -1.8 -62.75 0.7 -50.95 1.85 -39.0 3.4 -22.85 0.2 -7.45 -0.65 -3.7 -1.75 0.0 L-12.5 -0.3 -12.5 -3.35 Q-12.6 -5.2 -11.1 -13.0 -9.6 -20.75 -9.85 -24.4 L-10.15 -27.0 Q-10.65 -28.85 -12.5 -29.25 -12.4 -28.8 -12.85 -28.8 L-13.1 -31.5 Q-12.55 -34.05 -12.55 -36.05 L-12.85 -40.7 Q-13.15 -45.6 -14.6 -53.25 -16.0 -60.5 -17.15 -63.9 -18.4 -67.9 -23.6 -75.4 -28.45 -82.4 -28.5 -82.9 L-25.45 -86.8 -20.95 -93.1 -19.65 -95.95 -18.7 -98.9 -18.3 -98.75 M-33.25 -179.1 Q-29.95 -173.6 -28.35 -166.45 -23.85 -145.85 -31.15 -128.1 -32.4 -125.15 -33.9 -122.35 L-34.55 -121.35 -35.9 -120.45 Q-42.35 -116.45 -49.75 -114.7 L-51.15 -114.75 Q-48.65 -115.9 -44.85 -121.1 -41.0 -126.2 -37.4 -133.05 L-36.25 -135.25 Q-28.6 -150.6 -29.25 -160.1 -29.6 -165.6 -31.8 -173.45 L-33.25 -179.1" fill="#d1fff5" fill-rule="evenodd" stroke="none"/>
    <path d="M-42.1 -1.15 L-83.8 -2.25 -81.95 -4.3 -81.2 -5.15 -79.55 -7.2 Q-79.1 -9.8 -78.25 -12.3 -77.55 -14.45 -74.25 -21.4 -73.75 -22.5 -72.25 -28.3 L-71.0 -33.15 Q-69.05 -41.25 -67.5 -41.2 -67.0 -41.2 -66.25 -40.45 -65.95 -44.85 -66.25 -49.4 -66.9 -59.1 -73.15 -67.35 L-74.0 -68.35 -84.3 -67.55 Q-86.4 -67.65 -92.3 -69.5 -94.8 -66.7 -97.6 -61.9 -101.05 -56.2 -103.2 -50.85 -104.05 -48.75 -106.3 -36.55 -108.1 -26.4 -109.45 -26.45 -110.45 -26.45 -111.2 -28.3 -111.7 -29.8 -111.9 -32.0 L-111.85 -34.45 Q-111.9 -36.2 -112.2 -37.0 -114.7 -36.9 -115.15 -32.85 -115.7 -28.4 -117.5 -27.55 -118.5 -28.15 -118.95 -30.6 L-118.55 -30.5 Q-117.85 -30.5 -113.7 -44.0 L-111.8 -50.5 Q-111.2 -49.2 -110.3 -49.2 -109.1 -49.15 -107.15 -56.4 L-106.0 -61.2 -100.5 -69.3 -97.75 -73.5 Q-87.95 -69.15 -80.9 -68.95 -65.85 -68.55 -53.15 -74.15 L-49.9 -75.75 -49.35 -74.8 Q-44.4 -66.55 -41.4 -57.85 -37.9 -47.95 -37.3 -38.8 -37.05 -35.4 -37.5 -28.45 -38.05 -19.75 -39.45 -12.05 -40.6 -5.85 -42.1 -1.15 M-128.55 -96.3 L-128.45 -96.4 Q-124.2 -101.75 -119.1 -106.45 -112.05 -102.4 -108.25 -100.5 -100.6 -96.5 -94.15 -94.0 -93.8 -97.8 -92.05 -105.35 L-91.1 -108.45 -90.95 -108.45 -91.1 -108.5 -90.8 -109.5 -89.4 -114.95 -88.5 -114.95 -88.6 -114.35 Q-88.6 -114.05 -86.85 -113.75 L-74.3 -114.25 Q-63.5 -115.05 -56.25 -124.9 -49.05 -134.85 -46.15 -145.3 L-45.45 -147.85 Q-43.55 -156.4 -44.3 -166.4 -44.95 -176.0 -53.05 -187.15 L-53.55 -187.9 -58.1 -193.4 -60.6 -196.05 -61.15 -196.5 -60.6 -196.45 Q-50.35 -194.4 -43.25 -189.55 -37.15 -185.4 -33.25 -179.1 L-31.8 -173.45 Q-29.6 -165.6 -29.25 -160.1 -28.6 -150.6 -36.25 -135.25 L-37.4 -133.05 Q-41.0 -126.2 -44.85 -121.1 -48.65 -115.9 -51.15 -114.75 L-49.75 -114.7 Q-42.35 -116.45 -35.9 -120.45 L-34.55 -121.35 -35.65 -119.35 -37.05 -117.45 Q-31.1 -112.8 -26.15 -107.75 L-24.25 -105.85 Q-26.55 -105.25 -28.75 -103.5 -30.7 -101.95 -34.45 -97.35 -38.15 -93.0 -40.5 -91.25 -41.7 -90.4 -42.95 -89.8 L-44.2 -89.25 Q-46.35 -88.55 -48.6 -88.65 -50.45 -88.7 -54.8 -98.35 -57.95 -105.15 -58.85 -108.55 -62.35 -107.15 -66.9 -107.25 -72.45 -107.4 -74.3 -108.15 L-75.65 -109.1 Q-76.25 -109.85 -76.35 -110.95 L-75.9 -112.0 -79.0 -111.15 -77.15 -109.15 -62.5 -92.0 -54.25 -81.8 Q-55.2 -81.25 -56.0 -80.95 -77.6 -74.85 -82.85 -75.0 -88.15 -75.15 -95.25 -78.2 L-94.65 -79.7 Q-91.55 -83.65 -91.6 -84.3 -91.7 -85.9 -95.15 -83.85 L-99.65 -80.3 -99.75 -80.35 -109.2 -85.5 Q-110.15 -85.5 -110.7 -85.0 -111.3 -84.45 -111.25 -83.5 -111.05 -80.4 -103.45 -76.25 -109.55 -69.05 -111.45 -61.5 L-111.9 -61.25 Q-113.35 -59.6 -115.55 -53.8 -117.5 -48.6 -119.0 -42.85 L-120.05 -37.9 Q-120.55 -38.9 -121.4 -39.05 L-122.4 -33.5 Q-123.2 -29.45 -124.95 -29.6 L-125.5 -32.8 Q-125.75 -34.65 -126.25 -35.55 L-128.95 -34.3 -131.7 -34.35 -131.7 -35.25 -131.25 -36.55 -131.25 -36.6 Q-127.85 -46.6 -121.3 -59.9 -116.65 -69.55 -111.85 -77.5 -116.85 -81.15 -121.1 -85.6 -126.6 -91.4 -128.55 -96.3 M-119.65 -51.2 Q-119.9 -52.4 -119.85 -55.9 L-120.25 -55.9 Q-120.45 -53.25 -125.05 -47.05 -129.45 -41.15 -129.2 -38.4 L-129.05 -37.6 Q-128.65 -36.9 -127.4 -36.85 -126.75 -36.85 -125.8 -37.4 -124.85 -38.1 -124.2 -39.15 -123.55 -40.45 -122.2 -40.45 -120.8 -40.4 -120.25 -41.1 -118.9 -42.8 -119.25 -48.3 L-119.65 -51.2" fill="#c8f5eb" fill-rule="evenodd" stroke="none"/>
    <path d="M-83.8 -2.25 L-133.8 -3.6 Q-136.4 -7.35 -138.5 -11.2 -152.75 -36.7 -145.05 -63.8 -140.05 -81.2 -129.55 -94.95 L-128.55 -96.3 Q-126.6 -91.4 -121.1 -85.6 -116.85 -81.15 -111.85 -77.5 -116.65 -69.55 -121.3 -59.9 -127.85 -46.6 -131.25 -36.6 L-131.25 -36.55 -131.7 -35.25 -131.7 -34.35 -128.95 -34.3 -126.25 -35.55 Q-125.75 -34.65 -125.5 -32.8 L-124.95 -29.6 Q-123.2 -29.45 -122.4 -33.5 L-121.4 -39.05 Q-120.55 -38.9 -120.05 -37.9 -120.4 -35.85 -120.35 -34.8 L-120.05 -32.55 Q-119.7 -30.95 -118.95 -30.6 -118.5 -28.15 -117.5 -27.55 -115.7 -28.4 -115.15 -32.85 -114.7 -36.9 -112.2 -37.0 -111.9 -36.2 -111.85 -34.45 L-111.9 -32.0 Q-111.7 -29.8 -111.2 -28.3 -110.45 -26.45 -109.45 -26.45 -108.1 -26.4 -106.3 -36.55 -104.05 -48.75 -103.2 -50.85 -101.05 -56.2 -97.6 -61.9 -94.8 -66.7 -92.3 -69.5 -86.4 -67.65 -84.3 -67.55 L-74.0 -68.35 -73.15 -67.35 Q-66.9 -59.1 -66.25 -49.4 -65.95 -44.85 -66.25 -40.45 -67.0 -41.2 -67.5 -41.2 -69.05 -41.25 -71.0 -33.15 L-72.25 -28.3 Q-73.75 -22.5 -74.25 -21.4 -77.55 -14.45 -78.25 -12.3 -79.1 -9.8 -79.55 -7.2 L-81.2 -5.15 -81.95 -4.3 -83.8 -2.25 M-119.1 -106.45 L-114.95 -110.15 Q-109.25 -114.95 -102.65 -119.0 L-105.55 -122.0 -109.1 -125.95 Q-116.5 -135.25 -119.5 -145.8 -121.15 -151.7 -121.4 -158.0 -121.65 -162.85 -121.0 -167.9 L-120.95 -168.5 Q-119.65 -178.05 -112.3 -184.6 -102.6 -192.95 -90.85 -196.1 -87.65 -197.0 -84.3 -197.45 -73.55 -199.0 -61.25 -196.55 L-61.15 -196.5 -60.6 -196.05 -58.1 -193.4 -53.55 -187.9 -53.05 -187.15 Q-44.95 -176.0 -44.3 -166.4 -43.55 -156.4 -45.45 -147.85 L-46.15 -145.3 Q-49.05 -134.85 -56.25 -124.9 -63.5 -115.05 -74.3 -114.25 L-86.85 -113.75 Q-88.6 -114.05 -88.6 -114.35 L-88.5 -114.95 -89.4 -114.95 -90.8 -109.5 -91.1 -108.5 -91.1 -108.45 -92.05 -105.35 Q-93.8 -97.8 -94.15 -94.0 -100.6 -96.5 -108.25 -100.5 -112.05 -102.4 -119.1 -106.45 M-76.75 -180.45 L-73.55 -181.7 -73.75 -184.05 Q-76.85 -185.95 -78.35 -186.0 L-78.9 -185.9 Q-82.2 -182.05 -82.1 -180.6 L-81.35 -179.65 -80.4 -179.2 Q-79.3 -179.15 -76.75 -180.45 M-73.0 -158.35 L-76.0 -158.25 -78.85 -158.15 -81.7 -158.05 -81.7 -157.8 -80.8 -157.1 Q-79.85 -156.55 -78.25 -156.25 L-76.15 -155.95 Q-76.45 -151.45 -76.1 -146.65 -75.95 -143.9 -74.45 -142.25 -72.8 -140.4 -69.75 -140.3 -68.7 -140.3 -62.6 -141.95 L-67.9 -142.0 Q-70.55 -142.0 -71.65 -143.25 L-71.85 -143.55 -71.4 -143.55 -70.1 -143.8 -69.55 -143.65 -68.7 -143.55 Q-63.25 -143.4 -64.15 -158.6 L-68.3 -158.5 -73.0 -158.35 M-71.55 -126.05 L-77.55 -126.15 -85.3 -125.7 Q-92.6 -124.9 -92.6 -123.15 -92.6 -122.65 -91.75 -121.5 -90.8 -120.2 -89.7 -119.75 -86.55 -124.85 -71.9 -124.85 L-65.0 -124.55 Q-69.3 -125.85 -71.55 -126.05 M-85.6 -192.05 L-90.7 -192.7 -95.0 -192.3 -95.25 -192.25 -95.2 -191.45 Q-96.9 -191.55 -98.75 -190.85 L-102.6 -188.5 Q-107.05 -184.95 -106.7 -180.1 -106.5 -177.2 -101.8 -175.7 -98.7 -174.7 -95.35 -174.6 -91.65 -174.5 -87.0 -179.35 -82.35 -184.2 -82.6 -187.95 -82.8 -191.1 -85.6 -192.05 M-109.5 -158.0 L-112.9 -158.0 -113.6 -158.0 -120.65 -157.75 -115.95 -156.8 -113.75 -156.4 -112.7 -156.25 Q-112.3 -153.65 -111.1 -150.3 L-109.8 -146.85 Q-106.7 -139.05 -103.6 -139.0 -100.85 -138.9 -99.55 -145.05 L-98.7 -149.6 -98.45 -151.65 Q-98.95 -151.0 -99.6 -150.45 L-100.95 -149.2 -101.35 -148.9 -101.45 -148.9 -101.45 -149.05 -101.45 -149.15 -101.35 -151.85 Q-101.3 -154.7 -101.55 -157.9 L-106.7 -157.95 -109.5 -158.0" fill="#e2fcf6" fill-rule="evenodd" stroke="none"/>
    <path d="M-76.75 -180.45 Q-79.3 -179.15 -80.4 -179.2 L-81.35 -179.65 -82.1 -180.6 Q-82.2 -182.05 -78.9 -185.9 L-78.35 -186.0 Q-76.85 -185.95 -73.75 -184.05 L-73.55 -181.7 -76.75 -180.45 M-85.6 -192.05 Q-82.8 -191.1 -82.6 -187.95 -82.35 -184.2 -87.0 -179.35 -91.65 -174.5 -95.35 -174.6 -98.7 -174.7 -101.8 -175.7 -106.5 -177.2 -106.7 -180.1 -107.05 -184.95 -102.6 -188.5 L-98.75 -190.85 Q-96.9 -191.55 -95.2 -191.45 L-95.25 -192.25 -95.0 -192.3 -90.7 -192.7 -85.6 -192.05" fill="#ffffff" fill-rule="evenodd" stroke="none"/>
    <path d="M-12.5 -0.3 L-42.1 -1.15 Q-40.6 -5.85 -39.45 -12.05 -38.05 -19.75 -37.5 -28.45 -37.05 -35.4 -37.3 -38.8 -37.9 -47.95 -41.4 -57.85 -44.4 -66.55 -49.35 -74.8 L-49.9 -75.75 -53.15 -74.15 Q-65.85 -68.55 -80.9 -68.95 -87.95 -69.15 -97.75 -73.5 L-100.5 -69.3 -106.0 -61.2 -107.15 -56.4 Q-109.1 -49.15 -110.3 -49.2 -111.2 -49.2 -111.8 -50.5 L-113.7 -44.0 Q-117.85 -30.5 -118.55 -30.5 L-118.95 -30.6 Q-119.7 -30.95 -120.05 -32.55 L-120.35 -34.8 Q-120.4 -35.85 -120.05 -37.9 L-119.0 -42.85 Q-117.5 -48.6 -115.55 -53.8 -113.35 -59.6 -111.9 -61.25 L-111.45 -61.5 Q-109.55 -69.05 -103.45 -76.25 -111.05 -80.4 -111.25 -83.5 -111.3 -84.45 -110.7 -85.0 -110.15 -85.5 -109.2 -85.5 L-99.75 -80.35 -99.65 -80.3 -95.15 -83.85 Q-91.7 -85.9 -91.6 -84.3 -91.55 -83.65 -94.65 -79.7 L-95.25 -78.2 Q-88.15 -75.15 -82.85 -75.0 -77.6 -74.85 -56.0 -80.95 -55.2 -81.25 -54.25 -81.8 L-62.5 -92.0 -77.15 -109.15 -79.0 -111.15 -75.9 -112.0 -76.35 -110.95 Q-76.25 -109.85 -75.65 -109.1 L-74.3 -108.15 Q-72.45 -107.4 -66.9 -107.25 -62.35 -107.15 -58.85 -108.55 -57.95 -105.15 -54.8 -98.35 -50.45 -88.7 -48.6 -88.65 -46.35 -88.55 -44.2 -89.25 L-42.95 -89.8 Q-41.7 -90.4 -40.5 -91.25 -38.15 -93.0 -34.45 -97.35 -30.7 -101.95 -28.75 -103.5 -26.55 -105.25 -24.25 -105.85 L-21.75 -103.1 -18.55 -99.15 -18.45 -99.0 -18.7 -98.9 -19.65 -95.95 -20.95 -93.1 -25.45 -86.8 -28.5 -82.9 Q-28.45 -82.4 -23.6 -75.4 -18.4 -67.9 -17.15 -63.9 -16.0 -60.5 -14.6 -53.25 -13.15 -45.6 -12.85 -40.7 L-12.55 -36.05 Q-12.55 -34.05 -13.1 -31.5 L-12.85 -28.8 Q-12.4 -28.8 -12.5 -29.25 -10.65 -28.85 -10.15 -27.0 L-9.85 -24.4 Q-9.6 -20.75 -11.1 -13.0 -12.6 -5.2 -12.5 -3.35 L-12.5 -0.3 M-91.1 -108.5 L-90.95 -108.45 -91.1 -108.45 -91.1 -108.5 M-70.1 -143.8 L-71.4 -143.55 -71.85 -143.55 -71.65 -143.25 Q-70.55 -142.0 -67.9 -142.0 L-62.6 -141.95 Q-68.7 -140.3 -69.75 -140.3 -72.8 -140.4 -74.45 -142.25 -75.95 -143.9 -76.1 -146.65 -76.45 -151.45 -76.15 -155.95 L-78.25 -156.25 Q-79.85 -156.55 -80.8 -157.1 L-81.7 -157.8 -81.7 -158.05 -78.85 -158.15 -76.0 -158.25 -73.0 -158.35 -73.15 -155.45 -73.05 -151.65 Q-73.2 -149.6 -72.7 -147.6 -72.05 -144.65 -70.1 -143.8 M-101.45 -148.9 L-101.35 -148.9 -100.95 -149.2 -99.6 -150.45 Q-98.95 -151.0 -98.45 -151.65 L-98.7 -149.6 -99.55 -145.05 Q-100.85 -138.9 -103.6 -139.0 -106.7 -139.05 -109.8 -146.85 L-111.1 -150.3 Q-112.3 -153.65 -112.7 -156.25 L-113.75 -156.4 -115.95 -156.8 -120.65 -157.75 -113.6 -158.0 -112.9 -158.0 -109.5 -158.0 Q-109.7 -155.75 -109.5 -153.0 L-108.95 -149.4 -108.6 -148.05 Q-107.25 -143.95 -104.85 -143.4 L-104.3 -143.35 Q-102.0 -143.3 -101.45 -148.9 M-119.65 -51.2 L-119.25 -48.3 Q-118.9 -42.8 -120.25 -41.1 -120.8 -40.4 -122.2 -40.45 -123.55 -40.45 -124.2 -39.15 -124.85 -38.1 -125.8 -37.4 -126.75 -36.85 -127.4 -36.85 -128.65 -36.9 -129.05 -37.6 L-129.2 -38.4 Q-129.45 -41.15 -125.05 -47.05 -120.45 -53.25 -120.25 -55.9 L-119.85 -55.9 Q-119.9 -52.4 -119.65 -51.2" fill="#b3e6da" fill-rule="evenodd" stroke="none"/>
    <path d="M-70.1 -143.8 Q-72.05 -144.65 -72.7 -147.6 -73.2 -149.6 -73.05 -151.65 L-73.15 -155.45 -73.0 -158.35 -68.3 -158.5 -68.5 -156.4 -69.45 -151.1 Q-70.45 -146.05 -70.3 -145.0 -70.3 -144.25 -69.55 -143.65 L-70.1 -143.8 M-104.85 -143.4 Q-107.25 -143.95 -108.6 -148.05 L-108.95 -149.4 -109.5 -153.0 Q-109.7 -155.75 -109.5 -158.0 L-106.7 -157.95 Q-106.85 -155.3 -106.6 -151.85 L-106.3 -149.05 -105.65 -145.9 -104.85 -143.4" fill="#5f6c70" fill-rule="evenodd" stroke="none"/>
    <path d="M-68.3 -158.5 L-64.15 -158.6 Q-63.25 -143.4 -68.7 -143.55 L-69.55 -143.65 Q-70.3 -144.25 -70.3 -145.0 -70.45 -146.05 -69.45 -151.1 L-68.5 -156.4 -68.3 -158.5 M-101.45 -148.9 Q-102.0 -143.3 -104.3 -143.35 L-104.85 -143.4 -105.65 -145.9 -106.3 -149.05 -106.6 -151.85 Q-106.85 -155.3 -106.7 -157.95 L-101.55 -157.9 Q-101.3 -154.7 -101.35 -151.85 L-101.45 -149.15 -101.45 -149.05 -101.45 -148.9" fill="#545f63" fill-rule="evenodd" stroke="none"/>
    <path d="M-71.55 -126.05 Q-69.3 -125.85 -65.0 -124.55 L-71.9 -124.85 Q-86.55 -124.85 -89.7 -119.75 -90.8 -120.2 -91.75 -121.5 -92.6 -122.65 -92.6 -123.15 -92.6 -124.9 -85.3 -125.7 L-77.55 -126.15 -71.55 -126.05" fill="#9bc7bc" fill-rule="evenodd" stroke="none"/>
    <path d="M-18.45 -99.0 L-18.3 -98.75 -18.7 -98.9 -18.45 -99.0" fill="#d8e6e3" fill-rule="evenodd" stroke="none"/>
    <path d="M-84.75 -145.35 Q-82.9 -144.75 -81.45 -143.55 -79.0 -141.4 -78.4 -138.15 -77.95 -135.7 -79.55 -133.3 -80.8 -131.45 -82.85 -130.55 L-86.95 -131.1 -102.25 -133.5 -117.4 -134.6 Q-127.6 -134.95 -133.55 -136.45 -131.75 -136.6 -127.55 -137.75 L-120.7 -139.15 Q-109.65 -140.05 -98.1 -142.25 -90.5 -143.7 -84.75 -145.35" fill="#a46628" fill-rule="evenodd" stroke="none"/>
    <path d="M-82.85 -130.55 Q-84.4 -129.85 -86.5 -129.7 -94.9 -129.0 -111.35 -129.7 L-129.7 -130.65 -144.8 -131.75 Q-156.25 -132.9 -156.4 -133.85 -156.9 -136.45 -152.6 -137.65 L-139.9 -139.25 Q-111.15 -141.65 -93.85 -145.6 L-84.75 -145.35 Q-90.5 -143.7 -98.1 -142.25 -109.65 -140.05 -120.7 -139.15 L-127.55 -137.75 Q-131.75 -136.6 -133.55 -136.45 -127.6 -134.95 -117.4 -134.6 L-102.25 -133.5 -86.95 -131.1 -82.85 -130.55" fill="#cf8133" fill-rule="evenodd" stroke="none"/>
    <path d="M-40.9 -102.75 L-41.15 -104.4 Q-41.3 -106.65 -40.8 -109.1 -40.2 -111.65 -40.35 -113.35 -40.45 -115.0 -41.8 -116.9 L-43.15 -118.2 -35.75 -121.55 Q-35.9 -114.35 -37.35 -109.7 -38.55 -105.8 -40.9 -102.75 M-60.65 -111.6 L-59.5 -111.9 -59.4 -111.9 -59.25 -111.9 Q-57.45 -111.85 -56.75 -108.9 -58.8 -107.9 -60.35 -106.6 -62.15 -105.0 -64.1 -102.0 -66.6 -98.1 -71.95 -92.2 -78.05 -85.3 -85.45 -81.65 -86.55 -81.05 -95.75 -78.15 L-101.35 -76.3 -109.75 -79.9 -111.0 -80.5 -111.45 -80.7 -109.9 -80.75 Q-101.9 -81.2 -91.95 -86.3 -84.05 -90.45 -77.25 -96.15 -74.9 -98.1 -73.1 -100.9 L-70.4 -105.5 Q-67.8 -109.25 -62.8 -111.25 L-61.25 -111.5 -60.65 -111.6 M-56.25 -97.25 L-56.25 -94.3 -56.0 -92.45 Q-54.5 -93.35 -54.6 -98.0 L-54.6 -98.25 -52.35 -99.6 -52.05 -99.8 -51.75 -97.45 Q-51.4 -94.0 -50.95 -92.8 L-55.75 -87.05 -59.6 -82.5 Q-62.15 -79.65 -64.05 -78.6 L-72.05 -74.0 -74.75 -72.35 -76.75 -72.4 -85.0 -72.05 -88.9 -72.55 Q-77.95 -77.2 -71.55 -83.2 -69.6 -85.0 -66.4 -88.7 -63.7 -91.85 -61.9 -93.25 -59.45 -95.25 -56.25 -97.25 M-49.15 -94.85 Q-49.0 -96.25 -49.0 -98.35 L-49.0 -102.7 -47.35 -104.55 -46.85 -101.35 -46.2 -97.8 -49.15 -94.85 M-44.05 -99.5 L-44.05 -101.1 -44.15 -105.9 -44.4 -106.85 -44.7 -107.85 -44.6 -108.25 -44.55 -108.4 -44.55 -108.55 -44.55 -108.5 Q-42.95 -106.95 -42.2 -101.95 L-42.15 -101.3 -44.05 -99.5 M-34.45 -122.1 L-33.9 -122.3 Q-30.0 -123.5 -29.95 -114.7 L-30.65 -113.25 Q-31.7 -110.7 -32.3 -109.65 L-31.0 -107.9 Q-30.05 -106.5 -30.0 -105.9 -29.95 -105.6 -32.7 -97.35 L-33.95 -91.1 -34.35 -88.95 Q-37.8 -86.3 -42.0 -83.75 L-47.45 -80.6 Q-45.8 -86.35 -40.95 -93.05 L-35.45 -100.3 Q-32.95 -103.7 -33.0 -105.05 -33.1 -106.1 -33.9 -107.0 -34.7 -107.95 -35.8 -107.7 L-35.8 -108.05 Q-34.9 -109.75 -34.05 -112.6 -32.9 -115.95 -33.05 -117.85 L-33.25 -120.1 Q-33.55 -121.15 -34.45 -122.1 M-27.4 -114.35 Q-25.3 -113.55 -24.6 -110.85 L-24.05 -108.7 -23.65 -107.15 Q-22.9 -105.05 -21.5 -103.95 L-21.75 -103.0 Q-22.4 -101.15 -24.0 -98.95 L-26.95 -95.4 Q-26.25 -101.5 -26.75 -108.9 L-27.05 -111.5 -27.4 -114.35 M-71.5 -112.05 Q-74.25 -111.4 -77.25 -110.4 -83.6 -108.25 -85.6 -105.9 -89.05 -101.65 -92.1 -98.9 L-97.45 -94.45 Q-101.35 -91.3 -109.9 -89.8 -116.9 -88.5 -124.25 -88.7 L-125.0 -88.9 Q-128.75 -92.05 -129.55 -94.8 -127.95 -93.95 -125.05 -93.75 L-121.7 -93.65 Q-115.8 -93.5 -107.15 -96.95 -98.9 -100.2 -96.8 -103.1 L-93.35 -107.45 Q-90.85 -110.35 -88.75 -111.35 L-83.6 -114.0 -82.25 -114.6 -71.5 -112.05 M-104.4 -121.45 Q-106.5 -121.4 -107.55 -119.8 -108.7 -117.5 -109.6 -116.4 -110.6 -115.2 -113.1 -114.6 L-113.8 -114.4 -113.75 -114.5 Q-110.8 -117.6 -110.95 -119.85 -111.05 -121.1 -111.45 -122.35 L-111.8 -123.8 Q-111.7 -124.55 -109.0 -125.95 -108.4 -123.15 -105.6 -121.95 L-104.4 -121.45 M-121.7 -107.55 Q-118.3 -107.7 -113.5 -109.4 -109.85 -110.65 -106.85 -112.2 -103.7 -113.8 -102.4 -116.1 -101.7 -117.25 -99.6 -118.1 L-96.6 -118.75 -90.8 -116.95 Q-93.35 -116.45 -95.6 -115.1 -98.6 -113.35 -101.8 -109.45 L-105.0 -106.1 Q-106.45 -105.0 -108.75 -104.25 -113.35 -102.65 -114.7 -102.35 L-120.2 -102.15 -123.8 -102.25 -126.65 -102.85 -121.9 -107.35 -121.7 -107.55 M-123.5 -82.25 L-122.7 -84.05 -114.85 -78.6 -112.95 -69.5 Q-111.2 -62.3 -108.8 -55.0 L-108.65 -54.95 -108.7 -54.7 Q-108.95 -52.4 -108.8 -41.35 -108.8 -39.1 -108.95 -37.2 L-111.65 -43.7 Q-114.3 -51.7 -116.3 -56.95 L-120.1 -69.8 -123.5 -82.25 M-103.15 -70.4 L-105.2 -66.95 -106.45 -63.95 Q-107.8 -68.1 -108.6 -72.25 L-108.9 -74.55 -103.15 -70.4 M-131.25 -64.45 L-130.0 -68.0 -127.45 -74.1 -125.35 -65.85 -121.65 -54.3 -118.7 -46.55 -117.7 -43.8 -117.7 -38.75 Q-117.6 -31.2 -119.05 -28.9 -119.8 -29.95 -120.45 -32.3 L-121.1 -35.6 -120.8 -38.85 -120.5 -42.2 Q-120.55 -43.1 -121.5 -46.6 -122.4 -50.25 -122.7 -50.45 -124.7 -48.8 -124.6 -41.25 L-124.8 -41.2 -127.55 -50.1 -127.65 -50.1 -127.65 -50.55 -127.8 -52.1 Q-128.05 -53.0 -128.4 -53.4 L-131.25 -64.45 M-129.55 -43.25 L-129.55 -43.05 Q-129.85 -36.0 -132.65 -34.25 L-133.4 -45.3 Q-133.85 -48.7 -133.6 -52.45 L-129.55 -43.25 M-127.85 -39.7 L-124.9 -33.7 Q-125.15 -31.7 -125.75 -30.7 -125.8 -31.25 -126.9 -31.3 -127.05 -33.9 -127.65 -38.1 L-127.85 -39.7" fill="#9be0fd" fill-rule="evenodd" stroke="none"/>
    <path d="M-109.75 -79.9 L-101.35 -76.3 -98.9 -75.45 Q-101.35 -73.05 -103.15 -70.4 L-108.9 -74.55 -109.75 -79.9 M-121.55 -86.35 L-115.75 -82.9 -114.85 -78.6 -122.7 -84.05 -121.55 -86.35 M-108.65 -54.95 L-108.8 -55.0 -108.65 -55.05 -108.65 -54.95 M-127.65 -50.1 L-127.55 -50.1 -127.65 -50.1 M-124.8 -41.2 L-124.6 -41.25 -124.6 -40.6 -124.8 -41.2 M-128.4 -53.4 L-128.4 -53.35 -128.4 -53.4" fill="#8ec9e6" fill-rule="evenodd" stroke="none"/>
    <path d="M-43.15 -118.2 L-41.8 -116.9 Q-40.45 -115.0 -40.35 -113.35 -40.2 -111.65 -40.8 -109.1 -41.3 -106.65 -41.15 -104.4 L-40.9 -102.75 -40.15 -98.75 -40.35 -98.4 Q-40.9 -97.4 -41.25 -97.4 -41.55 -97.4 -42.15 -101.3 L-42.2 -101.95 Q-42.95 -106.95 -44.55 -108.5 L-44.55 -108.55 -44.55 -108.4 -44.6 -108.25 -44.7 -107.85 -44.4 -106.85 -44.15 -105.9 -44.05 -101.1 -44.05 -99.5 Q-44.3 -96.4 -45.25 -95.4 -45.8 -96.2 -46.2 -97.8 L-46.85 -101.35 -47.35 -104.55 Q-47.85 -106.55 -48.45 -107.5 -48.85 -106.4 -49.0 -102.7 L-49.0 -98.35 Q-49.0 -96.25 -49.15 -94.85 -49.5 -92.3 -50.4 -92.3 -50.65 -92.3 -50.95 -92.8 -51.4 -94.0 -51.75 -97.45 L-52.05 -99.8 Q-52.7 -103.55 -53.85 -104.85 -54.6 -103.45 -54.6 -98.25 L-54.6 -98.0 Q-54.5 -93.35 -56.0 -92.45 L-56.25 -94.3 -56.25 -97.25 -56.15 -98.5 Q-56.0 -100.7 -56.25 -103.8 L-56.75 -108.75 -56.75 -108.9 Q-57.45 -111.85 -59.25 -111.9 L-59.4 -111.9 -59.5 -111.9 -60.65 -111.6 -60.1 -112.15 -59.9 -112.65 Q-59.45 -113.9 -58.2 -114.4 L-53.55 -115.6 Q-53.1 -115.7 -49.75 -117.5 -46.8 -119.05 -45.4 -119.0 -44.2 -119.0 -43.15 -118.2" fill="#b0e5ff" fill-rule="evenodd" stroke="none"/>
    <path d="M-40.9 -102.75 Q-38.55 -105.8 -37.35 -109.7 -35.9 -114.35 -35.75 -121.55 L-34.7 -122.05 -34.45 -122.1 Q-33.55 -121.15 -33.25 -120.1 L-33.05 -117.85 Q-32.9 -115.95 -34.05 -112.6 -34.9 -109.75 -35.8 -108.05 L-35.8 -107.7 Q-34.7 -107.95 -33.9 -107.0 -33.1 -106.1 -33.0 -105.05 -32.95 -103.7 -35.45 -100.3 L-40.95 -93.05 Q-45.8 -86.35 -47.45 -80.6 -62.35 -72.65 -74.75 -72.35 L-72.05 -74.0 -64.05 -78.6 Q-62.15 -79.65 -59.6 -82.5 L-55.75 -87.05 -50.95 -92.8 Q-50.65 -92.3 -50.4 -92.3 -49.5 -92.3 -49.15 -94.85 L-46.2 -97.8 Q-45.8 -96.2 -45.25 -95.4 -44.3 -96.4 -44.05 -99.5 L-42.15 -101.3 Q-41.55 -97.4 -41.25 -97.4 -40.9 -97.4 -40.35 -98.4 L-40.15 -98.75 -40.9 -102.75 M-56.75 -108.9 L-56.75 -108.75 -56.25 -103.8 Q-56.0 -100.7 -56.15 -98.5 L-56.25 -97.25 Q-59.45 -95.25 -61.9 -93.25 -63.7 -91.85 -66.4 -88.7 -69.6 -85.0 -71.55 -83.2 -77.95 -77.2 -88.9 -72.55 -92.0 -73.15 -96.25 -74.55 L-98.9 -75.45 -101.35 -76.3 -95.75 -78.15 Q-86.55 -81.05 -85.45 -81.65 -78.05 -85.3 -71.95 -92.2 -66.6 -98.1 -64.1 -102.0 -62.15 -105.0 -60.35 -106.6 -58.8 -107.9 -56.75 -108.9 M-54.6 -98.25 Q-54.6 -103.45 -53.85 -104.85 -52.7 -103.55 -52.05 -99.8 L-52.35 -99.6 -54.6 -98.25 M-49.0 -102.7 Q-48.85 -106.4 -48.45 -107.5 -47.85 -106.55 -47.35 -104.55 L-49.0 -102.7 M-34.35 -88.95 L-33.95 -91.1 -32.7 -97.35 Q-29.95 -105.6 -30.0 -105.9 -30.05 -106.5 -31.0 -107.9 L-32.3 -109.65 Q-31.7 -110.7 -30.65 -113.25 L-29.95 -114.7 -29.95 -114.65 -27.4 -114.35 -27.05 -111.5 -26.75 -108.9 Q-26.25 -101.5 -26.95 -95.4 L-28.25 -94.2 -34.35 -88.95 M-71.5 -112.05 L-64.55 -111.15 -62.8 -111.25 Q-67.8 -109.25 -70.4 -105.5 L-73.1 -100.9 Q-74.9 -98.1 -77.25 -96.15 -84.05 -90.45 -91.95 -86.3 -101.9 -81.2 -109.9 -80.75 L-111.45 -80.7 -115.75 -82.9 -121.55 -86.35 Q-123.5 -87.65 -125.0 -88.9 L-124.25 -88.7 Q-116.9 -88.5 -109.9 -89.8 -101.35 -91.3 -97.45 -94.45 L-92.1 -98.9 Q-89.05 -101.65 -85.6 -105.9 -83.6 -108.25 -77.25 -110.4 -74.25 -111.4 -71.5 -112.05 M-82.25 -114.6 L-83.6 -114.0 -88.75 -111.35 Q-90.85 -110.35 -93.35 -107.45 L-96.8 -103.1 Q-98.9 -100.2 -107.15 -96.95 -115.8 -93.5 -121.7 -93.65 L-125.05 -93.75 Q-127.95 -93.95 -129.55 -94.8 L-129.55 -94.9 -129.6 -95.0 -129.75 -95.9 Q-129.95 -98.9 -127.0 -102.45 L-126.65 -102.85 -123.8 -102.25 -120.2 -102.15 -114.7 -102.35 Q-113.35 -102.65 -108.75 -104.25 -106.45 -105.0 -105.0 -106.1 L-101.8 -109.45 Q-98.6 -113.35 -95.6 -115.1 -93.35 -116.45 -90.8 -116.95 L-89.4 -116.6 -82.25 -114.6 M-113.8 -114.4 L-113.1 -114.6 Q-110.6 -115.2 -109.6 -116.4 -108.7 -117.5 -107.55 -119.8 -106.5 -121.4 -104.4 -121.45 L-96.6 -118.75 -99.6 -118.1 Q-101.7 -117.25 -102.4 -116.1 -103.7 -113.8 -106.85 -112.2 -109.85 -110.65 -113.5 -109.4 -118.3 -107.7 -121.7 -107.55 L-120.4 -108.65 -113.8 -114.4 M-123.5 -82.25 L-120.1 -69.8 -116.3 -56.95 Q-114.3 -51.7 -111.65 -43.7 L-108.95 -37.2 Q-109.4 -31.4 -111.25 -28.7 L-111.55 -29.15 -111.85 -29.2 Q-113.1 -38.25 -113.65 -40.8 -115.0 -46.9 -117.1 -49.75 -117.55 -48.05 -117.7 -43.8 L-118.7 -46.55 -121.65 -54.3 -125.35 -65.85 -127.45 -74.1 -123.5 -82.25 M-108.8 -55.0 Q-111.2 -62.3 -112.95 -69.5 L-114.85 -78.6 -112.9 -77.25 -108.9 -74.55 -108.6 -72.25 Q-107.8 -68.1 -106.45 -63.95 -107.9 -60.1 -108.65 -55.05 L-108.8 -55.0 M-131.25 -64.45 L-128.4 -53.4 -128.4 -53.35 Q-129.2 -51.6 -129.55 -43.25 L-133.6 -52.45 Q-133.25 -58.1 -131.25 -64.45 M-127.55 -50.1 L-124.8 -41.2 -124.6 -40.6 Q-124.55 -36.35 -124.9 -33.7 L-127.85 -39.7 -128.25 -42.65 -127.95 -46.4 -127.65 -50.1 -127.55 -50.1" fill="#e5f7ff" fill-rule="evenodd" stroke="none"/>
    <path d="M-111.45 -80.7 L-111.0 -80.5 -109.75 -79.9 -108.9 -74.55 -112.9 -77.25 -114.85 -78.6 -115.75 -82.9 -111.45 -80.7" fill="#cedee6" fill-rule="evenodd" stroke="none"/>
    <path d="M-132.4 -189.25 L-132.55 -189.4 -132.5 -189.4 -132.4 -189.25" fill="#556a77" fill-rule="evenodd" stroke="none"/>
    <path d="M-101.65 -223.1 L-102.4 -224.9 -103.3 -226.85 Q-105.65 -231.7 -109.4 -237.8 L-119.65 -253.6 Q-118.55 -257.8 -114.8 -262.1 L-113.75 -263.05 -115.85 -259.75 Q-118.75 -255.4 -118.05 -253.95 -117.3 -252.25 -113.4 -246.25 L-109.6 -240.2 -105.9 -233.1 -102.65 -227.05 -102.15 -226.0 -101.15 -223.75 -101.65 -223.1" fill="#b0bec9" fill-rule="evenodd" stroke="none"/>
    <path d="M-70.55 -207.3 L-64.5 -213.2 Q-62.1 -215.3 -59.3 -216.85 -62.05 -215.1 -64.3 -212.25 -67.55 -207.45 -69.9 -205.0 L-70.55 -207.3 M-96.2 -227.45 L-96.75 -229.1 -97.7 -232.2 Q-100.05 -239.45 -103.25 -246.5 L-107.3 -254.2 -110.1 -258.95 Q-105.8 -264.0 -98.0 -266.7 -90.3 -269.35 -83.0 -267.5 L-90.6 -267.3 Q-96.5 -265.25 -97.1 -261.6 -97.25 -260.6 -96.05 -252.75 L-94.0 -243.7 Q-92.55 -237.85 -92.25 -234.05 L-91.9 -230.75 -91.7 -228.9 -92.3 -228.75 -94.05 -228.25 -96.2 -227.45 M-76.15 -264.4 Q-72.45 -261.85 -70.5 -257.75 L-73.6 -246.4 Q-74.85 -241.0 -75.15 -236.55 L-75.15 -231.75 -74.9 -226.35 -77.35 -227.65 -77.7 -231.4 Q-77.9 -233.35 -77.6 -235.7 L-76.95 -239.1 Q-75.4 -245.0 -75.3 -246.45 L-74.1 -253.35 Q-73.3 -259.85 -74.2 -261.8 -74.85 -263.3 -76.15 -264.4 M-92.85 -200.45 L-90.75 -200.35 -87.05 -200.5 -86.1 -194.8 -86.35 -194.75 -93.6 -194.15 Q-93.0 -196.95 -92.85 -200.45 M-70.3 -200.5 L-72.0 -199.4 -72.5 -200.35 Q-73.35 -202.2 -74.1 -205.5 L-72.75 -206.55 -71.3 -202.45 -70.3 -200.5" fill="#60676e" fill-rule="evenodd" stroke="none"/>
    <path d="M-100.95 -195.2 L-99.95 -195.25 -96.75 -195.45 -96.6 -194.1 -95.8 -194.1 -93.6 -194.15 -86.35 -194.75 -86.1 -194.8 Q-77.7 -196.0 -72.0 -199.4 L-70.3 -200.5 -68.7 -201.75 -69.5 -204.0 -69.65 -204.4 -69.9 -205.0 Q-67.55 -207.45 -64.3 -212.25 -62.05 -215.1 -59.3 -216.85 -56.7 -218.4 -53.75 -219.4 L-52.7 -219.7 -51.0 -220.2 -50.7 -220.2 -50.7 -220.15 -48.0 -219.95 -46.95 -219.95 Q-42.7 -219.25 -41.9 -217.05 -41.05 -214.95 -42.8 -212.55 -44.55 -210.15 -47.0 -207.95 -52.75 -202.8 -60.2 -198.05 L-62.15 -196.75 -66.9 -194.95 Q-76.25 -191.75 -85.85 -191.1 L-91.45 -190.9 -97.0 -191.7 -104.5 -192.35 Q-108.4 -192.7 -111.25 -193.5 L-105.2 -194.55 -100.95 -195.2 M-87.65 -229.6 L-87.75 -231.3 -87.75 -232.2 -87.95 -244.8 Q-88.25 -249.75 -89.05 -254.25 L-90.35 -258.15 Q-91.35 -261.95 -90.05 -262.4 -87.1 -263.4 -81.65 -261.5 -76.55 -259.7 -75.9 -258.25 -77.55 -246.55 -78.45 -242.3 L-79.25 -235.15 -79.25 -234.55 -79.4 -228.45 -81.6 -229.1 -87.65 -229.6 M-81.5 -201.8 Q-78.9 -202.8 -76.6 -204.05 L-74.3 -199.2 -78.6 -197.7 -80.35 -200.0 -81.5 -201.8" fill="#454a4f" fill-rule="evenodd" stroke="none"/>
    <path d="M-92.3 -228.75 L-91.7 -228.9 -89.55 -214.7 -87.05 -200.5 -90.75 -200.35 -92.85 -200.45 -92.9 -205.55 Q-93.15 -210.8 -94.35 -218.7 -94.85 -222.3 -96.0 -226.55 L-94.75 -227.4 -92.3 -228.75 M-74.1 -205.5 Q-75.3 -210.4 -76.35 -218.45 L-77.35 -227.65 -74.9 -226.35 -74.5 -216.8 Q-74.05 -210.95 -72.75 -206.55 L-74.1 -205.5" fill="#a63333" fill-rule="evenodd" stroke="none"/>
    <path d="M-72.7 -224.95 Q-72.75 -215.95 -70.8 -208.25 L-72.75 -206.55 Q-74.05 -210.95 -74.5 -216.8 L-74.9 -226.35 -72.7 -224.95 M-96.2 -201.05 Q-96.35 -203.9 -97.05 -208.1 -97.95 -214.05 -98.75 -217.05 -99.4 -219.45 -100.6 -222.5 L-100.7 -222.7 Q-99.55 -224.6 -96.9 -225.95 L-96.0 -226.55 Q-94.85 -222.3 -94.35 -218.7 -93.15 -210.8 -92.9 -205.55 L-92.85 -200.45 -96.2 -201.05" fill="#c24545" fill-rule="evenodd" stroke="none"/>
    <path d="M-103.7 -191.45 L-116.95 -191.95 -124.9 -191.15 -131.2 -189.6 -131.2 -189.65 -125.1 -191.5 Q-114.6 -194.3 -100.95 -195.2 L-105.2 -194.55 -111.25 -193.5 Q-108.4 -192.7 -104.5 -192.35 L-97.0 -191.7 -91.45 -190.9 -96.4 -191.05 -101.95 -191.3 -103.7 -191.45 M-96.75 -195.45 L-97.4 -201.65 -96.2 -201.05 -92.85 -200.45 Q-93.0 -196.95 -93.6 -194.15 L-95.8 -194.1 -96.6 -194.1 -96.75 -195.45 M-113.75 -263.05 Q-109.55 -266.7 -98.55 -269.65 -86.0 -273.0 -75.05 -267.95 -68.85 -265.15 -67.9 -260.15 -67.2 -256.45 -69.4 -251.6 L-71.7 -237.75 -72.05 -234.9 Q-72.7 -229.75 -72.7 -224.95 L-74.9 -226.35 -75.15 -231.75 -75.15 -236.55 Q-74.85 -241.0 -73.6 -246.4 L-70.5 -257.75 Q-72.45 -261.85 -76.15 -264.4 -78.45 -266.05 -81.4 -267.0 L-83.0 -267.5 Q-90.3 -269.35 -98.0 -266.7 -105.8 -264.0 -110.1 -258.95 L-107.3 -254.2 -103.25 -246.5 Q-100.05 -239.45 -97.7 -232.2 L-96.75 -229.1 -96.2 -227.45 Q-97.9 -226.75 -98.85 -226.05 -100.1 -225.2 -101.15 -223.75 L-102.15 -226.0 -102.65 -227.05 -105.9 -233.1 -109.6 -240.2 -113.4 -246.25 Q-117.3 -252.25 -118.05 -253.95 -118.75 -255.4 -115.85 -259.75 L-113.75 -263.05 M-70.8 -208.25 L-70.55 -207.3 -69.9 -205.0 -69.65 -204.4 -69.5 -204.0 -68.7 -201.75 -70.3 -200.5 -71.3 -202.45 -72.75 -206.55 -70.8 -208.25 M-50.7 -220.2 L-46.2 -220.8 Q-41.7 -220.85 -40.55 -218.3 -38.05 -212.8 -47.35 -205.35 L-47.7 -205.05 Q-52.35 -201.5 -57.9 -198.75 -60.0 -197.7 -62.15 -196.75 L-60.2 -198.05 Q-52.75 -202.8 -47.0 -207.95 -44.55 -210.15 -42.8 -212.55 -41.05 -214.95 -41.9 -217.05 -42.7 -219.25 -46.95 -219.95 L-48.0 -219.95 -50.7 -220.15 -50.7 -220.2" fill="#6c747d" fill-rule="evenodd" stroke="none"/>
    <path d="M-97.4 -201.65 L-97.45 -201.85 -98.25 -209.15 Q-99.5 -217.45 -101.65 -223.1 L-101.15 -223.75 Q-100.1 -225.2 -98.85 -226.05 -97.9 -226.75 -96.2 -227.45 L-94.05 -228.25 -92.3 -228.75 -94.75 -227.4 -96.0 -226.55 -96.9 -225.95 Q-99.55 -224.6 -100.7 -222.7 L-100.6 -222.5 Q-99.4 -219.45 -98.75 -217.05 -97.95 -214.05 -97.05 -208.1 -96.35 -203.9 -96.2 -201.05 L-97.4 -201.65" fill="#ff5c5c" fill-rule="evenodd" stroke="none"/>
    <path d="M-135.75 -186.0 L-134.95 -186.65 Q-133.05 -188.1 -131.4 -188.7 -128.0 -189.85 -119.7 -189.0 L-110.65 -187.35 -111.8 -186.95 Q-115.25 -185.75 -122.1 -184.95 L-124.5 -184.7 Q-134.4 -183.8 -135.75 -186.0" fill="#373b40" fill-rule="evenodd" stroke="none"/>
    <path d="M-132.55 -189.4 L-132.4 -189.25 -132.15 -189.35 -131.2 -189.6 -124.9 -191.15 -116.95 -191.95 -103.7 -191.45 -106.5 -189.45 -108.05 -188.35 -108.9 -187.95 Q-109.3 -187.8 -110.65 -187.35 L-119.7 -189.0 Q-128.0 -189.85 -131.4 -188.7 -133.05 -188.1 -134.95 -186.65 L-135.75 -186.0 -135.9 -186.15 Q-136.2 -186.85 -134.75 -188.05 L-132.55 -189.4" fill="#282a2e" fill-rule="evenodd" stroke="none"/>
    <path d="M-83.0 -267.5 L-81.4 -267.0 Q-78.45 -266.05 -76.15 -264.4 -74.85 -263.3 -74.2 -261.8 -73.3 -259.85 -74.1 -253.35 L-75.3 -246.45 Q-75.4 -245.0 -76.95 -239.1 L-77.6 -235.7 Q-77.9 -233.35 -77.7 -231.4 L-77.35 -227.65 -79.4 -228.45 -79.25 -234.55 -79.25 -235.15 -78.45 -242.3 Q-77.55 -246.55 -75.9 -258.25 -76.55 -259.7 -81.65 -261.5 -87.1 -263.4 -90.05 -262.4 -91.35 -261.95 -90.35 -258.15 L-89.05 -254.25 Q-88.25 -249.75 -87.95 -244.8 L-87.75 -232.2 -87.75 -231.3 -87.65 -229.6 -89.15 -229.45 -89.9 -229.3 -91.7 -228.9 -91.9 -230.75 -92.25 -234.05 Q-92.55 -237.85 -94.0 -243.7 L-96.05 -252.75 Q-97.25 -260.6 -97.1 -261.6 -96.5 -265.25 -90.6 -267.3 L-83.0 -267.5 M-76.6 -204.05 L-75.1 -204.9 -74.1 -205.5 Q-73.35 -202.2 -72.5 -200.35 L-72.0 -199.4 Q-77.7 -196.0 -86.1 -194.8 L-87.05 -200.5 Q-84.6 -200.75 -82.75 -201.35 L-81.5 -201.8 -80.35 -200.0 -78.6 -197.7 -74.3 -199.2 -76.6 -204.05" fill="#50555c" fill-rule="evenodd" stroke="none"/>
    <path d="M-79.4 -228.45 L-77.35 -227.65 -76.35 -218.45 Q-75.3 -210.4 -74.1 -205.5 L-75.1 -204.9 -76.6 -204.05 Q-78.3 -208.55 -79.0 -213.05 -79.75 -218.0 -79.4 -227.45 L-79.4 -228.45 M-91.7 -228.9 L-89.9 -229.3 -89.15 -229.45 -87.65 -229.6 Q-87.25 -214.05 -82.05 -202.6 L-81.5 -201.8 -82.75 -201.35 Q-84.6 -200.75 -87.05 -200.5 L-89.55 -214.7 -91.7 -228.9" fill="#992323" fill-rule="evenodd" stroke="none"/>
    <path d="M-87.65 -229.6 L-81.6 -229.1 -79.4 -228.45 -79.4 -227.45 Q-79.75 -218.0 -79.0 -213.05 -78.3 -208.55 -76.6 -204.05 -78.9 -202.8 -81.5 -201.8 L-82.05 -202.6 Q-87.25 -214.05 -87.65 -229.6" fill="#821e1e" fill-rule="evenodd" stroke="none"/>
  </g>
</svg>
