<?xml version="1.0" encoding="UTF-8" standalone="no"?>
<svg xmlns:xlink="http://www.w3.org/1999/xlink" height="19.1px" width="15.85px" xmlns="http://www.w3.org/2000/svg">
  <g transform="matrix(1.0, 0.0, 0.0, 1.0, 7.7, 32.7)">
    <path d="M8.15 -26.6 L7.25 -27.65 Q6.0 -30.3 2.3 -30.65 0.2 -30.85 -1.6 -30.15 L-1.95 -30.0 Q-4.65 -30.15 -4.65 -26.85 L-4.65 -26.65 Q-6.5 -24.35 -6.5 -22.05 -6.5 -21.05 -5.6 -19.5 -4.35 -17.4 -2.15 -17.1 L-2.15 -17.05 Q-1.7 -15.95 0.05 -15.95 1.85 -15.95 2.95 -16.85 4.15 -17.15 5.1 -17.9 6.45 -18.15 7.35 -19.6 L7.2 -19.1 5.15 -16.0 2.4 -14.15 0.0 -13.6 -2.3 -14.05 Q-3.85 -14.65 -4.95 -15.7 -6.45 -17.2 -6.95 -18.75 -7.55 -19.9 -7.65 -20.8 L-7.6 -21.95 Q-8.65 -33.0 0.9 -32.7 7.35 -32.9 8.15 -26.6 M0.25 -25.35 Q-0.35 -24.35 -1.1 -24.35 -2.7 -24.35 -3.2 -25.25 L-3.4 -26.2 Q-3.4 -28.15 -1.3 -28.45 0.75 -28.8 0.75 -26.8 0.75 -26.2 0.25 -25.35" fill="#ffff00" fill-rule="evenodd" stroke="none"/>
  </g>
</svg>
