<?xml version="1.0" encoding="UTF-8" standalone="no"?>
<svg xmlns:xlink="http://www.w3.org/1999/xlink" height="18.2px" width="35.5px" xmlns="http://www.w3.org/2000/svg">
  <g transform="matrix(1.0, 0.0, 0.0, 1.0, 18.1, 8.85)">
    <path d="M-9.95 -0.05 L-6.6 -3.6 -5.3 -4.75 Q-1.9 -7.35 1.65 -8.25 L2.0 -8.4 2.05 -8.4 5.7 -8.85 5.95 -8.85 8.3 -8.5 10.8 -7.05 12.0 -5.85 11.2 -5.85 5.7 -5.2 Q3.8 -4.8 2.0 -4.05 -0.2 -3.2 -2.3 -1.9 L-6.8 1.4 Q-8.5 0.35 -9.95 -0.05" fill="#fff7f7" fill-rule="evenodd" stroke="none"/>
    <path d="M8.3 -8.5 Q10.5 -8.05 12.4 -6.85 15.35 -4.9 15.6 -2.15 L15.6 -1.5 13.85 -1.7 13.0 -1.6 Q11.45 -1.25 9.5 0.1 L5.7 0.2 2.0 0.6 0.85 0.85 Q-2.2 1.45 -3.65 3.0 L-4.5 2.65 -6.35 1.7 Q-6.55 1.5 -6.8 1.4 L-2.3 -1.9 Q-0.2 -3.2 2.0 -4.05 3.8 -4.8 5.7 -5.2 L11.2 -5.85 12.0 -5.85 10.8 -7.05 8.3 -8.5" fill="#f2eaea" fill-rule="evenodd" stroke="none"/>
    <path d="M-3.65 3.0 Q-2.2 1.45 0.85 0.85 L2.0 0.6 5.7 0.2 9.5 0.1 8.05 1.1 Q4.2 3.9 0.15 3.9 -1.6 3.9 -3.65 3.0" fill="#e0cdcd" fill-rule="evenodd" stroke="none"/>
    <path d="M15.6 -1.5 L15.75 -1.5 15.9 -1.4 Q17.25 -0.25 13.75 2.55 10.1 5.3 3.75 6.2 -2.55 6.95 -8.55 4.45 -14.4 1.85 -15.0 1.85 -16.95 1.85 -17.75 3.15 L-18.05 3.8 Q-18.15 3.05 -17.8 2.4 -17.5 1.7 -16.65 1.0 -14.85 -0.6 -12.7 -0.6 -11.4 -0.6 -9.95 -0.05 -8.5 0.35 -6.8 1.4 -6.55 1.5 -6.35 1.7 L-4.5 2.65 -3.65 3.0 Q-1.6 3.9 0.15 3.9 4.2 3.9 8.05 1.1 L9.5 0.1 Q11.45 -1.25 13.0 -1.6 L13.85 -1.7 15.6 -1.5" fill="#d2b6b6" fill-rule="evenodd" stroke="none"/>
    <path d="M15.9 -1.4 Q17.05 -1.2 17.15 -0.4 L17.15 -0.2 17.15 -0.15 Q17.2 0.4 17.35 0.3 L17.2 1.75 Q16.9 3.35 12.5 6.3 L11.15 7.1 Q7.05 9.35 1.85 9.35 -1.9 9.35 -6.0 7.1 L-6.15 7.05 -7.0 6.6 Q-11.55 3.9 -14.4 3.9 -15.6 3.9 -15.85 4.3 -16.2 4.55 -15.95 5.7 -15.8 6.4 -14.75 7.1 L-14.25 7.4 -15.15 7.1 Q-16.05 6.75 -16.7 6.05 L-17.45 5.25 -17.95 4.05 -18.05 3.8 -17.75 3.15 Q-16.95 1.85 -15.0 1.85 -14.4 1.85 -8.55 4.45 -2.55 6.95 3.75 6.2 10.1 5.3 13.75 2.55 17.25 -0.25 15.9 -1.4" fill="#c29c9c" fill-rule="evenodd" stroke="none"/>
    <path d="M-6.15 7.05 L-6.25 7.1 Q-8.2 8.05 -10.35 8.5 -12.25 8.5 -14.0 7.55 L-14.25 7.4 -14.75 7.1 Q-15.8 6.4 -15.95 5.7 -16.2 4.55 -15.85 4.3 -15.6 3.9 -14.4 3.9 -11.55 3.9 -7.0 6.6 L-6.15 7.05" fill="#b38484" fill-rule="evenodd" stroke="none"/>
    <path d="M-9.95 -0.05 L-6.6 -3.6 -5.3 -4.75 Q-1.9 -7.35 1.65 -8.25 L2.0 -8.4 2.05 -8.4 5.7 -8.85 5.95 -8.85 8.3 -8.5 Q10.5 -8.05 12.4 -6.85 15.35 -4.9 15.6 -2.15 L15.6 -1.5 15.75 -1.5 15.9 -1.4 Q17.05 -1.2 17.15 -0.4 L17.15 -0.2 17.15 -0.15 Q17.2 0.4 17.35 0.3 L17.2 1.75 Q16.9 3.35 12.5 6.3 L11.15 7.1 Q7.05 9.35 1.85 9.35 -1.9 9.35 -6.0 7.1 L-6.15 7.05 -6.25 7.1 Q-8.2 8.05 -10.35 8.5 -12.25 8.5 -14.0 7.55 L-14.25 7.4 -15.15 7.1 Q-16.05 6.75 -16.7 6.05 L-17.45 5.25 -17.95 4.05 -18.05 3.8 Q-18.15 3.05 -17.8 2.4 -17.5 1.7 -16.65 1.0 -14.85 -0.6 -12.7 -0.6 -11.4 -0.6 -9.95 -0.05 -8.5 0.35 -6.8 1.4 M9.5 0.1 Q11.45 -1.25 13.0 -1.6 L13.85 -1.7 15.6 -1.5 M9.5 0.1 L8.05 1.1 Q4.2 3.9 0.15 3.9 -1.6 3.9 -3.65 3.0 L-4.5 2.65 -6.35 1.7 Q-6.55 1.5 -6.8 1.4 M-14.25 7.4 L-14.75 7.1 Q-15.8 6.4 -15.95 5.7 -16.2 4.55 -15.85 4.3 -15.6 3.9 -14.4 3.9 -11.55 3.9 -7.0 6.6 L-6.15 7.05" fill="none" stroke="#a36a6a" stroke-linecap="round" stroke-linejoin="round" stroke-opacity="0.4" stroke-width="0.05"/>
  </g>
</svg>
