<?xml version="1.0" encoding="UTF-8" standalone="no"?>
<svg xmlns:xlink="http://www.w3.org/1999/xlink" height="9.75px" width="6.2px" xmlns="http://www.w3.org/2000/svg">
  <g transform="matrix(1.0, 0.0, 0.0, 1.0, 3.1, 5.1)">
    <path d="M-1.7 2.05 Q-1.7 3.15 -1.2 3.9 -0.65 4.65 0.05 4.65 0.75 4.65 1.25 3.9 1.8 3.15 1.8 2.05 1.8 0.95 1.25 0.2 0.75 -0.55 0.05 -0.55 -0.65 -0.55 -1.2 0.2 -1.7 0.95 -1.7 2.05" fill="#ffff00" fill-rule="evenodd" stroke="none">
      <animate attributeName="fill" dur="2s" repeatCount="indefinite" values="#ffff00;#ffff01"/>
      <animate attributeName="fill-opacity" dur="2s" repeatCount="indefinite" values="1.0;1.0"/>
      <animate attributeName="d" dur="2s" repeatCount="indefinite" values="M-1.7 2.05 Q-1.7 3.15 -1.2 3.9 -0.65 4.65 0.05 4.65 0.75 4.65 1.25 3.9 1.8 3.15 1.8 2.05 1.8 0.95 1.25 0.2 0.75 -0.55 0.05 -0.55 -0.65 -0.55 -1.2 0.2 -1.7 0.95 -1.7 2.05;M-2.95 0.1 Q-2.15 2.65 0.05 2.75 2.15 2.65 2.9 0.1 3.35 -1.65 2.65 -3.2 2.15 -4.2 1.35 -4.65 0.65 -5.2 0.05 -5.1 -0.7 -5.2 -1.35 -4.65 -2.2 -4.2 -2.6 -3.2 -3.35 -1.65 -2.95 0.1"/>
    </path>
    <path d="M-1.7 2.05 Q-1.7 0.95 -1.2 0.2 -0.65 -0.55 0.05 -0.55 0.75 -0.55 1.25 0.2 1.8 0.95 1.8 2.05 1.8 3.15 1.25 3.9 0.75 4.65 0.05 4.65 -0.65 4.65 -1.2 3.9 -1.7 3.15 -1.7 2.05" fill="none" stroke="#000000" stroke-linecap="round" stroke-linejoin="round" stroke-opacity="0.0" stroke-width="1.0">
      <animate attributeName="stroke" dur="2s" repeatCount="indefinite" values="#000000;#000001"/>
      <animate attributeName="stroke-width" dur="2s" repeatCount="indefinite" values="0.0;0.0"/>
      <animate attributeName="fill-opacity" dur="2s" repeatCount="indefinite" values="0.0;0.0"/>
      <animate attributeName="d" dur="2s" repeatCount="indefinite" values="M-1.7 2.05 Q-1.7 0.95 -1.2 0.2 -0.65 -0.55 0.05 -0.55 0.75 -0.55 1.25 0.2 1.8 0.95 1.8 2.05 1.8 3.15 1.25 3.9 0.75 4.65 0.05 4.65 -0.65 4.65 -1.2 3.9 -1.7 3.15 -1.7 2.05;M-2.95 0.1 Q-3.35 -1.65 -2.6 -3.2 -2.2 -4.2 -1.35 -4.65 -0.7 -5.2 0.05 -5.1 0.65 -5.2 1.35 -4.65 2.15 -4.2 2.65 -3.2 3.35 -1.65 2.9 0.1 2.15 2.65 0.05 2.75 -2.15 2.65 -2.95 0.1"/>
    </path>
  </g>
</svg>
