<?xml version="1.0" encoding="UTF-8" standalone="no"?>
<svg xmlns:xlink="http://www.w3.org/1999/xlink" height="87.8px" width="82.6px" xmlns="http://www.w3.org/2000/svg">
  <g transform="matrix(1.0, 0.0, 0.0, 1.0, 41.3, 43.9)">
    <path d="M-40.1 -23.9 L-36.35 -28.35 -36.25 -28.25 -36.1 -28.15 Q-33.9 -30.7 -27.15 -35.3 -16.45 -42.55 -9.95 -43.4 0.9 -44.85 16.2 -42.05 26.5 -40.2 30.2 -37.7 32.4 -38.5 34.5 -36.95 L36.25 -35.2 Q39.95 -36.8 39.95 -31.8 39.95 -30.65 39.55 -29.75 L39.8 -29.95 Q36.3 -24.5 30.65 -18.7 L28.75 -16.8 26.9 -15.1 Q19.4 -8.25 11.65 -3.85 3.9 0.55 -0.75 0.55 -8.0 0.55 -21.75 -9.05 L-24.4 -11.0 -29.9 -15.25 Q-35.4 -19.65 -40.1 -23.9 M-32.2 -24.9 L-32.45 -25.2 -32.5 -25.15 -32.2 -24.9 M3.4 -23.55 L3.35 -23.2 3.65 -23.5 3.4 -23.55" fill="#2f411d" fill-rule="evenodd" stroke="none"/>
    <path d="M14.3 41.25 Q10.25 43.9 7.45 43.9 L2.95 43.6 Q-4.8 42.45 -10.0 37.2 -12.0 35.2 -13.75 32.45 L-14.7 30.9 -15.45 29.75 -18.6 27.45 -20.55 24.3 Q-25.45 16.5 -27.6 12.45 L-26.6 9.4 Q-25.25 4.4 -24.4 -11.0 L-21.75 -9.05 Q-22.6 -8.5 -22.6 -7.75 L-21.6 -5.85 -20.15 -3.25 -16.4 0.4 Q-12.7 4.05 -9.55 6.5 L-9.05 6.85 -13.55 9.5 Q-17.7 12.1 -14.1 16.1 -10.5 20.15 -9.7 22.35 L-8.55 25.3 -8.35 25.75 -6.85 28.65 -7.05 28.8 -6.05 30.9 Q-4.5 34.1 -3.25 35.4 -0.6 38.15 1.25 38.15 1.7 38.15 2.95 36.85 L7.75 30.9 9.7 28.25 13.9 22.35 Q17.0 17.75 17.25 16.55 L9.8 22.35 5.0 26.2 6.85 22.35 7.0 22.0 Q11.85 12.35 16.1 8.35 20.7 4.05 24.8 -5.9 L25.6 -7.9 27.9 -14.4 28.75 -16.8 30.65 -18.7 30.65 -9.3 Q29.95 -4.5 25.95 7.1 22.3 17.8 22.3 19.7 22.3 20.3 22.85 21.05 23.4 21.8 23.4 22.35 23.4 25.95 18.6 33.95 L14.3 41.25" fill="#4e6e31" fill-rule="evenodd" stroke="none"/>
    <path d="M-21.75 -9.05 Q-8.0 0.55 -0.75 0.55 3.9 0.55 11.65 -3.85 19.4 -8.25 26.9 -15.1 L28.75 -16.8 27.9 -14.4 24.65 -11.1 13.45 -0.05 12.25 0.6 1.1 6.5 -0.7 7.4 -2.0 6.5 Q-5.6 4.05 -11.0 0.8 L-21.6 -5.85 -22.6 -7.75 Q-22.6 -8.5 -21.75 -9.05" fill="#77a84b" fill-rule="evenodd" stroke="none"/>
    <path d="M27.9 -14.4 L25.6 -7.9 24.8 -5.9 Q20.7 4.05 16.1 8.35 11.85 12.35 7.0 22.0 L6.85 22.35 5.0 26.2 9.8 22.35 17.25 16.55 Q17.0 17.75 13.9 22.35 L9.7 28.25 7.75 30.9 2.95 36.85 Q1.7 38.15 1.25 38.15 -0.6 38.15 -3.25 35.4 -4.5 34.1 -6.05 30.9 L-7.05 28.8 -6.85 28.65 -8.35 25.75 -8.55 25.3 -9.7 22.35 Q-10.5 20.15 -14.1 16.1 -17.7 12.1 -13.55 9.5 L-9.05 6.85 -9.55 6.5 Q-12.7 4.05 -16.4 0.4 L-20.15 -3.25 -21.6 -5.85 -11.0 0.8 Q-5.6 4.05 -2.0 6.5 L-0.7 7.4 1.1 6.5 12.25 0.6 13.45 -0.05 24.65 -11.1 27.9 -14.4" fill="#63873d" fill-rule="evenodd" stroke="none"/>
    <path d="M39.8 -29.95 L40.65 -27.75 41.3 -25.35 35.45 -12.4 Q33.15 -7.5 31.75 -3.8 L29.7 2.9 Q29.15 5.6 29.15 8.2 29.15 10.7 31.05 14.25 L32.9 18.2 32.95 18.45 Q32.95 19.7 32.25 20.6 31.45 21.65 30.0 21.75 L29.9 22.35 Q29.15 26.45 25.6 30.9 L20.85 35.95 Q17.25 39.3 14.3 41.25 L18.6 33.95 Q23.4 25.95 23.4 22.35 23.4 21.8 22.85 21.05 22.3 20.3 22.3 19.7 22.3 17.8 25.95 7.1 29.95 -4.5 30.65 -9.3 L30.65 -18.7 Q36.3 -24.5 39.8 -29.95 M-18.6 27.45 L-26.35 22.35 -27.35 21.7 -28.75 20.75 -30.4 19.15 Q-32.1 17.2 -32.1 15.0 -32.1 13.3 -31.5 11.65 -30.95 10.05 -29.75 8.5 L-29.9 8.05 -29.9 8.0 -29.75 6.5 -29.05 3.2 -28.25 -0.6 -28.2 -1.8 Q-28.2 -4.75 -36.75 -15.65 L-41.3 -21.8 -40.1 -23.9 Q-35.4 -19.65 -29.9 -15.25 L-24.4 -11.0 Q-25.25 4.4 -26.6 9.4 L-27.6 12.45 Q-25.45 16.5 -20.55 24.3 L-18.6 27.45" fill="#3f5c29" fill-rule="evenodd" stroke="none"/>
  </g>
</svg>
