<?xml version="1.0" encoding="UTF-8" standalone="no"?>
<svg xmlns:xlink="http://www.w3.org/1999/xlink" height="235.25px" width="111.45px" xmlns="http://www.w3.org/2000/svg">
  <g transform="matrix(1.0, 0.0, 0.0, 1.0, 19.4, 87.75)">
    <path d="M-3.35 -44.8 L-3.45 -55.65 -3.45 -64.5 -3.45 -67.3 Q-1.0 -70.1 3.45 -73.0 5.3 -74.3 7.65 -75.6 L8.9 -76.3 Q13.0 -78.65 18.25 -81.05 L18.65 -81.2 19.3 -81.5 18.2 -80.65 17.8 -80.35 16.3 -79.05 Q15.0 -77.8 14.0 -76.3 L13.65 -75.9 13.4 -75.6 13.25 -75.35 12.35 -73.8 12.05 -73.2 11.95 -73.05 11.95 -73.0 11.5 -72.2 Q11.45 -72.6 6.3 -64.5 L3.2 -59.65 3.65 -55.65 Q4.25 -50.95 5.35 -45.95 L5.6 -44.95 6.7 -39.4 7.15 -37.7 7.3 -39.4 Q7.85 -43.3 8.95 -47.15 L9.05 -47.65 9.05 -47.4 8.6 -41.9 8.45 -39.4 8.1 -32.05 8.05 -31.45 8.05 -27.65 8.2 -21.2 8.45 -18.8 Q8.6 -16.4 8.9 -14.05 9.1 -11.75 9.45 -9.4 L9.55 -8.35 9.55 -8.25 9.75 -7.0 10.55 -1.85 11.75 4.85 Q12.15 7.05 12.85 9.4 L13.3 10.95 13.9 13.0 14.45 14.6 15.15 16.4 16.05 18.85 16.25 19.25 16.45 19.8 Q16.1 22.9 16.1 26.6 L16.15 27.35 16.3 30.45 16.5 35.05 16.5 36.05 15.75 30.45 15.6 29.25 14.75 22.85 15.2 33.65 Q14.65 33.75 14.2 34.4 L13.25 35.75 12.9 30.45 12.5 26.35 12.55 22.35 12.55 16.5 12.15 16.5 Q10.9 18.2 10.8 20.05 L8.8 10.95 8.7 10.4 7.35 3.95 4.55 -29.85 Q4.7 -29.85 4.65 -30.85 L4.7 -31.1 4.2 -30.9 4.05 -30.9 3.8 -30.95 3.0 -39.4 2.95 -40.5 Q2.2 -48.75 2.6 -53.55 1.5 -52.15 0.55 -45.75 -0.1 -41.95 -0.2 -39.4 L-0.25 -37.15 -0.65 -37.15 -1.0 -39.4 -1.35 -42.35 Q-1.95 -46.8 -2.6 -48.35 L-3.35 -44.8 M47.8 -85.65 L47.8 -85.7 Q64.0 -82.85 68.1 -81.2 L72.35 -78.5 72.4 -76.3 72.45 -75.6 72.5 -73.0 72.6 -64.5 72.85 -55.65 72.9 -52.8 72.25 -54.25 68.95 -61.8 68.8 -61.45 68.6 -61.4 68.45 -54.65 Q68.1 -49.95 67.6 -47.55 L66.85 -52.65 66.05 -57.35 65.75 -51.55 65.7 -47.25 Q65.75 -44.45 66.65 -39.4 L66.8 -38.65 67.75 -33.65 67.65 -33.65 67.45 -33.65 67.65 -33.6 70.1 -3.9 70.1 -3.6 69.1 1.55 68.75 1.25 68.55 0.2 68.3 -0.95 67.9 -0.95 67.2 2.45 Q66.75 4.45 66.4 4.8 66.4 4.45 65.95 4.45 65.05 0.65 64.35 -5.45 L64.35 -5.75 64.15 -10.4 63.9 -15.95 64.6 -16.1 64.4 -18.85 63.9 -19.25 63.75 -19.35 63.3 -30.6 63.45 -30.6 63.3 -30.65 63.15 -31.95 63.15 -32.45 63.25 -32.3 64.85 -30.95 64.75 -32.85 64.65 -36.5 Q64.6 -37.45 64.7 -38.3 L64.65 -39.4 64.7 -40.25 64.35 -42.15 64.05 -43.5 64.2 -45.35 64.35 -48.85 64.3 -52.3 63.85 -55.65 63.0 -60.5 61.95 -64.4 61.9 -64.5 Q60.45 -69.4 59.65 -73.0 L59.1 -75.6 58.9 -76.3 58.8 -77.25 Q51.45 -84.15 47.8 -85.65 M19.2 -67.3 L19.35 -67.45 Q20.75 -69.3 22.3 -70.65 23.6 -71.95 25.05 -73.0 L29.05 -75.6 30.55 -76.3 Q34.85 -78.1 39.55 -78.1 42.9 -78.1 45.95 -76.3 L47.2 -75.6 50.15 -73.0 Q53.25 -69.75 56.1 -64.5 L58.0 -60.7 56.1 -63.55 52.2 -68.5 49.9 -70.35 46.9 -72.0 43.6 -73.8 Q41.4 -74.7 39.2 -74.7 L37.05 -74.35 33.55 -67.6 34.8 -74.3 34.65 -74.3 31.55 -71.0 32.6 -73.25 33.35 -74.75 Q23.8 -71.0 18.05 -64.15 15.4 -61.0 11.05 -53.2 L12.1 -55.65 13.9 -59.2 15.25 -61.6 15.6 -62.25 17.1 -64.5 19.2 -67.3 M65.15 14.45 L66.1 17.95 Q66.05 16.15 66.65 13.45 L67.25 10.95 67.65 9.4 67.6 9.0 68.05 10.95 Q68.85 14.25 70.45 17.7 L72.2 21.6 72.45 24.05 72.6 25.9 72.45 35.85 71.85 33.05 71.55 33.05 71.55 33.7 71.65 35.5 71.8 36.4 71.85 37.4 70.55 37.4 69.1 37.4 68.15 26.7 67.75 30.45 67.7 32.75 67.5 37.9 67.4 40.75 66.15 40.4 65.15 14.45 M9.0 24.25 L9.15 24.85 9.6 28.3 Q10.25 27.55 10.55 26.15 L10.95 24.3 11.2 30.45 11.5 34.3 Q11.85 38.35 12.55 41.8 L13.25 45.0 15.2 41.8 15.2 41.75 15.5 41.2 16.0 53.05 11.45 53.05 9.0 24.25" fill="#4b3d3d" fill-rule="evenodd" stroke="none"/>
    <path d="M77.9 -33.8 Q81.95 -32.2 86.05 -27.45 L87.35 -25.75 Q88.1 -23.4 88.2 -21.2 88.4 -17.35 87.8 -13.35 L85.35 -14.6 81.5 -16.1 82.2 -22.8 Q82.85 -29.1 80.6 -31.1 L77.9 -33.8 M-4.35 -31.55 L-3.65 -31.55 -3.3 -31.55 -0.4 -31.45 1.8 -31.15 Q-2.1 -30.3 -5.0 -24.8 L-4.9 -24.7 Q-5.95 -23.0 -6.65 -21.0 L-6.75 -21.0 -7.9 -17.35 Q-12.3 -17.3 -15.1 -16.35 L-14.9 -18.0 Q-14.25 -20.4 -11.75 -24.65 -10.15 -27.2 -7.6 -29.45 -6.0 -30.75 -4.4 -31.55 L-4.4 -31.5 -4.35 -31.55 M12.05 -73.2 L12.35 -73.8 13.25 -75.35 13.4 -75.6 13.65 -75.9 14.0 -76.3 Q15.0 -77.8 16.3 -79.05 L16.45 -76.3 16.45 -75.6 16.5 -73.0 16.45 -71.5 Q16.45 -70.6 16.7 -69.85 L16.3 -69.45 Q13.15 -65.75 10.9 -61.65 L10.6 -61.8 Q10.55 -62.6 11.2 -64.5 L11.5 -65.3 Q12.45 -67.85 12.35 -69.4 L12.05 -73.0 12.05 -73.2" fill="#ffd066" fill-rule="evenodd" stroke="none"/>
    <path d="M19.3 -81.5 L20.4 -81.95 21.7 -83.05 Q28.3 -86.95 35.05 -87.55 L36.8 -87.75 37.8 -87.75 Q42.65 -87.75 47.4 -85.75 L47.8 -85.65 Q51.45 -84.15 58.8 -77.25 L58.9 -76.3 59.1 -75.6 59.65 -73.0 Q60.45 -69.4 61.9 -64.5 L61.95 -64.4 63.0 -60.5 Q61.35 -62.4 59.8 -65.45 56.5 -71.85 55.05 -72.95 L48.55 -77.85 Q43.2 -81.2 39.8 -81.2 26.55 -81.2 16.7 -69.85 16.45 -70.6 16.45 -71.5 L16.5 -73.0 16.45 -75.6 16.45 -76.3 16.3 -79.05 17.8 -80.35 18.2 -80.65 19.3 -81.5 M73.35 -34.7 L73.7 -34.7 Q75.8 -34.7 77.9 -33.8 L80.6 -31.1 Q82.85 -29.1 82.2 -22.8 L81.5 -16.1 Q77.65 -17.25 73.5 -17.35 L68.55 -33.9 70.3 -34.4 73.35 -34.7 M87.35 -25.75 Q91.55 -20.1 92.0 -15.35 92.2 -12.3 91.85 -9.55 90.35 -11.7 87.8 -13.35 88.4 -17.35 88.2 -21.2 88.1 -23.4 87.35 -25.75 M-19.4 -13.25 Q-19.5 -15.45 -18.65 -17.95 L-18.25 -19.05 Q-17.2 -21.65 -15.25 -24.4 -10.45 -31.1 -4.4 -31.55 -6.0 -30.75 -7.6 -29.45 -10.15 -27.2 -11.75 -24.65 -14.25 -20.4 -14.9 -18.0 L-15.1 -16.35 Q-18.35 -15.4 -19.4 -13.25 M5.35 -45.95 Q4.25 -50.95 3.65 -55.65 L3.2 -59.65 6.3 -64.5 Q11.45 -72.6 11.5 -72.2 L11.95 -73.0 11.95 -73.05 12.05 -73.0 12.35 -69.4 Q12.45 -67.85 11.5 -65.3 L11.2 -64.5 Q10.55 -62.6 10.6 -61.8 L10.7 -61.35 Q6.85 -54.2 5.65 -45.85 L5.35 -45.95 M-7.9 -17.35 L-6.75 -21.0 -6.65 -21.0 Q-5.95 -23.0 -4.9 -24.7 L-5.0 -24.8 Q-2.1 -30.3 1.8 -31.15 L2.95 -31.0 2.65 -16.55 0.4 -16.8 -7.3 -17.35 -7.9 -17.35" fill="#1f1f2b" fill-rule="evenodd" stroke="none"/>
    <path d="M91.85 -9.55 L91.75 -8.35 Q90.4 -0.85 84.85 5.15 81.6 8.6 77.9 10.65 81.75 6.15 84.5 -1.15 85.9 -4.85 86.8 -8.35 L87.8 -13.35 Q90.35 -11.7 91.85 -9.55 M87.3 139.9 L90.5 147.5 89.15 147.5 87.3 139.9 M71.9 147.5 L13.65 147.5 13.95 145.4 15.15 136.65 13.5 135.4 Q10.75 133.35 9.25 127.3 8.7 124.8 8.65 122.45 8.55 120.55 8.8 118.65 L8.85 118.35 Q9.4 114.75 11.15 111.35 L12.75 108.0 12.85 107.85 14.1 104.2 13.85 103.5 11.55 96.35 9.4 89.3 10.3 88.45 11.95 86.85 12.9 85.85 14.5 84.4 17.75 80.85 Q21.0 77.0 23.8 72.6 L25.5 69.55 Q27.8 65.25 29.65 60.5 L30.35 58.65 30.65 57.6 31.25 58.65 31.6 59.3 32.3 60.5 32.9 61.4 33.3 62.25 Q32.8 63.15 32.85 64.05 32.95 64.95 36.15 69.05 L36.45 69.55 Q39.3 73.65 39.55 79.75 39.7 83.0 39.05 86.85 L38.75 88.45 37.1 94.7 Q34.45 103.25 34.55 106.2 L34.75 107.5 Q35.0 108.65 35.6 109.4 36.65 110.85 38.15 110.85 39.6 110.85 41.35 109.75 42.9 108.65 43.95 108.65 45.2 108.65 46.6 109.65 47.95 110.55 48.65 110.55 49.95 110.55 50.6 109.85 51.3 109.05 51.25 107.45 L50.4 105.05 50.1 104.35 49.95 103.9 49.4 102.65 Q45.75 96.5 44.45 90.55 L44.1 88.45 43.8 86.85 42.65 80.55 Q43.0 73.85 44.7 69.55 L45.35 68.15 46.4 67.0 48.25 64.05 Q48.5 63.55 48.4 61.5 48.4 61.0 47.75 60.55 L47.8 60.5 48.6 59.6 49.3 58.65 50.55 56.85 50.55 56.7 50.7 56.5 51.35 55.55 51.5 55.35 51.55 55.55 51.5 55.85 51.9 56.65 52.2 58.15 52.4 58.65 53.0 60.5 Q54.6 65.05 56.85 69.55 L58.6 72.95 59.5 73.9 59.75 74.25 Q62.85 78.0 64.4 79.3 L69.9 83.8 70.85 84.6 71.3 85.0 70.9 86.85 70.55 88.45 70.4 89.25 69.45 94.6 68.1 103.6 69.45 106.9 71.85 111.35 Q73.95 114.9 74.8 118.65 75.75 122.85 75.05 127.3 74.05 133.35 71.5 135.4 L70.05 136.55 70.25 138.65 70.45 140.2 70.5 140.75 70.65 141.05 71.9 147.5 M-10.95 1.95 Q-15.65 -1.9 -17.7 -6.2 L-18.05 -7.0 Q-19.15 -9.55 -19.35 -12.2 L-19.4 -13.25 Q-18.35 -15.4 -15.1 -16.35 -15.3 -14.5 -15.15 -11.35 L-14.85 -7.0 -14.8 -6.45 Q-14.4 -4.55 -13.15 -1.65 L-12.4 -0.25 -12.15 -0.25 -11.6 0.85 -10.95 1.95 M-4.4 -31.55 L-4.35 -31.55 -4.4 -31.5 -4.4 -31.55 M3.8 -30.95 L4.05 -30.9 4.2 -30.9 4.65 -30.85 Q4.7 -29.85 4.55 -29.85 L7.35 3.95 7.75 9.1 4.95 8.85 4.75 8.8 2.0 8.25 0.9 8.0 -0.75 7.5 -0.9 7.3 -2.2 6.55 -2.3 6.5 -2.75 6.3 -4.8 4.9 Q-5.9 4.0 -6.4 2.9 L-6.95 1.7 -7.75 -0.25 -8.35 -1.9 Q-9.2 -4.45 -9.3 -7.0 L-9.35 -7.05 Q-9.55 -12.0 -7.9 -17.35 L-7.3 -17.35 0.4 -16.8 2.65 -16.55 2.95 -31.0 3.8 -30.95 M9.05 -47.65 L8.95 -47.15 Q7.85 -43.3 7.3 -39.4 L7.15 -37.7 6.7 -39.4 5.6 -44.95 5.35 -45.95 5.65 -45.85 Q6.85 -54.2 10.7 -61.35 11.05 -60.65 12.45 -59.9 L13.9 -59.2 12.1 -55.65 11.05 -53.2 10.05 -50.5 9.8 -49.8 9.05 -47.65 M11.95 -73.05 L12.05 -73.2 12.05 -73.0 11.95 -73.05 M16.7 -69.85 Q26.55 -81.2 39.8 -81.2 43.2 -81.2 48.55 -77.85 L55.05 -72.95 Q56.5 -71.85 59.8 -65.45 61.35 -62.4 63.0 -60.5 L63.85 -55.65 64.3 -52.3 64.35 -48.85 64.2 -45.35 64.05 -43.5 62.6 -48.85 60.65 -54.4 60.1 -55.65 59.55 -57.2 59.45 -57.4 58.25 -60.1 58.0 -60.7 56.1 -64.5 Q53.25 -69.75 50.15 -73.0 L47.2 -75.6 45.95 -76.3 Q42.9 -78.1 39.55 -78.1 34.85 -78.1 30.55 -76.3 L29.05 -75.6 25.05 -73.0 Q23.6 -71.95 22.3 -70.65 20.75 -69.3 19.35 -67.45 L19.2 -67.3 Q17.2 -67.85 16.7 -69.85 M67.65 -33.65 L67.75 -33.65 68.55 -33.9 73.5 -17.35 Q77.65 -17.25 81.5 -16.1 L81.25 -13.75 Q81.1 -11.9 79.9 -8.35 L78.35 -4.4 Q76.25 0.7 71.1 7.7 L70.15 -3.6 70.1 -3.9 67.65 -33.6 67.65 -33.65 M61.5 8.35 L62.3 5.0 63.5 -0.4 64.35 -5.15 64.95 10.45 64.65 10.3 Q63.3 9.7 61.5 8.35 M52.9 29.25 L52.9 30.45 52.9 30.5 53.45 30.85 Q54.4 31.45 54.95 32.75 L55.1 32.75 56.05 33.95 57.75 36.15 58.15 37.0 58.65 39.45 58.45 41.1 Q57.9 43.2 55.65 45.3 L55.65 45.35 55.4 45.6 Q53.95 46.9 53.1 47.75 L51.85 49.2 Q51.8 51.75 51.05 53.9 L50.9 54.35 50.5 55.55 49.95 56.6 48.55 58.6 48.5 58.65 47.25 60.05 46.8 59.75 Q45.55 59.75 44.4 60.5 L44.15 60.75 44.2 60.5 44.55 58.65 44.55 58.6 46.05 55.55 47.75 52.3 48.25 51.3 49.95 48.3 48.15 49.2 45.95 50.4 Q41.05 53.05 36.5 53.05 L35.3 52.9 35.7 55.55 36.15 58.65 36.4 60.5 36.55 61.3 36.35 61.25 35.6 61.0 Q34.75 61.0 34.2 61.3 L33.8 60.5 33.1 58.65 32.95 58.4 32.25 55.55 31.85 53.85 Q31.75 53.6 31.8 53.35 L31.4 52.85 31.25 52.65 30.1 51.9 29.45 51.55 Q28.8 51.05 28.0 50.7 L27.55 50.55 Q23.7 49.0 23.7 48.35 23.6 46.0 25.1 43.4 L26.95 41.1 27.55 40.4 29.85 37.95 29.85 38.1 29.9 38.1 31.45 41.1 31.45 41.15 31.9 42.6 32.0 43.05 32.65 43.9 Q34.95 47.0 40.1 47.0 43.45 47.0 46.3 44.5 L47.9 42.8 48.7 41.15 48.75 41.1 Q49.0 40.1 48.9 39.1 L49.1 37.0 49.4 33.55 49.55 33.35 52.9 29.25 M7.0 104.9 L6.75 105.1 6.6 104.9 7.0 104.9" fill="#13131a" fill-rule="evenodd" stroke="none"/>
    <path d="M77.9 10.65 L77.35 10.95 75.35 11.85 74.25 12.25 74.15 12.3 71.6 12.85 71.5 12.85 71.1 7.7 Q76.25 0.7 78.35 -4.4 L79.9 -8.35 Q81.1 -11.9 81.25 -13.75 L81.5 -16.1 85.35 -14.6 87.8 -13.35 86.8 -8.35 Q85.9 -4.85 84.5 -1.15 81.75 6.15 77.9 10.65 M4.9 96.05 L2.95 93.2 3.4 92.8 5.9 90.35 6.8 89.45 7.9 88.45 8.9 87.55 9.15 88.45 9.4 89.3 11.55 96.35 13.85 103.5 14.1 104.2 12.85 107.85 11.6 106.05 4.9 96.05 M-2.3 6.95 Q-5.85 5.45 -9.0 3.4 L-10.05 2.6 -10.45 2.3 -10.95 1.95 -11.6 0.85 -12.15 -0.25 -12.4 -0.25 -13.15 -1.65 Q-14.4 -4.55 -14.8 -6.45 L-14.85 -7.0 -15.15 -11.35 Q-15.3 -14.5 -15.1 -16.35 -12.3 -17.3 -7.9 -17.35 -9.55 -12.0 -9.35 -7.05 L-9.3 -7.0 Q-9.2 -4.45 -8.35 -1.9 L-7.75 -0.25 -6.95 1.7 -6.4 2.9 Q-5.9 4.0 -4.8 4.9 L-2.75 6.3 -2.3 6.5 -2.2 6.55 -0.9 7.3 -0.75 7.5 -2.1 7.0 -2.15 7.0 -2.3 6.95 M19.2 -67.3 L17.1 -64.5 15.6 -62.25 15.25 -61.6 13.9 -59.2 12.45 -59.9 Q11.05 -60.65 10.7 -61.35 L10.6 -61.8 10.9 -61.65 Q13.15 -65.75 16.3 -69.45 L16.7 -69.85 Q17.2 -67.85 19.2 -67.3 M71.95 82.5 L72.2 82.9 74.15 86.85 74.5 87.8 74.8 88.45 76.6 93.1 75.0 96.2 69.45 106.9 68.1 103.6 69.45 94.6 70.4 89.25 70.55 88.45 70.9 86.85 71.3 85.0 71.95 82.5 M53.1 47.75 Q53.65 48.9 53.6 49.45 53.7 51.4 51.5 55.35 L51.35 55.55 50.7 56.5 50.55 56.7 50.55 56.85 49.3 58.65 48.6 59.6 47.8 60.5 47.75 60.55 46.8 61.65 46.55 61.9 46.35 62.35 46.3 62.95 45.3 62.95 45.3 62.05 46.85 60.5 47.25 60.05 48.5 58.65 48.55 58.6 49.95 56.6 50.5 55.55 50.9 54.35 51.05 53.9 Q51.8 51.75 51.85 49.2 L53.1 47.75 M30.1 51.9 L31.25 52.65 31.4 52.85 31.8 53.35 Q31.75 53.6 31.85 53.85 L32.25 55.55 32.95 58.4 33.1 58.65 33.8 60.5 34.2 61.3 Q34.95 62.95 36.35 64.75 L37.15 65.4 37.3 65.5 Q38.15 67.0 38.2 68.4 L36.55 66.7 33.3 62.25 32.9 61.4 32.3 60.5 31.6 59.3 31.25 58.65 30.65 57.6 30.0 55.55 29.7 54.05 Q29.7 53.0 30.1 51.9" fill="#e1b859" fill-rule="evenodd" stroke="none"/>
    <path d="M7.35 3.95 L8.7 10.4 8.8 10.95 10.8 20.05 Q10.9 18.2 12.15 16.5 L12.55 16.5 12.55 22.35 12.5 26.35 12.9 30.45 13.25 35.75 14.2 34.4 Q14.65 33.75 15.2 33.65 L15.5 41.2 15.2 41.75 15.2 41.8 13.25 45.0 12.55 41.8 Q11.85 38.35 11.5 34.3 L11.2 30.45 10.95 24.3 10.55 26.15 Q10.25 27.55 9.6 28.3 L9.15 24.85 9.0 24.25 7.75 9.1 7.35 3.95 M8.1 -32.05 L8.45 -39.4 8.6 -41.9 9.05 -47.4 9.05 -47.65 9.8 -49.8 10.05 -50.5 11.05 -53.2 Q15.4 -61.0 18.05 -64.15 23.8 -71.0 33.35 -74.75 L32.6 -73.25 31.55 -71.0 34.65 -74.3 34.8 -74.3 33.55 -67.6 37.05 -74.35 39.2 -74.7 Q41.4 -74.7 43.6 -73.8 L46.9 -72.0 49.9 -70.35 52.2 -68.5 56.1 -63.55 58.0 -60.7 58.25 -60.1 59.45 -57.4 58.9 -57.5 55.55 -58.05 52.95 -57.35 Q52.25 -57.85 51.8 -59.7 L51.2 -62.15 50.8 -62.15 Q51.0 -61.75 50.55 -60.45 L49.85 -58.75 45.9 -65.3 Q43.2 -70.0 41.6 -71.45 39.9 -65.9 40.0 -63.3 L35.75 -62.65 Q33.35 -62.3 33.55 -59.9 33.15 -61.05 33.0 -62.9 32.1 -61.8 28.8 -61.35 L24.7 -60.7 24.4 -68.15 19.9 -60.3 14.95 -52.8 14.9 -53.2 Q15.25 -54.2 15.8 -57.55 12.1 -52.3 9.75 -48.5 9.45 -46.35 9.5 -45.35 L9.6 -43.15 11.1 -45.65 13.2 -48.7 13.15 -49.1 Q13.4 -48.2 12.85 -45.5 L12.3 -42.75 12.3 -42.0 17.55 -50.85 Q22.35 -59.2 22.75 -60.7 L23.15 -60.7 23.1 -55.6 23.1 -51.7 23.15 -50.6 24.4 -56.0 Q25.9 -60.35 28.55 -60.25 L31.25 -60.25 32.95 -47.2 33.35 -47.2 Q33.75 -56.15 34.45 -57.95 36.05 -61.8 42.05 -60.25 41.95 -61.55 42.65 -63.6 L43.65 -67.0 45.55 -59.75 Q47.0 -54.3 47.8 -52.1 L48.15 -52.1 Q48.1 -52.95 48.75 -54.85 49.5 -56.75 49.4 -58.05 L51.15 -54.3 52.85 -50.2 53.25 -50.2 53.6 -52.75 54.15 -55.85 Q55.05 -55.05 58.75 -54.65 L60.65 -54.4 62.6 -48.85 64.05 -43.5 64.35 -42.15 64.7 -40.25 64.65 -39.4 64.7 -38.3 Q64.6 -37.45 64.65 -36.5 L64.75 -32.85 64.85 -30.95 63.25 -32.3 63.15 -32.45 61.4 -34.85 60.5 -37.2 60.0 -39.4 59.95 -39.65 59.6 -41.15 59.35 -41.85 59.05 -43.65 58.9 -44.15 58.9 -43.6 58.8 -39.4 58.6 -35.05 57.6 -39.4 57.15 -40.95 57.0 -40.8 56.75 -39.4 Q56.4 -37.0 56.35 -35.35 L56.35 -34.1 56.1 -34.3 55.0 -34.75 54.35 -35.0 52.95 -35.3 52.9 -35.5 52.5 -38.85 52.4 -39.4 50.85 -48.85 50.6 -48.4 50.85 -42.65 51.0 -40.25 51.0 -39.4 Q51.15 -37.25 51.4 -36.1 L49.8 -36.9 49.4 -37.1 Q47.8 -37.8 46.95 -37.7 L47.05 -39.4 47.1 -41.0 46.05 -48.85 45.95 -49.55 44.8 -55.65 Q43.95 -60.5 43.7 -63.5 L43.1 -55.65 42.9 -53.4 42.7 -48.85 42.5 -42.7 41.35 -56.75 41.2 -55.65 40.6 -49.65 40.5 -48.85 Q39.8 -43.05 38.5 -39.4 L38.45 -39.2 38.4 -39.25 38.35 -39.4 38.9 -48.85 39.25 -55.65 39.5 -60.05 38.95 -55.65 38.25 -50.2 38.1 -48.85 37.4 -41.2 37.35 -39.4 37.4 -37.85 35.2 -38.2 33.7 -38.05 33.55 -38.0 32.3 -37.7 30.65 -37.35 29.05 -56.75 28.55 -56.75 28.3 -55.65 26.25 -48.85 25.75 -47.4 24.25 -42.85 23.85 -41.55 23.1 -39.4 22.7 -37.85 22.55 -39.55 23.0 -42.55 23.55 -47.25 20.45 -40.2 20.05 -39.4 18.85 -36.6 18.8 -36.7 19.0 -39.4 19.45 -43.05 19.5 -44.65 19.6 -45.15 19.8 -50.6 19.55 -51.65 14.45 -36.15 13.95 -35.85 12.95 -35.3 Q10.1 -33.6 8.1 -32.05 M64.35 -5.45 Q65.05 0.65 65.95 4.45 66.4 4.45 66.4 4.8 66.75 4.45 67.2 2.45 L67.9 -0.95 68.3 -0.95 68.55 0.2 68.75 1.25 69.1 1.55 70.1 -3.6 70.15 -3.6 71.1 7.7 71.5 12.85 72.2 21.6 70.45 17.7 Q68.85 14.25 68.05 10.95 L67.6 9.0 67.65 9.4 67.25 10.95 66.65 13.45 Q66.05 16.15 66.1 17.95 L65.15 14.45 64.95 10.45 64.35 -5.15 64.3 -5.45 64.35 -5.45" fill="#5e4949" fill-rule="evenodd" stroke="none"/>
    <path d="M59.45 -57.4 L59.55 -57.2 60.1 -55.65 60.65 -54.4 58.75 -54.65 Q55.05 -55.05 54.15 -55.85 L53.6 -52.75 53.25 -50.2 52.85 -50.2 51.15 -54.3 49.4 -58.05 Q49.5 -56.75 48.75 -54.85 48.1 -52.95 48.15 -52.1 L47.8 -52.1 Q47.0 -54.3 45.55 -59.75 L43.65 -67.0 42.65 -63.6 Q41.95 -61.55 42.05 -60.25 36.05 -61.8 34.45 -57.95 33.75 -56.15 33.35 -47.2 L32.95 -47.2 31.25 -60.25 28.55 -60.25 Q25.9 -60.35 24.4 -56.0 L23.15 -50.6 23.1 -51.7 23.1 -55.6 23.15 -60.7 22.75 -60.7 Q22.35 -59.2 17.55 -50.85 L12.3 -42.0 12.3 -42.75 12.85 -45.5 Q13.4 -48.2 13.15 -49.1 L13.2 -48.7 11.1 -45.65 9.6 -43.15 9.5 -45.35 Q9.45 -46.35 9.75 -48.5 12.1 -52.3 15.8 -57.55 15.25 -54.2 14.9 -53.2 L14.95 -52.8 19.9 -60.3 24.4 -68.15 24.7 -60.7 28.8 -61.35 Q32.1 -61.8 33.0 -62.9 33.15 -61.05 33.55 -59.9 33.35 -62.3 35.75 -62.65 L40.0 -63.3 Q39.9 -65.9 41.6 -71.45 43.2 -70.0 45.9 -65.3 L49.85 -58.75 50.55 -60.45 Q51.0 -61.75 50.8 -62.15 L51.2 -62.15 51.8 -59.7 Q52.25 -57.85 52.95 -57.35 L55.55 -58.05 58.9 -57.5 59.45 -57.4 M64.35 -5.75 L64.35 -5.45 64.3 -5.45 64.35 -5.75 M70.1 -3.6 L70.1 -3.9 70.15 -3.6 70.1 -3.6" fill="#755b5b" fill-rule="evenodd" stroke="none"/>
    <path d="M8.2 -21.2 L8.05 -27.65 8.05 -31.45 8.1 -32.05 Q10.1 -33.6 12.95 -35.3 L13.95 -35.85 14.45 -36.15 19.55 -51.65 19.8 -50.6 19.6 -45.15 16.95 -39.4 15.4 -35.65 15.25 -35.5 15.0 -35.3 13.0 -34.1 Q8.7 -31.7 8.7 -31.35 L9.1 -29.85 Q9.5 -28.75 9.35 -28.3 L10.95 -28.3 12.65 -28.75 13.9 -29.05 15.0 -29.05 Q11.2 -26.8 10.9 -25.6 10.6 -24.9 10.5 -23.0 L10.5 -22.7 8.2 -21.2 M20.45 -40.2 L23.55 -47.25 23.0 -42.55 22.05 -40.35 21.65 -39.4 Q20.65 -37.0 20.6 -36.2 L20.45 -39.4 20.45 -40.2 M23.85 -41.55 L24.25 -42.85 25.75 -47.4 26.25 -48.85 28.3 -55.65 28.55 -56.75 29.05 -56.75 30.65 -37.35 32.3 -37.7 33.55 -38.0 33.7 -38.05 35.2 -38.2 35.25 -34.95 33.95 -34.95 28.65 -34.75 28.5 -34.95 28.1 -45.6 Q28.45 -45.6 28.05 -45.95 L28.1 -45.75 24.9 -39.4 24.45 -38.35 23.25 -36.2 23.6 -39.4 23.85 -41.55 M37.4 -41.2 L38.1 -48.85 38.25 -50.2 38.95 -55.65 39.5 -60.05 39.25 -55.65 38.9 -48.85 38.35 -39.4 38.4 -39.25 38.45 -39.2 38.5 -39.4 Q39.8 -43.05 40.5 -48.85 L40.6 -49.65 41.2 -55.65 41.35 -56.75 42.5 -42.7 42.7 -48.85 42.9 -53.4 43.1 -55.65 43.7 -63.5 Q43.95 -60.5 44.8 -55.65 L45.95 -49.55 46.05 -48.85 47.1 -41.0 Q45.6 -41.55 45.25 -43.5 L44.7 -47.85 44.45 -47.85 43.35 -43.9 42.25 -40.55 41.5 -46.55 39.85 -42.0 38.85 -39.4 38.15 -37.65 38.1 -37.7 37.75 -39.4 37.4 -41.2 M49.4 -37.1 L49.8 -36.9 51.4 -36.1 Q51.15 -37.25 51.0 -39.4 L51.0 -40.25 50.85 -42.65 50.6 -48.4 50.85 -48.85 52.4 -39.4 52.5 -38.85 52.9 -35.5 52.95 -35.3 54.35 -35.0 54.25 -33.4 53.95 -33.4 51.0 -35.15 Q49.55 -35.9 49.4 -37.1 M55.0 -34.75 L56.1 -34.3 56.35 -34.1 56.35 -35.35 Q56.4 -37.0 56.75 -39.4 L57.0 -40.8 57.15 -40.95 57.6 -39.4 58.6 -35.05 58.8 -39.4 58.9 -43.6 59.05 -43.65 59.35 -41.85 59.6 -41.15 59.95 -39.65 60.0 -39.4 60.5 -37.2 61.4 -34.85 63.15 -32.45 63.15 -31.95 63.3 -30.65 63.45 -30.6 63.3 -30.6 63.75 -19.35 62.9 -20.1 62.8 -20.4 62.75 -22.1 Q62.6 -22.85 62.05 -23.4 L59.65 -26.25 61.25 -26.25 61.4 -27.7 61.65 -28.65 61.7 -31.55 61.7 -31.7 61.6 -33.5 61.5 -31.8 59.2 -33.8 59.1 -32.85 Q58.7 -32.95 58.6 -33.1 L58.25 -33.4 Q58.1 -32.75 57.3 -32.4 56.85 -32.85 55.55 -32.85 L55.0 -34.75 M19.5 18.95 L20.1 17.85 20.35 17.5 20.75 17.3 Q21.4 17.0 22.6 16.65 24.95 15.9 25.6 15.9 L25.2 16.15 24.9 16.3 22.2 17.95 20.45 18.85 19.5 18.95 M48.85 15.7 L49.55 15.55 Q52.9 16.05 54.05 16.95 L54.55 17.55 53.55 18.4 Q52.9 18.4 51.5 17.7 L50.2 17.1 50.05 16.85 48.85 15.7 M18.05 23.65 L20.3 26.3 20.65 26.65 23.35 29.3 24.4 30.45 27.25 33.2 29.65 34.8 Q32.55 36.5 36.0 36.85 L37.35 36.85 38.5 36.3 Q44.65 34.9 47.5 33.3 L47.8 33.05 50.15 31.35 51.1 30.45 53.0 28.3 55.55 24.5 53.05 29.1 52.9 29.25 49.55 33.35 49.4 33.55 48.15 34.55 47.65 35.05 43.7 37.45 42.5 37.9 Q39.8 38.9 36.9 38.85 34.0 38.85 31.45 37.9 L30.7 37.65 30.45 37.5 28.95 36.75 27.4 35.85 24.45 33.3 22.25 30.45 20.6 27.95 18.05 23.65" fill="#d8b59e" fill-rule="evenodd" stroke="none"/>
    <path d="M19.6 -45.15 L19.5 -44.65 19.45 -43.05 19.0 -39.4 18.8 -36.7 18.85 -36.6 20.05 -39.4 20.45 -40.2 20.45 -39.4 20.6 -36.2 Q20.65 -37.0 21.65 -39.4 L22.05 -40.35 23.0 -42.55 22.55 -39.55 22.7 -37.85 23.1 -39.4 23.85 -41.55 23.6 -39.4 23.25 -36.2 24.45 -38.35 24.9 -39.4 28.1 -45.75 28.05 -45.95 Q28.45 -45.6 28.1 -45.6 L28.5 -34.95 28.65 -34.75 33.95 -34.95 35.25 -34.95 35.2 -38.2 37.4 -37.85 37.35 -39.4 37.4 -41.2 37.75 -39.4 38.1 -37.7 38.15 -37.65 38.85 -39.4 39.85 -42.0 41.5 -46.55 42.25 -40.55 43.35 -43.9 44.45 -47.85 44.7 -47.85 45.25 -43.5 Q45.6 -41.55 47.1 -41.0 L47.05 -39.4 46.95 -37.7 Q47.8 -37.8 49.4 -37.1 49.55 -35.9 51.0 -35.15 L53.95 -33.4 54.25 -33.4 54.35 -35.0 55.0 -34.75 55.55 -32.85 Q56.85 -32.85 57.3 -32.4 58.1 -32.75 58.25 -33.4 L58.6 -33.1 Q58.7 -32.95 59.1 -32.85 L58.95 -27.0 Q57.3 -27.35 55.8 -28.1 L52.8 -29.25 49.8 -30.0 Q48.15 -30.35 46.75 -30.0 45.15 -29.7 43.75 -28.45 L43.55 -28.25 Q42.15 -27.0 41.1 -25.5 L41.2 -25.35 Q39.35 -22.4 39.95 -15.6 L40.15 -14.3 39.7 -13.6 39.85 -13.35 40.15 -12.8 40.5 -12.2 41.1 -11.6 Q41.9 -9.95 43.3 -8.35 L44.55 -7.0 45.95 -5.65 Q47.65 -4.2 49.75 -2.8 58.85 3.25 58.85 6.65 58.9 9.0 58.55 10.95 L58.1 12.7 Q57.4 15.4 55.5 18.25 L54.8 17.75 54.55 17.55 54.05 16.95 Q52.9 16.05 49.55 15.55 L48.85 15.7 48.7 15.6 47.75 15.6 47.75 15.7 Q48.9 16.5 50.65 18.4 L51.55 19.25 52.4 20.05 53.1 21.55 52.7 22.05 51.0 24.15 48.4 26.45 48.35 26.5 47.25 26.7 46.75 26.75 46.0 27.05 45.4 26.0 44.55 24.8 40.6 25.7 34.5 26.6 Q33.1 26.6 26.95 24.85 L26.0 24.55 Q26.0 24.85 26.5 25.35 L26.7 25.9 Q23.6 24.55 21.15 22.25 L21.05 22.05 20.55 21.6 Q20.8 20.15 21.7 19.15 23.2 17.45 27.15 15.9 L26.5 15.9 25.2 16.15 25.6 15.9 Q24.95 15.9 22.6 16.65 21.4 17.0 20.75 17.3 L20.35 17.5 20.1 17.85 19.5 18.95 18.55 19.4 18.8 19.9 17.9 19.0 Q15.55 16.65 15.05 13.2 L14.8 10.95 14.7 9.85 14.7 9.45 Q14.6 6.6 16.15 4.25 17.9 1.65 20.65 0.15 L22.8 -1.1 25.8 -3.1 27.9 -4.8 30.25 -7.0 31.2 -8.35 31.75 -9.55 Q32.55 -10.95 32.9 -12.45 L33.25 -14.3 33.3 -15.8 Q33.3 -18.65 32.7 -21.35 32.25 -23.65 31.35 -25.95 31.05 -26.8 30.4 -27.45 L28.7 -28.75 25.55 -30.15 24.75 -30.45 20.7 -31.3 14.1 -29.6 13.25 -29.3 9.8 -28.5 9.75 -28.6 Q11.35 -29.95 13.15 -30.8 L13.0 -34.1 15.0 -35.3 15.25 -35.5 15.4 -35.65 16.95 -39.4 19.6 -45.15 M58.9 -43.6 L58.9 -44.15 59.05 -43.65 58.9 -43.6 M61.4 -27.7 L61.45 -31.15 61.5 -31.8 61.6 -33.5 61.7 -31.7 61.7 -31.55 61.65 -28.65 61.4 -27.7 M20.45 18.85 L19.4 19.1 19.5 18.95 20.45 18.85" fill="#e8d7c5" fill-rule="evenodd" stroke="none"/>
    <path d="M16.45 19.8 L16.25 19.25 16.05 18.85 15.15 16.4 14.45 14.6 13.9 13.0 13.3 10.95 12.85 9.4 Q12.15 7.05 11.75 4.85 L10.55 -1.85 9.75 -7.0 9.55 -8.25 18.25 -0.15 18.7 -0.5 25.6 -7.0 25.65 -7.05 27.05 -8.35 27.6 -8.9 30.65 -12.2 30.85 -12.45 31.35 -13.6 31.05 -14.15 30.65 -14.6 25.1 -22.0 22.75 -25.2 20.75 -27.9 Q20.15 -28.65 19.2 -28.7 L18.95 -28.6 18.3 -28.25 12.8 -24.45 10.5 -22.7 10.5 -23.0 Q10.6 -24.9 10.9 -25.6 11.2 -26.8 15.0 -29.05 L13.9 -29.05 12.65 -28.75 10.95 -28.3 9.35 -28.3 Q9.5 -28.75 9.1 -29.85 L8.7 -31.35 Q8.7 -31.7 13.0 -34.1 L13.15 -30.8 Q11.35 -29.95 9.75 -28.6 L9.6 -28.45 9.8 -28.5 13.25 -29.3 14.1 -29.6 20.7 -31.3 24.75 -30.45 25.55 -30.15 28.7 -28.75 30.4 -27.45 Q31.05 -26.8 31.35 -25.95 32.25 -23.65 32.7 -21.35 33.3 -18.65 33.3 -15.8 L33.25 -14.3 32.9 -12.45 Q32.55 -10.95 31.75 -9.55 L31.2 -8.35 30.25 -7.0 27.9 -4.8 25.8 -3.1 22.8 -1.1 20.65 0.15 Q17.9 1.65 16.15 4.25 14.6 6.6 14.7 9.45 L14.7 9.85 14.8 10.95 15.05 13.2 Q15.55 16.65 17.9 19.0 L18.8 19.9 18.55 19.4 19.5 18.95 19.4 19.1 20.45 18.85 22.2 17.95 24.9 16.3 25.2 16.15 26.5 15.9 27.15 15.9 Q23.2 17.45 21.7 19.15 20.8 20.15 20.55 21.6 L21.05 22.05 21.15 22.25 Q23.6 24.55 26.7 25.9 L26.5 25.35 Q26.0 24.85 26.0 24.55 L26.95 24.85 Q33.1 26.6 34.5 26.6 L40.6 25.7 44.55 24.8 45.4 26.0 46.0 27.05 46.75 26.75 47.25 26.7 48.35 26.5 48.4 26.55 48.45 26.45 48.4 26.45 51.0 24.15 52.7 22.05 53.1 21.55 52.4 20.05 51.55 19.25 50.65 18.4 Q48.9 16.5 47.75 15.7 L47.75 15.6 48.7 15.6 48.85 15.7 50.05 16.85 50.2 17.1 51.5 17.7 Q52.9 18.4 53.55 18.4 L54.55 17.55 54.8 17.75 55.5 18.25 Q57.4 15.4 58.1 12.7 L58.55 10.95 Q58.9 9.0 58.85 6.65 58.85 3.25 49.75 -2.8 47.65 -4.2 45.95 -5.65 L44.55 -7.0 43.3 -8.35 Q41.9 -9.95 41.1 -11.6 L43.85 -8.9 44.55 -8.35 53.45 -0.5 53.9 -0.15 64.15 -10.4 64.35 -5.75 64.3 -5.45 64.35 -5.15 63.5 -0.4 62.3 5.0 61.5 8.35 60.95 10.5 60.85 10.95 59.95 13.85 58.6 17.75 57.5 20.7 57.25 21.3 Q57.0 21.65 56.9 22.05 L55.75 24.25 55.55 24.5 53.0 28.3 51.1 30.45 50.15 31.35 47.8 33.05 47.5 33.3 Q44.65 34.9 38.5 36.3 L37.35 36.85 36.0 36.85 Q32.55 36.5 29.65 34.8 L27.25 33.2 24.4 30.45 23.35 29.3 20.65 26.65 20.3 26.3 18.05 23.65 18.0 23.5 17.45 22.05 16.55 20.1 16.45 19.8 M40.15 -14.3 L39.95 -15.6 Q39.35 -22.4 41.2 -25.35 L41.1 -25.5 Q42.15 -27.0 43.55 -28.25 L43.75 -28.45 Q45.15 -29.7 46.75 -30.0 48.15 -30.35 49.8 -30.0 L52.8 -29.25 55.8 -28.1 Q57.3 -27.35 58.95 -27.0 L59.1 -32.85 59.2 -33.8 61.5 -31.8 61.45 -31.15 61.4 -27.7 61.25 -26.25 59.65 -26.25 62.05 -23.4 Q62.6 -22.85 62.75 -22.1 L62.8 -20.4 62.9 -20.1 61.5 -21.25 57.45 -24.45 51.6 -28.25 50.95 -28.6 50.75 -28.7 Q49.7 -28.65 49.2 -27.9 L47.4 -25.2 40.3 -14.6 40.15 -14.3 M58.3 -15.65 L58.35 -15.55 58.3 -15.55 58.3 -15.65" fill="#dfc7b0" fill-rule="evenodd" stroke="none"/>
    <path d="M8.9 -14.05 Q8.6 -16.4 8.45 -18.8 L8.2 -21.2 10.5 -22.7 12.8 -24.45 18.3 -28.25 18.95 -28.6 19.2 -28.7 Q20.15 -28.65 20.75 -27.9 L22.75 -25.2 25.1 -22.0 30.65 -14.6 31.05 -14.15 26.65 -13.7 26.85 -13.3 26.95 -12.65 Q27.0 -11.6 25.55 -10.5 L25.35 -10.4 Q23.0 -8.9 22.5 -8.4 L23.45 -10.4 21.15 -9.6 Q17.35 -8.45 16.0 -8.55 14.5 -8.65 9.5 -12.75 L11.35 -13.3 10.9 -13.75 8.9 -14.05 M39.85 -13.35 L39.7 -13.6 40.15 -14.3 40.3 -14.6 47.4 -25.2 49.2 -27.9 Q49.7 -28.65 50.75 -28.7 L50.95 -28.6 51.6 -28.25 57.45 -24.45 61.5 -21.25 62.9 -20.1 63.75 -19.35 63.9 -19.25 64.4 -18.85 64.6 -16.1 63.9 -15.95 61.35 -15.6 60.7 -15.5 61.25 -15.15 60.4 -13.95 59.8 -13.3 61.65 -12.75 Q56.95 -8.65 55.55 -8.55 54.2 -8.45 50.2 -9.6 L47.9 -10.4 49.05 -8.4 Q48.5 -8.9 46.0 -10.4 44.1 -11.7 44.25 -13.05 L44.3 -13.3 44.4 -13.5 43.75 -13.5 39.85 -13.35 M58.3 -15.65 L58.3 -15.55 58.35 -15.55 58.3 -15.65" fill="#40353f" fill-rule="evenodd" stroke="none"/>
    <path d="M72.9 -52.8 L73.0 -48.85 73.25 -39.4 73.35 -34.7 70.3 -34.4 68.55 -33.9 67.75 -33.65 66.8 -38.65 66.65 -39.4 Q65.75 -44.45 65.7 -47.25 L65.75 -51.55 66.05 -57.35 66.85 -52.65 67.6 -47.55 Q68.1 -49.95 68.45 -54.65 L68.6 -61.4 68.8 -61.45 68.95 -61.8 72.25 -54.25 72.9 -52.8 M-3.3 -31.55 L-3.3 -32.05 -3.35 -32.35 -3.4 -39.4 -3.35 -44.8 -2.6 -48.35 Q-1.95 -46.8 -1.35 -42.35 L-1.0 -39.4 -0.65 -37.15 -0.25 -37.15 -0.2 -39.4 Q-0.1 -41.95 0.55 -45.75 1.5 -52.15 2.6 -53.55 2.2 -48.75 2.95 -40.5 L3.0 -39.4 3.8 -30.95 2.95 -31.0 1.8 -31.15 -0.4 -31.45 -3.3 -31.55" fill="#3b3030" fill-rule="evenodd" stroke="none"/>
    <path d="M9.55 -8.25 L9.55 -8.35 9.45 -9.4 Q9.1 -11.75 8.9 -14.05 L10.9 -13.75 11.35 -13.3 9.5 -12.75 Q14.5 -8.65 16.0 -8.55 17.35 -8.45 21.15 -9.6 L23.45 -10.4 22.5 -8.4 Q23.0 -8.9 25.35 -10.4 L25.55 -10.5 Q27.0 -11.6 26.95 -12.65 L26.85 -13.3 26.65 -13.7 31.05 -14.15 31.35 -13.6 30.85 -12.45 30.65 -12.2 27.6 -8.9 27.05 -8.35 25.65 -7.05 25.6 -7.0 18.7 -0.5 18.25 -0.15 9.55 -8.25 M41.1 -11.6 L40.5 -12.2 40.15 -12.8 39.85 -13.35 43.75 -13.5 44.4 -13.5 44.3 -13.3 44.25 -13.05 Q44.1 -11.7 46.0 -10.4 48.5 -8.9 49.05 -8.4 L47.9 -10.4 50.2 -9.6 Q54.2 -8.45 55.55 -8.55 56.95 -8.65 61.65 -12.75 L59.8 -13.3 60.4 -13.95 61.25 -15.15 60.7 -15.5 61.35 -15.6 63.9 -15.95 64.15 -10.4 53.9 -0.15 53.45 -0.5 44.55 -8.35 43.85 -8.9 41.1 -11.6" fill="#5e4f5e" fill-rule="evenodd" stroke="none"/>
    <path d="M74.15 12.3 L74.35 19.95 74.35 20.15 74.55 25.35 74.55 25.6 74.65 30.45 74.65 33.25 Q75.2 36.4 76.3 41.1 L79.1 52.85 Q84.4 73.9 88.8 82.5 L88.7 82.65 88.15 83.55 87.6 84.45 Q82.4 74.15 79.05 61.7 77.2 55.25 75.05 44.05 L75.45 55.55 75.55 58.65 75.6 60.5 76.05 69.55 76.4 74.35 Q76.95 81.35 78.3 86.85 L78.7 88.45 79.8 91.75 81.65 97.9 83.05 101.75 88.2 116.3 88.95 118.65 89.65 120.75 83.65 122.7 83.3 122.75 81.9 119.05 81.8 118.65 78.55 108.85 75.0 96.2 76.6 93.1 74.8 88.45 74.5 87.8 74.15 86.85 72.2 82.9 71.95 82.5 72.15 82.5 70.65 58.95 70.6 41.1 70.55 37.4 71.85 37.4 71.8 36.4 71.65 34.4 71.55 33.7 71.55 33.05 71.85 33.05 72.45 35.85 72.6 25.9 72.45 24.05 71.6 12.85 74.15 12.3 M3.4 92.8 Q0.1 84.4 -1.05 77.15 -1.6 73.5 -2.2 57.95 L-2.55 41.1 -2.55 30.7 -2.3 6.95 -2.15 7.0 -2.1 7.0 -0.75 7.5 0.9 8.0 2.0 8.25 4.75 8.8 4.7 10.35 Q5.1 18.9 6.65 32.9 L7.55 41.1 8.65 51.6 Q9.65 62.6 11.1 70.3 12.25 76.55 14.5 84.4 L12.9 85.85 11.95 86.85 10.3 88.45 9.4 89.3 9.15 88.45 8.9 87.55 7.9 88.45 6.8 89.45 6.7 88.45 6.5 86.85 4.45 69.55 3.2 58.65 2.85 55.55 1.1 41.1 0.8 38.4 0.85 41.1 1.1 63.65 Q1.5 73.8 2.8 79.95 3.8 84.7 5.9 90.35 L3.4 92.8 M59.5 73.9 L59.8 74.0 60.3 66.8 61.5 50.4 61.45 50.0 Q62.15 51.95 62.7 55.75 63.15 59.3 63.05 61.5 64.1 59.6 65.05 52.1 65.85 45.3 65.75 42.5 67.05 51.45 68.1 63.15 L69.9 83.8 64.4 79.3 Q62.85 78.0 59.75 74.25 L59.5 73.9 M23.8 72.6 Q21.0 77.0 17.75 80.85 17.0 78.45 16.15 74.7 14.35 66.8 14.2 63.65 L14.15 61.85 17.25 71.8 17.6 71.8 Q17.35 67.0 18.25 56.1 18.9 48.25 19.5 42.9 L19.9 42.9 20.35 52.95 Q20.5 58.4 22.9 68.95 L23.8 72.6" fill="#2b2323" fill-rule="evenodd" stroke="none"/>
    <path d="M15.2 33.65 L14.75 22.85 15.6 29.25 15.75 30.45 16.5 36.05 16.5 35.05 16.3 30.45 16.15 27.35 16.1 26.6 Q16.1 22.9 16.45 19.8 L16.55 20.1 17.45 22.05 18.0 23.5 18.05 23.65 20.6 27.95 22.25 30.45 24.45 33.3 27.4 35.85 28.95 36.75 30.45 37.5 29.9 38.05 29.85 37.95 27.55 40.4 26.95 41.1 25.1 43.4 Q23.6 46.0 23.7 48.35 23.7 49.0 27.55 50.55 L28.0 50.7 Q28.8 51.05 29.45 51.55 L30.1 51.9 Q29.7 53.0 29.7 54.05 L30.0 55.55 30.65 57.6 30.35 58.65 29.65 60.5 Q27.8 65.25 25.5 69.55 L23.8 72.6 22.9 68.95 Q20.5 58.4 20.35 52.95 L19.9 42.9 19.5 42.9 Q18.9 48.25 18.25 56.1 17.35 67.0 17.6 71.8 L17.25 71.8 14.15 61.85 14.2 63.65 Q14.35 66.8 16.15 74.7 17.0 78.45 17.75 80.85 L14.5 84.4 Q12.25 76.55 11.1 70.3 9.65 62.6 8.65 51.6 L7.55 41.1 6.65 32.9 Q5.1 18.9 4.7 10.35 L4.75 8.8 4.95 8.85 7.75 9.1 9.0 24.25 11.45 53.05 16.0 53.05 15.5 41.2 15.2 33.65 M64.95 10.45 L65.15 14.45 66.15 40.4 67.4 40.75 67.5 37.9 67.7 32.75 67.75 30.45 68.15 26.7 69.1 37.4 70.55 37.4 70.6 41.1 70.65 58.95 72.15 82.5 71.95 82.5 71.3 85.0 70.85 84.6 69.9 83.8 68.1 63.15 Q67.05 51.45 65.75 42.5 65.85 45.3 65.05 52.1 64.1 59.6 63.05 61.5 63.15 59.3 62.7 55.75 62.15 51.95 61.45 50.0 L61.5 50.4 60.3 66.8 59.8 74.0 59.5 73.9 58.6 72.95 56.85 69.55 Q54.6 65.05 53.0 60.5 L52.4 58.65 52.2 58.15 51.9 56.65 51.5 55.85 51.55 55.55 51.5 55.35 Q53.7 51.4 53.6 49.45 53.65 48.9 53.1 47.75 53.95 46.9 55.4 45.6 L55.65 45.35 55.65 45.3 Q57.9 43.2 58.45 41.1 L58.65 39.45 58.15 37.0 57.75 36.15 56.05 33.95 55.1 32.75 54.95 32.75 Q54.4 31.45 53.45 30.85 L52.9 30.5 52.9 30.45 52.9 29.25 53.05 29.1 55.55 24.5 55.75 24.25 56.9 22.05 Q57.0 21.65 57.25 21.3 L57.5 20.7 58.6 17.75 59.95 13.85 60.85 10.95 60.95 10.5 61.5 8.35 Q63.3 9.7 64.65 10.3 L64.95 10.45" fill="#211b1b" fill-rule="evenodd" stroke="none"/>
    <path d="M30.45 37.5 L30.7 37.65 31.45 37.9 Q34.0 38.85 36.9 38.85 39.8 38.9 42.5 37.9 L43.7 37.45 47.65 35.05 48.15 34.55 49.4 33.55 49.1 37.0 48.9 39.1 Q49.0 40.1 48.75 41.1 L48.7 41.15 47.9 42.8 46.3 44.5 Q43.45 47.0 40.1 47.0 34.95 47.0 32.65 43.9 L32.0 43.05 31.9 42.6 31.45 41.15 31.45 41.1 29.9 38.1 29.9 38.05 30.45 37.5" fill="#a67159" fill-rule="evenodd" stroke="none"/>
    <path d="M36.55 61.3 L36.4 60.5 36.15 58.65 35.7 55.55 35.3 52.9 36.5 53.05 Q41.05 53.05 45.95 50.4 L48.15 49.2 49.95 48.3 48.25 51.3 47.75 52.3 46.05 55.55 44.55 58.6 44.55 58.65 44.2 60.5 44.15 60.75 43.35 61.4 Q41.75 62.95 40.75 62.95 L39.35 62.6 Q38.8 62.15 38.15 61.95 L38.0 61.9 36.55 61.3" fill="#09090d" fill-rule="evenodd" stroke="none"/>
    <path d="M34.2 61.3 Q34.75 61.0 35.6 61.0 L36.35 61.25 36.55 61.3 38.0 61.9 38.15 61.95 Q38.8 62.15 39.35 62.6 L40.75 62.95 Q41.75 62.95 43.35 61.4 L44.15 60.75 44.4 60.5 Q45.55 59.75 46.8 59.75 L47.25 60.05 46.85 60.5 45.3 62.05 45.3 62.95 46.3 62.95 46.35 62.35 46.55 61.9 46.8 61.65 47.75 60.55 Q48.4 61.0 48.4 61.5 48.5 63.55 48.25 64.05 L46.4 67.0 45.35 68.15 44.7 69.55 Q43.0 73.85 42.65 80.55 L43.8 86.85 44.1 88.45 44.45 90.55 Q45.75 96.5 49.4 102.65 L49.95 103.9 50.1 104.35 50.4 105.05 51.25 107.45 Q51.3 109.05 50.6 109.85 49.95 110.55 48.65 110.55 47.95 110.55 46.6 109.65 45.2 108.65 43.95 108.65 42.9 108.65 41.35 109.75 39.6 110.85 38.15 110.85 36.65 110.85 35.6 109.4 35.0 108.65 34.75 107.5 L34.55 106.2 Q34.45 103.25 37.1 94.7 L38.75 88.45 39.05 86.85 Q39.7 83.0 39.55 79.75 39.3 73.65 36.45 69.55 L36.15 69.05 Q32.95 64.95 32.85 64.05 32.8 63.15 33.3 62.25 L36.55 66.7 36.9 67.35 38.2 68.4 Q38.15 67.0 37.3 65.5 L37.1 65.15 Q36.45 63.95 36.35 64.75 34.95 62.95 34.2 61.3" fill="#b8a783" fill-rule="evenodd" stroke="none"/>
    <path d="M37.3 65.5 L37.15 65.4 36.35 64.75 Q36.45 63.95 37.1 65.15 L37.3 65.5" fill="#87704e" fill-rule="evenodd" stroke="none"/>
    <path d="M83.65 122.7 L86.75 137.45 87.3 139.9 89.15 147.5 82.4 147.5 81.6 146.7 81.9 147.5 71.9 147.5 70.65 141.05 70.5 140.75 70.45 140.2 70.25 138.65 70.05 136.55 71.5 135.4 Q74.05 133.35 75.05 127.3 75.75 122.85 74.8 118.65 73.95 114.9 71.85 111.35 L69.45 106.9 75.0 96.2 78.55 108.85 81.8 118.65 81.9 119.05 83.3 122.75 83.65 122.7 M13.65 147.5 L-6.2 147.5 Q-4.85 144.25 -3.5 139.65 -0.65 129.8 1.1 122.45 L1.95 118.65 Q3.75 110.1 3.75 105.8 3.6 99.95 4.85 96.2 L4.9 96.05 11.6 106.05 9.1 105.55 7.0 104.9 6.6 104.9 6.75 105.1 6.75 105.15 8.85 107.8 10.35 109.7 7.85 113.6 Q5.95 116.1 5.5 117.35 L5.5 118.2 8.85 118.35 8.8 118.65 Q8.55 120.55 8.65 122.45 8.7 124.8 9.25 127.3 10.75 133.35 13.5 135.4 L15.15 136.65 13.95 145.4 13.65 147.5" fill="#2e2e40" fill-rule="evenodd" stroke="none"/>
    <path d="M12.85 107.85 L12.75 108.0 11.15 111.35 Q9.4 114.75 8.85 118.35 L5.5 118.2 5.5 117.35 Q5.95 116.1 7.85 113.6 L10.35 109.7 8.85 107.8 6.75 105.15 6.75 105.1 7.0 104.9 9.1 105.55 11.6 106.05 12.85 107.85" fill="#232330" fill-rule="evenodd" stroke="none"/>
    <path d="M41.5 -21.35 Q45.15 -26.6 50.35 -28.35 L56.6 -29.6 Q54.05 -28.55 51.0 -26.35 45.75 -23.0 41.5 -21.35" fill="#4b3d3d" fill-rule="evenodd" stroke="none"/>
    <path d="M12.6 -15.4 L12.65 -15.4 12.65 -15.5 12.6 -15.4 M10.95 -13.75 L9.75 -15.0 13.65 -17.45 Q15.7 -18.4 18.85 -18.4 21.2 -18.4 23.35 -17.25 L25.35 -15.65 26.7 -13.7 26.9 -13.35 27.0 -12.8 Q27.05 -11.85 25.65 -10.9 L25.45 -10.8 22.6 -9.0 23.55 -10.8 21.3 -10.1 Q17.45 -9.05 16.1 -9.15 14.65 -9.2 9.55 -12.9 L11.4 -13.35 10.95 -13.75 M12.9 -13.1 L12.7 -13.0 14.45 -11.55 Q15.6 -10.65 18.9 -10.75 22.15 -10.8 24.65 -12.6 L24.3 -13.05 24.25 -13.15 24.05 -13.45 Q22.65 -15.25 20.15 -16.0 L20.55 -15.45 Q21.5 -14.35 21.45 -13.3 L21.4 -13.25 20.85 -12.3 20.4 -12.2 Q17.5 -11.2 15.65 -13.05 L16.35 -13.1 16.9 -13.3 17.1 -13.45 17.25 -13.65 Q17.8 -14.0 17.75 -14.35 L17.7 -14.9 17.4 -15.25 16.8 -15.45 Q15.85 -15.45 15.45 -15.0 L15.55 -15.4 15.1 -15.0 13.25 -13.45 12.9 -13.1" fill="#13131a" fill-rule="evenodd" stroke="none"/>
    <path d="M24.3 -13.05 L21.45 -13.3 Q21.5 -14.35 20.55 -15.45 L20.15 -16.0 Q22.65 -15.25 24.05 -13.45 L24.25 -13.15 24.3 -13.05 M15.15 -13.25 L12.9 -13.1 13.25 -13.45 15.1 -15.0 15.55 -15.4 15.45 -15.0 15.1 -13.5 Q15.05 -13.35 15.15 -13.25" fill="#b7b5ae" fill-rule="evenodd" stroke="none"/>
    <path d="M24.3 -13.05 L24.65 -12.6 Q22.15 -10.8 18.9 -10.75 15.6 -10.65 14.45 -11.55 L12.7 -13.0 12.9 -13.1 15.15 -13.25 Q15.2 -13.0 15.65 -13.05 17.5 -11.2 20.4 -12.2 L20.85 -12.3 21.4 -13.25 21.45 -13.3 24.3 -13.05" fill="#d4d3cf" fill-rule="evenodd" stroke="none"/>
    <path d="M15.65 -13.05 Q15.2 -13.0 15.15 -13.25 15.05 -13.35 15.1 -13.5 L15.45 -15.0 Q15.85 -15.45 16.8 -15.45 L17.4 -15.25 17.7 -14.9 17.75 -14.35 Q17.8 -14.0 17.25 -13.65 L17.1 -13.45 16.9 -13.3 16.35 -13.1 15.65 -13.05" fill="#ffffff" fill-rule="evenodd" stroke="none"/>
    <path d="M55.6 -15.0 L55.4 -15.4 55.95 -15.0 56.4 -14.7 57.6 -13.85 56.05 -13.75 55.8 -14.6 55.6 -15.0 M47.1 -13.3 L47.4 -13.7 Q48.45 -15.3 50.85 -16.0 L50.4 -15.45 Q49.75 -14.6 49.8 -13.9 L49.9 -13.45 47.1 -13.3" fill="#b7b5ae" fill-rule="evenodd" stroke="none"/>
    <path d="M57.6 -13.85 L56.4 -14.7 55.95 -15.0 55.4 -15.4 55.6 -15.0 Q55.1 -15.45 54.15 -15.45 L53.55 -15.25 53.35 -14.9 53.3 -14.35 53.35 -14.3 Q53.4 -13.95 53.9 -13.65 L54.15 -13.45 Q54.75 -13.05 55.6 -13.05 54.0 -11.2 50.95 -12.2 L50.5 -12.3 Q49.95 -12.85 49.9 -13.45 L49.8 -13.9 Q49.75 -14.6 50.4 -15.45 L50.85 -16.0 Q48.45 -15.3 47.4 -13.7 L47.1 -13.3 47.0 -13.15 46.7 -12.6 Q49.4 -10.8 52.65 -10.75 56.0 -10.65 57.0 -11.55 L58.55 -13.0 57.6 -13.85 M59.85 -13.35 L61.7 -12.9 Q57.1 -9.2 55.65 -9.15 54.3 -9.05 50.35 -10.1 L48.0 -10.8 49.15 -9.0 Q48.6 -9.5 46.1 -10.8 44.15 -11.95 44.3 -13.15 L44.35 -13.35 44.4 -13.55 Q45.35 -15.85 47.4 -17.25 49.45 -18.4 51.8 -18.4 54.95 -18.4 57.1 -17.45 L60.7 -15.35 61.3 -15.0 60.45 -13.95 59.85 -13.35 M58.35 -15.4 L58.3 -15.5 58.3 -15.4 58.35 -15.4" fill="#13131a" fill-rule="evenodd" stroke="none"/>
    <path d="M55.6 -15.0 L55.8 -14.6 56.05 -13.75 56.1 -13.5 Q56.25 -13.0 55.6 -13.05 54.75 -13.05 54.15 -13.45 L53.9 -13.65 Q53.4 -13.95 53.35 -14.3 L53.3 -14.35 53.35 -14.9 53.55 -15.25 54.15 -15.45 Q55.1 -15.45 55.6 -15.0" fill="#ffffff" fill-rule="evenodd" stroke="none"/>
    <path d="M56.05 -13.75 L57.6 -13.85 58.55 -13.0 57.0 -11.55 Q56.0 -10.65 52.65 -10.75 49.4 -10.8 46.7 -12.6 L47.0 -13.15 47.1 -13.3 49.9 -13.45 Q49.95 -12.85 50.5 -12.3 L50.95 -12.2 Q54.0 -11.2 55.6 -13.05 56.25 -13.0 56.1 -13.5 L56.05 -13.75" fill="#d4d3cf" fill-rule="evenodd" stroke="none"/>
    <path d="M41.4 21.6 L41.1 21.25 40.7 21.3 40.6 21.65 40.7 22.0 41.0 21.95 41.4 21.6 M29.75 21.25 L30.1 21.25 Q32.4 21.3 34.7 22.15 38.2 21.1 41.9 20.6 L42.25 20.45 42.3 20.45 43.0 20.9 43.45 21.6 43.45 21.8 Q43.5 23.15 40.65 24.0 L35.85 24.75 31.35 24.55 30.75 24.4 Q28.7 23.8 28.45 22.6 L28.45 22.4 Q28.45 22.15 29.15 21.65 L29.75 21.25 M40.2 22.15 L40.1 21.85 Q39.0 21.55 39.05 22.55 L39.45 23.1 39.95 22.7 40.2 22.15 M32.0 22.2 Q32.0 21.85 31.95 22.05 L31.45 22.1 Q31.1 22.1 31.1 22.45 L31.2 22.85 32.0 22.2 M29.9 22.25 L29.9 22.45 30.0 22.55 30.2 22.6 30.5 22.55 30.75 21.9 Q29.85 21.75 29.9 22.25" fill="#ddad99" fill-rule="evenodd" stroke="none"/>
    <path d="M41.4 21.6 L41.0 21.95 40.7 22.0 40.6 21.65 40.7 21.3 41.1 21.25 41.4 21.6 M29.9 22.25 Q29.85 21.75 30.75 21.9 L30.5 22.55 30.2 22.6 30.0 22.55 29.9 22.45 29.9 22.25 M32.0 22.2 L31.2 22.85 31.1 22.45 Q31.1 22.1 31.45 22.1 L31.95 22.05 Q32.0 21.85 32.0 22.2 M40.2 22.15 L39.95 22.7 39.45 23.1 39.05 22.55 Q39.0 21.55 40.1 21.85 L40.2 22.15" fill="#fae7d4" fill-rule="evenodd" stroke="none"/>
    <path d="M29.75 21.25 L29.15 21.65 Q28.45 22.15 28.45 22.4 L28.45 22.6 26.1 22.9 24.6 23.15 23.5 22.95 22.8 22.6 22.9 22.45 22.9 22.3 24.2 22.1 25.0 21.9 25.05 21.9 25.7 22.0 25.8 22.0 26.05 21.95 27.9 21.35 29.75 21.25 M30.75 24.4 L31.35 24.55 35.85 24.75 40.65 24.0 Q40.85 25.4 40.05 26.0 39.35 26.5 37.4 26.65 L33.65 26.05 Q30.75 25.25 30.4 24.75 L30.75 24.4 M43.45 21.6 L43.0 20.9 42.3 20.45 46.85 20.65 46.95 20.6 47.7 20.55 48.75 20.35 49.15 20.2 49.7 19.9 50.05 19.7 50.7 19.65 Q50.75 20.3 50.2 20.7 L49.9 21.0 49.2 21.3 48.7 21.35 47.2 21.3 45.65 21.25 43.45 21.6" fill="#c69575" fill-rule="evenodd" stroke="none"/>
    <path d="M42.3 20.45 L42.25 20.45 41.9 20.6 Q38.2 21.1 34.7 22.15 32.4 21.3 30.1 21.25 L29.75 21.25 27.9 21.35 26.05 21.95 25.8 22.0 25.7 22.0 25.05 21.9 25.0 21.9 24.35 21.05 24.45 21.0 25.8 21.0 25.65 20.45 25.4 20.0 24.85 19.2 25.95 19.4 34.6 20.5 41.5 19.1 46.0 17.85 46.95 19.0 47.65 20.0 48.55 19.65 49.15 19.5 50.4 19.2 50.45 19.15 50.5 19.15 50.05 19.7 49.7 19.9 49.15 20.2 48.75 20.35 47.7 20.55 46.95 20.6 46.85 20.65 42.3 20.45" fill="#a67159" fill-rule="evenodd" stroke="none"/>
    <path d="M28.45 22.6 Q28.7 23.8 30.75 24.4 L30.4 24.75 Q30.75 25.25 33.65 26.05 L37.4 26.65 Q39.35 26.5 40.05 26.0 40.85 25.4 40.65 24.0 43.5 23.15 43.45 21.8 L43.45 21.6 45.65 21.25 47.2 21.3 48.7 21.35 49.2 21.3 49.9 21.0 49.25 21.8 48.05 22.2 44.15 23.1 Q41.5 24.45 41.4 26.0 41.2 26.95 38.25 27.2 L33.3 26.95 Q29.4 26.5 29.4 25.65 29.35 25.4 29.6 25.15 L29.85 24.55 Q29.8 23.7 26.7 23.55 L26.15 23.55 23.15 23.4 23.5 22.95 24.6 23.15 26.1 22.9 28.45 22.6" fill="#d8b59e" fill-rule="evenodd" stroke="none"/>
    <path d="M39.6 13.05 L39.25 12.0 38.8 10.6 40.45 11.95 41.9 13.35 42.0 13.7 Q42.1 14.75 41.3 15.75 40.55 16.75 39.1 17.4 37.05 18.15 36.5 18.7 L36.0 19.2 34.9 20.4 Q34.15 20.45 32.5 19.35 L31.25 18.6 Q28.75 16.9 27.9 15.45 L28.05 15.1 28.8 13.2 Q29.4 11.55 30.5 10.7 L30.5 11.05 30.0 13.45 Q29.55 13.55 29.6 14.25 29.6 15.0 30.25 15.6 L30.35 15.7 30.95 16.0 32.05 16.85 32.25 16.95 34.3 17.1 Q35.9 17.05 37.5 16.45 L38.0 16.2 39.9 14.85 40.25 13.8 40.2 13.65 Q40.2 13.05 39.6 13.05" fill="#dfc7b0" fill-rule="evenodd" stroke="none"/>
    <path d="M33.55 6.85 L33.75 6.5 Q34.1 6.05 35.05 6.0 35.8 5.95 36.5 6.8 37.2 7.75 37.25 9.15 37.3 10.5 36.65 11.6 35.9 12.95 34.5 13.0 32.65 13.1 32.55 10.35 32.5 9.1 32.95 7.75 L33.05 7.55 33.55 6.85" fill="#fae7d4" fill-rule="evenodd" stroke="none"/>
    <path d="M30.0 13.45 L30.25 13.4 Q30.45 13.35 32.35 14.05 L35.0 14.7 Q35.75 14.65 37.45 13.85 L39.5 13.05 39.6 13.05 Q40.2 13.05 40.2 13.65 L40.25 13.8 39.9 14.85 39.0 14.65 Q38.55 14.65 37.75 15.1 37.0 15.65 37.0 15.95 37.0 16.25 37.5 16.45 35.9 17.05 34.3 17.1 L32.25 16.95 32.35 16.85 Q32.75 16.45 32.75 16.0 L32.35 15.45 Q31.9 15.0 31.25 15.05 L30.65 15.05 Q30.35 15.15 30.35 15.7 L30.25 15.6 Q29.6 15.0 29.6 14.25 29.55 13.55 30.0 13.45" fill="#a67159" fill-rule="evenodd" stroke="none"/>
    <path d="M39.9 14.85 L38.0 16.2 37.5 16.45 Q37.0 16.25 37.0 15.95 37.0 15.65 37.75 15.1 38.55 14.65 39.0 14.65 L39.9 14.85 M32.25 16.95 L32.05 16.85 30.95 16.0 30.35 15.7 Q30.35 15.15 30.65 15.05 L31.25 15.05 Q31.9 15.0 32.35 15.45 L32.75 16.0 Q32.75 16.45 32.35 16.85 L32.25 16.95" fill="#7a5342" fill-rule="evenodd" stroke="none"/>
    <path d="M31.65 -21.3 Q27.4 -22.95 22.15 -26.3 19.1 -28.5 16.55 -29.55 L22.8 -28.3 Q28.0 -26.55 31.65 -21.3" fill="#4b3d3d" fill-rule="evenodd" stroke="none"/>
  </g>
</svg>
