<?xml version="1.0" encoding="UTF-8" standalone="no"?>
<svg xmlns:xlink="http://www.w3.org/1999/xlink" height="79.45px" width="253.35px" xmlns="http://www.w3.org/2000/svg">
  <g transform="matrix(1.0, 0.0, 0.0, 1.0, 18.7, 43.85)">
    <path d="M3.9 -15.05 L4.7 -14.65 Q5.95 -13.9 6.8 -12.3 9.2 -15.85 11.2 -17.2 14.05 -19.15 18.7 -19.15 L21.9 -18.7 Q22.8 -18.1 22.8 -16.0 22.8 -14.5 18.25 -12.3 L19.6 -12.3 Q21.8 -11.65 22.7 -10.75 23.7 -9.75 23.7 -7.75 23.7 -4.15 19.1 -3.35 L10.45 -3.6 10.0 -3.6 10.35 -3.4 Q12.1 -2.45 13.5 -0.95 15.0 0.65 15.4 2.15 L15.95 1.7 Q17.75 0.45 20.3 0.45 23.35 0.45 24.7 2.35 25.45 3.45 25.45 4.7 25.45 6.35 23.5 7.85 21.5 9.45 19.15 9.45 16.1 9.45 14.85 7.55 L14.7 7.3 14.65 7.55 Q13.8 9.45 12.3 11.35 8.95 15.5 4.95 15.5 L3.7 15.5 3.7 17.2 2.0 17.2 0.35 17.2 0.3 17.2 -0.15 17.15 -0.15 14.35 0.3 14.4 0.35 14.4 2.05 14.4 3.7 14.45 3.7 12.85 4.25 12.85 Q5.9 12.85 8.4 10.35 10.9 7.85 10.9 6.4 10.9 2.15 9.2 0.1 7.65 -1.75 5.4 -1.25 L3.7 -0.55 3.7 -2.95 Q5.65 -3.0 6.8 -4.95 7.7 -6.5 7.7 -7.9 7.7 -11.65 3.85 -11.5 L3.65 -11.5 0.3 -14.35 0.0 -14.5 -0.15 -14.5 -0.15 -16.15 0.15 -16.1 0.3 -16.15 0.35 -16.15 2.15 -16.15 3.1 -15.35 3.7 -14.7 3.9 -15.05 M18.25 -12.3 L17.3 -12.3 17.3 -11.85 18.25 -12.3 M16.75 -14.6 Q16.75 -17.85 13.6 -17.55 10.45 -17.25 10.45 -14.55 10.4 -13.7 10.75 -12.9 11.4 -11.4 13.4 -11.4 15.2 -11.4 16.1 -12.6 16.75 -13.45 16.75 -14.6 M13.2 -6.75 Q15.15 -6.75 15.15 -8.9 15.15 -11.0 12.8 -11.0 10.45 -11.0 10.45 -9.1 10.45 -8.5 11.05 -7.75 11.85 -6.75 13.2 -6.75 M-0.2 17.15 L-0.6 17.15 -0.55 16.1 -3.7 15.25 Q-7.65 13.9 -10.2 11.8 -15.15 7.75 -15.15 0.3 -15.15 -6.75 -11.85 -10.5 -9.3 -13.4 -3.7 -15.45 L-1.4 -16.25 -0.35 -16.15 -0.2 -16.15 -0.2 -14.5 Q-2.05 -14.4 -3.7 -13.65 -6.0 -12.6 -8.0 -10.25 -11.7 -5.95 -11.7 -0.15 -11.7 6.15 -7.1 10.55 -5.45 12.1 -3.7 13.05 -2.2 13.85 -0.6 14.25 L-0.2 14.35 -0.2 17.15" fill="#fefd81" fill-rule="evenodd" stroke="none"/>
    <path d="M-0.15 -14.5 L0.0 -14.5 0.3 -14.35 3.65 -11.5 3.85 -11.5 Q7.7 -11.65 7.7 -7.9 7.7 -6.5 6.8 -4.95 5.65 -3.0 3.7 -2.95 L3.7 -0.55 5.4 -1.25 Q7.65 -1.75 9.2 0.1 10.9 2.15 10.9 6.4 10.9 7.85 8.4 10.35 5.9 12.85 4.25 12.85 L3.7 12.85 3.7 14.45 2.05 14.4 0.35 14.4 0.3 14.4 -0.15 14.35 -0.15 -14.5 M16.75 -14.6 Q16.75 -13.45 16.1 -12.6 15.2 -11.4 13.4 -11.4 11.4 -11.4 10.75 -12.9 10.4 -13.7 10.45 -14.55 10.45 -17.25 13.6 -17.55 16.75 -17.85 16.75 -14.6 M13.2 -6.75 Q11.85 -6.75 11.05 -7.75 10.45 -8.5 10.45 -9.1 10.45 -11.0 12.8 -11.0 15.15 -11.0 15.15 -8.9 15.15 -6.75 13.2 -6.75 M-0.2 14.35 L-0.6 14.25 Q-2.2 13.85 -3.7 13.05 -5.45 12.1 -7.1 10.55 -11.7 6.15 -11.7 -0.15 -11.7 -5.95 -8.0 -10.25 -6.0 -12.6 -3.7 -13.65 -2.05 -14.4 -0.2 -14.5 L-0.2 14.35" fill="#ffffff" fill-rule="evenodd" stroke="none"/>
    <path d="M18.25 -12.3 Q22.8 -14.5 22.8 -16.0 22.8 -18.1 21.9 -18.7 L18.7 -19.15 Q14.05 -19.15 11.2 -17.2 9.2 -15.85 6.8 -12.3 5.95 -13.9 4.7 -14.65 L3.9 -15.05 3.7 -15.1 3.7 -14.7 3.1 -15.35 2.15 -16.15 0.35 -16.15 0.3 -16.15 0.15 -16.1 -0.15 -16.15 -0.15 -18.7 0.1 -18.7 0.3 -18.7 0.35 -18.7 1.05 -18.7 1.85 -18.7 1.85 -18.95 3.35 -19.15 Q3.75 -19.15 5.0 -18.4 L5.75 -17.9 6.35 -17.35 Q7.65 -19.15 11.1 -21.15 14.8 -23.3 17.3 -23.3 20.3 -23.3 22.9 -22.35 L22.95 -22.3 25.6 -21.0 27.75 -19.25 27.9 -18.3 Q27.9 -14.95 23.25 -12.75 25.05 -12.55 26.2 -11.1 L26.85 -10.15 Q27.9 -8.15 27.9 -5.45 27.9 -3.65 25.95 -1.25 L25.75 -1.0 Q27.8 -0.65 29.35 0.55 31.5 2.25 31.5 4.85 31.5 6.8 29.85 8.8 L29.45 9.2 Q26.7 12.15 21.9 12.15 19.35 12.15 17.7 11.35 17.35 14.45 13.65 16.85 10.05 19.15 6.55 19.15 L4.45 18.85 4.05 18.75 3.7 18.6 3.7 17.2 3.7 15.5 4.95 15.5 Q8.95 15.5 12.3 11.35 13.8 9.45 14.65 7.55 L14.7 7.3 14.85 7.55 Q16.1 9.45 19.15 9.45 21.5 9.45 23.5 7.85 25.45 6.35 25.45 4.7 25.45 3.45 24.7 2.35 23.35 0.45 20.3 0.45 17.75 0.45 15.95 1.7 L15.4 2.15 Q15.0 0.65 13.5 -0.95 12.1 -2.45 10.35 -3.4 L10.45 -3.6 19.1 -3.35 Q23.7 -4.15 23.7 -7.75 23.7 -9.75 22.7 -10.75 21.8 -11.65 19.6 -12.3 L18.25 -12.3 M-0.2 -16.15 L-0.35 -16.15 -1.4 -16.25 -3.7 -15.45 Q-9.3 -13.4 -11.85 -10.5 -15.15 -6.75 -15.15 0.3 -15.15 7.75 -10.2 11.8 -7.65 13.9 -3.7 15.25 L-0.55 16.1 -0.6 17.15 -0.2 17.15 -0.2 18.7 -3.7 18.4 Q-9.1 17.35 -13.25 13.2 -15.5 10.95 -16.85 8.25 -18.7 4.5 -18.7 0.0 -18.7 -4.5 -16.85 -8.25 -15.5 -10.95 -13.25 -13.25 -9.1 -17.35 -3.7 -18.35 L-0.2 -18.7 -0.2 -16.15" fill="#f7de09" fill-rule="evenodd" stroke="none"/>
    <path d="M-0.15 17.15 L0.3 17.2 0.35 17.2 2.0 17.2 3.7 17.2 3.7 18.6 3.7 18.7 0.35 18.7 0.3 18.7 0.1 18.7 -0.15 18.7 -0.15 17.15 M4.45 18.85 L6.55 19.15 Q10.05 19.15 13.65 16.85 17.35 14.45 17.7 11.35 19.35 12.15 21.9 12.15 26.7 12.15 29.45 9.2 L29.85 8.8 Q31.5 6.8 31.5 4.85 31.5 2.25 29.35 0.55 27.8 -0.65 25.75 -1.0 L25.95 -1.25 Q27.9 -3.65 27.9 -5.45 27.9 -8.15 26.85 -10.15 L26.2 -11.1 Q25.05 -12.55 23.25 -12.75 27.9 -14.95 27.9 -18.3 L27.75 -19.25 25.6 -21.0 22.95 -22.3 22.9 -22.35 Q20.3 -23.3 17.3 -23.3 14.8 -23.3 11.1 -21.15 7.65 -19.15 6.35 -17.35 L5.75 -17.9 Q6.7 -20.35 10.95 -22.7 16.0 -25.55 19.85 -25.55 24.45 -25.55 27.45 -23.75 30.05 -22.2 30.5 -19.8 L30.6 -18.75 Q30.6 -16.9 29.25 -14.65 L29.2 -14.35 28.9 -14.15 27.9 -13.7 Q27.9 -13.25 27.5 -13.25 L28.2 -13.2 Q30.65 -12.9 33.25 -10.35 L34.65 -8.8 Q36.05 -7.0 36.05 -5.45 36.05 -3.05 32.4 -1.35 L32.2 -1.25 32.35 -1.2 Q33.5 -0.65 34.05 -0.1 35.15 1.0 35.15 3.8 35.15 6.0 34.0 7.85 L32.45 9.7 31.5 10.45 31.25 10.65 Q34.45 10.75 34.45 14.5 34.45 18.0 31.7 18.0 28.3 18.0 27.05 15.95 L26.45 14.05 Q26.45 13.25 26.75 12.65 L26.45 12.7 25.35 12.75 23.55 12.65 Q22.85 16.0 19.65 17.95 16.15 20.05 10.45 20.05 L6.5 19.95 Q5.1 19.7 4.45 18.85 M33.6 -18.3 Q36.45 -18.15 36.45 -15.35 36.45 -12.45 33.75 -12.45 31.6 -12.45 30.95 -14.05 L30.7 -15.6 Q30.7 -18.45 33.6 -18.3 M36.75 -5.45 Q36.75 -8.45 39.6 -8.15 42.45 -7.9 42.45 -5.2 L42.2 -3.85 Q44.3 -4.05 45.75 -2.8 47.6 -1.3 47.6 1.9 47.6 3.25 46.45 4.95 44.8 7.35 42.0 7.35 38.75 7.35 37.0 4.8 L35.85 2.05 Q35.85 -0.2 37.7 -1.9 L38.7 -2.65 Q37.5 -2.95 37.0 -4.2 L36.75 -5.45 M53.55 -24.95 Q53.55 -22.6 51.15 -22.6 49.6 -22.6 49.2 -23.7 49.0 -24.25 49.1 -24.9 49.1 -27.45 51.35 -27.45 53.55 -27.4 53.55 -24.95 M56.45 -17.35 Q54.0 -17.35 53.0 -19.35 L52.55 -21.35 Q52.55 -24.45 56.9 -25.15 61.2 -25.85 61.2 -22.15 61.2 -20.9 60.15 -19.4 58.7 -17.35 56.45 -17.35" fill="#f7a809" fill-rule="evenodd" stroke="none"/>
    <path d="M26.45 12.7 L26.75 12.65 Q26.45 13.25 26.45 14.05 L27.05 15.95 Q28.3 18.0 31.7 18.0 34.45 18.0 34.45 14.5 34.45 10.75 31.25 10.65 L31.5 10.45 32.45 9.7 34.5 11.05 Q36.55 12.9 36.55 15.45 36.55 17.35 35.6 18.7 34.35 20.5 31.95 20.5 30.1 20.5 28.35 19.15 26.0 17.35 26.0 14.1 26.0 13.45 26.45 12.7 M34.0 7.85 Q35.15 6.0 35.15 3.8 35.15 1.0 34.05 -0.1 33.5 -0.65 32.35 -1.2 L32.4 -1.35 Q36.05 -3.05 36.05 -5.45 36.05 -7.0 34.65 -8.8 L33.25 -10.35 Q30.65 -12.9 28.2 -13.2 L27.5 -13.25 Q27.9 -13.25 27.9 -13.7 L28.9 -14.15 29.2 -14.35 29.25 -14.65 Q30.6 -16.9 30.6 -18.75 L30.5 -19.8 Q31.75 -21.0 33.5 -21.0 36.2 -21.0 38.35 -18.25 40.2 -15.9 40.2 -14.15 40.2 -13.15 39.8 -12.3 45.2 -12.25 45.2 -8.65 L44.45 -7.55 44.1 -7.05 Q47.25 -8.1 50.7 -5.45 54.35 -2.65 54.35 0.9 54.35 2.9 52.65 4.65 L52.05 5.2 Q50.5 6.55 47.95 7.7 42.95 10.0 39.9 10.0 36.1 10.0 34.25 8.1 L34.0 7.85 M33.6 -18.3 Q30.7 -18.45 30.7 -15.6 L30.95 -14.05 Q31.6 -12.45 33.75 -12.45 36.45 -12.45 36.45 -15.35 36.45 -18.15 33.6 -18.3 M39.7 -12.3 L39.8 -12.25 39.8 -12.3 39.7 -12.3 M36.75 -5.45 L37.0 -4.2 Q37.5 -2.95 38.7 -2.65 L37.7 -1.9 Q35.85 -0.2 35.85 2.05 L37.0 4.8 Q38.75 7.35 42.0 7.35 44.8 7.35 46.45 4.95 47.6 3.25 47.6 1.9 47.6 -1.3 45.75 -2.8 44.3 -4.05 42.2 -3.85 L42.45 -5.2 Q42.45 -7.9 39.6 -8.15 36.75 -8.45 36.75 -5.45 M49.25 -15.15 L47.75 -16.65 Q46.35 -18.5 46.35 -20.3 46.35 -21.5 47.65 -24.3 L49.1 -27.3 Q49.4 -29.25 51.1 -30.95 L52.05 -31.05 Q55.1 -30.35 54.8 -28.35 L54.8 -27.9 Q55.2 -28.25 56.2 -28.5 L58.05 -28.8 Q60.9 -28.8 63.5 -27.0 66.25 -25.05 66.25 -22.65 66.25 -18.55 60.3 -16.45 56.2 -15.05 51.85 -15.05 L49.25 -15.15 M56.45 -17.35 Q58.7 -17.35 60.15 -19.4 61.2 -20.9 61.2 -22.15 61.2 -25.85 56.9 -25.15 52.55 -24.45 52.55 -21.35 L53.0 -19.35 Q54.0 -17.35 56.45 -17.35 M53.55 -24.95 Q53.55 -27.4 51.35 -27.45 49.1 -27.45 49.1 -24.9 49.0 -24.25 49.2 -23.7 49.6 -22.6 51.15 -22.6 53.55 -22.6 53.55 -24.95 M44.1 -7.05 L43.4 -6.8 43.4 -6.35 44.1 -7.05 M48.45 20.05 L48.5 18.85 48.95 19.15 Q51.95 20.95 54.6 20.95 56.15 20.95 57.6 20.1 59.4 19.0 59.4 17.3 59.4 15.55 58.35 13.9 57.1 11.9 54.8 10.9 L58.5 10.45 58.5 8.15 55.6 7.7 53.45 7.25 50.65 7.5 50.95 6.8 51.7 6.0 52.2 5.45 Q53.9 4.5 55.7 4.5 58.1 4.5 63.05 7.7 68.55 11.25 68.55 14.3 68.55 15.8 66.7 17.3 65.0 18.7 63.5 18.7 L62.7 18.6 62.15 17.75 61.7 17.75 62.35 18.4 62.7 18.6 63.2 19.35 63.5 20.75 Q63.5 22.7 60.3 24.2 57.45 25.55 54.8 25.55 51.85 25.55 50.35 24.45 48.8 23.25 48.5 20.55 48.85 20.05 48.45 20.05 M83.15 -11.3 L89.5 -12.15 Q99.65 -13.85 99.65 -16.7 99.65 -18.6 96.9 -19.65 94.5 -20.55 90.95 -20.55 L87.75 -19.85 85.1 -19.15 86.15 -20.55 Q87.1 -21.8 87.3 -22.85 L83.15 -22.85 81.3 -21.6 81.7 -23.75 83.0 -24.45 Q85.45 -25.55 86.85 -25.55 L89.45 -25.4 Q90.7 -25.0 90.05 -23.3 90.75 -24.35 92.3 -24.6 L95.5 -24.65 Q97.85 -24.65 100.55 -22.35 103.3 -20.05 103.3 -18.05 103.3 -16.3 100.2 -14.1 97.5 -12.2 93.75 -11.0 L93.6 -10.95 Q93.05 -9.1 90.5 -7.95 89.0 -7.25 87.3 -7.0 L87.05 -7.05 Q85.45 -7.7 83.15 -10.95 L83.15 -11.3 M131.15 -9.5 L131.65 -10.5 125.25 -10.5 Q122.9 -9.6 119.0 -9.05 L117.85 -8.9 117.8 -9.1 Q117.8 -10.35 119.2 -11.05 120.75 -11.85 124.35 -12.15 124.5 -12.3 124.25 -12.65 123.9 -13.2 123.9 -13.8 123.9 -14.15 128.15 -16.4 L132.8 -16.9 135.3 -16.45 Q135.75 -16.15 135.75 -15.3 135.75 -14.95 133.95 -13.25 140.45 -13.15 147.9 -10.75 160.0 -6.85 160.0 1.1 160.0 3.9 157.85 5.4 155.0 6.3 151.5 6.3 130.4 6.3 126.8 2.85 L149.5 1.35 149.5 0.9 143.85 0.0 Q138.3 -0.8 136.7 -1.35 L132.1 -1.35 Q134.6 -1.85 135.7 -2.7 L154.05 -2.7 154.05 -3.6 Q150.5 -6.85 143.25 -8.65 136.65 -10.3 131.15 -9.5 M75.7 3.95 Q79.05 5.35 79.05 6.55 79.05 7.65 77.25 8.65 75.6 9.55 74.25 9.55 L71.75 9.1 Q70.35 8.3 70.35 6.05 70.35 5.55 71.5 4.3 L72.85 3.0 75.7 3.95" fill="#f76f09" fill-rule="evenodd" stroke="none"/>
    <path d="M75.0 -41.6 Q76.3 -39.6 76.3 -37.95 76.3 -34.95 75.0 -33.8 L73.65 -33.1 75.05 -30.7 Q76.2 -28.15 76.2 -24.75 76.2 -23.0 75.05 -20.5 L74.95 -20.3 Q73.85 -18.05 72.2 -15.95 69.55 -12.65 67.9 -11.75 64.55 -10.0 56.85 -10.0 48.2 -10.0 45.85 -14.95 L45.5 -15.85 Q44.8 -18.0 45.2 -20.45 45.2 -24.05 46.25 -27.0 47.45 -30.4 50.05 -33.0 54.35 -37.4 60.7 -38.05 62.9 -38.3 64.9 -38.0 L64.9 -39.3 Q65.45 -40.5 67.5 -42.05 69.8 -43.85 71.55 -43.85 73.45 -43.85 75.0 -41.6 M49.25 -15.15 Q51.5 -13.5 55.25 -13.5 58.5 -13.5 64.4 -16.6 71.65 -20.4 71.65 -24.95 71.65 -26.05 70.4 -28.05 69.0 -30.4 66.95 -32.1 61.25 -36.9 54.95 -33.6 52.55 -32.35 51.1 -30.95 49.4 -29.25 49.1 -27.3 L47.65 -24.3 Q46.35 -21.5 46.35 -20.3 46.35 -18.5 47.75 -16.65 L49.25 -15.15 M53.75 3.95 L54.7 3.0 Q55.55 2.25 59.3 1.75 L63.0 1.35 Q64.3 0.65 66.75 -2.4 69.5 -4.45 75.05 -4.95 L78.6 -5.1 Q86.05 -2.6 89.5 2.1 92.1 5.7 92.1 10.15 92.1 14.1 90.95 17.45 89.4 21.9 85.95 24.4 L82.55 25.8 Q79.95 26.7 79.75 26.9 L78.6 28.5 77.1 30.35 75.05 32.2 72.65 33.95 Q69.7 35.6 65.3 35.6 56.55 35.6 51.7 29.45 48.4 25.25 48.4 21.9 L48.4 21.75 Q48.95 25.8 51.05 28.15 53.3 30.6 56.4 30.6 61.2 30.6 65.8 28.35 71.3 25.65 71.3 21.4 71.3 20.3 71.1 20.05 L69.45 19.15 72.5 19.6 75.85 20.05 Q81.7 20.05 84.15 18.25 86.85 16.25 86.85 11.1 86.85 5.4 83.2 2.25 79.55 -0.9 73.1 -0.9 69.45 -0.9 67.15 0.9 64.9 2.65 64.9 5.4 64.9 6.05 65.15 6.35 L65.35 6.8 64.9 6.8 Q64.35 4.3 63.15 3.3 61.9 2.25 59.15 2.25 57.4 2.25 54.95 3.35 L53.75 3.95 M82.3 -25.7 Q84.65 -32.0 90.95 -31.2 92.1 -31.05 95.0 -31.8 L100.35 -32.55 Q102.3 -32.25 104.85 -30.6 L107.55 -28.45 110.75 -23.4 Q111.4 -22.0 111.4 -19.15 111.4 -13.85 108.25 -9.9 103.6 -4.1 93.4 -4.1 88.1 -4.1 84.9 -6.6 L82.95 -8.65 Q82.0 -9.9 81.55 -11.2 L83.15 -11.3 83.15 -10.95 Q85.45 -7.7 87.05 -7.05 L87.3 -7.0 90.95 -6.8 Q99.4 -6.8 103.3 -9.55 107.4 -12.45 107.4 -19.0 107.4 -22.8 104.65 -25.15 101.9 -27.45 97.35 -27.45 96.2 -27.45 95.0 -26.75 94.15 -26.3 93.15 -26.15 93.7 -26.35 93.7 -27.45 93.7 -28.75 92.8 -29.25 L90.2 -29.7 Q87.9 -29.7 84.9 -27.8 L82.3 -25.7 M85.1 -19.15 L85.05 -19.15 84.7 -19.15 85.1 -19.15 M93.15 -26.15 L92.8 -26.1 92.45 -26.1 93.15 -26.15 M135.35 -20.05 Q138.6 -21.55 142.85 -21.45 147.05 -21.4 153.15 -19.8 156.75 -18.35 157.8 -15.65 158.9 -12.85 161.4 -11.75 164.4 -10.45 165.8 -8.05 166.85 -6.2 166.85 -4.05 166.85 -0.85 163.4 2.25 L161.05 4.0 Q161.85 1.9 161.85 -0.65 161.85 -9.75 151.95 -12.65 148.8 -13.6 144.55 -13.9 L141.3 -14.05 Q142.0 -14.1 142.55 -14.5 143.55 -15.2 143.55 -16.7 143.55 -17.75 142.2 -18.7 140.25 -20.1 136.65 -20.1 L135.35 -20.05 M131.15 -9.5 Q130.45 -8.85 128.9 -9.1 L131.15 -9.5 M159.8 -36.05 Q161.65 -37.45 165.25 -37.45 168.45 -37.45 170.1 -35.65 171.45 -34.2 171.45 -32.0 171.45 -27.55 166.9 -24.7 163.2 -22.35 159.55 -22.35 157.75 -22.35 156.1 -22.9 158.8 -23.15 160.9 -24.65 163.2 -26.3 163.2 -28.1 L162.3 -29.65 160.9 -31.05 Q161.85 -31.1 162.75 -31.9 163.65 -32.75 163.65 -33.55 163.65 -34.65 163.25 -35.2 162.45 -36.1 160.25 -36.1 L159.8 -36.05 M200.35 -16.55 L200.65 -16.65 Q206.2 -18.3 206.2 -21.45 206.2 -23.5 202.55 -25.15 199.45 -26.55 197.0 -26.55 L196.65 -26.55 197.2 -26.95 Q199.15 -28.2 201.85 -28.25 204.6 -28.3 206.5 -27.05 208.6 -25.65 208.6 -23.1 208.6 -21.05 206.95 -19.15 204.65 -16.55 200.45 -16.55 L200.35 -16.55 M182.65 -17.05 Q184.95 -16.85 185.85 -15.1 186.3 -14.2 186.3 -12.85 186.3 -8.9 181.95 -8.9 179.6 -8.9 178.55 -9.95 179.25 -9.55 180.15 -9.55 182.35 -9.55 183.85 -10.95 185.15 -12.15 185.15 -13.5 L184.05 -15.25 182.65 -17.05 M210.55 -18.0 Q213.15 -18.05 213.15 -15.0 213.15 -13.9 212.6 -13.25 212.0 -12.45 210.75 -12.45 208.85 -12.45 208.15 -14.05 L207.9 -15.45 Q207.9 -18.0 210.55 -18.0 M216.25 -1.35 L222.0 -2.25 Q227.25 -2.6 230.7 -1.1 234.65 0.55 234.65 4.05 234.65 6.85 231.9 8.5 228.55 10.55 221.75 10.55 215.25 10.55 211.85 8.15 L211.1 7.55 217.55 6.5 Q223.2 5.0 224.55 3.15 223.8 1.65 221.35 0.55 219.15 -0.45 217.4 -0.45 L216.7 -0.4 216.7 -0.9 Q216.4 -0.9 216.3 -1.1 L216.25 -1.35 M216.7 -0.4 L216.7 0.0 214.45 0.45 Q214.8 0.1 215.65 -0.15 L216.7 -0.4 M169.75 11.45 L170.2 11.8 171.6 12.95 171.7 13.25 Q172.2 15.1 173.75 16.85 176.15 19.6 179.2 19.6 182.4 19.6 182.4 16.2 L182.15 15.15 Q182.8 16.05 183.55 16.3 L185.85 16.4 Q187.95 16.4 190.65 14.1 193.85 11.45 193.85 8.15 193.85 6.6 192.9 5.3 195.45 5.85 196.5 7.4 197.3 8.6 197.3 10.9 197.3 11.65 196.55 12.55 195.7 13.55 195.45 14.85 L195.4 16.6 195.2 18.55 Q194.65 20.3 191.25 22.3 187.7 24.4 184.7 24.4 177.55 24.4 172.9 19.05 169.5 15.15 169.5 12.8 169.5 12.15 169.75 11.45 M129.8 13.05 Q130.75 14.7 130.75 16.1 130.75 19.3 129.25 21.75 126.65 26.0 120.2 26.0 112.55 26.0 109.75 22.1 L110.8 22.7 Q114.75 24.65 119.75 24.65 124.05 24.65 127.15 20.5 129.8 16.95 129.8 13.65 L129.8 13.05" fill="#5a1403" fill-rule="evenodd" stroke="none"/>
    <path d="M51.1 -30.95 Q52.55 -32.35 54.95 -33.6 61.25 -36.9 66.95 -32.1 69.0 -30.4 70.4 -28.05 71.65 -26.05 71.65 -24.95 71.65 -20.4 64.4 -16.6 58.5 -13.5 55.25 -13.5 51.5 -13.5 49.25 -15.15 L51.85 -15.05 Q56.2 -15.05 60.3 -16.45 66.25 -18.55 66.25 -22.65 66.25 -25.05 63.5 -27.0 60.9 -28.8 58.05 -28.8 L56.2 -28.5 Q55.2 -28.25 54.8 -27.9 L54.8 -28.35 Q55.1 -30.35 52.05 -31.05 L51.1 -30.95 M48.4 21.75 L48.45 20.05 Q48.85 20.05 48.5 20.55 48.8 23.25 50.35 24.45 51.85 25.55 54.8 25.55 57.45 25.55 60.3 24.2 63.5 22.7 63.5 20.75 L63.2 19.35 62.7 18.6 62.35 18.4 61.7 17.75 62.15 17.75 62.7 18.6 63.5 18.7 Q65.0 18.7 66.7 17.3 68.55 15.8 68.55 14.3 68.55 11.25 63.05 7.7 58.1 4.5 55.7 4.5 53.9 4.5 52.2 5.45 L53.75 3.95 54.95 3.35 Q57.4 2.25 59.15 2.25 61.9 2.25 63.15 3.3 64.35 4.3 64.9 6.8 L65.35 6.8 65.15 6.35 Q64.9 6.05 64.9 5.4 64.9 2.65 67.15 0.9 69.45 -0.9 73.1 -0.9 79.55 -0.9 83.2 2.25 86.85 5.4 86.85 11.1 86.85 16.25 84.15 18.25 81.7 20.05 75.85 20.05 L72.5 19.6 69.45 19.15 71.1 20.05 Q71.3 20.3 71.3 21.4 71.3 25.65 65.8 28.35 61.2 30.6 56.4 30.6 53.3 30.6 51.05 28.15 48.95 25.8 48.4 21.75 M81.7 -23.75 L81.75 -24.1 81.8 -24.25 82.3 -25.7 84.9 -27.8 Q87.9 -29.7 90.2 -29.7 L92.8 -29.25 Q93.7 -28.75 93.7 -27.45 93.7 -26.35 93.15 -26.15 94.15 -26.3 95.0 -26.75 96.2 -27.45 97.35 -27.45 101.9 -27.45 104.65 -25.15 107.4 -22.8 107.4 -19.0 107.4 -12.45 103.3 -9.55 99.4 -6.8 90.95 -6.8 L87.3 -7.0 Q89.0 -7.25 90.5 -7.95 93.05 -9.1 93.6 -10.95 L93.75 -11.0 Q97.5 -12.2 100.2 -14.1 103.3 -16.3 103.3 -18.05 103.3 -20.05 100.55 -22.35 97.85 -24.65 95.5 -24.65 L92.3 -24.6 Q90.75 -24.35 90.05 -23.3 90.7 -25.0 89.45 -25.4 L86.85 -25.55 Q85.45 -25.55 83.0 -24.45 L81.7 -23.75 M93.15 -26.15 L92.45 -26.1 92.8 -26.1 93.15 -26.15 M128.15 -16.4 L135.1 -19.95 135.35 -20.05 136.65 -20.1 Q140.25 -20.1 142.2 -18.7 143.55 -17.75 143.55 -16.7 143.55 -15.2 142.55 -14.5 142.0 -14.1 141.3 -14.05 L144.55 -13.9 Q148.8 -13.6 151.95 -12.65 161.85 -9.75 161.85 -0.65 161.85 1.9 161.05 4.0 159.55 4.85 157.85 5.4 160.0 3.9 160.0 1.1 160.0 -6.85 147.9 -10.75 140.45 -13.15 133.95 -13.25 135.75 -14.95 135.75 -15.3 135.75 -16.15 135.3 -16.45 L132.8 -16.9 128.15 -16.4 M156.1 -22.9 Q154.3 -23.45 152.7 -24.65 149.7 -26.85 149.55 -29.5 149.6 -30.4 150.1 -31.15 L150.6 -31.8 151.25 -32.35 Q152.65 -33.35 154.05 -33.35 L154.95 -33.25 155.45 -32.0 158.25 -34.65 159.2 -35.6 159.8 -36.05 160.25 -36.1 Q162.45 -36.1 163.25 -35.2 163.65 -34.65 163.65 -33.55 163.65 -32.75 162.75 -31.9 161.85 -31.1 160.9 -31.05 L162.3 -29.65 163.2 -28.1 Q163.2 -26.3 160.9 -24.65 158.8 -23.15 156.1 -22.9 M196.65 -26.55 L197.0 -26.55 Q199.45 -26.55 202.55 -25.15 206.2 -23.5 206.2 -21.45 206.2 -18.3 200.65 -16.65 L200.35 -16.55 Q196.55 -16.6 195.45 -19.85 194.9 -21.5 195.1 -23.3 195.1 -25.25 196.65 -26.55 M178.55 -9.95 L177.85 -10.95 Q177.4 -11.95 177.6 -13.05 177.6 -17.1 181.95 -17.1 L182.65 -17.05 184.05 -15.25 185.15 -13.5 Q185.15 -12.15 183.85 -10.95 182.35 -9.55 180.15 -9.55 179.25 -9.55 178.55 -9.95 M211.1 7.55 Q209.3 5.95 209.3 4.05 209.3 1.6 213.25 -0.25 214.65 -0.9 216.25 -1.35 L216.3 -1.1 Q216.4 -0.9 216.7 -0.9 L216.7 -0.4 217.4 -0.45 Q219.15 -0.45 221.35 0.55 223.8 1.65 224.55 3.15 223.2 5.0 217.55 6.5 L211.1 7.55 M192.9 5.3 Q193.85 6.6 193.85 8.15 193.85 11.45 190.65 14.1 187.95 16.4 185.85 16.4 L183.55 16.3 Q182.8 16.05 182.15 15.15 L182.4 16.2 Q182.4 19.6 179.2 19.6 176.15 19.6 173.75 16.85 172.2 15.1 171.7 13.25 L171.6 12.95 170.2 11.8 169.75 11.45 Q169.95 10.65 170.5 9.8 172.1 7.2 175.3 7.2 177.4 7.2 178.45 8.75 179.55 10.25 181.45 10.25 185.1 10.25 186.2 8.8 L186.65 7.05 Q186.9 6.3 188.6 5.55 190.1 4.85 190.65 4.95 L192.9 5.3 M216.7 -0.4 L215.65 -0.15 Q214.8 0.1 214.45 0.45 L216.7 0.0 216.7 -0.4 M129.8 13.05 L129.8 13.65 Q129.8 16.95 127.15 20.5 124.05 24.65 119.75 24.65 114.75 24.65 110.8 22.7 L109.75 22.1 109.25 21.35 Q108.45 19.9 108.3 18.1 L108.35 16.85 108.8 17.3 Q111.8 20.05 115.85 20.05 119.15 20.05 121.15 17.3 122.95 14.75 122.95 11.1 122.95 7.95 122.3 6.45 124.95 7.3 127.35 9.85 128.95 11.55 129.8 13.05 M75.7 3.95 L72.85 3.0 71.5 4.3 Q70.35 5.55 70.35 6.05 70.35 8.3 71.75 9.1 L74.25 9.55 Q75.6 9.55 77.25 8.65 79.05 7.65 79.05 6.55 79.05 5.35 75.7 3.95" fill="#ac2706" fill-rule="evenodd" stroke="none"/>
  </g>
</svg>
