<?xml version="1.0" encoding="UTF-8" standalone="no"?>
<svg xmlns:xlink="http://www.w3.org/1999/xlink" height="51.05px" width="56.1px" xmlns="http://www.w3.org/2000/svg">
  <g transform="matrix(1.0, 0.0, 0.0, 1.0, 40.25, 51.2)">
    <path d="M7.4 -36.7 L15.85 -0.15 7.25 -9.5 -0.65 -51.2 7.4 -36.7" fill="url(#gradient0)" fill-rule="evenodd" stroke="none"/>
    <path d="M7.25 -9.5 L15.85 -0.15 -20.25 -0.5 -40.25 -5.45 7.25 -9.5" fill="url(#gradient1)" fill-rule="evenodd" stroke="none"/>
    <path d="M-40.25 -5.45 L-0.65 -51.2 7.25 -9.5 -40.25 -5.45" fill="url(#gradient2)" fill-rule="evenodd" stroke="none"/>
  </g>
  <defs>
    <linearGradient gradientTransform="matrix(0.0, 0.0, 0.0, 0.0, 0.0, 0.0)" gradientUnits="userSpaceOnUse" id="gradient0" spreadMethod="pad" x1="-819.2" x2="819.2">
      <stop offset="0.0" stop-color="#ab7d66"/>
      <stop offset="0.5411764705882353" stop-color="#8f6650"/>
      <stop offset="1.0" stop-color="#876f64"/>
    </linearGradient>
    <linearGradient gradientTransform="matrix(-0.0054, 0.0216, -0.0099, -0.0023, -6.9, 1.3)" gradientUnits="userSpaceOnUse" id="gradient1" spreadMethod="pad" x1="-819.2" x2="819.2">
      <stop offset="0.0" stop-color="#ab5428"/>
      <stop offset="0.5411764705882353" stop-color="#7d492b"/>
      <stop offset="1.0" stop-color="#7d685d"/>
    </linearGradient>
    <linearGradient gradientTransform="matrix(-0.0038, -0.0738, 0.1054, -0.0108, 43.05, -35.6)" gradientUnits="userSpaceOnUse" id="gradient2" spreadMethod="pad" x1="-819.2" x2="819.2">
      <stop offset="0.0" stop-color="#e35202"/>
      <stop offset="0.36470588235294116" stop-color="#ed8e02"/>
      <stop offset="0.6980392156862745" stop-color="#ede102"/>
      <stop offset="1.0" stop-color="#fefda3"/>
    </linearGradient>
  </defs>
</svg>
