<?xml version="1.0" encoding="UTF-8" standalone="no"?>
<svg xmlns:xlink="http://www.w3.org/1999/xlink" height="15.6px" width="18.2px" xmlns="http://www.w3.org/2000/svg">
  <g transform="matrix(1.0, 0.0, 0.0, 1.0, -7.45, -6.4)">
    <path d="M16.55 22.0 Q12.8 22.0 10.1 19.7 7.45 17.45 7.45 14.2 7.45 10.95 10.1 8.65 12.8 6.4 16.55 6.4 20.3 6.4 22.95 8.65 25.65 10.95 25.65 14.2 25.65 17.45 22.95 19.7 20.3 22.0 16.55 22.0" fill="url(#gradient0)" fill-rule="evenodd" stroke="none"/>
  </g>
  <defs>
    <radialGradient cx="0" cy="0" fx="41.6" fy="0" gradientTransform="matrix(0.0, -0.0091, 0.0105, 0.0, 16.45, 14.15)" gradientUnits="userSpaceOnUse" id="gradient0" r="819.2" spreadMethod="pad">
      <stop offset="0.0" stop-color="#fa3000"/>
      <stop offset="0.4745098039215686" stop-color="#fa3000" stop-opacity="0.6431373"/>
      <stop offset="1.0" stop-color="#e00505" stop-opacity="0.0"/>
    </radialGradient>
  </defs>
</svg>
