<?xml version="1.0" encoding="UTF-8" standalone="no"?>
<svg xmlns:xlink="http://www.w3.org/1999/xlink" height="68.6px" width="65.1px" xmlns="http://www.w3.org/2000/svg">
  <g transform="matrix(1.0, 0.0, 0.0, 1.0, 32.55, 33.2)">
    <path d="M20.2 -26.6 L32.55 -9.45 32.55 11.65 20.2 28.8 0.0 35.4 -20.2 28.8 -32.55 11.65 -32.55 -9.45 -20.2 -26.6 0.0 -33.2 20.2 -26.6 M11.3 -14.45 L10.7 -14.65 -10.2 -14.65 -10.8 -14.45 -11.15 -13.95 -17.55 5.85 -17.55 6.45 -17.2 6.95 -0.35 19.25 0.25 19.45 0.85 19.25 17.7 6.95 18.05 6.45 18.05 5.85 11.65 -13.95 11.3 -14.45 M7.95 -10.85 L12.75 -4.15 12.75 4.15 7.95 10.85 0.0 13.4 -7.95 10.85 -12.75 4.15 -12.75 -4.15 -7.95 -10.85 0.0 -13.4 7.95 -10.85 M16.45 -16.3 Q19.5 -13.25 21.2 -9.65 23.25 -5.2 23.25 0.1 23.25 5.4 21.2 9.8 19.5 13.4 16.45 16.45 10.85 22.1 3.2 23.05 L3.2 26.15 Q12.15 25.15 18.65 18.55 22.15 15.15 24.05 11.0 26.4 6.0 26.4 0.0 26.4 -6.05 24.05 -11.05 22.15 -15.2 18.65 -18.6 12.15 -25.25 3.2 -26.2 L3.2 -22.95 Q10.85 -22.0 16.45 -16.3 M-18.65 -18.6 Q-26.4 -10.95 -26.4 0.0 -26.4 10.9 -18.65 18.55 L-15.3 21.5 Q-10.0 25.4 -3.2 26.15 L-3.2 23.05 Q-8.95 22.35 -13.45 19.05 L-16.45 16.45 Q-23.25 9.7 -23.25 0.1 -23.25 -9.55 -16.45 -16.3 L-13.45 -18.9 Q-8.95 -22.25 -3.2 -22.95 L-3.2 -26.2 Q-10.0 -25.5 -15.3 -21.55 L-18.65 -18.6" fill="#000000" fill-rule="evenodd" stroke="none"/>
  </g>
</svg>
