<?xml version="1.0" encoding="UTF-8" standalone="no"?>
<svg xmlns:xlink="http://www.w3.org/1999/xlink" height="3.85px" width="46.7px" xmlns="http://www.w3.org/2000/svg">
  <g transform="matrix(1.0, 0.0, 0.0, 1.0, 46.7, 1.9)">
    <path d="M0.0 -0.1 L0.0 0.8 -44.55 0.8 -44.55 -0.1 0.0 -0.1" fill="#303030" fill-rule="evenodd" stroke="none"/>
    <path d="M0.0 0.8 L0.0 1.95 -44.55 1.95 -44.55 0.8 0.0 0.8 M-44.55 -1.9 L0.0 -1.9 0.0 -1.35 -44.55 -1.35 -44.55 -1.9" fill="#4d4d4d" fill-rule="evenodd" stroke="none"/>
    <path d="M0.0 -1.35 L0.0 -0.65 -44.55 -0.65 -44.55 -1.35 0.0 -1.35" fill="#bdbdbd" fill-rule="evenodd" stroke="none"/>
    <path d="M0.0 -0.65 L0.0 -0.1 -44.55 -0.1 -44.55 -0.65 0.0 -0.65" fill="#8c8c8c" fill-rule="evenodd" stroke="none"/>
    <path d="M-44.55 1.95 L-46.7 1.95 -46.7 -1.9 -44.55 -1.9 -44.55 -1.35 -44.55 -0.65 -44.55 -0.1 -44.55 0.8 -44.55 1.95" fill="#121212" fill-rule="evenodd" stroke="none"/>
    <path d="M0.0 1.95 L-30.7 1.95 -30.7 -1.9 0.0 -1.9 0.0 1.95" fill="url(#gradient0)" fill-rule="evenodd" stroke="none"/>
  </g>
  <defs>
    <linearGradient gradientTransform="matrix(-0.0189, 0.0, 0.0, -0.0196, -14.65, -14.25)" gradientUnits="userSpaceOnUse" id="gradient0" spreadMethod="pad" x1="-819.2" x2="819.2">
      <stop offset="0.0" stop-color="#000000" stop-opacity="0.54901963"/>
      <stop offset="1.0" stop-color="#000000" stop-opacity="0.0"/>
    </linearGradient>
  </defs>
</svg>
