<?xml version="1.0" encoding="UTF-8" standalone="no"?>
<svg xmlns:xlink="http://www.w3.org/1999/xlink" height="4.25px" width="10.35px" xmlns="http://www.w3.org/2000/svg">
  <g transform="matrix(1.0, 0.0, 0.0, 1.0, 6.1, 2.55)">
    <path d="M-2.5 -0.35 L-2.65 -0.35 -2.9 -0.35 -3.95 0.0 -4.1 -0.3 -4.05 -0.3 -3.75 -0.4 -3.4 -0.55 -3.95 -0.15 Q-0.75 -1.25 0.4 -1.25 L2.15 -1.2 3.4 -1.2 4.25 -1.15 3.7 -0.75 3.65 -0.7 3.55 -0.65 3.15 -0.55 2.7 -0.55 1.35 -0.45 1.35 -0.55 1.8 -0.8 1.75 -0.8 0.3 -0.6 -1.1 -0.6 -0.4 -1.0 -0.45 -1.0 -2.5 -0.35" fill="#b38484" fill-rule="evenodd" stroke="none"/>
    <path d="M-3.4 -0.55 L-3.35 -0.55 -3.0 -0.65 -2.5 -0.85 -2.4 -0.9 Q-0.35 -1.65 1.3 -1.65 L4.05 -1.45 4.25 -1.25 4.25 -1.15 3.4 -1.2 2.15 -1.2 0.4 -1.25 Q-0.75 -1.25 -3.95 -0.15 L-3.4 -0.55" fill="#c29c9c" fill-rule="evenodd" stroke="none"/>
    <path d="M3.2 -0.35 Q3.65 -0.35 3.95 0.05 1.55 1.7 0.1 1.7 -0.6 1.7 -1.8 1.05 -2.9 0.5 -3.4 0.45 L-3.05 0.25 -1.9 0.65 0.0 1.05 1.9 0.75 Q3.2 0.4 3.5 0.0 L3.15 -0.3 3.2 -0.35" fill="#a36a6a" fill-opacity="0.3529412" fill-rule="evenodd" stroke="none"/>
    <path d="M2.85 -0.15 Q2.7 0.2 2.1 0.2 L2.05 0.0 Q2.05 -0.25 2.65 -0.25 L2.85 -0.15 M1.85 0.5 Q1.55 0.5 1.55 0.2 L1.65 0.0 1.9 -0.05 2.05 0.3 1.85 0.5 M0.9 0.4 L0.85 0.25 0.9 0.1 1.25 0.1 1.3 0.25 1.2 0.4 0.9 0.4 M-3.15 -1.05 L-3.2 -1.2 Q-2.4 -2.35 -1.35 -2.55 L-0.85 -2.2 -0.65 -1.9 -0.8 -1.8 -1.3 -1.45 -3.15 -1.05 M-1.7 0.25 L-2.35 0.2 -2.4 0.05 Q-1.5 -0.3 -1.5 0.05 L-1.7 0.25" fill="#f2eaea" fill-opacity="0.7254902" fill-rule="evenodd" stroke="none"/>
    <path d="M0.25 -0.25 L-2.5 -0.35 -0.45 -1.0 -0.4 -1.0 -1.1 -0.6 0.3 -0.6 1.75 -0.8 1.8 -0.8 1.35 -0.55 1.35 -0.45 2.7 -0.55 3.15 -0.55 2.1 -0.3 0.25 -0.3 0.25 -0.25" fill="#946d6d" fill-rule="evenodd" stroke="none"/>
    <path d="M-3.95 0.0 L-4.1 0.15 -4.65 0.35 -5.25 0.25 -6.05 0.05 -6.1 -0.1 -6.05 -0.15 -6.05 -0.2 -4.55 -1.15 -4.4 -1.1 -4.7 -0.5 -4.05 -0.3 -4.1 -0.3 -3.95 0.0" fill="#b38484" fill-opacity="0.3137255" fill-rule="evenodd" stroke="none"/>
    <path d="M0.25 -0.3 L0.4 -0.25 0.25 -0.25 -2.5 -0.35 M-2.65 -0.35 L-2.9 -0.35 M-4.05 -0.3 L-3.75 -0.4 -3.4 -0.55 -3.35 -0.55 -3.0 -0.65 M-2.4 -0.9 Q-0.35 -1.65 1.3 -1.65 L4.05 -1.45 4.25 -1.25 4.25 -1.15 3.7 -0.75 3.65 -0.7 3.55 -0.65 3.15 -0.55 2.1 -0.3 0.25 -0.3 M-4.1 -0.3 L-4.05 -0.3" fill="none" stroke="#a36a6a" stroke-linecap="round" stroke-linejoin="round" stroke-opacity="0.4" stroke-width="0.05"/>
  </g>
</svg>
