<?xml version="1.0" encoding="UTF-8" standalone="no"?>
<svg xmlns:xlink="http://www.w3.org/1999/xlink" height="3.6px" width="3.0px" xmlns="http://www.w3.org/2000/svg">
  <g transform="matrix(1.0, 0.0, 0.0, 1.0, 111.5, 7.85)">
    <path d="M-109.9 -4.25 Q-111.5 -4.25 -111.5 -6.05 -111.5 -7.7 -110.0 -7.85 -108.5 -7.95 -108.5 -6.5 -108.5 -4.25 -109.9 -4.25" fill="#000000" fill-rule="evenodd" stroke="none"/>
  </g>
</svg>
