<?xml version="1.0" encoding="UTF-8" standalone="no"?>
<svg xmlns:xlink="http://www.w3.org/1999/xlink" height="48.7px" width="75.55px" xmlns="http://www.w3.org/2000/svg">
  <g transform="matrix(1.0, 0.0, 0.0, 1.0, 34.25, 57.9)">
    <path d="M-32.85 -11.25 L39.9 -10.05 5.2 -57.9 -32.85 -11.25" fill="url(#gradient0)" fill-rule="evenodd" stroke="none">
      <animate attributeName="d" dur="2s" repeatCount="indefinite" values="M-32.85 -11.25 L39.9 -10.05 5.2 -57.9 -32.85 -11.25;M-34.25 -12.35 L41.3 -9.2 5.25 -56.1 -34.25 -12.35"/>
    </path>
    <path d="M-32.85 -11.25 L5.2 -57.9 39.9 -10.05 -32.85 -11.25" fill="none" stroke="#000000" stroke-linecap="round" stroke-linejoin="round" stroke-opacity="0.0" stroke-width="1.0">
      <animate attributeName="stroke" dur="2s" repeatCount="indefinite" values="#000000;#000001"/>
      <animate attributeName="stroke-width" dur="2s" repeatCount="indefinite" values="0.0;0.0"/>
      <animate attributeName="fill-opacity" dur="2s" repeatCount="indefinite" values="0.0;0.0"/>
      <animate attributeName="d" dur="2s" repeatCount="indefinite" values="M-32.85 -11.25 L5.2 -57.9 39.9 -10.05 -32.85 -11.25;M-34.25 -12.35 L5.25 -56.1 41.3 -9.2 -34.25 -12.35"/>
    </path>
  </g>
  <defs>
    <linearGradient gradientTransform="matrix(-0.0085, -0.043, 0.0385, -0.0105, -3.0, -25.8)" gradientUnits="userSpaceOnUse" id="gradient0" spreadMethod="pad" x1="-819.2" x2="819.2">
      <animateTransform additive="replace" attributeName="gradientTransform" dur="2s" from="1" repeatCount="indefinite" to="1" type="scale"/>
      <animateTransform additive="sum" attributeName="gradientTransform" dur="2s" from="-3.0 -25.8" repeatCount="indefinite" to="-3.25 -25.55" type="translate"/>
      <animateTransform additive="sum" attributeName="gradientTransform" dur="2s" from="-101.2043" repeatCount="indefinite" to="-102.0171" type="rotate"/>
      <animateTransform additive="sum" attributeName="gradientTransform" dur="2s" from="0.0438 0.0398" repeatCount="indefinite" to="0.0424 0.041" type="scale"/>
      <animateTransform additive="sum" attributeName="gradientTransform" dur="2s" from="3.6244" repeatCount="indefinite" to="0.6347" type="skewX"/>
      <stop offset="0.0" stop-color="#e35202">
        <animate attributeName="offset" dur="2s" repeatCount="indefinite" values="0.0;0.0"/>
        <animate attributeName="stop-color" dur="2s" repeatCount="indefinite" values="#e35202;#e35203"/>
        <animate attributeName="stop-opacity" dur="2s" repeatCount="indefinite" values="1.0;1.0"/>
      </stop>
      <stop offset="0.36470588235294116" stop-color="#ed8e02">
        <animate attributeName="offset" dur="2s" repeatCount="indefinite" values="0.36470588235294116;0.36470588235294116"/>
        <animate attributeName="stop-color" dur="2s" repeatCount="indefinite" values="#ed8e02;#ed8e03"/>
        <animate attributeName="stop-opacity" dur="2s" repeatCount="indefinite" values="1.0;1.0"/>
      </stop>
      <stop offset="0.6980392156862745" stop-color="#ede102">
        <animate attributeName="offset" dur="2s" repeatCount="indefinite" values="0.6980392156862745;0.6980392156862745"/>
        <animate attributeName="stop-color" dur="2s" repeatCount="indefinite" values="#ede102;#ede103"/>
        <animate attributeName="stop-opacity" dur="2s" repeatCount="indefinite" values="1.0;1.0"/>
      </stop>
      <stop offset="1.0" stop-color="#fefda3">
        <animate attributeName="offset" dur="2s" repeatCount="indefinite" values="1.0;1.0"/>
        <animate attributeName="stop-color" dur="2s" repeatCount="indefinite" values="#fefda3;#fefda4"/>
        <animate attributeName="stop-opacity" dur="2s" repeatCount="indefinite" values="1.0;1.0"/>
      </stop>
    </linearGradient>
  </defs>
</svg>
