<?xml version="1.0" encoding="UTF-8" standalone="no"?>
<svg xmlns:xlink="http://www.w3.org/1999/xlink" height="16.85px" width="46.0px" xmlns="http://www.w3.org/2000/svg">
  <g transform="matrix(1.0, 0.0, 0.0, 1.0, 0.0, -16.4)">
    <path d="M38.5 16.6 L38.5 16.55 38.5 16.6 M36.05 31.15 L36.05 31.1 36.25 31.15 36.05 31.15" fill="url(#gradient0)" fill-rule="evenodd" stroke="none"/>
    <path d="M43.05 23.2 L40.6 21.6 40.6 21.8 40.2 21.1 39.4 19.55 38.85 18.6 39.1 19.7 39.15 20.3 Q39.15 21.8 38.6 22.55 L38.15 20.1 38.0 19.5 38.0 20.15 37.5 24.75 36.8 28.15 36.6 28.95 36.35 28.2 35.85 25.65 35.45 23.15 35.15 22.15 Q34.65 20.3 34.5 19.2 L34.2 22.35 34.15 22.65 Q33.75 25.25 32.7 26.55 L32.7 23.45 32.55 23.45 32.45 25.5 Q32.4 27.25 31.8 28.85 L30.25 32.65 28.7 30.6 Q27.45 29.15 26.55 29.15 L17.35 27.75 Q16.4 28.1 15.55 29.95 14.6 31.9 14.6 32.85 L14.2 32.85 Q12.05 28.95 12.05 28.05 12.05 27.6 12.2 27.35 L12.35 27.0 11.9 27.35 12.1 24.75 12.45 23.35 12.3 23.3 11.3 24.75 9.3 27.3 10.0 24.1 10.2 22.55 10.05 22.55 8.95 24.8 8.25 25.8 8.35 24.9 7.2 26.15 6.0 27.6 5.35 28.55 3.7 31.55 3.7 33.25 3.25 32.3 3.05 31.75 2.85 30.7 Q2.85 28.7 3.75 26.9 L6.05 23.0 7.6 19.7 7.85 18.85 8.3 16.4 22.1 16.4 22.15 16.55 22.2 16.4 40.6 16.4 41.35 18.85 43.05 23.2 M38.5 16.6 L38.5 16.55 38.5 16.6" fill="#b38484" fill-rule="evenodd" stroke="none"/>
    <path d="M40.6 21.8 Q40.15 24.0 38.85 26.85 L36.95 30.25 36.6 28.95 36.8 28.15 37.5 24.75 38.0 20.15 38.0 19.5 38.15 20.1 38.6 22.55 Q39.15 21.8 39.15 20.3 L39.1 19.7 38.85 18.6 39.4 19.55 40.2 21.1 40.6 21.8 M35.85 25.65 L35.8 25.4 Q35.5 25.4 35.5 25.1 L30.65 33.2 30.25 32.65 31.8 28.85 Q32.4 27.25 32.45 25.5 L32.55 23.45 32.7 23.45 32.7 26.55 Q33.75 25.25 34.15 22.65 L34.2 22.35 34.5 19.2 Q34.65 20.3 35.15 22.15 L35.45 23.15 35.85 25.65 M11.9 27.35 L11.7 27.45 8.9 30.15 8.4 30.65 8.25 30.2 8.2 29.2 8.15 27.6 8.25 25.8 8.95 24.8 10.05 22.55 10.2 22.55 10.0 24.1 9.3 27.3 11.3 24.75 12.3 23.3 12.45 23.35 12.1 24.75 11.9 27.35 M3.05 31.75 Q2.35 30.05 2.2 28.7 L2.2 28.55 Q2.15 26.8 3.5 22.5 2.1 23.55 0.0 25.3 L0.9 23.1 1.75 20.6 Q2.15 19.0 2.15 17.5 L2.15 16.4 8.3 16.4 7.85 18.85 7.6 19.7 6.05 23.0 3.75 26.9 Q2.85 28.7 2.85 30.7 L3.05 31.75 M40.6 16.4 L42.4 16.4 42.45 17.15 42.75 19.15 Q43.5 22.5 46.0 25.2 L43.3 23.4 43.05 23.2 41.35 18.85 40.6 16.4 M3.5 22.5 L3.6 22.4 3.6 22.1 3.5 22.5" fill="#c29c9c" fill-rule="evenodd" stroke="none"/>
    <path d="M43.05 23.2 L40.6 21.6 40.6 21.8 Q40.15 24.0 38.85 26.85 L36.95 30.25 36.6 28.95 36.35 28.2 35.85 25.65 35.8 25.4 Q35.5 25.4 35.5 25.1 L30.65 33.2 30.25 32.65 28.7 30.6 Q27.45 29.15 26.55 29.15 L17.35 27.75 Q16.4 28.1 15.55 29.95 14.6 31.9 14.6 32.85 L14.2 32.85 Q12.05 28.95 12.05 28.05 12.05 27.6 12.2 27.35 L12.35 27.0 11.9 27.35 11.7 27.45 8.9 30.15 8.4 30.65 8.25 30.2 8.2 29.2 8.15 27.6 8.25 25.8 8.35 24.9 7.2 26.15 6.0 27.6 5.35 28.55 3.7 31.55 3.7 33.25 3.25 32.3 3.05 31.75 Q2.35 30.05 2.2 28.7 L2.2 28.55 Q2.15 26.8 3.5 22.5 2.1 23.55 0.0 25.3 L0.9 23.1 1.75 20.6 Q2.15 19.0 2.15 17.5 L2.15 16.4 M42.4 16.4 L42.45 17.15 42.75 19.15 Q43.5 22.5 46.0 25.2 L43.3 23.4 43.05 23.2 M3.5 22.5 L3.6 22.4 3.6 22.1 3.5 22.5" fill="none" stroke="#a36a6a" stroke-linecap="round" stroke-linejoin="round" stroke-opacity="0.6" stroke-width="0.05"/>
  </g>
  <defs>
    <radialGradient cx="0" cy="0" gradientTransform="matrix(0.0667, 0.0, 0.0, 0.0667, 30.8, -14.05)" gradientUnits="userSpaceOnUse" id="gradient0" r="819.2" spreadMethod="pad">
      <stop offset="0.0" stop-color="#ffffff"/>
      <stop offset="0.3137254901960784" stop-color="#f2eaea"/>
      <stop offset="0.6823529411764706" stop-color="#e0cbcb"/>
      <stop offset="0.7607843137254902" stop-color="#cca9a9"/>
      <stop offset="1.0" stop-color="#e0cbcb"/>
    </radialGradient>
  </defs>
</svg>
