<?xml version="1.0" encoding="UTF-8" standalone="no"?>
<svg xmlns:xlink="http://www.w3.org/1999/xlink" height="42.65px" width="29.1px" xmlns="http://www.w3.org/2000/svg">
  <g transform="matrix(1.0, 0.0, 0.0, 1.0, 14.85, 25.6)">
    <path d="M-14.0 -21.15 L-14.0 -21.2 -14.0 -21.25 -13.5 -22.15 -13.2 -22.45 -13.1 -22.5 -13.0 -22.75 -12.85 -22.9 -12.8 -23.0 -12.7 -23.05 -12.55 -23.2 -12.5 -23.2 -11.75 -23.5 Q-11.3 -23.9 -10.7 -23.85 L-10.2 -23.75 -9.55 -23.2 -9.05 -23.9 -9.0 -23.9 -8.8 -24.1 -7.7 -24.45 -7.2 -24.4 Q-6.55 -24.25 -5.95 -23.35 L-5.55 -23.4 -5.5 -23.4 -5.45 -23.4 -5.1 -23.7 -4.7 -23.6 -4.55 -23.7 -3.75 -24.15 -3.6 -24.3 Q-2.95 -24.9 -1.95 -24.9 L-1.6 -24.85 -1.55 -24.9 Q-0.55 -25.65 0.15 -25.6 L1.6 -25.25 2.5 -24.3 2.7 -23.95 2.85 -24.15 2.95 -24.2 3.55 -24.55 4.0 -24.65 4.05 -24.65 6.05 -24.15 6.1 -24.15 6.15 -24.1 6.35 -24.0 6.95 -23.65 7.3 -23.35 7.95 -24.2 8.0 -24.25 8.15 -24.35 8.2 -24.35 9.35 -24.65 9.4 -24.65 10.25 -24.55 10.8 -24.1 11.35 -23.35 11.4 -23.25 11.45 -23.2 11.65 -22.7 11.85 -22.7 12.2 -22.65 12.65 -22.5 12.95 -22.15 13.35 -21.45 11.65 -21.75 11.65 -21.8 11.6 -21.75 10.05 -20.45 8.8 -20.0 6.95 -19.5 5.2 -19.45 3.95 -19.7 1.25 -20.2 -0.15 -20.45 Q-2.15 -20.2 -4.0 -20.9 L-5.2 -21.45 -7.35 -21.5 -12.0 -21.65 -12.45 -21.6 -14.0 -21.15 M-5.55 -22.9 L-5.6 -22.85 -5.55 -22.85 -5.55 -22.9" fill="#ffe9c7" fill-rule="evenodd" stroke="none"/>
    <path d="M-6.15 16.8 L-9.3 16.55 -9.3 15.25 Q-9.55 8.15 -9.3 3.9 L-8.55 -3.85 Q-7.95 -9.15 -7.9 -10.4 L-7.35 -21.5 -5.2 -21.45 -4.0 -20.9 -4.6 -16.6 -5.1 -9.15 -5.3 -2.2 -6.15 16.8 M-14.35 9.55 L-14.35 9.5 -14.35 9.55" fill="#566063" fill-rule="evenodd" stroke="none"/>
    <path d="M13.35 -21.45 L13.5 -21.2 13.55 -21.05 13.8 -20.2 13.9 -19.55 13.45 -18.15 13.5 -18.25 12.8 -17.35 Q12.25 -16.7 12.0 -15.05 L12.0 -14.85 12.15 6.6 12.35 7.55 12.4 7.55 12.65 8.25 12.7 8.35 13.75 9.5 Q14.25 10.05 14.25 11.5 L14.0 12.85 13.9 13.0 13.95 15.0 13.85 15.5 13.45 15.85 12.95 16.0 11.45 16.25 7.05 16.7 7.2 15.55 Q7.6 11.7 7.6 -5.05 L7.25 -14.4 6.95 -19.5 8.8 -20.0 10.05 -20.45 11.6 -21.75 11.65 -21.8 11.65 -21.75 13.35 -21.45 M2.1 17.05 L1.55 17.05 1.0 17.05 0.1 17.05 0.05 17.05 -0.15 17.05 -0.1 4.2 Q-0.05 -7.75 0.8 -15.9 L1.25 -20.2 3.95 -19.7 3.1 0.7 2.1 17.05" fill="#717e82" fill-rule="evenodd" stroke="none"/>
    <path d="M-0.15 17.05 L-2.7 17.0 -2.75 17.0 -5.45 16.85 -6.15 16.8 -5.3 -2.2 -5.1 -9.15 -4.6 -16.6 -4.0 -20.9 Q-2.15 -20.2 -0.15 -20.45 L1.25 -20.2 0.8 -15.9 Q-0.05 -7.75 -0.1 4.2 L-0.15 17.05 M-9.3 16.55 L-11.95 16.25 -13.6 16.0 -14.2 15.65 -14.45 15.0 -14.45 13.0 -14.55 12.85 -14.85 11.5 Q-14.85 10.1 -14.35 9.55 L-13.25 8.35 -13.2 8.3 -12.95 7.6 -12.95 7.5 -12.8 6.85 -12.7 6.55 -12.7 0.7 -12.65 0.4 -12.6 -10.3 -12.65 -10.45 -12.7 -10.8 -12.7 -15.4 -12.8 -16.1 -12.9 -16.4 -12.95 -16.55 -13.35 -17.35 Q-14.5 -18.5 -14.45 -19.55 L-14.0 -21.15 -12.45 -21.6 -12.0 -21.65 -7.35 -21.5 -7.9 -10.4 Q-7.95 -9.15 -8.55 -3.85 L-9.3 3.9 Q-9.55 8.15 -9.3 15.25 L-9.3 16.55" fill="#646f73" fill-rule="evenodd" stroke="none"/>
    <path d="M7.05 16.7 L5.6 16.8 4.1 16.9 3.85 16.95 3.8 16.95 2.1 17.05 3.1 0.7 3.95 -19.7 5.2 -19.45 6.95 -19.5 7.25 -14.4 7.6 -5.05 Q7.6 11.7 7.2 15.55 L7.05 16.7" fill="#808f94" fill-rule="evenodd" stroke="none"/>
    <path d="M9.5 -23.65 L9.45 -23.75 Q9.55 -23.95 9.8 -24.0 L9.95 -24.0 10.05 -24.0 10.15 -24.0 Q10.9 -23.35 11.15 -22.4 L11.3 -22.5 11.5 -22.2 11.55 -22.3 11.7 -22.3 12.1 -22.25 12.25 -22.2 12.35 -22.1 12.5 -21.95 12.55 -21.85 12.55 -21.75 12.6 -21.8 12.75 -21.85 12.8 -21.85 12.95 -21.8 13.1 -21.65 13.15 -21.45 13.15 -21.3 13.1 -21.1 13.05 -21.05 13.0 -21.0 12.95 -20.95 12.55 -20.95 12.45 -21.0 12.3 -21.15 12.05 -20.95 11.95 -20.9 11.65 -20.9 11.65 -20.7 11.6 -20.3 11.6 -20.25 11.5 -19.75 Q11.35 -19.55 11.15 -19.75 L11.05 -19.8 11.05 -20.3 11.05 -20.6 11.05 -20.7 11.0 -20.85 10.95 -20.9 10.95 -21.0 10.95 -21.05 11.0 -21.1 11.0 -21.15 11.0 -21.3 11.0 -21.35 10.95 -21.5 10.8 -21.75 10.8 -21.85 10.75 -22.0 10.7 -22.25 10.65 -22.3 10.6 -22.35 10.55 -22.4 10.55 -22.55 10.3 -22.85 10.15 -23.15 9.65 -23.5 9.5 -23.65 M-12.9 -21.2 L-12.9 -21.25 -12.9 -21.9 -12.9 -22.0 -12.9 -22.05 -12.85 -22.1 -12.75 -22.2 -12.7 -22.2 -12.3 -22.3 -12.15 -22.35 -12.0 -22.35 -11.8 -22.3 -11.55 -22.25 -11.5 -22.2 -11.4 -22.1 -11.0 -22.1 -10.85 -22.05 -10.8 -22.05 -10.8 -22.1 -10.75 -22.15 -10.35 -22.4 -10.25 -22.5 -10.1 -22.4 -10.0 -22.3 -9.95 -22.25 -9.9 -22.2 -9.8 -22.0 -9.75 -21.9 -9.75 -22.0 -9.3 -22.95 -9.2 -23.05 -9.1 -23.1 -9.05 -23.25 -8.85 -23.55 -8.5 -23.65 -8.5 -23.7 -8.4 -23.65 -8.25 -23.55 -8.25 -23.45 -8.35 -23.25 -8.55 -23.05 -8.55 -22.95 -8.55 -22.5 -8.6 -22.15 -8.5 -21.4 -8.6 -21.15 -8.7 -21.0 -8.85 -21.0 -9.0 -21.0 -9.05 -21.05 -9.15 -21.2 -9.15 -21.1 -9.15 -21.05 -9.2 -20.65 -9.2 -20.6 -9.25 -20.5 -9.3 -20.45 -9.3 -20.4 -9.3 -20.25 -9.3 -20.15 -9.35 -19.95 -9.45 -19.7 -9.8 -19.15 -9.85 -18.95 -10.1 -18.7 -10.2 -18.7 -10.7 -18.75 -10.85 -19.0 -10.95 -19.15 -11.05 -20.45 -11.0 -20.7 -11.0 -21.1 -11.5 -21.2 -11.9 -20.95 -12.0 -20.85 -12.35 -20.85 -12.8 -21.05 -12.9 -21.2" fill="#ffe9c7" fill-rule="evenodd" stroke="none"/>
    <path d="M-12.0 -22.35 L-11.6 -22.5 -11.3 -22.3 Q-11.1 -22.85 -10.7 -22.85 L-10.25 -22.5 -9.8 -22.8 -9.3 -22.95 -9.75 -22.0 -9.8 -22.0 -9.9 -22.2 -9.95 -22.25 -10.0 -22.3 -10.1 -22.4 -10.25 -22.5 -10.35 -22.4 -10.75 -22.15 -10.8 -22.1 -10.8 -22.05 -10.85 -22.05 -11.0 -22.1 -11.4 -22.1 -11.5 -22.2 -11.55 -22.25 -11.8 -22.3 -12.0 -22.35 M3.8 -23.6 L4.05 -23.65 5.65 -23.25 5.7 -23.2 6.05 -22.5 5.95 -22.3 5.6 -22.35 5.5 -22.5 5.45 -22.75 4.95 -23.3 4.8 -23.3 4.65 -23.3 4.35 -23.15 4.15 -22.95 3.85 -23.5 3.8 -23.6 M8.7 -23.5 L9.35 -23.65 9.5 -23.65 9.65 -23.5 10.15 -23.15 10.3 -22.85 10.55 -22.55 10.55 -22.4 10.6 -22.35 10.65 -22.3 10.7 -22.25 10.75 -22.0 10.75 -21.9 10.75 -21.85 10.1 -21.9 9.9 -22.4 9.85 -22.5 Q9.7 -22.75 9.55 -22.7 L9.35 -22.6 Q9.1 -23.5 8.6 -23.25 L8.7 -23.5" fill="#f2ddbc" fill-rule="evenodd" stroke="none"/>
    <path d="M12.45 -21.0 L12.55 -20.8 12.55 -20.7 12.05 -20.95 12.3 -21.15 12.45 -21.0 M11.85 8.95 L12.0 9.05 12.95 10.1 Q13.25 10.5 13.25 11.5 L13.05 12.45 12.9 12.6 12.9 13.65 Q12.5 12.4 12.25 10.85 L11.85 8.95 M10.8 -21.85 L10.8 -21.75 10.95 -21.5 10.75 -21.6 10.1 -21.9 10.75 -21.85 10.8 -21.85" fill="#dbf7fc" fill-rule="evenodd" stroke="none"/>
    <path d="M12.6 -18.7 L12.1 -18.05 Q11.3 -17.25 11.0 -15.2 L11.0 -14.85 11.0 -7.65 10.55 -4.95 10.15 -2.05 Q9.95 -0.9 9.9 1.1 L9.9 -15.6 10.1 -16.55 10.35 -17.4 Q10.7 -18.35 11.3 -18.85 L11.75 -19.55 11.6 -20.15 11.6 -20.3 11.65 -20.7 12.0 -20.55 12.15 -20.45 12.6 -18.7 M11.3 15.25 L5.5 15.8 5.4 15.05 4.95 12.3 11.0 11.65 11.35 15.0 11.3 15.25 M-5.4 15.85 L-11.85 15.25 -12.1 12.55 -12.0 11.55 -6.05 12.3 -5.4 15.85 M-11.8 7.0 L-11.7 6.75 -11.7 3.95 -11.45 3.7 -11.35 3.6 -11.4 3.55 Q-11.4 3.1 -11.7 2.6 L-11.7 0.75 -11.65 0.75 -11.6 -10.55 -11.7 -10.8 -11.7 -13.6 -11.65 -13.6 -11.6 -13.45 -11.6 -14.25 -11.6 -14.85 -11.65 -15.25 -11.7 -15.5 -11.8 -16.3 -12.0 -16.8 Q-12.2 -17.6 -12.65 -18.05 -13.45 -18.85 -13.45 -19.55 L-13.1 -20.8 -12.9 -21.2 -12.8 -21.05 -12.35 -20.85 -12.0 -20.85 -11.9 -20.95 -11.5 -21.2 -11.0 -21.1 -11.0 -20.7 -11.75 -20.6 -12.0 -20.55 -12.1 -20.3 -12.3 -19.55 -11.85 -18.85 -11.8 -18.8 Q-11.2 -18.2 -10.9 -17.1 L-10.85 -16.95 -10.65 -16.3 -10.55 -15.65 -10.55 -15.6 -10.5 0.3 -10.5 1.2 Q-10.4 3.65 -10.55 5.9 L-10.7 7.45 Q-10.8 8.5 -11.6 9.7 L-11.95 10.05 -11.75 8.2 -11.75 7.35 -11.8 7.0 M10.95 -21.0 L10.95 -20.9 11.0 -20.85 11.05 -20.7 11.05 -20.6 7.35 -21.15 5.5 -21.4 3.1 -21.6 0.95 -21.65 0.95 -22.5 2.05 -22.5 4.15 -22.4 4.5 -22.35 5.7 -22.2 5.9 -22.2 9.75 -21.4 10.65 -21.1 10.95 -21.0 M-7.05 -22.3 L-7.05 -22.2 -7.2 -21.35 -8.6 -21.15 -8.5 -21.4 -8.6 -22.15 -7.05 -22.3 M-9.75 -22.0 L-9.75 -21.9 -9.8 -22.0 -9.75 -22.0 M-9.05 -21.05 L-9.15 -21.05 -9.15 -21.1 -9.15 -21.2 -9.05 -21.05" fill="#8a9c9e" fill-rule="evenodd" stroke="none"/>
    <path d="M12.55 -20.7 L12.8 -20.0 12.9 -19.55 12.6 -18.7 12.15 -20.45 12.0 -20.55 11.65 -20.7 11.65 -20.9 11.95 -20.9 12.05 -20.95 12.55 -20.7 M11.0 -7.65 L11.15 6.75 11.4 7.8 11.85 8.95 12.25 10.85 Q12.5 12.4 12.9 13.65 L12.95 15.0 12.9 15.0 11.3 15.25 11.35 15.0 11.0 11.65 11.85 11.2 12.0 11.05 11.75 10.65 Q10.95 9.95 10.5 8.8 L10.25 7.65 10.15 6.55 10.1 6.3 9.95 5.45 9.9 1.1 Q9.95 -0.9 10.15 -2.05 L10.55 -4.95 11.0 -7.65 M-11.85 15.25 L-13.45 15.0 -13.45 12.6 -13.6 12.45 -13.65 12.4 -13.85 11.5 -13.55 10.1 -12.55 9.05 Q-12.2 8.75 -12.0 7.8 L-11.8 7.0 -11.75 7.35 -11.75 8.2 -11.95 10.05 -12.65 11.05 -12.5 11.3 -12.0 11.55 -12.1 12.55 -11.85 15.25 M-11.7 0.75 L-11.7 0.7 -11.65 0.75 -11.7 0.75 M-11.7 -14.35 L-11.7 -15.5 -11.65 -15.25 -11.6 -14.85 -11.6 -14.25 -11.7 -14.35 M10.95 -21.5 L11.0 -21.35 11.0 -21.3 11.0 -21.15 11.0 -21.1 10.95 -21.05 10.95 -21.0 10.65 -21.1 9.75 -21.4 5.9 -22.2 5.7 -22.2 4.5 -22.35 4.15 -22.4 5.5 -22.35 5.6 -22.35 5.95 -22.3 10.05 -21.9 10.1 -21.9 10.75 -21.6 10.95 -21.5 M-11.4 3.55 L-11.35 3.6 -11.45 3.7 -11.4 3.55" fill="#9eb2b5" fill-rule="evenodd" stroke="none"/>
    <path d="M11.6 -20.25 L11.6 -20.3 11.6 -20.15 11.6 -20.25" fill="#bdbdbd" fill-rule="evenodd" stroke="none"/>
    <path d="M11.05 -20.6 L11.05 -20.3 11.05 -19.8 11.15 -19.75 Q11.35 -19.55 11.5 -19.75 L11.6 -20.25 11.6 -20.15 11.75 -19.55 11.3 -18.85 Q10.7 -18.35 10.35 -17.4 10.15 -17.9 9.6 -17.9 L9.55 -19.25 Q9.4 -20.3 8.75 -20.3 8.3 -20.3 7.65 -19.6 L7.7 -20.4 7.35 -20.4 Q7.55 -20.8 7.35 -21.15 L11.05 -20.6 M-9.85 -18.95 L-9.8 -18.75 -10.65 -18.15 -10.85 -16.95 -10.9 -17.1 Q-11.2 -18.2 -11.8 -18.8 L-11.85 -18.85 -12.3 -19.55 -12.1 -20.3 -12.0 -20.55 -11.75 -20.6 -11.0 -20.7 -11.05 -20.45 -10.95 -19.15 -10.85 -19.0 -10.7 -18.75 -10.2 -18.7 -10.1 -18.7 -9.85 -18.95" fill="#ccaf7e" fill-rule="evenodd" stroke="none"/>
    <path d="M-8.55 -22.95 L-8.35 -23.2 -7.7 -23.45 Q-7.15 -23.45 -6.6 -22.55 L-6.5 -22.3 -7.05 -22.3 -8.6 -22.15 -8.55 -22.5 -8.55 -22.95 M-3.3 -23.0 L-3.2 -23.2 Q-2.8 -23.9 -1.95 -23.9 L-1.3 -23.75 -1.75 -23.25 -1.95 -23.3 -2.25 -23.45 Q-2.6 -23.45 -2.75 -22.85 L-3.25 -23.0 -3.3 -23.0 M1.85 -23.4 L3.4 -23.1 Q3.3 -23.2 3.55 -23.45 L3.8 -23.6 3.85 -23.5 4.15 -22.95 4.35 -23.15 4.65 -23.3 4.8 -23.3 4.95 -23.3 5.45 -22.75 5.5 -22.5 5.6 -22.35 5.5 -22.35 4.15 -22.4 2.05 -22.5 1.85 -23.4 M5.7 -23.2 Q6.4 -22.9 6.5 -22.65 6.75 -23.3 7.4 -23.3 8.0 -23.3 8.15 -22.85 L8.55 -23.4 8.7 -23.5 8.6 -23.25 Q9.1 -23.5 9.35 -22.6 L9.55 -22.7 Q9.7 -22.75 9.85 -22.5 L9.9 -22.4 10.1 -21.9 10.05 -21.9 5.95 -22.3 6.05 -22.5 5.7 -23.2" fill="#dbc8aa" fill-rule="evenodd" stroke="none"/>
    <path d="M10.35 -17.4 L10.1 -16.55 9.9 -15.6 5.6 -16.05 5.6 -16.1 5.4 -16.95 5.45 -17.85 5.25 -18.15 4.8 -18.4 4.75 -18.3 4.75 -18.4 4.8 -18.4 4.95 -18.7 Q4.95 -19.15 4.15 -19.55 L3.15 -19.8 2.8 -19.75 2.7 -19.6 2.7 -19.75 2.8 -19.75 3.45 -20.6 3.45 -21.35 3.0 -21.35 3.1 -21.6 5.5 -21.4 7.35 -21.15 Q7.55 -20.8 7.35 -20.4 L7.7 -20.4 7.65 -19.6 Q8.3 -20.3 8.75 -20.3 9.4 -20.3 9.55 -19.25 L9.6 -17.9 Q10.15 -17.9 10.35 -17.4 M-7.2 -21.35 L-7.15 -21.35 -7.2 -20.9 -6.65 -19.35 -5.9 -18.3 -5.9 -18.15 -6.75 -18.45 -7.65 -18.0 -8.1 -16.9 -8.0 -15.95 -10.5 -15.6 -10.55 -15.6 -10.55 -15.65 -10.65 -16.3 -10.85 -16.95 -10.65 -18.15 -9.8 -18.75 -9.85 -18.95 -9.8 -19.15 -9.45 -19.7 -9.35 -19.95 -9.3 -20.15 -9.3 -20.25 -9.3 -20.4 -9.3 -20.45 -9.25 -20.5 -9.2 -20.6 -9.2 -20.65 -9.15 -21.05 -9.05 -21.05 -9.0 -21.0 -8.85 -21.0 -8.7 -21.0 -8.6 -21.15 -7.2 -21.35" fill="#c2a778" fill-rule="evenodd" stroke="none"/>
    <path d="M-4.2 -22.5 L-4.15 -22.7 -3.95 -22.95 -3.55 -23.15 -3.3 -23.0 -3.25 -23.0 -2.75 -22.85 Q-2.6 -23.45 -2.25 -23.45 L-1.95 -23.3 -1.75 -23.25 -1.3 -23.75 -0.95 -24.1 Q-0.3 -24.6 0.15 -24.6 1.35 -24.6 1.85 -23.4 L2.05 -22.5 0.95 -22.5 -1.8 -22.5 -2.75 -22.5 -3.5 -22.5 -4.05 -22.5 -4.2 -22.5" fill="#ccba9f" fill-rule="evenodd" stroke="none"/>
    <path d="M-4.9 -16.15 L-4.95 -16.75 Q-4.95 -17.85 -3.95 -17.85 L-3.5 -17.7 Q-3.55 -18.05 -3.25 -18.15 L-2.75 -18.15 -2.75 -19.15 Q-2.65 -19.45 -2.1 -19.45 L-1.55 -19.35 -1.4 -19.1 -0.8 -19.8 Q-0.05 -20.45 0.65 -20.45 1.25 -20.45 1.75 -19.75 L2.1 -18.4 2.0 -17.85 Q2.3 -17.9 2.55 -17.2 L2.75 -16.15 -1.15 -16.25 -4.9 -16.15" fill="#a38b64" fill-rule="evenodd" stroke="none"/>
    <path d="M0.95 -21.65 L3.1 -21.6 3.0 -21.35 3.45 -21.35 3.45 -20.6 2.8 -19.75 2.7 -19.75 2.7 -19.6 2.8 -19.75 3.15 -19.8 4.15 -19.55 Q4.95 -19.15 4.95 -18.7 L4.8 -18.4 4.75 -18.4 4.75 -18.3 4.8 -18.4 5.25 -18.15 5.45 -17.85 5.4 -16.95 5.6 -16.1 5.6 -16.05 4.45 -16.15 2.75 -16.15 2.55 -17.2 Q2.3 -17.9 2.0 -17.85 L2.1 -18.4 1.75 -19.75 Q1.25 -20.45 0.65 -20.45 -0.05 -20.45 -0.8 -19.8 L-1.4 -19.1 -1.55 -19.35 -2.1 -19.45 Q-2.65 -19.45 -2.75 -19.15 L-2.75 -18.15 -3.25 -18.15 Q-3.55 -18.05 -3.5 -17.7 L-3.95 -17.85 Q-4.95 -17.85 -4.95 -16.75 L-4.9 -16.15 -6.75 -16.05 -8.0 -15.95 -8.1 -16.9 -7.65 -18.0 -6.75 -18.45 -5.9 -18.15 -5.9 -18.3 -6.65 -19.35 -7.2 -20.9 -7.15 -21.35 -6.15 -21.45 -5.2 -21.5 -4.65 -21.55 -1.8 -21.65 0.95 -21.65" fill="#b59b70" fill-rule="evenodd" stroke="none"/>
    <path d="M5.5 15.8 L0.05 16.05 -0.15 12.55 4.95 12.3 5.4 15.05 5.5 15.8 M-2.7 16.0 L-5.4 15.85 -6.05 12.3 -2.85 12.5 Q-2.7 14.15 -2.7 16.0 M-6.5 -22.3 L-5.5 -22.4 -4.7 -22.4 -4.65 -22.2 -4.65 -21.55 -5.2 -21.5 -6.15 -21.45 -7.15 -21.35 -7.2 -21.35 -7.05 -22.2 -7.05 -22.3 -6.5 -22.3 M0.95 -22.5 L0.95 -21.65 -1.8 -21.65 -1.8 -22.5 0.95 -22.5" fill="#79898c" fill-rule="evenodd" stroke="none"/>
    <path d="M9.9 -15.6 L9.9 1.1 9.95 5.45 10.1 6.3 10.15 6.55 10.25 7.65 10.5 8.8 Q10.95 9.95 11.75 10.65 L12.0 11.05 11.85 11.2 11.0 11.65 4.95 12.3 -0.15 12.55 -2.85 12.5 -6.05 12.3 -12.0 11.55 -12.5 11.3 -12.65 11.05 -11.95 10.05 -11.6 9.7 Q-10.8 8.5 -10.7 7.45 L-10.55 5.9 Q-10.4 3.65 -10.5 1.2 L-10.5 0.3 -10.55 -15.6 -10.5 -15.6 -8.0 -15.95 -6.75 -16.05 -4.9 -16.15 -1.15 -16.25 2.75 -16.15 4.45 -16.15 5.6 -16.05 9.9 -15.6 M0.1 -14.15 L0.0 -14.15 -0.15 -14.2 -0.4 -14.2 -0.6 -14.15 -0.75 -14.0 -0.95 -13.55 -0.95 -13.4 -0.95 -13.35 -0.95 -13.25 -0.95 -13.2 -4.15 -13.25 -4.7 -13.25 -4.7 -13.6 -4.75 -14.05 -4.95 -14.35 -5.8 -14.5 -6.05 -14.45 -6.3 -14.35 -6.4 -14.25 -6.55 -14.05 -6.65 -13.85 -6.65 -13.55 -6.65 -13.35 -9.6 -13.75 -9.6 -1.25 -9.3 -1.3 -9.0 -1.2 -8.35 -0.6 -8.25 0.0 -8.25 0.65 -8.45 0.95 -8.6 1.1 -9.6 1.0 -9.55 1.8 Q-9.35 4.35 -9.6 6.7 L-9.75 9.6 -9.8 10.4 -5.8 10.35 Q-3.2 10.15 -0.75 10.4 1.65 10.25 4.15 10.35 6.85 10.05 9.55 10.9 L9.75 10.95 9.75 10.2 9.45 9.55 9.3 9.25 9.3 7.9 9.0 3.9 8.9 4.0 8.45 4.0 8.25 3.95 8.15 3.7 8.1 3.65 8.0 3.55 Q8.0 3.25 8.15 3.0 L8.45 2.6 8.6 2.6 8.9 2.6 9.0 2.6 9.0 2.4 9.0 2.1 8.9 2.25 8.8 2.3 8.75 2.3 8.6 2.3 8.45 2.2 8.3 2.05 8.3 1.8 8.35 1.55 8.45 1.5 8.75 1.45 8.95 1.55 9.0 1.65 9.05 -2.7 9.05 -4.95 9.1 -8.15 9.1 -11.6 9.0 -13.85 6.75 -13.45 6.35 -13.4 6.55 -13.2 6.65 -12.95 6.65 -12.8 6.65 -12.65 6.65 -12.5 6.55 -12.4 6.5 -12.25 6.35 -12.15 5.3 -12.25 5.05 -12.75 5.05 -12.95 5.05 -13.05 5.1 -13.05 5.1 -13.3 4.75 -13.25 4.75 -13.1 4.7 -13.05 4.65 -12.9 4.5 -12.8 4.3 -12.75 4.15 -12.8 Q3.95 -12.85 3.9 -13.05 L3.85 -13.2 1.3 -13.2 0.6 -13.2 0.6 -13.6 0.6 -13.65 0.4 -13.85 0.35 -14.0 0.3 -14.05 0.15 -14.1 0.1 -14.15 M6.05 2.9 L6.25 3.0 6.35 3.2 6.35 3.4 6.3 3.65 6.05 3.85 5.9 3.85 5.75 3.8 5.45 3.4 5.45 3.2 5.45 3.1 5.55 2.9 5.8 2.85 6.05 2.9 M5.7 5.3 L5.95 5.65 6.35 6.3 6.35 6.4 6.35 6.6 6.35 6.85 Q5.9 8.35 4.35 8.15 L3.9 7.85 3.85 7.45 3.85 6.65 3.85 6.6 4.15 5.85 Q4.45 5.3 4.95 5.15 L5.4 5.25 5.7 5.3 M3.5 5.3 L3.35 5.5 3.25 5.6 3.1 5.65 2.7 5.5 2.55 5.45 2.55 5.25 2.55 4.85 Q2.75 4.5 3.15 4.5 L3.55 4.85 3.55 5.1 3.5 5.3 M-5.55 -3.65 L-5.3 -3.7 -4.95 -3.65 -4.7 -3.6 -4.45 -3.45 -4.25 -3.0 -4.35 -2.25 Q-4.5 -1.75 -4.95 -1.4 L-5.15 -1.4 -5.55 -1.4 -5.75 -1.55 -5.95 -1.9 -6.05 -1.95 -6.1 -2.35 -6.1 -3.15 -5.9 -3.35 -5.7 -3.55 -5.55 -3.65 M-8.1 -2.9 L-8.0 -2.85 -7.95 -2.8 -7.95 -2.65 -7.95 -2.4 -8.1 -2.25 -8.15 -2.05 -8.5 -2.05 -8.65 -2.1 -8.75 -2.1 -8.8 -2.25 -8.9 -2.5 -8.9 -2.55 -8.9 -2.7 -8.9 -2.75 -8.75 -2.9 -8.5 -3.05 -8.3 -3.05 -8.3 -3.0 -8.2 -3.0 -8.1 -2.9 M-3.4 -4.9 L-3.4 -4.5 -3.45 -4.25 -4.15 -4.15 -4.25 -4.15 -4.35 -4.6 -4.3 -4.95 -4.2 -5.05 -4.0 -5.25 -3.95 -5.25 -3.85 -5.25 -3.45 -5.05 -3.4 -4.9" fill="#2a2d45" fill-rule="evenodd" stroke="none"/>
    <path d="M0.1 -14.15 L0.15 -14.1 0.3 -14.05 0.35 -14.0 0.4 -13.85 0.6 -13.65 0.6 -13.6 0.6 -13.2 1.3 -13.2 3.85 -13.2 3.9 -13.05 Q3.95 -12.85 4.15 -12.8 L4.3 -12.75 4.5 -12.8 4.65 -12.9 4.7 -13.05 4.75 -13.1 4.75 -13.25 5.1 -13.3 5.1 -13.05 5.05 -13.05 5.05 -12.95 5.05 -12.75 5.3 -12.25 6.35 -12.15 6.5 -12.25 6.55 -12.4 6.65 -12.5 6.65 -12.65 6.65 -12.8 6.65 -12.95 6.55 -13.2 6.35 -13.4 6.75 -13.45 9.0 -13.85 9.1 -11.6 9.1 -8.15 9.05 -4.95 9.05 -2.7 9.0 1.65 8.95 1.55 8.75 1.45 8.45 1.5 8.35 1.55 8.3 1.8 8.3 2.05 8.45 2.2 8.6 2.3 8.75 2.3 8.8 2.3 8.9 2.25 9.0 2.1 9.0 2.4 9.0 2.6 8.9 2.6 8.6 2.6 8.45 2.6 8.15 3.0 Q8.0 3.25 8.0 3.55 L8.1 3.65 8.15 3.7 8.25 3.95 8.45 4.0 8.9 4.0 9.0 3.9 9.3 7.9 9.3 9.25 9.45 9.55 9.75 10.2 9.75 10.95 9.55 10.9 Q6.85 10.05 4.15 10.35 1.65 10.25 -0.75 10.4 -3.2 10.15 -5.8 10.35 L-9.8 10.4 -9.75 9.6 -9.6 6.7 Q-9.35 4.35 -9.55 1.8 L-9.6 1.0 -8.6 1.1 -8.45 0.95 -8.25 0.65 -8.25 0.0 -8.35 -0.6 -9.0 -1.2 -9.3 -1.3 -9.6 -1.25 -9.6 -13.75 -6.65 -13.35 -6.65 -13.55 -6.65 -13.85 -6.55 -14.05 -6.4 -14.25 -6.3 -14.35 -6.05 -14.45 -5.8 -14.5 -4.95 -14.35 -4.75 -14.05 -4.7 -13.6 -4.7 -13.25 -4.15 -13.25 -0.95 -13.2 -0.95 -13.25 -0.95 -13.35 -0.95 -13.4 -0.95 -13.55 -0.75 -14.0 -0.6 -14.15 -0.4 -14.2 -0.15 -14.2 0.0 -14.15 0.1 -14.15 M3.5 5.3 L3.55 5.1 3.55 4.85 3.15 4.5 Q2.75 4.5 2.55 4.85 L2.55 5.25 2.55 5.45 2.7 5.5 3.1 5.65 3.25 5.6 3.35 5.5 3.5 5.3 M5.7 5.3 L5.4 5.25 4.95 5.15 Q4.45 5.3 4.15 5.85 L3.85 6.6 3.85 6.65 3.85 7.45 3.9 7.85 4.35 8.15 Q5.9 8.35 6.35 6.85 L6.35 6.6 6.35 6.4 6.35 6.3 5.95 5.65 5.7 5.3 M6.05 2.9 L5.8 2.85 5.55 2.9 5.45 3.1 5.45 3.2 5.45 3.4 5.75 3.8 5.9 3.85 6.05 3.85 6.3 3.65 6.35 3.4 6.35 3.2 6.25 3.0 6.05 2.9 M-5.55 -3.65 L-5.7 -3.55 -5.9 -3.35 -6.1 -3.15 -6.1 -2.35 -6.05 -1.95 -5.95 -1.9 -5.75 -1.55 -5.55 -1.4 -5.15 -1.4 -4.95 -1.4 Q-4.5 -1.75 -4.35 -2.25 L-4.25 -3.0 -4.45 -3.45 -4.7 -3.6 -4.95 -3.65 -5.3 -3.7 -5.55 -3.65 M-8.1 -2.9 L-8.2 -3.0 -8.3 -3.0 -8.3 -3.05 -8.5 -3.05 -8.75 -2.9 -8.9 -2.75 -8.9 -2.7 -8.9 -2.55 -8.9 -2.5 -8.8 -2.25 -8.75 -2.1 -8.65 -2.1 -8.5 -2.05 -8.15 -2.05 -8.1 -2.25 -7.95 -2.4 -7.95 -2.65 -7.95 -2.8 -8.0 -2.85 -8.1 -2.9 M-3.4 -4.9 L-3.45 -5.05 -3.85 -5.25 -3.95 -5.25 -4.0 -5.25 -4.2 -5.05 -4.3 -4.95 -4.35 -4.6 -4.25 -4.15 -4.15 -4.15 -3.45 -4.25 -3.4 -4.5 -3.4 -4.9" fill="url(#gradient0)" fill-rule="evenodd" stroke="none"/>
    <path d="M0.05 16.05 L-2.7 16.0 Q-2.7 14.15 -2.85 12.5 L-0.15 12.55 0.05 16.05 M-4.7 -22.4 L-4.6 -22.4 -4.25 -22.5 -4.2 -22.5 -4.05 -22.5 -3.5 -22.5 -2.75 -22.5 -1.8 -22.5 -1.8 -21.65 -4.65 -21.55 -4.65 -22.2 -4.7 -22.4" fill="#6c7a7d" fill-rule="evenodd" stroke="none"/>
    <path d="M-11.7 3.95 L-11.7 2.6 Q-11.4 3.1 -11.4 3.55 L-11.45 3.7 -11.7 3.95 M-11.7 -13.6 L-11.7 -14.35 -11.6 -14.25 -11.6 -13.45 -11.65 -13.6 -11.7 -13.6" fill="#90a2a6" fill-rule="evenodd" stroke="none"/>
    <path d="M4.65 -22.15 L4.9 -22.15 7.45 -21.7 7.4 -19.35 6.65 -13.65 Q5.85 -8.7 5.85 -5.6 L6.05 -1.3 5.85 1.3 5.65 4.7 5.65 5.1 5.7 7.4 5.2 9.0 Q4.2 12.15 2.95 12.15 1.5 12.15 0.75 7.5 L0.45 3.5 0.4 3.5 0.4 2.9 0.4 2.65 0.55 -0.3 0.75 -3.3 1.0 -9.9 0.75 -14.8 0.6 -17.35 1.3 -17.55 Q3.1 -18.2 3.1 -18.65 3.1 -19.35 1.3 -19.35 L0.5 -19.35 0.5 -19.6 0.6 -22.3 0.6 -22.5 1.2 -22.4 2.35 -22.2 2.3 -22.2 2.2 -22.15 2.1 -22.05 1.95 -21.8 2.1 -21.7 2.6 -21.7 2.6 -21.15 Q2.6 -19.65 3.25 -19.65 3.9 -19.65 4.35 -21.2 L4.45 -21.55 5.05 -21.55 5.2 -21.6 5.2 -21.8 4.7 -22.05 4.65 -22.05 4.65 -22.15 M3.65 -16.75 Q3.3 -17.65 2.8 -17.55 1.85 -14.05 2.05 -2.2 L2.15 -0.9 Q3.1 -2.2 3.75 -5.9 4.4 -9.2 4.4 -12.1 L4.2 -14.6 4.1 -15.0 4.35 -15.3 4.4 -15.5 4.4 -15.9 4.4 -16.15 4.25 -16.45 4.2 -16.7 3.95 -16.75 3.75 -16.75 3.65 -16.75" fill="#dbf6fc" fill-opacity="0.30588236" fill-rule="evenodd" stroke="none"/>
    <path d="M4.65 -22.05 L4.7 -22.05 5.2 -21.8 5.2 -21.6 5.05 -21.55 4.45 -21.55 3.0 -21.65 2.65 -21.8 2.6 -21.7 2.1 -21.7 1.95 -21.8 2.1 -22.05 2.2 -22.15 2.3 -22.2 2.35 -22.2 2.8 -22.35 4.2 -22.15 4.25 -22.15 4.65 -22.05 M4.1 -15.0 L4.05 -15.0 4.1 -14.25 4.05 -13.65 4.0 -13.35 3.75 -13.0 3.55 -12.95 3.2 -13.0 3.1 -13.05 2.95 -13.2 2.95 -13.25 2.95 -13.4 2.95 -13.45 2.9 -13.55 2.9 -13.65 2.85 -13.7 2.8 -14.25 2.85 -14.8 2.85 -14.85 2.9 -14.95 2.9 -15.0 2.95 -15.1 2.9 -15.15 2.85 -15.25 2.85 -15.45 2.8 -15.6 2.8 -15.8 2.85 -16.2 2.85 -16.25 2.9 -16.3 2.9 -16.45 3.1 -16.55 3.2 -16.7 3.65 -16.75 3.75 -16.75 3.95 -16.75 4.2 -16.7 4.25 -16.45 4.4 -16.15 4.4 -15.9 4.4 -15.5 4.35 -15.3 4.1 -15.0 M3.25 -11.9 Q3.45 -12.0 3.45 -12.2 L3.65 -11.95 3.75 -11.95 3.9 -11.45 3.75 -11.15 Q3.45 -11.0 3.2 -11.15 L3.1 -11.2 3.1 -11.5 3.1 -11.65 3.2 -11.85 3.25 -11.9" fill="#dbf5fc" fill-opacity="0.83137256" fill-rule="evenodd" stroke="none"/>
    <path d="M4.65 -22.15 L4.65 -22.05 4.25 -22.15 4.65 -22.15 M4.45 -21.55 L4.35 -21.2 Q3.9 -19.65 3.25 -19.65 2.6 -19.65 2.6 -21.15 L2.6 -21.7 2.65 -21.8 3.0 -21.65 4.45 -21.55 M3.65 -16.75 L3.2 -16.7 3.1 -16.55 2.9 -16.45 2.9 -16.3 2.85 -16.25 2.85 -16.2 2.8 -15.8 2.8 -15.6 2.85 -15.45 2.85 -15.25 2.9 -15.15 2.95 -15.1 2.9 -15.0 2.9 -14.95 2.85 -14.85 2.85 -14.8 2.8 -14.25 2.85 -13.7 2.9 -13.65 2.9 -13.55 2.95 -13.45 2.95 -13.4 2.95 -13.25 2.95 -13.2 3.1 -13.05 3.2 -13.0 3.55 -12.95 3.75 -13.0 4.0 -13.35 4.05 -13.65 4.1 -14.25 4.05 -15.0 4.1 -15.0 4.2 -14.6 4.4 -12.1 Q4.4 -9.2 3.75 -5.9 3.1 -2.2 2.15 -0.9 L2.05 -2.2 Q1.85 -14.05 2.8 -17.55 3.3 -17.65 3.65 -16.75 M3.25 -11.9 L3.2 -11.85 3.1 -11.65 3.1 -11.5 3.1 -11.2 3.2 -11.15 Q3.45 -11.0 3.75 -11.15 L3.9 -11.45 3.75 -11.95 3.65 -11.95 3.45 -12.2 Q3.45 -12.0 3.25 -11.9" fill="#dbf6fc" fill-opacity="0.49803922" fill-rule="evenodd" stroke="none"/>
    <path d="M0.6 -22.3 L0.5 -19.6 0.5 -19.35 1.3 -19.35 Q3.1 -19.35 3.1 -18.65 3.1 -18.2 1.3 -17.55 L0.6 -17.35 0.75 -14.8 1.0 -9.9 0.75 -3.3 0.55 -0.3 0.4 2.65 0.4 2.9 0.4 3.5 0.45 3.5 0.75 7.5 Q1.5 12.15 2.95 12.15 4.2 12.15 5.2 9.0 L5.7 7.4 5.65 5.1 5.65 4.7 5.85 1.3 6.05 -1.3 5.85 -5.6 Q5.85 -8.7 6.65 -13.65 L7.4 -19.35 Q8.05 -18.5 7.9 -16.25 L8.1 -5.85 7.6 2.1 7.15 9.55 Q7.15 13.75 6.1 15.0 5.45 15.7 3.7 15.95 L1.55 16.05 Q-0.1 16.05 -0.65 15.05 -1.05 14.25 -1.05 12.1 -1.05 1.15 -1.65 -8.3 L-2.15 -15.9 -2.25 -17.4 -2.35 -19.95 -2.35 -20.25 -2.2 -21.8 -2.15 -22.0 Q-1.85 -22.4 -0.3 -22.4 L0.6 -22.3" fill="#dbf5fc" fill-opacity="0.14509805" fill-rule="evenodd" stroke="none"/>
  </g>
  <defs>
    <radialGradient cx="0" cy="0" fx="-1174.4" fy="0" gradientTransform="matrix(1.0E-4, -0.0178, -0.0172, -2.0E-4, -0.45, -3.8)" gradientUnits="userSpaceOnUse" id="gradient0" r="819.2" spreadMethod="pad">
      <stop offset="0.0" stop-color="#5b63a4"/>
      <stop offset="0.5019607843137255" stop-color="#343854"/>
      <stop offset="1.0" stop-color="#2a2d45"/>
    </radialGradient>
  </defs>
</svg>
