<?xml version="1.0" encoding="UTF-8" standalone="no"?>
<svg xmlns:xlink="http://www.w3.org/1999/xlink" height="82.05px" width="82.05px" xmlns="http://www.w3.org/2000/svg">
  <g transform="matrix(1.0, 0.0, 0.0, 1.0, 41.0, 41.0)">
    <path d="M26.5 -31.45 L26.55 -31.4 26.7 -31.3 26.8 -31.25 26.75 -31.25 27.2 -30.8 27.2 -30.75 27.3 -30.2 27.3 -30.15 27.0 -29.65 23.4 -26.05 23.25 -25.7 23.4 -25.35 24.3 -24.4 24.35 -24.35 24.35 -24.3 24.4 -24.3 24.45 -24.25 25.6 -23.1 25.8 -22.95 26.1 -22.95 26.3 -23.1 29.95 -26.75 Q30.15 -27.0 30.45 -27.05 L31.05 -26.95 31.45 -26.55 31.55 -26.45 31.55 -26.5 31.55 -26.45 31.7 -26.2 31.8 -26.1 Q34.6 -22.85 36.55 -19.15 L36.65 -18.9 36.8 -18.6 36.85 -18.55 36.9 -18.4 37.0 -17.85 36.8 -17.35 Q36.65 -17.1 36.4 -17.0 L36.2 -16.95 31.7 -15.1 31.5 -14.95 31.4 -14.7 31.45 -14.45 32.6 -11.6 32.75 -11.4 33.0 -11.25 33.3 -11.3 37.9 -13.25 38.55 -13.3 38.7 -13.25 39.1 -12.95 39.15 -12.9 39.3 -12.5 39.35 -12.4 39.4 -12.15 39.45 -12.1 39.5 -11.9 39.5 -11.8 Q40.6 -7.9 40.95 -3.65 L40.95 -3.5 40.95 -3.4 41.0 -3.2 41.0 -2.75 41.05 -2.75 40.7 -2.2 40.65 -2.15 40.0 -1.95 35.0 -1.95 34.75 -1.85 34.55 -1.7 34.5 -1.4 34.5 0.0 34.45 1.7 34.5 1.95 34.7 2.15 34.95 2.2 40.0 2.2 40.65 2.4 40.7 2.45 41.05 3.05 41.0 3.0 41.0 3.5 40.95 3.65 40.95 3.8 40.95 3.9 Q40.55 8.3 39.3 12.35 L39.3 12.4 39.25 12.65 39.25 12.7 39.25 12.75 39.2 12.85 39.05 13.2 39.0 13.3 38.6 13.6 38.45 13.6 37.8 13.55 33.15 11.6 32.9 11.55 32.65 11.7 32.5 11.9 31.3 14.8 31.25 15.05 31.35 15.3 31.55 15.45 36.05 17.35 36.2 17.4 36.65 17.7 36.7 17.75 36.7 17.8 36.85 18.25 36.85 18.35 36.85 18.4 36.65 18.95 36.6 19.0 36.5 19.25 36.45 19.3 Q34.45 22.95 31.65 26.35 L31.55 26.45 31.45 26.6 31.35 26.7 30.9 27.15 30.3 27.25 Q30.0 27.2 29.8 26.95 L29.75 26.95 26.15 23.3 Q26.0 23.15 25.8 23.15 25.6 23.15 25.45 23.3 L24.4 24.35 24.35 24.4 23.2 25.55 Q23.05 25.7 23.05 25.9 L23.2 26.25 26.8 29.8 27.1 30.5 26.85 31.15 26.8 31.2 26.1 31.8 26.0 31.9 Q22.65 34.6 19.15 36.5 L19.2 36.5 19.0 36.6 18.9 36.7 18.75 36.75 18.35 36.9 18.3 36.9 17.85 36.85 17.75 36.8 17.7 36.8 17.3 36.3 17.25 36.15 15.3 31.6 15.15 31.4 14.9 31.3 14.65 31.35 11.85 32.5 11.6 32.65 11.5 32.9 11.55 33.2 13.5 37.8 13.55 37.85 13.6 38.5 13.55 38.55 13.05 39.1 12.6 39.25 12.5 39.25 12.35 39.3 12.25 39.3 Q8.3 40.55 3.9 40.95 L3.75 40.95 3.6 40.95 3.45 41.0 2.95 41.0 3.0 41.05 Q2.65 40.95 2.4 40.7 L2.35 40.65 2.15 40.0 2.15 35.0 2.1 34.75 1.9 34.55 1.65 34.5 0.0 34.5 -1.45 34.5 -1.75 34.55 -1.9 34.75 -2.0 35.0 -2.0 40.0 Q-2.0 40.4 -2.3 40.7 -2.6 41.0 -3.0 41.0 L-3.2 41.0 -3.35 40.95 -3.6 40.95 -3.7 40.95 Q-7.95 40.6 -12.0 39.45 L-12.05 39.4 -12.0 39.45 -12.05 39.4 -12.1 39.4 -12.15 39.35 -12.45 39.25 -12.55 39.25 -12.35 39.35 -12.4 39.35 -12.55 39.4 -12.55 39.25 -12.85 39.1 -12.9 39.05 -13.25 38.55 -13.25 38.45 -13.25 37.95 -13.25 37.85 -11.35 33.25 -11.3 32.95 -11.45 32.7 -11.65 32.55 -13.25 31.95 -13.4 31.9 -13.5 31.85 -13.45 31.85 -14.45 31.45 -14.75 31.4 -15.0 31.5 -15.15 31.7 -17.0 36.2 -17.05 36.4 -17.5 36.9 -17.6 36.95 -18.1 37.0 -18.15 37.0 -18.55 36.85 -18.6 36.85 -18.7 36.8 -18.75 36.75 -18.95 36.65 -19.05 36.65 -19.05 36.6 -19.1 36.6 Q-22.8 34.5 -26.1 31.8 L-26.15 31.75 -26.2 31.7 -26.25 31.65 -26.4 31.55 -26.9 31.0 -27.0 30.4 -26.7 29.9 -23.05 26.3 -22.95 26.05 -22.95 25.8 -23.1 25.55 -24.35 24.4 -24.35 24.35 -25.35 23.4 Q-25.5 23.25 -25.7 23.25 -25.9 23.25 -26.05 23.4 L-29.65 27.0 -30.15 27.3 -30.2 27.3 -30.75 27.2 -30.8 27.2 -31.15 26.9 -31.3 26.7 -31.35 26.65 -31.4 26.55 -31.45 26.55 -31.45 26.5 -31.5 26.45 Q-34.4 23.05 -36.4 19.4 L-36.4 19.45 -36.45 19.3 -36.45 19.25 -36.6 18.95 -36.75 18.35 -36.75 18.25 -36.6 17.8 -36.55 17.8 -36.5 17.75 -36.1 17.45 -35.95 17.4 -31.45 15.45 -31.25 15.3 -31.15 15.05 -31.2 14.8 -32.45 11.95 -32.6 11.75 -32.85 11.65 -33.1 11.7 -37.75 13.65 -38.4 13.7 -38.9 13.4 -39.0 13.3 -39.15 12.95 -39.15 12.8 -39.15 12.75 -39.2 12.6 -39.25 12.45 Q-40.5 8.4 -40.85 4.15 L-40.85 4.05 -40.95 3.4 -40.95 3.2 -40.65 2.5 Q-40.35 2.2 -39.95 2.2 L-34.95 2.2 -34.7 2.15 -34.5 1.95 -34.45 1.7 -34.5 0.0 -34.45 -1.4 -34.5 -1.7 -34.7 -1.85 -34.95 -1.95 -40.0 -1.95 Q-40.4 -1.95 -40.7 -2.25 L-41.0 -2.95 -41.0 -3.1 -40.95 -3.5 -40.95 -3.6 Q-40.65 -8.0 -39.4 -12.15 L-39.3 -12.5 -39.25 -12.55 -39.15 -12.9 -38.6 -13.4 -38.5 -13.4 -37.85 -13.35 -33.2 -11.4 -32.95 -11.35 -32.7 -11.5 -32.55 -11.7 -31.35 -14.5 -31.3 -14.8 -31.4 -15.05 -31.6 -15.2 -36.3 -17.15 -36.4 -17.15 -36.7 -17.5 -36.75 -17.55 -36.8 -17.6 -36.85 -18.35 -36.75 -18.65 -36.65 -18.8 -36.65 -18.85 -36.55 -19.0 -36.55 -19.05 -36.5 -19.1 Q-34.6 -22.85 -31.75 -26.1 L-31.7 -26.15 -31.4 -26.55 -31.35 -26.6 -31.3 -26.7 -31.25 -26.7 -31.2 -26.8 -30.5 -27.1 -29.8 -26.8 -26.2 -23.15 -26.0 -23.05 -25.7 -23.05 -25.5 -23.2 -24.5 -24.25 -24.35 -24.35 -23.3 -25.35 -23.15 -25.6 -23.15 -25.85 -23.3 -26.1 -26.85 -29.65 -27.15 -30.1 -27.15 -30.2 -27.05 -30.8 -27.05 -30.75 -26.9 -31.0 -26.8 -31.15 -26.3 -31.55 -26.15 -31.65 -26.15 -31.7 -21.65 -35.05 -21.55 -35.1 -21.4 -35.2 -21.35 -35.2 -19.35 -36.4 -19.2 -36.5 -19.0 -36.6 -18.8 -36.7 -18.65 -36.75 -18.55 -36.8 -18.05 -36.9 -17.55 -36.7 -17.2 -36.25 -17.15 -36.1 -15.3 -31.55 -15.15 -31.35 -14.9 -31.25 -14.65 -31.3 -13.5 -31.8 -13.4 -31.8 -13.25 -31.85 -11.75 -32.45 -11.55 -32.6 -11.4 -32.85 -11.45 -33.15 -13.4 -37.8 -13.45 -38.45 -13.4 -38.55 -13.15 -38.95 -13.0 -39.05 -12.6 -39.2 -12.3 -39.3 -12.25 -39.35 Q-8.25 -40.6 -3.75 -40.95 L-3.7 -40.95 -3.15 -41.0 -3.0 -41.0 Q-2.6 -41.0 -2.3 -40.7 -2.0 -40.4 -2.0 -40.0 L-2.0 -34.95 -1.9 -34.7 -1.75 -34.5 -1.45 -34.45 0.0 -34.5 1.65 -34.45 1.9 -34.5 2.1 -34.7 2.15 -34.95 2.15 -40.0 Q2.15 -40.4 2.45 -40.7 L3.15 -41.0 3.3 -41.0 3.35 -41.0 3.75 -40.95 3.85 -40.95 Q8.3 -40.55 12.4 -39.25 L12.45 -39.2 12.7 -39.2 12.75 -39.15 12.8 -39.15 12.9 -39.15 13.25 -39.0 13.35 -38.9 13.65 -38.4 13.6 -37.75 11.65 -33.1 11.6 -32.8 11.75 -32.55 11.95 -32.4 14.85 -31.25 15.1 -31.2 15.35 -31.3 15.5 -31.5 17.4 -36.0 17.45 -36.15 17.75 -36.55 17.8 -36.6 17.8 -36.65 18.25 -36.8 18.35 -36.8 18.95 -36.65 19.3 -36.45 19.35 -36.45 Q19.35 -36.4 19.45 -36.4 L19.4 -36.4 Q23.05 -34.4 26.45 -31.5 L26.5 -31.45 M4.05 -26.7 L3.85 -26.55 3.75 -26.25 3.75 -22.2 3.9 -21.85 4.15 -21.7 6.85 -21.05 10.1 -19.7 10.15 -19.65 10.2 -19.6 12.4 -18.25 12.75 -18.15 Q12.9 -18.15 13.05 -18.3 L16.0 -21.2 16.15 -21.45 16.15 -21.7 15.95 -21.95 14.95 -22.6 14.8 -22.7 14.75 -22.7 14.7 -22.75 12.8 -23.9 12.8 -23.95 12.65 -24.0 12.55 -24.1 12.45 -24.15 Q10.55 -25.15 8.45 -25.8 L8.15 -25.9 4.35 -26.75 4.05 -26.7 M18.2 -12.7 L18.3 -12.35 19.75 -10.0 21.1 -6.65 21.75 -4.0 21.95 -3.7 22.25 -3.6 26.35 -3.6 26.6 -3.65 26.8 -3.9 26.85 -4.15 26.0 -7.9 26.0 -7.95 25.95 -8.0 25.95 -8.05 25.95 -8.1 25.9 -8.15 25.9 -8.2 24.25 -12.3 24.2 -12.35 24.2 -12.4 24.1 -12.5 22.05 -15.8 21.8 -16.0 21.55 -16.0 21.3 -15.85 18.35 -13.0 18.2 -12.7 M4.9 -15.55 L2.4 -16.05 2.35 -16.05 1.6 -16.2 1.5 -16.2 1.4 -16.2 0.0 -16.25 -1.3 -16.2 -1.45 -16.2 -2.35 -16.1 -4.75 -15.55 -4.8 -15.5 -4.85 -15.5 -5.0 -15.5 -5.1 -15.45 -7.4 -14.5 -7.6 -14.4 -7.75 -14.35 -9.75 -13.0 -9.7 -13.0 -10.4 -12.45 -10.45 -12.4 -10.5 -12.4 -10.75 -12.25 -11.45 -11.5 -11.5 -11.45 -12.4 -10.5 -12.45 -10.45 -12.55 -10.4 -12.6 -10.35 -13.05 -9.7 -13.1 -9.6 -14.4 -7.55 -14.4 -7.45 -14.45 -7.45 -14.55 -7.3 -15.45 -5.15 -15.5 -5.05 -15.6 -4.7 -15.6 -4.65 -16.1 -2.3 -16.15 -2.2 -16.2 -1.5 -16.2 -1.45 -16.2 -1.3 -16.25 -1.15 -16.25 0.0 -16.2 1.4 -16.2 1.55 -16.1 2.45 -16.1 2.5 -15.55 4.8 -15.55 4.9 -15.45 5.15 -15.4 5.25 -14.4 7.45 -14.45 7.45 -14.4 7.55 -14.35 7.65 -14.35 7.7 -13.05 9.7 -12.45 10.5 -12.4 10.55 -12.45 10.55 -12.35 10.65 -12.25 10.75 -11.5 11.5 -11.45 11.55 -10.55 12.35 -10.5 12.4 -10.3 12.6 -10.15 12.7 -9.55 13.1 -9.6 13.1 -7.65 14.45 -7.5 14.5 -7.35 14.55 -7.3 14.6 -5.1 15.5 -4.95 15.5 -4.75 15.55 -2.35 16.1 -1.55 16.2 -1.45 16.2 -1.3 16.2 0.0 16.25 1.35 16.2 1.5 16.2 2.35 16.1 2.4 16.1 4.9 15.55 5.1 15.5 5.05 15.5 7.4 14.55 7.45 14.5 7.65 14.4 7.75 14.35 9.55 13.15 9.6 13.1 9.65 13.05 10.45 12.5 10.5 12.45 11.45 11.5 11.5 11.45 12.3 10.7 12.4 10.6 12.55 10.4 12.6 10.35 13.05 9.8 13.05 9.75 13.1 9.7 14.4 7.6 14.45 7.55 14.5 7.45 15.45 5.2 15.45 5.1 15.55 4.85 15.6 4.75 16.1 2.45 16.2 1.6 16.2 1.55 16.2 1.45 16.25 0.0 16.2 -1.2 16.2 -1.3 16.2 -1.4 16.2 -1.45 16.1 -2.3 15.65 -4.6 15.6 -4.65 15.5 -5.0 15.5 -5.1 14.65 -7.2 14.55 -7.3 14.5 -7.45 14.45 -7.5 13.15 -9.6 13.05 -9.7 12.55 -10.4 12.5 -10.45 12.45 -10.5 12.4 -10.55 11.5 -11.45 11.45 -11.5 11.4 -11.55 10.65 -12.3 10.6 -12.35 10.5 -12.4 9.7 -13.05 7.75 -14.35 7.7 -14.4 7.65 -14.4 7.5 -14.5 5.05 -15.45 5.1 -15.45 4.95 -15.5 4.9 -15.55 M0.0 -12.7 Q5.3 -12.7 9.0 -8.95 12.75 -5.25 12.75 0.05 12.75 5.3 9.0 9.0 5.3 12.75 0.0 12.75 -4.25 12.75 -7.4 10.45 L-9.0 9.0 Q-12.75 5.3 -12.75 0.05 -12.75 -5.25 -9.0 -8.95 L-7.4 -10.35 Q-4.25 -12.7 0.0 -12.7 M24.7 -24.7 L24.65 -24.75 24.75 -24.7 24.7 -24.7 M26.75 4.1 L26.6 3.9 26.3 3.8 22.2 3.8 Q22.0 3.8 21.9 3.95 L21.7 4.2 21.05 6.8 19.7 10.1 19.65 10.2 19.6 10.25 18.2 12.5 18.1 12.8 18.25 13.1 21.2 16.05 21.45 16.2 21.7 16.15 21.95 16.0 23.95 12.8 24.05 12.7 24.05 12.65 24.1 12.6 24.15 12.5 24.25 12.3 25.8 8.4 25.85 8.4 25.85 8.3 25.85 8.25 25.9 8.2 25.9 8.1 26.8 4.4 26.75 4.1 M3.9 21.9 L3.75 22.2 3.75 26.3 3.85 26.6 4.05 26.75 4.35 26.8 8.05 25.9 8.35 25.85 8.5 25.85 12.35 24.2 12.4 24.2 12.55 24.1 12.7 24.0 15.85 22.0 16.05 21.8 16.05 21.5 15.9 21.25 13.05 18.4 12.75 18.25 12.4 18.3 10.05 19.7 6.8 21.05 4.15 21.7 3.9 21.9 M-8.35 -25.85 Q-10.35 -25.25 -12.15 -24.25 L-12.35 -24.15 -12.45 -24.15 -12.5 -24.1 -12.6 -24.05 -12.65 -24.05 Q-14.4 -23.15 -15.95 -21.9 L-16.15 -21.7 -16.15 -21.4 -16.0 -21.15 -13.1 -18.25 Q-12.95 -18.1 -12.75 -18.1 L-12.45 -18.2 -10.2 -19.65 -10.1 -19.7 -10.0 -19.7 -9.95 -19.75 -6.75 -21.05 -4.05 -21.7 -3.75 -21.9 -3.65 -22.2 -3.65 -26.25 -3.7 -26.55 -3.9 -26.7 -4.2 -26.75 -8.05 -25.95 -8.35 -25.85 M-24.15 -12.4 L-24.3 -12.1 Q-25.3 -10.3 -25.9 -8.35 L-25.9 -8.3 -25.9 -8.2 -25.9 -8.25 -26.0 -8.0 Q-26.6 -6.1 -26.8 -4.15 L-26.75 -3.85 -26.6 -3.65 -26.3 -3.6 -22.2 -3.6 -21.85 -3.7 -21.7 -4.0 -21.05 -6.75 -19.8 -9.9 -19.75 -9.9 -19.7 -10.1 -18.3 -12.35 -18.2 -12.7 -18.35 -13.0 -21.2 -15.85 -21.45 -16.0 -21.75 -16.0 -21.95 -15.8 -24.05 -12.55 -24.1 -12.4 -24.15 -12.4 M-19.65 10.15 L-19.65 10.1 -19.7 10.0 -19.75 9.95 -20.95 6.95 -21.0 6.9 -21.0 6.85 -21.65 4.25 -21.85 3.95 -22.15 3.8 -26.25 3.8 -26.55 3.9 -26.7 4.1 -26.75 4.4 -25.9 8.2 -25.85 8.3 -25.8 8.4 -25.85 8.35 -25.8 8.4 -25.8 8.45 -25.8 8.5 -25.75 8.6 -24.15 12.35 -24.15 12.4 -24.15 12.35 -24.1 12.45 -24.1 12.5 -24.0 12.7 -23.95 12.75 -21.9 15.95 -21.7 16.1 -21.4 16.15 -21.15 16.0 -18.3 13.05 -18.15 12.75 -18.25 12.4 -19.6 10.2 -19.65 10.15 M-12.7 18.2 Q-12.9 18.2 -13.0 18.35 L-15.9 21.3 -16.05 21.55 -16.0 21.8 -15.85 22.05 -12.75 24.0 -12.65 24.05 -12.2 24.3 -12.1 24.4 -8.45 25.85 -8.35 25.85 -8.05 25.9 -7.95 25.95 -4.2 26.8 -3.95 26.75 -3.7 26.6 -3.65 26.3 -3.65 22.25 -3.75 21.95 -4.05 21.75 -6.65 21.1 Q-8.4 20.55 -9.95 19.75 L-12.35 18.3 -12.7 18.2" fill="#000000" fill-rule="evenodd" stroke="none"/>
  </g>
</svg>
