<?xml version="1.0" encoding="UTF-8" standalone="no"?>
<svg xmlns:xlink="http://www.w3.org/1999/xlink" height="21.15px" width="37.35px" xmlns="http://www.w3.org/2000/svg">
  <g transform="matrix(1.0, 0.0, 0.0, 1.0, 1.0, 9.75)">
    <path d="M14.0 2.0 L-1.0 6.0 -0.3 -3.9 16.0 -6.0 25.65 2.55 36.35 -9.75 26.15 11.4 14.0 2.0" fill="#ffffff" fill-rule="evenodd" stroke="none"/>
  </g>
</svg>
