<?xml version="1.0" encoding="UTF-8" standalone="no"?>
<svg xmlns:xlink="http://www.w3.org/1999/xlink" height="39.7px" width="53.6px" xmlns="http://www.w3.org/2000/svg">
  <g transform="matrix(1.0, 0.0, 0.0, 1.0, 26.8, 31.85)">
    <path d="M7.1 -31.85 L8.05 -31.65 8.25 -31.55 9.35 -31.25 Q11.85 -30.45 14.1 -28.85 L14.4 -28.65 14.45 -28.6 14.55 -28.5 14.65 -28.4 14.65 -28.45 15.65 -27.6 15.8 -27.5 16.65 -26.65 16.75 -26.65 Q17.35 -26.8 17.85 -26.05 L17.85 -26.0 17.9 -25.95 18.15 -25.3 18.15 -24.95 18.2 -24.9 18.25 -24.85 Q20.95 -21.5 22.4 -17.5 L22.45 -17.35 22.9 -15.95 22.95 -15.8 23.55 -13.25 23.55 -13.2 23.7 -12.1 24.0 -12.1 24.1 -12.05 24.65 -11.95 25.5 -11.95 26.2 -11.65 26.7 -11.0 26.7 -11.05 26.75 -11.0 26.8 -10.6 26.8 6.55 26.65 7.1 26.25 7.45 25.7 7.55 25.0 7.5 24.85 7.5 24.8 7.5 24.5 7.45 24.35 7.45 24.25 7.5 23.45 7.6 21.3 7.65 20.9 7.6 20.8 7.6 20.7 7.6 20.1 7.4 19.8 7.5 19.75 7.5 19.2 7.7 19.25 7.65 19.0 7.7 18.15 7.7 17.7 7.6 17.65 7.6 17.55 7.55 17.3 7.45 17.0 7.5 15.75 7.65 13.9 7.45 13.15 7.55 13.05 7.55 12.55 7.65 12.45 7.65 12.1 7.7 11.45 7.7 10.9 7.55 10.65 7.5 10.45 7.5 10.3 7.55 10.1 7.6 10.05 7.6 9.55 7.65 9.5 7.65 7.95 7.6 7.1 7.5 6.85 7.5 6.75 7.5 6.4 7.55 6.35 7.55 5.8 7.4 5.65 7.3 5.6 7.25 5.5 7.15 5.35 7.3 5.1 7.45 5.1 7.4 4.95 7.5 4.9 7.55 4.85 7.55 4.3 7.7 3.5 7.7 3.0 7.55 2.65 7.6 2.35 7.6 1.65 7.4 1.35 7.45 0.1 7.35 -0.25 7.45 -0.5 7.55 -1.05 7.7 -1.3 7.7 -3.05 7.85 -3.75 7.65 -4.05 7.25 -6.5 6.85 -6.55 6.85 -6.8 6.75 -6.75 6.75 -7.2 6.65 -7.45 6.65 -8.05 6.45 -8.6 6.45 -9.2 6.25 -9.25 6.25 -9.75 6.25 -9.7 6.3 -9.75 6.3 -10.15 6.2 -10.75 5.95 -10.95 5.95 -11.0 5.95 -11.2 5.95 -11.8 5.75 -11.85 5.7 -12.15 5.8 -12.15 5.85 -12.75 5.8 -12.9 5.75 -13.4 5.4 -13.65 5.4 -13.8 5.4 -14.0 5.4 -14.05 5.4 -14.6 5.3 -14.95 5.15 -17.7 4.75 -17.95 4.75 -18.35 4.7 -18.8 4.55 -19.1 4.5 -20.05 4.55 -20.3 4.55 -20.6 4.55 -21.15 4.3 -21.2 4.3 -21.65 4.35 -21.7 4.35 -22.0 4.3 -22.15 4.25 -22.4 4.25 -22.45 4.25 -22.9 4.15 -23.4 3.85 -23.7 3.8 -23.8 3.75 -23.85 3.75 -24.6 3.6 -24.65 3.6 -25.2 3.75 -25.25 3.75 -25.6 3.7 -25.75 3.65 -25.95 3.6 -26.5 3.25 -26.7 2.65 -26.7 2.45 -26.75 2.05 -26.7 1.75 -26.75 1.65 -26.8 1.2 -26.8 1.15 -26.75 0.95 -26.8 0.65 -26.8 0.5 -26.8 0.45 -26.8 0.2 -26.8 0.15 -26.75 -0.4 -26.7 -0.7 -26.7 -2.15 -26.75 -2.4 -26.8 -2.85 -26.75 -4.0 -26.75 -4.55 -26.7 -5.0 -26.7 -5.65 -26.6 -6.1 -26.55 -6.2 -26.2 -6.6 -25.75 -6.85 -25.75 -6.9 -24.85 -7.1 -24.8 -7.35 -24.8 -7.45 -24.65 -8.15 -24.65 -8.3 -24.55 -8.7 -24.6 -8.9 -24.45 -9.4 -24.45 -9.45 -24.25 -9.9 -22.95 -13.2 -22.9 -13.25 -22.7 -13.55 -22.7 -13.5 -22.25 -14.25 -22.4 -14.75 -22.25 -15.5 -22.2 -15.55 -22.15 -15.7 -22.1 -15.7 -21.75 -16.1 -21.7 -16.1 -21.45 -16.3 -20.8 -16.35 -20.7 -16.3 -18.95 -17.9 -17.65 -18.7 -17.25 -18.85 -17.0 -19.0 -14.9 -19.65 -14.85 -19.65 -14.75 -19.65 -14.6 -19.65 -14.05 -19.5 -13.5 -19.4 -13.35 -19.35 Q-11.15 -18.65 -9.35 -16.9 L-9.2 -17.05 -8.7 -17.35 Q-7.55 -20.7 -5.5 -23.6 L-5.6 -24.05 -5.45 -25.0 -5.4 -25.0 -5.15 -25.3 -5.1 -25.35 -4.75 -25.7 -4.65 -25.75 -4.4 -25.9 -3.5 -26.15 -3.35 -26.15 -2.2 -27.35 -2.15 -27.4 -0.45 -28.75 0.75 -29.5 1.3 -29.85 1.4 -29.9 1.45 -29.95 2.15 -30.3 2.2 -30.35 Q4.35 -31.4 6.75 -31.85 L6.75 -31.8 7.1 -31.85" fill="#ffffff" fill-rule="evenodd" stroke="none"/>
  </g>
</svg>
