<?xml version="1.0" encoding="UTF-8" standalone="no"?>
<svg xmlns:xlink="http://www.w3.org/1999/xlink" height="29.75px" width="31.85px" xmlns="http://www.w3.org/2000/svg">
  <g transform="matrix(1.0, 0.0, 0.0, 1.0, 17.2, 14.05)">
    <path d="M-12.4 -1.15 L-12.2 0.4 -12.1 0.75 -11.8 1.8 -12.25 1.35 -12.45 1.15 -12.4 -1.15 M5.9 -6.35 L5.85 -6.35 5.9 -6.35 M6.15 12.8 L6.15 12.75 6.2 12.7 6.15 12.8" fill="#70b1a4" fill-rule="evenodd" stroke="none"/>
    <path d="M6.7 -3.1 Q7.5 -4.15 7.35 -5.45 7.05 -7.7 5.4 -9.05 L5.35 -9.05 5.25 -9.15 4.7 -9.75 4.55 -9.85 Q0.2 -12.25 -4.8 -9.7 -9.75 -7.15 -9.8 -2.6 -9.8 -0.8 -9.2 0.75 L-8.55 2.05 -8.2 3.25 Q-7.5 5.05 -5.95 6.55 L-5.35 7.1 -8.0 6.5 -10.7 5.4 Q-13.95 3.75 -15.5 1.1 L-15.6 0.65 -15.7 -0.1 Q-15.95 -1.9 -15.45 -3.75 L-15.15 -4.75 -14.85 -2.55 -14.7 -1.9 -14.65 -1.75 Q-14.0 0.2 -12.45 1.8 L-12.35 1.9 -10.55 3.35 Q-11.25 2.1 -11.55 0.85 L-11.6 0.8 -11.8 -0.25 Q-12.6 -5.45 -7.2 -9.9 L-6.8 -10.2 Q-2.8 -13.2 2.55 -12.65 6.6 -12.1 9.15 -10.2 10.8 -8.95 11.8 -7.1 12.3 -5.25 12.05 -3.6 11.45 -0.25 7.75 2.3 6.0 3.5 4.1 3.9 2.0 4.35 -0.3 3.9 L-0.55 3.85 Q-4.3 3.0 -5.95 0.4 L-6.1 -0.65 Q-6.15 -2.8 -4.5 -4.75 L-3.95 -5.3 -2.0 -6.7 Q-2.95 -5.0 -3.0 -3.7 L-2.95 -2.65 -2.75 -2.2 -1.95 -1.15 -1.1 -0.65 -0.8 -0.5 Q0.35 -0.05 2.05 0.1 3.2 0.0 4.2 -0.6 L4.4 -0.7 4.6 -0.85 5.05 -1.15 5.85 -1.85 5.9 -1.85 6.7 -3.1 M-3.85 -7.15 L-3.85 -7.2 -3.8 -7.2 -3.85 -7.15 M-0.65 -4.1 L-0.65 -4.15 Q-0.5 -4.9 0.2 -5.45 0.95 -6.0 1.95 -6.0 2.9 -6.0 3.55 -5.45 L3.8 -5.2 3.8 -5.05 Q3.8 -4.05 3.05 -3.5 2.3 -2.9 1.0 -2.9 -0.2 -2.9 -0.6 -4.1 L-0.65 -4.1" fill="#ffffff" fill-rule="evenodd" stroke="none"/>
    <path d="M-12.4 -1.15 Q-12.35 -2.7 -11.8 -4.2 -11.15 -6.1 -9.8 -7.7 L-7.3 -10.2 -6.9 -10.55 Q-5.0 -12.0 -2.7 -12.5 L2.0 -13.05 Q4.3 -12.85 6.55 -12.0 8.25 -11.3 9.7 -10.2 L10.05 -9.9 11.3 -8.65 12.85 -5.95 Q13.65 -3.9 13.6 -1.7 L13.35 -0.15 Q12.45 2.8 9.05 5.1 7.8 5.95 6.45 6.4 3.8 7.35 0.85 6.85 L0.65 6.85 0.3 6.75 -0.9 6.4 Q-4.85 5.05 -6.15 1.6 L-6.25 1.3 -6.5 0.3 -6.55 -0.15 -6.6 -0.9 Q-6.5 -3.0 -4.95 -4.85 L-4.9 -4.95 -4.2 -5.65 -4.05 -5.8 Q-3.25 -6.5 -2.25 -7.0 L-1.0 -7.65 -0.95 -7.6 -0.95 -7.55 -1.5 -6.55 Q-2.55 -4.7 -2.55 -3.4 L-2.5 -2.85 -2.35 -2.4 -2.25 -2.15 -1.75 -1.55 -1.35 -1.3 -1.1 -1.15 -0.5 -0.85 2.1 -0.3 Q3.1 -0.4 4.0 -0.9 L4.2 -1.0 4.6 -1.25 5.0 -1.55 5.65 -2.2 5.75 -2.3 Q7.15 -4.05 5.95 -6.2 L5.85 -6.35 5.9 -6.35 5.4 -6.9 Q1.25 -9.35 -3.55 -6.85 L-3.95 -6.6 Q-5.95 -5.55 -7.05 -4.1 -8.35 -2.35 -8.3 -0.1 L-8.0 2.3 -7.65 3.3 Q-7.2 4.45 -6.35 5.4 L-4.4 7.2 -3.9 7.55 -3.35 7.9 -3.1 8.05 Q-1.9 8.65 -0.55 8.85 L1.7 8.9 6.15 8.3 2.5 9.65 2.45 9.65 2.35 9.65 -2.65 10.15 -3.35 10.1 -6.65 9.55 -10.0 8.3 Q-14.95 5.7 -16.0 1.0 L-16.05 0.75 -16.2 -0.45 -16.2 -0.5 -16.25 -0.9 -16.25 -1.5 Q-16.15 -3.0 -15.65 -4.35 L-14.6 -6.55 -14.35 -3.1 -13.8 -1.05 -12.45 1.15 -12.25 1.35 -11.8 1.8 -12.1 0.75 -12.2 0.4 -12.4 -1.15 M6.7 -3.1 L5.9 -1.85 5.85 -1.85 5.05 -1.15 4.6 -0.85 4.4 -0.7 4.2 -0.6 Q3.2 0.0 2.05 0.1 0.35 -0.05 -0.8 -0.5 L-1.1 -0.65 -1.95 -1.15 -2.75 -2.2 -2.95 -2.65 -3.0 -3.7 Q-2.95 -5.0 -2.0 -6.7 L-3.95 -5.3 -4.5 -4.75 Q-6.15 -2.8 -6.1 -0.65 L-5.95 0.4 -5.8 0.9 -5.75 1.15 Q-4.45 5.25 0.45 6.35 L0.7 6.4 Q3.0 6.85 5.1 6.4 7.0 6.0 8.75 4.8 12.45 2.25 13.05 -1.1 13.35 -3.0 12.65 -5.15 L11.8 -7.1 Q10.8 -8.95 9.15 -10.2 6.6 -12.1 2.55 -12.65 -2.8 -13.2 -6.8 -10.2 L-7.2 -9.9 Q-12.6 -5.45 -11.8 -0.25 L-11.6 0.8 -11.55 0.85 Q-11.25 2.1 -10.55 3.35 L-12.35 1.9 -12.45 1.8 Q-14.0 0.2 -14.65 -1.75 L-14.7 -1.9 -14.85 -2.55 -15.15 -4.75 -15.45 -3.75 Q-15.95 -1.9 -15.7 -0.1 L-15.6 0.65 -15.5 1.1 Q-14.35 5.55 -9.7 7.9 L-7.0 9.0 -3.4 9.7 -3.35 9.7 2.4 9.25 Q-0.9 9.65 -3.35 8.45 L-4.25 7.9 -5.35 7.1 -5.95 6.55 Q-7.5 5.05 -8.2 3.25 L-8.55 2.05 -8.8 -0.1 Q-8.75 -2.95 -6.8 -5.0 -5.65 -6.25 -3.85 -7.15 L-3.8 -7.2 Q1.3 -9.8 5.7 -7.25 L6.0 -7.0 6.35 -6.55 Q7.4 -4.65 6.7 -3.1 M3.8 -5.2 L3.55 -5.45 Q2.9 -6.0 1.95 -6.0 0.95 -6.0 0.2 -5.45 -0.5 -4.9 -0.65 -4.15 L-0.65 -4.1 -0.55 -3.45 -0.05 -2.75 0.3 -2.45 1.55 -2.15 Q2.5 -2.15 3.3 -2.75 L3.8 -3.15 4.05 -3.65 4.15 -4.1 Q4.25 -4.7 3.8 -5.2 M-1.1 -3.5 L-1.15 -4.1 -1.1 -4.35 -1.0 -4.6 -0.8 -5.05 -0.1 -5.75 Q0.85 -6.4 2.0 -6.4 L3.5 -6.05 3.95 -5.75 4.6 -4.55 4.6 -4.1 4.2 -3.0 3.65 -2.45 3.6 -2.4 Q3.1 -2.05 2.5 -1.85 L1.55 -1.75 1.05 -1.75 Q0.2 -1.9 -0.45 -2.45 L-0.65 -2.65 -0.95 -3.1 -0.95 -3.15 -1.05 -3.35 -1.1 -3.5" fill="#acd2cb" fill-rule="evenodd" stroke="none"/>
    <path d="M-16.2 -0.45 L-16.05 0.75 -16.0 1.0 Q-14.95 5.7 -10.0 8.3 L-6.65 9.55 -3.35 10.1 -2.65 10.15 2.35 9.65 2.45 9.65 2.5 9.65 6.15 8.3 6.15 12.75 6.15 12.8 4.25 13.6 3.45 13.85 1.7 14.1 -2.65 14.65 Q-5.1 14.7 -7.5 13.8 L-8.05 13.6 Q-9.95 12.9 -11.6 11.7 -13.55 10.2 -14.8 8.1 -16.0 6.1 -16.05 3.85 L-16.2 -0.45" fill="url(#gradient0)" fill-rule="evenodd" stroke="none"/>
    <path d="M-0.55 8.85 Q-1.9 8.65 -3.1 8.05 L-3.35 7.9 -3.9 7.55 -4.4 7.2 -6.35 5.4 -6.55 4.45 -6.55 4.4 -6.5 2.75 -6.5 0.3 -6.25 1.3 -6.15 1.6 Q-4.85 5.05 -0.9 6.4 L0.3 6.75 0.65 6.85 0.85 6.85 Q3.8 7.35 6.45 6.4 7.8 5.95 9.05 5.1 12.45 2.8 13.35 -0.15 L13.6 -1.7 13.65 -0.1 Q13.85 2.3 13.2 4.6 12.6 6.65 11.0 8.1 9.3 9.7 7.15 10.65 L7.15 6.9 5.4 7.8 1.55 8.8 -0.55 8.85" fill="url(#gradient1)" fill-rule="evenodd" stroke="none"/>
    <path d="M-8.0 2.3 L-8.3 -0.1 Q-8.35 -2.35 -7.05 -4.1 -5.95 -5.55 -3.95 -6.6 L-3.55 -6.85 Q1.25 -9.35 5.4 -6.9 L5.9 -6.35 5.85 -6.35 5.95 -6.2 Q7.15 -4.05 5.75 -2.3 L5.65 -2.2 5.4 -2.4 5.05 -2.6 5.05 -4.5 5.05 -5.15 Q5.05 -5.85 3.9 -6.5 2.85 -7.05 2.0 -7.05 0.9 -7.05 -0.25 -6.25 L-0.85 -5.75 -0.95 -7.55 -0.95 -7.6 -1.0 -7.65 -2.25 -7.0 Q-3.25 -6.5 -4.05 -5.8 L-4.2 -5.65 -4.9 -4.95 -4.95 -4.85 -5.7 -4.1 -7.0 -2.4 -7.05 -2.2 -7.0 0.35 Q-7.65 1.25 -8.0 2.3" fill="url(#gradient2)" fill-rule="evenodd" stroke="none"/>
    <path d="M-1.75 -1.55 L-2.25 -2.15 -2.35 -2.4 -2.5 -2.85 -2.55 -3.4 Q-2.55 -4.7 -1.5 -6.55 L-0.95 -7.55 -0.85 -5.75 Q-1.5 -5.1 -1.5 -4.4 L-1.4 -2.25 -1.5 -2.05 -1.75 -1.55" fill="url(#gradient3)" fill-rule="evenodd" stroke="none"/>
    <path d="M4.6 -1.25 L4.2 -1.0 4.0 -0.9 Q3.1 -0.4 2.1 -0.3 L-0.5 -0.85 -1.1 -1.15 -1.1 -3.5 -1.05 -3.35 -0.95 -3.15 -1.0 -3.15 -0.95 -3.1 -0.65 -2.65 -0.45 -2.45 Q0.2 -1.9 1.05 -1.75 L1.55 -1.75 2.5 -1.85 Q3.1 -2.05 3.6 -2.4 L3.65 -2.45 4.2 -3.0 4.6 -4.1 4.6 -1.25" fill="url(#gradient4)" fill-rule="evenodd" stroke="none"/>
    <path d="M-0.95 -3.15 L-0.95 -3.1 -1.0 -3.15 -0.95 -3.15" fill="#35645a" fill-rule="evenodd" stroke="none"/>
    <path d="M2.1 -14.0 L5.7 -13.35 6.8 -12.95 9.5 -11.5 10.7 -10.55 11.1 -10.2 Q12.45 -8.85 13.4 -7.2 14.5 -5.15 14.6 -2.6 L14.65 1.5 Q14.65 4.0 13.55 6.2 12.6 8.0 10.85 9.45 9.1 10.95 7.15 11.75 L7.15 13.45 6.8 13.6 6.4 13.8 Q4.3 14.8 1.95 15.3 L-1.95 15.7 -5.95 15.25 Q-8.15 14.85 -10.3 13.8 L-10.65 13.6 -13.55 11.35 Q-15.1 9.8 -16.1 7.75 -17.05 5.85 -17.15 3.55 L-17.05 -2.15 -16.75 -3.8 -16.0 -5.85 -15.9 -6.1 -13.95 -9.35 -13.9 -8.2 -13.25 -2.55 -12.9 -4.3 -12.35 -5.65 Q-11.25 -7.7 -9.65 -9.45 L-8.9 -10.2 -6.25 -12.15 -3.55 -13.35 -2.25 -13.7 2.1 -14.0 M13.6 -1.7 Q13.65 -3.9 12.85 -5.95 L11.3 -8.65 10.05 -9.9 9.7 -10.2 Q8.25 -11.3 6.55 -12.0 4.3 -12.85 2.0 -13.05 L-2.7 -12.5 Q-5.0 -12.0 -6.9 -10.55 L-7.3 -10.2 -9.8 -7.7 Q-11.15 -6.1 -11.8 -4.2 -12.35 -2.7 -12.4 -1.15 L-12.45 1.15 -13.8 -1.05 -14.35 -3.1 -14.6 -6.55 -15.65 -4.35 Q-16.15 -3.0 -16.25 -1.5 L-16.25 -0.9 -16.2 -0.5 -16.2 -0.45 -16.05 3.85 Q-16.0 6.1 -14.8 8.1 -13.55 10.2 -11.6 11.7 -9.95 12.9 -8.05 13.6 L-7.5 13.8 Q-5.1 14.7 -2.65 14.65 L1.7 14.1 3.45 13.85 4.25 13.6 6.15 12.8 6.2 12.7 6.15 12.75 6.15 8.3 1.7 8.9 -0.55 8.85 1.55 8.8 5.4 7.8 7.15 6.9 7.15 10.65 Q9.3 9.7 11.0 8.1 12.6 6.65 13.2 4.6 13.85 2.3 13.65 -0.1 L13.6 -1.7 M-6.35 5.4 Q-7.2 4.45 -7.65 3.3 L-8.0 2.3 Q-7.65 1.25 -7.0 0.35 L-7.05 -2.2 -7.0 -2.4 -5.7 -4.1 -4.95 -4.85 Q-6.5 -3.0 -6.6 -0.9 L-6.55 -0.15 -6.5 0.3 -6.5 2.75 -6.55 4.4 -6.55 4.45 -6.35 5.4 M5.65 -2.2 L5.0 -1.55 4.6 -1.25 4.6 -4.1 4.6 -4.55 3.95 -5.75 3.5 -6.05 2.0 -6.4 Q0.85 -6.4 -0.1 -5.75 L-0.8 -5.05 -1.0 -4.6 -1.1 -4.35 -1.15 -4.1 -1.1 -3.5 -1.1 -1.15 -1.35 -1.3 -1.75 -1.55 -1.5 -2.05 -1.4 -2.25 -1.5 -4.4 Q-1.5 -5.1 -0.85 -5.75 L-0.25 -6.25 Q0.9 -7.05 2.0 -7.05 2.85 -7.05 3.9 -6.5 5.05 -5.85 5.05 -5.15 L5.05 -4.5 5.05 -2.6 5.4 -2.4 5.65 -2.2" fill="#42796d" fill-rule="evenodd" stroke="none"/>
    <path d="M-8.55 2.05 L-9.2 0.75 Q-9.8 -0.8 -9.8 -2.6 -9.75 -7.15 -4.8 -9.7 0.2 -12.25 4.55 -9.85 L4.7 -9.75 5.25 -9.15 5.35 -9.05 5.4 -9.05 Q7.05 -7.7 7.35 -5.45 7.5 -4.15 6.7 -3.1 7.4 -4.65 6.35 -6.55 L6.0 -7.0 5.7 -7.25 Q1.3 -9.8 -3.8 -7.2 L-3.85 -7.2 -3.85 -7.15 Q-5.65 -6.25 -6.8 -5.0 -8.75 -2.95 -8.8 -0.1 L-8.55 2.05 M-5.95 0.4 Q-4.3 3.0 -0.55 3.85 L-0.3 3.9 Q2.0 4.35 4.1 3.9 6.0 3.5 7.75 2.3 11.45 -0.25 12.05 -3.6 12.3 -5.25 11.8 -7.1 L12.65 -5.15 Q13.35 -3.0 13.05 -1.1 12.45 2.25 8.75 4.8 7.0 6.0 5.1 6.4 3.0 6.85 0.7 6.4 L0.45 6.35 Q-4.45 5.25 -5.75 1.15 L-5.8 0.9 -5.95 0.4 M-15.5 1.1 Q-13.95 3.75 -10.7 5.4 L-8.0 6.5 -5.35 7.1 -4.25 7.9 -3.35 8.45 Q-0.9 9.65 2.4 9.25 L-3.35 9.7 -3.4 9.7 -7.0 9.0 -9.7 7.9 Q-14.35 5.55 -15.5 1.1 M3.8 -5.2 Q4.25 -4.7 4.15 -4.1 L4.05 -3.65 3.8 -3.15 3.3 -2.75 Q2.5 -2.15 1.55 -2.15 L0.3 -2.45 -0.05 -2.75 -0.55 -3.45 -0.65 -4.1 -0.6 -4.1 Q-0.2 -2.9 1.0 -2.9 2.3 -2.9 3.05 -3.5 3.8 -4.05 3.8 -5.05 L3.8 -5.2" fill="#deedea" fill-rule="evenodd" stroke="none"/>
  </g>
  <defs>
    <linearGradient gradientTransform="matrix(0.0131, 0.0, 0.0, 0.0095, -4.1, 6.85)" gradientUnits="userSpaceOnUse" id="gradient0" spreadMethod="pad" x1="-819.2" x2="819.2">
      <stop offset="0.0" stop-color="#acd2cb"/>
      <stop offset="0.32941176470588235" stop-color="#70b1a4"/>
      <stop offset="0.611764705882353" stop-color="#4a8a7d"/>
      <stop offset="0.7568627450980392" stop-color="#72b2a5"/>
      <stop offset="1.0" stop-color="#b7d8d1"/>
    </linearGradient>
    <linearGradient gradientTransform="matrix(-0.0118, 0.0, 0.0, -0.0078, 3.25, 4.65)" gradientUnits="userSpaceOnUse" id="gradient1" spreadMethod="pad" x1="-819.2" x2="819.2">
      <stop offset="0.0" stop-color="#d2e8e2"/>
      <stop offset="0.11764705882352941" stop-color="#acd2cb"/>
      <stop offset="0.3803921568627451" stop-color="#70b1a4"/>
      <stop offset="0.7137254901960784" stop-color="#4a8a7d"/>
      <stop offset="1.0" stop-color="#72b2a5"/>
    </linearGradient>
    <linearGradient gradientTransform="matrix(0.0085, 0.0, 0.0, 0.0063, 0.1, -2.9)" gradientUnits="userSpaceOnUse" id="gradient2" spreadMethod="pad" x1="-819.2" x2="819.2">
      <stop offset="0.0" stop-color="#4a8a7d"/>
      <stop offset="0.3803921568627451" stop-color="#8bc0b5"/>
      <stop offset="1.0" stop-color="#3c6f64"/>
    </linearGradient>
    <linearGradient gradientTransform="matrix(-0.0036, 0.0, 0.0, -0.0037, -4.65, -4.55)" gradientUnits="userSpaceOnUse" id="gradient3" spreadMethod="pad" x1="-819.2" x2="819.2">
      <stop offset="0.0" stop-color="#4a8a7d"/>
      <stop offset="0.3803921568627451" stop-color="#8bc0b5"/>
      <stop offset="1.0" stop-color="#3c6f64"/>
    </linearGradient>
    <linearGradient gradientTransform="matrix(0.0034, 0.0, 0.0, 0.0023, 2.95, -2.2)" gradientUnits="userSpaceOnUse" id="gradient4" spreadMethod="pad" x1="-819.2" x2="819.2">
      <stop offset="0.0" stop-color="#4a8a7d"/>
      <stop offset="0.3803921568627451" stop-color="#8bc0b5"/>
      <stop offset="1.0" stop-color="#3c6f64"/>
    </linearGradient>
  </defs>
</svg>
