<?xml version="1.0" encoding="UTF-8" standalone="no"?>
<svg xmlns:xlink="http://www.w3.org/1999/xlink" height="26.4px" width="43.05px" xmlns="http://www.w3.org/2000/svg">
  <g transform="matrix(1.0, 0.0, 0.0, 1.0, 0.0, 11.0)">
    <path d="M27.0 -11.0 L25.3 4.75 43.05 -7.35 21.2 15.4 21.9 -0.75 0.0 11.5 0.0 -1.6 27.0 -11.0" fill="#ffffff" fill-rule="evenodd" stroke="none"/>
  </g>
</svg>
