<?xml version="1.0" encoding="UTF-8" standalone="no"?>
<svg xmlns:xlink="http://www.w3.org/1999/xlink" height="35.35px" width="88.55px" xmlns="http://www.w3.org/2000/svg">
  <g transform="matrix(1.0, 0.0, 0.0, 1.0, 85.25, 32.85)">
    <path d="M-85.0 -11.45 L-85.0 -11.4 Q-84.45 -10.9 -82.6 -10.6 L-80.1 -10.35 -78.25 -10.6 -74.85 -11.6 Q-71.75 -12.7 -70.65 -13.3 L-70.45 -13.3 -73.45 -11.2 Q-75.15 -10.1 -76.95 -9.6 L-76.95 -9.55 -70.45 -11.65 -68.9 -12.1 Q-65.15 -13.2 -62.6 -13.0 -64.4 -12.9 -67.55 -11.8 L-68.65 -11.35 Q-71.15 -10.4 -72.15 -9.35 L-72.1 -9.25 Q-70.95 -10.05 -68.45 -10.75 L-68.2 -10.85 Q-65.0 -11.8 -62.25 -11.8 L-57.45 -11.5 -55.6 -11.15 -55.1 -11.05 -56.3 -9.75 -56.95 -9.05 -58.85 -9.6 -62.25 -10.0 -66.1 -9.65 -67.9 -9.25 -69.7 -8.65 -67.85 -9.05 -67.75 -9.1 -65.75 -9.4 -64.7 -9.35 -67.25 -8.8 -67.75 -8.65 Q-69.35 -8.1 -70.9 -7.15 L-71.85 -6.2 -73.75 -3.8 -75.7 -3.65 -76.35 -3.65 Q-80.4 -3.65 -83.15 -6.55 L-83.25 -6.65 -82.35 -6.6 -82.35 -6.55 -82.3 -6.55 -77.55 -6.15 -75.85 -6.4 -75.65 -6.4 Q-76.25 -6.1 -77.4 -5.9 L-80.2 -5.6 -77.2 -5.6 -75.9 -5.8 Q-73.6 -6.2 -72.35 -7.55 L-72.35 -7.75 -73.1 -7.75 -77.6 -7.05 -76.2 -7.35 -78.15 -7.4 Q-82.2 -7.9 -84.55 -10.55 L-85.1 -11.35 -85.0 -11.45 M-53.8 -12.55 L-53.95 -12.65 -54.85 -13.05 Q-57.85 -14.5 -59.95 -14.5 L-59.25 -14.65 -54.3 -14.1 -53.3 -14.0 -54.2 -14.4 -56.3 -15.6 -53.8 -15.15 -53.45 -14.95 -53.45 -15.1 -52.45 -14.7 -51.9 -14.5 -51.95 -14.5 -53.8 -12.55 M-49.75 -16.25 L-49.85 -16.35 -51.95 -17.9 Q-53.8 -19.05 -55.0 -19.35 L-51.4 -18.65 Q-49.35 -18.15 -47.95 -17.3 L-49.75 -16.25 M-59.75 -27.35 L-57.9 -26.35 -55.45 -24.85 Q-53.6 -23.45 -51.95 -21.35 L-56.8 -23.4 -58.5 -24.0 -59.15 -24.25 -61.25 -24.75 -61.5 -24.75 -63.7 -24.6 Q-64.85 -26.2 -65.55 -28.65 -66.1 -30.35 -66.25 -32.0 -65.4 -30.05 -63.15 -27.95 -60.35 -25.3 -57.35 -24.0 -59.3 -24.9 -61.65 -27.35 L-61.65 -27.45 -58.25 -25.15 -58.15 -25.15 -60.45 -26.85 -61.55 -27.95 -61.25 -27.85 -59.75 -27.35 M-74.9 0.2 L-74.05 -1.2 -73.8 -1.5 Q-73.15 -2.5 -72.15 -3.1 -67.95 -5.3 -67.45 -5.8 L-67.25 -5.8 -69.25 -4.5 -71.3 -2.8 -71.15 -2.7 -67.1 -5.05 -66.75 -5.25 Q-63.6 -6.7 -60.45 -6.7 L-58.75 -6.6 -59.1 -5.4 Q-60.95 -3.7 -63.95 -3.2 L-64.9 -3.0 -67.1 -2.65 -68.6 -2.5 -71.95 -1.35 -73.15 -0.8 Q-74.65 -0.15 -74.85 0.35 L-74.85 0.3 -74.9 0.25 -74.9 0.2 M-61.2 -3.05 L-60.8 -3.45 -59.15 -4.65 -59.1 -4.6 Q-61.4 -1.85 -62.95 1.25 L-63.95 2.4 -64.05 2.35 Q-63.85 0.5 -63.3 -0.55 L-62.4 -1.8 -61.0 -3.15 -61.2 -3.05 M-53.3 -14.0 L-53.25 -13.95 -53.1 -13.95 -53.3 -14.0" fill="#b38484" fill-rule="evenodd" stroke="none"/>
    <path d="M-55.1 -11.05 L-55.6 -11.15 -57.45 -11.5 -62.25 -11.8 Q-65.0 -11.8 -68.2 -10.85 L-68.45 -10.75 Q-70.95 -10.05 -72.1 -9.25 L-72.15 -9.35 Q-71.15 -10.4 -68.65 -11.35 L-67.55 -11.8 Q-64.4 -12.9 -62.6 -13.0 -65.15 -13.2 -68.9 -12.1 L-70.45 -11.65 -76.95 -9.55 -76.95 -9.6 Q-75.15 -10.1 -73.45 -11.2 L-70.45 -13.3 -70.65 -13.3 Q-71.75 -12.7 -74.85 -11.6 L-78.25 -10.6 -80.1 -10.35 -82.6 -10.6 Q-84.45 -10.9 -85.0 -11.4 L-85.0 -11.45 Q-82.35 -11.45 -80.0 -13.55 L-78.6 -14.95 -77.7 -15.9 -74.8 -18.05 Q-72.1 -19.9 -69.7 -20.65 -71.35 -19.95 -73.1 -18.2 L-75.65 -15.6 -71.8 -17.85 -77.6 -13.6 -75.8 -14.3 -71.45 -16.0 -69.3 -16.8 -65.65 -17.95 -69.4 -16.25 -69.9 -16.05 Q-73.2 -14.55 -74.6 -13.45 L-74.55 -13.3 -69.55 -15.1 -68.15 -15.55 -62.55 -16.15 -59.5 -15.9 -56.25 -15.2 -58.25 -16.05 Q-60.65 -17.0 -63.4 -17.4 L-63.25 -17.4 -61.95 -17.85 -60.45 -17.85 -53.5 -16.9 -58.55 -18.55 Q-62.1 -19.55 -64.5 -19.35 L-61.85 -19.85 -59.05 -20.05 -59.05 -20.2 -64.1 -20.2 -66.75 -19.8 -68.0 -19.5 -68.9 -19.2 -67.75 -19.9 -65.1 -21.15 -61.0 -21.7 -56.8 -21.2 -51.75 -19.65 Q-54.05 -21.0 -57.55 -22.25 -60.85 -23.5 -62.7 -23.8 L-62.6 -23.95 -60.6 -24.25 -59.15 -24.25 -58.5 -24.0 -56.8 -23.4 -51.95 -21.35 Q-53.6 -23.45 -55.45 -24.85 L-57.9 -26.35 -59.75 -27.35 -57.55 -26.5 -55.65 -25.6 Q-52.05 -23.75 -49.5 -20.6 L-47.5 -17.55 -47.5 -17.5 -47.95 -17.3 Q-49.35 -18.15 -51.4 -18.65 L-55.0 -19.35 Q-53.8 -19.05 -51.95 -17.9 L-49.85 -16.35 -49.75 -16.25 -51.0 -15.35 -51.8 -14.65 -51.9 -14.5 -52.45 -14.7 -53.45 -15.1 -53.45 -14.95 -53.8 -15.15 -56.3 -15.6 -54.2 -14.4 -53.3 -14.0 -54.3 -14.1 -59.25 -14.65 -59.95 -14.5 Q-57.85 -14.5 -54.85 -13.05 L-53.95 -12.65 -53.8 -12.55 -55.0 -11.2 -55.1 -11.05 M-77.6 -7.05 L-73.1 -7.75 -72.35 -7.75 -72.35 -7.55 Q-73.6 -6.2 -75.9 -5.8 L-77.2 -5.6 -80.2 -5.6 -77.4 -5.9 Q-76.25 -6.1 -75.65 -6.4 L-75.85 -6.4 -77.55 -6.15 -82.3 -6.55 -82.35 -6.55 -82.35 -6.6 -78.45 -6.95 -78.0 -7.0 -77.6 -7.05 M-73.75 -3.8 L-71.85 -6.2 -70.9 -7.15 Q-69.35 -8.1 -67.75 -8.65 L-67.25 -8.8 -64.7 -9.35 -65.75 -9.4 -67.75 -9.1 -67.85 -9.05 -69.7 -8.65 -67.9 -9.25 -66.1 -9.65 -62.25 -10.0 -58.85 -9.6 -56.95 -9.05 -57.8 -8.15 -58.75 -6.6 -60.45 -6.7 Q-63.6 -6.7 -66.75 -5.25 L-67.1 -5.05 -71.15 -2.7 -71.3 -2.8 -69.25 -4.5 -67.25 -5.8 -67.45 -5.8 Q-67.95 -5.3 -72.15 -3.1 -73.15 -2.5 -73.8 -1.5 L-74.05 -1.2 -74.9 0.2 Q-74.9 -1.05 -74.5 -2.2 L-73.75 -3.8 M-61.55 -27.95 L-60.45 -26.85 -58.15 -25.15 -58.25 -25.15 -61.65 -27.45 -61.65 -27.35 Q-59.3 -24.9 -57.35 -24.0 -60.35 -25.3 -63.15 -27.95 -65.4 -30.05 -66.25 -32.0 L-66.35 -32.85 -65.4 -31.2 Q-64.05 -29.5 -61.65 -28.0 L-61.55 -27.95 M-69.2 -13.6 L-65.85 -14.2 -62.1 -14.5 -60.2 -14.2 -59.05 -13.95 -60.0 -14.5 -62.7 -15.0 -64.55 -15.1 -65.4 -14.8 -69.2 -13.65 -69.2 -13.6 M-65.0 -18.25 L-65.0 -18.1 -65.65 -17.95 -65.0 -18.25 M-68.9 -7.2 Q-70.25 -6.15 -70.35 -5.5 L-67.6 -6.75 -67.3 -6.85 -64.1 -7.75 -67.45 -7.65 -68.3 -7.6 -68.65 -7.35 -68.9 -7.2 M-53.3 -14.0 L-53.1 -13.95 -53.25 -13.95 -53.3 -14.0" fill="#c29c9c" fill-rule="evenodd" stroke="none"/>
    <path d="M-59.15 -24.25 L-60.6 -24.25 -62.6 -23.95 -62.7 -23.8 Q-60.85 -23.5 -57.55 -22.25 -54.05 -21.0 -51.75 -19.65 L-56.8 -21.2 -61.0 -21.7 -65.1 -21.15 -67.75 -19.9 -68.9 -19.2 -68.0 -19.5 -66.75 -19.8 -64.1 -20.2 -59.05 -20.2 -59.05 -20.05 -61.85 -19.85 -64.5 -19.35 Q-62.1 -19.55 -58.55 -18.55 L-53.5 -16.9 -60.45 -17.85 -61.95 -17.85 -63.25 -17.4 -63.4 -17.4 Q-60.65 -17.0 -58.25 -16.05 L-56.25 -15.2 -59.5 -15.9 -62.55 -16.15 -68.15 -15.55 -69.55 -15.1 -74.55 -13.3 -74.6 -13.45 Q-73.2 -14.55 -69.9 -16.05 L-69.4 -16.25 -65.65 -17.95 -69.3 -16.8 -71.45 -16.0 -75.8 -14.3 -77.6 -13.6 -71.8 -17.85 -75.65 -15.6 -73.1 -18.2 Q-71.35 -19.95 -69.7 -20.65 -72.1 -19.9 -74.8 -18.05 L-77.7 -15.9 -75.7 -18.1 Q-70.65 -23.75 -63.7 -24.6 L-61.5 -24.75 -61.25 -24.75 -59.15 -24.25 M-69.2 -13.6 L-69.2 -13.65 -65.4 -14.8 -64.55 -15.1 -62.7 -15.0 -60.0 -14.5 -59.05 -13.95 -60.2 -14.2 -62.1 -14.5 -65.85 -14.2 -69.2 -13.6 M-65.0 -18.25 L-65.65 -17.95 -65.0 -18.1 -65.0 -18.25 M-68.9 -7.2 L-68.65 -7.35 -68.3 -7.6 -67.45 -7.65 -64.1 -7.75 -67.3 -6.85 -67.6 -6.75 -70.35 -5.5 Q-70.25 -6.15 -68.9 -7.2" fill="#d2b6b6" fill-rule="evenodd" stroke="none"/>
    <path d="M-56.95 -9.05 L-56.3 -9.75 -56.4 -8.95 Q-56.65 -7.65 -57.2 -6.35 -57.75 -5.2 -58.6 -4.0 -60.0 -2.05 -62.95 1.25 -61.4 -1.85 -59.1 -4.6 L-59.15 -4.65 -60.8 -3.45 -61.2 -3.05 -61.3 -3.0 -64.65 -1.8 -67.25 -1.0 -68.6 -0.85 -68.65 -0.9 -67.2 -1.65 -65.75 -2.5 -64.9 -3.0 -63.95 -3.2 Q-60.95 -3.7 -59.1 -5.4 L-58.75 -6.6 -57.8 -8.15 -56.95 -9.05" fill="#a36a6a" fill-rule="evenodd" stroke="none"/>
    <path d="M-85.1 -11.35 L-84.55 -10.55 Q-82.2 -7.9 -78.15 -7.4 L-76.2 -7.35 -77.6 -7.05 M-82.35 -6.6 L-83.25 -6.65 M-83.15 -6.55 Q-80.4 -3.65 -76.35 -3.65 L-75.7 -3.65 -73.75 -3.8 -71.85 -6.2 M-56.3 -9.75 L-55.1 -11.05 -55.0 -11.2 -53.8 -12.55 M-51.9 -14.5 L-51.8 -14.65 -51.0 -15.35 -49.75 -16.25 M-47.95 -17.3 L-47.5 -17.5 -47.5 -17.55 -49.5 -20.6 Q-52.05 -23.75 -55.65 -25.6 L-57.55 -26.5 -59.75 -27.35 M-51.95 -21.35 L-56.8 -23.4 -58.5 -24.0 M-78.6 -14.95 L-80.0 -13.55 Q-82.35 -11.45 -85.0 -11.45 L-85.1 -11.45 -85.25 -11.5 -85.15 -11.45 -85.1 -11.35 M-61.55 -27.95 L-61.65 -28.0 Q-64.05 -29.5 -65.4 -31.2 L-66.35 -32.85 -66.25 -32.0 Q-66.1 -30.35 -65.55 -28.65 -64.85 -26.2 -63.7 -24.6 L-61.5 -24.75 -61.25 -24.75 -59.15 -24.25 M-61.55 -27.95 L-61.25 -27.85 M-63.7 -24.6 Q-70.65 -23.75 -75.7 -18.1 L-77.7 -15.9 M-73.75 -3.8 L-74.5 -2.2 Q-74.9 -1.05 -74.9 0.2 M-64.9 -3.0 L-67.1 -2.65 -68.6 -2.5 -71.95 -1.35 -73.15 -0.8 Q-74.65 -0.15 -74.85 0.35 L-74.9 0.4 -74.9 0.25 -74.9 0.2 M-68.65 -0.9 L-68.85 -0.85 -68.6 -0.85 -67.25 -1.0 -64.65 -1.8 -61.3 -3.0 -61.2 -3.05 -61.0 -3.15 -62.4 -1.8 -63.3 -0.55 Q-63.85 0.5 -64.05 2.35 M-68.65 -0.9 L-67.2 -1.65 -65.75 -2.5 -64.9 -3.0 -63.95 -3.2 Q-60.95 -3.7 -59.1 -5.4 M-62.95 1.25 Q-60.0 -2.05 -58.6 -4.0 -57.75 -5.2 -57.2 -6.35 -56.65 -7.65 -56.4 -8.95 L-56.3 -9.75 M-63.95 2.4 L-62.95 1.25 M-47.95 -17.3 L-49.75 -16.25 M-51.9 -14.5 L-51.95 -14.5 -53.8 -12.55 M-82.35 -6.6 L-78.45 -6.95 M-63.95 2.4 L-64.05 2.5 -64.05 2.35" fill="none" stroke="#a36a6a" stroke-linecap="butt" stroke-linejoin="miter" stroke-miterlimit="3.0" stroke-opacity="0.4" stroke-width="0.05"/>
    <path d="M3.2 -20.5 L2.65 -19.95 Q0.4 -18.4 -2.5 -17.6 -4.95 -16.85 -7.45 -16.7 L-10.35 -16.65 -16.55 -17.75 -16.55 -17.7 Q-11.55 -15.7 -9.2 -15.55 L-7.75 -15.45 -6.9 -15.4 -7.8 -15.15 -8.8 -15.0 -10.95 -15.1 -16.2 -15.9 -21.25 -16.75 -23.1 -16.55 -24.25 -16.4 -19.65 -15.15 Q-16.65 -14.25 -15.7 -13.6 L-18.55 -14.6 -23.0 -15.2 -24.4 -15.1 -27.2 -14.65 -28.7 -14.1 -30.3 -13.35 -30.9 -14.2 -31.25 -14.55 -29.25 -15.8 -27.55 -16.65 -26.6 -17.1 -26.65 -17.15 -27.95 -16.8 -32.7 -15.75 -32.7 -15.9 -31.15 -17.35 -30.55 -17.8 -29.6 -18.6 -31.1 -18.05 -34.15 -16.15 -34.35 -16.25 -34.65 -16.3 -35.65 -16.65 -35.2 -17.7 -34.55 -18.65 Q-33.7 -19.9 -32.95 -20.2 -33.75 -20.05 -35.4 -18.85 L-35.95 -18.5 -37.25 -17.35 Q-37.9 -17.85 -37.9 -18.5 L-37.85 -18.9 -37.65 -19.6 -37.65 -19.65 -37.5 -20.05 -37.4 -20.5 -37.3 -20.65 -36.25 -22.15 Q-33.1 -26.3 -25.9 -31.2 L-25.9 -30.75 -31.4 -26.05 -33.4 -24.4 Q-32.3 -25.2 -29.7 -26.3 L-26.4 -27.6 -30.55 -25.55 -32.7 -24.05 Q-32.2 -24.4 -29.05 -24.95 L-32.4 -23.1 Q-35.2 -21.2 -36.1 -19.9 L-36.0 -19.8 Q-33.45 -21.5 -30.35 -22.45 L-29.7 -22.65 Q-26.1 -23.8 -23.6 -23.7 L-21.75 -23.55 -28.75 -21.6 -26.65 -21.95 -26.5 -21.95 Q-28.05 -21.7 -30.15 -20.7 L-32.75 -19.15 -33.55 -18.45 -34.0 -18.0 -33.15 -18.35 -33.15 -18.4 Q-30.05 -19.85 -26.95 -20.6 -23.75 -21.45 -21.7 -21.3 L-21.4 -21.3 -21.9 -21.15 -26.45 -19.7 Q-28.95 -18.8 -30.25 -17.7 L-30.5 -17.45 -30.15 -17.7 Q-28.1 -18.85 -24.55 -19.35 L-23.95 -19.4 -17.75 -19.65 -12.85 -18.95 -7.65 -18.25 -7.3 -18.25 -5.05 -18.5 -6.85 -18.6 -7.3 -18.6 Q-8.7 -18.9 -11.9 -20.35 L-16.05 -22.3 -11.75 -21.25 -7.45 -20.65 -7.35 -20.65 -4.65 -20.6 -3.95 -20.7 -3.85 -20.7 -5.25 -20.3 -7.3 -20.0 -2.4 -19.2 0.25 -19.55 3.1 -20.6 3.2 -20.5 M-9.1 -11.65 L-9.05 -11.65 -8.5 -11.6 -5.1 -12.15 -1.8 -13.15 Q-4.45 -11.2 -7.35 -9.85 L-9.1 -9.65 -10.4 -9.6 -12.95 -9.45 -10.85 -9.9 -14.1 -9.75 -17.45 -10.15 -12.25 -10.85 -9.15 -11.65 -9.1 -11.65 M-17.1 -30.6 L-18.0 -29.9 -20.05 -28.8 -24.05 -26.9 -19.8 -27.2 -19.15 -27.15 -24.2 -26.5 -27.55 -25.4 -27.8 -25.35 -27.35 -25.6 -22.8 -28.15 -19.85 -29.55 -17.1 -30.6 M-25.55 -12.85 L-24.0 -12.75 -21.05 -12.45 -19.15 -12.1 Q-17.2 -11.95 -15.55 -12.5 L-15.5 -12.45 -18.45 -11.6 -20.35 -11.2 -21.8 -11.15 Q-23.95 -11.25 -26.7 -12.5 L-25.55 -12.85 M-7.65 -19.9 Q-7.45 -19.9 -7.3 -20.0 L-7.8 -20.15 -7.65 -19.9" fill="#c29c9c" fill-rule="evenodd" stroke="none"/>
    <path d="M-26.4 -27.6 L-16.85 -30.9 -17.1 -30.6 -19.85 -29.55 -22.8 -28.15 -27.35 -25.6 -27.8 -25.35 -27.55 -25.4 -24.2 -26.5 -19.15 -27.15 -17.15 -26.5 -16.05 -26.05 -12.35 -24.25 -7.5 -21.9 -3.95 -20.7 -4.65 -20.6 -7.35 -20.65 -7.45 -20.65 -11.75 -21.25 -16.05 -22.3 -11.9 -20.35 Q-8.7 -18.9 -7.3 -18.6 L-6.85 -18.6 -5.05 -18.5 -7.3 -18.25 -7.65 -18.25 -12.85 -18.95 -17.75 -19.65 -23.95 -19.4 -24.55 -19.35 Q-28.1 -18.85 -30.15 -17.7 L-30.5 -17.45 -30.25 -17.7 Q-28.95 -18.8 -26.45 -19.7 L-21.9 -21.15 -21.4 -21.3 -21.7 -21.3 Q-23.75 -21.45 -26.95 -20.6 -30.05 -19.85 -33.15 -18.4 L-33.15 -18.35 -34.0 -18.0 -33.55 -18.45 -32.75 -19.15 -30.15 -20.7 Q-28.05 -21.7 -26.5 -21.95 L-26.65 -21.95 -28.75 -21.6 -21.75 -23.55 -23.6 -23.7 Q-26.1 -23.8 -29.7 -22.65 L-30.35 -22.45 Q-33.45 -21.5 -36.0 -19.8 L-36.1 -19.9 Q-35.2 -21.2 -32.4 -23.1 L-29.05 -24.95 Q-32.2 -24.4 -32.7 -24.05 L-30.55 -25.55 -26.4 -27.6" fill="#d2b6b6" fill-rule="evenodd" stroke="none"/>
    <path d="M-19.75 -7.6 L-17.55 -3.85 -19.4 -5.7 -20.35 -6.7 -21.75 -8.15 -21.75 -8.4 Q-21.45 -8.0 -20.15 -7.7 L-19.75 -7.6 M-17.95 -2.45 Q-16.75 -1.25 -15.7 -0.9 L-15.7 -0.85 -18.75 -1.9 -21.6 -3.1 -22.35 -3.55 Q-24.95 -4.95 -26.25 -6.65 L-26.3 -6.75 -27.55 -8.5 -28.95 -11.05 -29.3 -11.75 -29.25 -11.75 Q-27.85 -11.5 -25.8 -10.35 -23.35 -8.9 -22.5 -8.55 L-24.7 -8.9 Q-26.05 -9.05 -26.75 -9.35 -25.4 -8.6 -24.55 -7.5 -23.65 -6.35 -22.15 -5.15 L-21.05 -4.45 -19.45 -3.5 -18.05 -2.5 -17.95 -2.45 M-37.65 -19.65 L-37.25 -22.85 Q-36.75 -25.3 -35.5 -26.4 L-36.25 -22.15 -37.3 -20.65 -37.4 -20.5 -37.5 -20.05 -37.65 -19.65 M-31.4 -26.05 L-27.75 -27.9 -27.7 -27.85 -29.7 -26.3 Q-32.3 -25.2 -33.4 -24.4 L-31.4 -26.05" fill="#a36a6a" fill-rule="evenodd" stroke="none"/>
    <path d="M2.65 -19.95 Q-1.55 -15.85 -6.95 -13.2 L-8.8 -12.35 -9.85 -11.85 -9.1 -11.65 -9.15 -11.65 -12.25 -10.85 -17.45 -10.15 -14.1 -9.75 -10.85 -9.9 -12.95 -9.45 -10.4 -9.6 -9.1 -9.65 -7.35 -9.85 -10.15 -8.8 -11.3 -8.4 Q-14.55 -7.45 -17.45 -7.45 L-18.95 -7.45 -19.25 -7.5 -19.75 -7.6 -20.15 -7.7 Q-21.45 -8.0 -21.75 -8.4 L-21.75 -8.15 -20.35 -6.7 -19.4 -5.7 -17.55 -3.85 -17.35 -3.5 Q-18.5 -4.55 -20.55 -5.85 L-20.65 -5.9 -21.85 -6.6 -20.65 -5.45 -19.45 -4.15 -18.0 -2.5 -17.95 -2.45 -18.05 -2.5 -19.45 -3.5 -21.05 -4.45 -22.15 -5.15 Q-23.65 -6.35 -24.55 -7.5 -25.4 -8.6 -26.75 -9.35 -26.05 -9.05 -24.7 -8.9 L-22.5 -8.55 Q-23.35 -8.9 -25.8 -10.35 -27.85 -11.5 -29.25 -11.75 L-29.3 -11.75 -29.8 -12.6 -30.3 -13.35 -28.7 -14.1 -27.2 -14.65 -24.4 -15.1 -23.0 -15.2 -18.55 -14.6 -15.7 -13.6 Q-16.65 -14.25 -19.65 -15.15 L-24.25 -16.4 -23.1 -16.55 -21.25 -16.75 -16.2 -15.9 -10.95 -15.1 -8.8 -15.0 -7.8 -15.15 -6.9 -15.4 -7.75 -15.45 -9.2 -15.55 Q-11.55 -15.7 -16.55 -17.7 L-16.55 -17.75 -10.35 -16.65 -7.45 -16.7 Q-4.95 -16.85 -2.5 -17.6 0.4 -18.4 2.65 -19.95 M-15.7 -0.9 L-15.6 -0.8 -15.7 -0.85 -15.7 -0.9 M-31.25 -14.55 Q-32.3 -15.55 -34.15 -16.15 L-31.1 -18.05 -29.6 -18.6 -30.55 -17.8 -31.15 -17.35 -32.7 -15.9 -32.7 -15.75 -27.95 -16.8 -26.65 -17.15 -26.6 -17.1 -27.55 -16.65 -29.25 -15.8 -31.25 -14.55 M-35.65 -16.65 Q-36.6 -16.95 -36.85 -17.15 L-37.25 -17.35 -35.95 -18.5 -35.4 -18.85 Q-33.75 -20.05 -32.95 -20.2 -33.7 -19.9 -34.55 -18.65 L-35.2 -17.7 -35.65 -16.65 M-25.55 -12.85 L-26.7 -12.5 Q-23.95 -11.25 -21.8 -11.15 L-20.35 -11.2 -18.45 -11.6 -15.5 -12.45 -15.55 -12.5 Q-17.2 -11.95 -19.15 -12.1 L-21.05 -12.45 -24.0 -12.75 -25.55 -12.85 M-23.7 -7.9 L-21.85 -6.6 -23.7 -7.9" fill="#b38484" fill-rule="evenodd" stroke="none"/>
    <path d="M3.1 -20.6 L3.3 -20.6 3.2 -20.5 2.65 -19.95 Q-1.55 -15.85 -6.95 -13.2 L-8.8 -12.35 -9.85 -11.85 -9.1 -11.65 -9.05 -11.65 -8.5 -11.6 -5.1 -12.15 -1.8 -13.15 Q-4.45 -11.2 -7.35 -9.85 L-10.15 -8.8 -11.3 -8.4 Q-14.55 -7.45 -17.45 -7.45 L-18.95 -7.45 -19.25 -7.5 M-19.75 -7.6 L-17.55 -3.85 -17.35 -3.5 Q-18.5 -4.55 -20.55 -5.85 L-20.65 -5.9 -21.85 -6.6 -20.65 -5.45 -19.45 -4.15 -18.0 -2.5 -17.95 -2.45 Q-16.75 -1.25 -15.7 -0.9 L-15.6 -0.8 -15.7 -0.85 -18.75 -1.9 -21.6 -3.1 -22.35 -3.55 Q-24.95 -4.95 -26.25 -6.65 L-26.3 -6.75 -27.55 -8.5 -28.95 -11.05 -29.3 -11.75 -29.8 -12.6 -30.3 -13.35 -30.9 -14.2 -31.25 -14.55 Q-32.3 -15.55 -34.15 -16.15 L-34.35 -16.25 -34.65 -16.3 -35.65 -16.65 Q-36.6 -16.95 -36.85 -17.15 L-37.25 -17.35 Q-37.9 -17.85 -37.9 -18.5 L-37.85 -18.9 -37.65 -19.6 -37.65 -19.65 -37.25 -22.85 Q-36.75 -25.3 -35.5 -26.4 L-36.25 -22.15 Q-33.1 -26.3 -25.9 -31.2 L-25.9 -30.75 -31.4 -26.05 -27.75 -27.9 -27.65 -27.9 -27.7 -27.85 -29.7 -26.3 -26.4 -27.6 -16.85 -30.9 -17.1 -30.6 -18.0 -29.9 -20.05 -28.8 -24.05 -26.9 -19.8 -27.2 -19.15 -27.15 M-17.15 -26.5 L-16.05 -26.05 -12.35 -24.25 -7.5 -21.9 -3.95 -20.7 -3.85 -20.7 -5.25 -20.3 -7.3 -20.0 -2.4 -19.2 0.25 -19.55 3.1 -20.6 M-37.65 -19.65 L-37.5 -20.05 -37.4 -20.5 -37.3 -20.65 -36.25 -22.15 M-21.85 -6.6 L-23.7 -7.9 M-7.65 -19.9 Q-7.45 -19.9 -7.3 -20.0 L-7.8 -20.15 -7.65 -19.9 M-31.4 -26.05 L-33.4 -24.4 Q-32.3 -25.2 -29.7 -26.3" fill="none" stroke="#a36a6a" stroke-linecap="butt" stroke-linejoin="miter" stroke-miterlimit="3.0" stroke-opacity="0.4" stroke-width="0.05"/>
  </g>
</svg>
