<?xml version="1.0" encoding="UTF-8" standalone="no"?>
<svg xmlns:xlink="http://www.w3.org/1999/xlink" height="58.8px" width="58.8px" xmlns="http://www.w3.org/2000/svg">
  <g transform="matrix(1.0, 0.0, 0.0, 1.0, 29.3, 29.4)">
    <path d="M20.65 -1.75 Q20.4 -11.25 13.7 -18.45 8.7 -23.85 1.95 -25.45 11.7 -24.75 18.5 -17.6 25.85 -10.05 25.6 0.55 25.35 11.15 17.7 18.45 10.15 25.75 -0.45 25.5 -6.0 25.35 -10.6 23.25 -7.7 24.05 -4.45 24.1 5.7 24.35 12.9 17.3 16.6 13.65 18.55 9.3 20.6 5.3 20.7 0.45 L20.65 -1.75" fill="#000000" fill-opacity="0.8" fill-rule="evenodd" stroke="none"/>
    <path d="M18.55 9.3 Q20.5 4.8 20.65 -0.45 L20.65 -1.75 20.7 0.45 Q20.6 5.3 18.55 9.3" fill="#000000" fill-opacity="0.6" fill-rule="evenodd" stroke="none"/>
    <path d="M21.3 -20.3 Q29.75 -11.55 29.5 0.65 29.25 12.85 20.4 21.2 11.65 29.65 -0.55 29.4 -12.75 29.15 -21.1 20.3 -29.55 11.55 -29.3 -0.65 -29.05 -12.85 -20.2 -21.2 -11.45 -29.65 0.75 -29.4 12.95 -29.15 21.3 -20.3 M1.95 -25.45 L-3.3 -26.1 Q-13.4 -26.3 -20.9 -19.25 -28.45 -11.85 -28.65 -1.55 -28.9 8.8 -21.7 16.5 -16.85 21.5 -10.6 23.25 -6.0 25.35 -0.45 25.5 10.15 25.75 17.7 18.45 25.35 11.15 25.6 0.55 25.85 -10.05 18.5 -17.6 11.7 -24.75 1.95 -25.45" fill="#000000" fill-rule="evenodd" stroke="none"/>
  </g>
</svg>
