<?xml version="1.0" encoding="UTF-8" standalone="no"?>
<svg xmlns:xlink="http://www.w3.org/1999/xlink" height="15.5px" width="15.5px" xmlns="http://www.w3.org/2000/svg">
  <g transform="matrix(1.0, 0.0, 0.0, 1.0, 7.75, 15.5)">
    <path d="M5.45 -13.25 Q7.75 -10.95 7.75 -7.75 7.75 -4.55 5.45 -2.3 3.2 0.0 0.0 0.0 -3.2 0.0 -5.5 -2.3 -7.75 -4.55 -7.75 -7.75 -7.75 -10.95 -5.5 -13.25 -3.2 -15.5 0.0 -15.5 3.2 -15.5 5.45 -13.25" fill="url(#gradient0)" fill-rule="evenodd" stroke="none"/>
  </g>
  <defs>
    <radialGradient cx="0" cy="0" fx="-1088.0" fy="0" gradientTransform="matrix(0.0094, 0.0, 0.0, 0.0094, 0.0, -7.75)" gradientUnits="userSpaceOnUse" id="gradient0" r="819.2" spreadMethod="pad">
      <stop offset="0.2235294117647059" stop-color="#ffffff"/>
      <stop offset="0.5019607843137255" stop-color="#faf6f6" stop-opacity="0.8117647"/>
      <stop offset="1.0" stop-color="#e0cbcb" stop-opacity="0.0"/>
    </radialGradient>
  </defs>
</svg>
