<?xml version="1.0" encoding="UTF-8" standalone="no"?>
<svg xmlns:xlink="http://www.w3.org/1999/xlink" height="32.65px" width="100.2px" xmlns="http://www.w3.org/2000/svg">
  <g transform="matrix(1.0, 0.0, 0.0, 1.0, 49.0, 16.3)">
    <path d="M22.4 -1.05 L22.55 -1.1 22.55 -1.05 22.4 -1.05 20.0 0.8 20.9 1.0 Q21.8 1.0 22.6 0.3 L22.55 0.25 22.7 0.2 22.75 0.15 24.45 -0.6 24.95 -0.8 25.5 -1.05 Q27.95 -2.35 28.8 -4.1 L28.85 -4.1 28.9 -3.85 Q28.65 -2.7 27.85 -1.35 26.95 0.15 26.0 0.9 L29.5 1.2 32.4 0.75 34.05 0.0 Q34.6 -0.35 35.0 -0.8 34.55 -0.55 34.1 -0.45 L33.5 -0.4 29.9 -0.95 32.95 -4.35 34.75 -5.65 Q36.05 -6.3 37.5 -6.35 L36.9 -5.55 37.75 -6.0 37.85 -6.1 38.65 -6.75 38.9 -6.95 41.25 -8.05 44.7 -9.1 44.55 -8.95 45.45 -9.25 45.7 -9.3 47.0 -9.45 47.4 -9.4 47.6 -9.4 48.15 -9.25 48.55 -9.1 48.6 -9.0 46.85 -7.35 Q45.6 -5.75 45.6 -4.4 45.6 -3.55 45.9 -2.8 L46.2 -1.2 Q46.2 -0.2 45.4 0.85 L44.05 1.85 44.9 2.0 47.15 1.65 48.65 1.25 48.85 1.2 50.0 0.8 Q51.1 0.3 51.2 -0.2 51.15 0.7 50.7 1.6 48.3 3.1 45.2 3.65 L39.95 4.0 36.0 4.4 38.05 5.15 39.1 5.55 40.2 6.0 39.7 6.0 38.9 5.85 38.35 5.7 36.1 5.4 33.45 5.75 Q32.25 6.0 30.9 6.5 27.95 7.6 25.8 7.6 L23.95 7.5 Q24.4 8.15 25.95 8.5 L28.2 8.55 25.45 9.55 22.1 10.2 19.2 9.8 17.8 9.55 16.3 9.4 Q15.15 9.4 13.75 10.25 12.45 11.0 12.0 11.8 L12.0 11.2 Q12.0 10.25 12.5 9.25 12.9 8.45 13.4 8.0 L13.2 8.0 10.75 9.3 8.4 10.4 Q8.85 9.45 9.75 8.4 L11.35 6.7 8.55 7.2 6.2 7.6 Q3.4 7.6 0.4 5.95 L-2.2 4.2 -3.15 3.3 -1.85 3.65 0.7 4.2 2.6 3.8 2.6 3.6 Q1.25 3.8 -0.35 2.6 L-0.85 2.15 Q-2.0 1.05 -2.0 -0.1 L-1.55 -1.7 -1.4 -2.0 -0.45 -2.3 -0.45 -2.15 -0.75 -1.8 -1.1 -0.85 Q-1.1 0.1 -0.35 0.85 L-0.1 1.05 Q0.55 1.6 1.3 1.6 L5.2 0.75 Q7.7 -0.15 8.9 -0.15 11.1 -0.15 12.3 0.95 L13.05 1.95 14.55 0.7 17.85 -1.1 Q16.85 0.35 16.1 1.85 19.25 -0.75 22.4 -1.05 M42.7 -11.95 L43.85 -12.05 Q45.7 -12.05 47.25 -11.3 L47.3 -11.15 Q47.35 -11.05 47.5 -11.05 L47.5 -11.0 44.15 -10.85 41.2 -10.6 41.2 -10.8 42.7 -11.95 M35.15 -4.75 L34.55 -4.25 33.45 -3.4 Q32.55 -2.7 32.6 -2.0 33.0 -2.55 33.8 -2.8 L34.2 -1.3 34.2 -1.2 35.85 -1.7 38.0 -2.0 38.0 -1.8 35.65 0.75 33.8 2.6 33.0 3.2 33.6 3.2 33.7 3.2 Q34.85 3.15 37.8 1.9 40.95 0.55 41.4 -0.2 L42.75 -3.9 Q43.45 -5.95 44.4 -6.45 L39.6 -4.6 35.0 -2.6 Q35.0 -4.05 35.15 -4.75 M-6.75 0.1 L-7.0 0.7 Q-7.0 1.6 -5.8 1.75 L-4.2 1.8 Q-4.4 2.25 -5.2 2.3 L-6.4 2.6 -3.55 5.65 -3.2 5.95 -0.6 8.2 -5.25 8.55 Q-8.0 8.75 -9.25 9.5 L-9.3 9.5 -7.35 7.95 Q-6.1 7.0 -6.0 6.6 -8.5 6.6 -10.75 5.35 L-12.8 4.0 -12.8 3.95 -11.3 4.0 -8.0 3.6 Q-8.65 3.55 -9.15 2.85 L-9.6 1.5 Q-9.6 -0.2 -7.95 -1.8 L-6.7 -2.8 -5.25 -3.1 -5.1 -2.95 -6.75 -1.35 -6.75 0.1 M-11.8 -0.3 Q-12.1 0.4 -12.0 1.2 L-18.0 1.2 Q-19.15 0.8 -21.3 -0.6 L-17.95 -0.5 -16.55 -0.35 -14.8 -0.2 Q-14.85 -1.15 -15.3 -2.2 L-16.0 -3.45 -17.2 -4.75 -14.4 -3.4 -13.6 -2.85 Q-12.3 -1.7 -11.8 -0.3 M12.6 3.0 L9.6 3.0 9.8 2.3 Q10.05 1.75 10.4 1.6 L10.6 1.5 10.6 1.4 9.6 1.4 5.65 3.75 5.7 3.8 7.05 4.1 9.0 4.4 Q10.8 4.4 14.2 3.4 L11.8 6.4 12.85 6.2 14.2 6.0 Q15.5 6.0 17.7 6.7 L19.4 7.2 20.9 7.4 24.0 7.0 21.3 6.35 20.1 6.15 18.8 6.05 Q19.4 5.8 20.55 5.45 L21.4 5.2 Q24.3 4.4 26.3 4.4 L30.1 4.8 31.75 5.15 31.75 5.05 27.2 3.2 Q24.85 2.25 22.8 2.05 L21.8 2.0 18.15 2.4 15.0 3.0 12.6 3.0 Q12.7 2.35 13.05 1.95 12.7 2.35 12.6 3.0 M18.4 6.0 L18.8 6.05 18.4 6.2 18.4 6.0" fill="#e0cdcd" fill-rule="evenodd" stroke="none"/>
    <path d="M35.15 -4.75 Q35.0 -4.05 35.0 -2.6 L39.6 -4.6 44.4 -6.45 Q43.45 -5.95 42.75 -3.9 L41.4 -0.2 Q40.95 0.55 37.8 1.9 34.85 3.15 33.7 3.2 L33.6 3.2 33.0 3.2 33.8 2.6 35.65 0.75 38.0 -1.8 38.0 -2.0 35.85 -1.7 34.2 -1.2 34.2 -1.3 33.8 -2.8 Q33.0 -2.55 32.6 -2.0 32.55 -2.7 33.45 -3.4 L34.55 -4.25 35.15 -4.75 M12.6 3.0 L15.0 3.0 18.15 2.4 21.8 2.0 22.8 2.05 Q24.85 2.25 27.2 3.2 L31.75 5.05 31.75 5.15 30.1 4.8 26.3 4.4 Q24.3 4.4 21.4 5.2 L20.55 5.45 Q19.4 5.8 18.8 6.05 L20.1 6.15 21.3 6.35 24.0 7.0 20.9 7.4 19.4 7.2 17.7 6.7 Q15.5 6.0 14.2 6.0 L12.85 6.2 11.8 6.4 14.2 3.4 Q10.8 4.4 9.0 4.4 L7.05 4.1 5.7 3.8 5.65 3.75 9.6 1.4 10.6 1.4 10.6 1.5 10.4 1.6 Q10.05 1.75 9.8 2.3 L9.6 3.0 12.6 3.0 M18.4 6.0 L18.4 6.2 18.8 6.05 18.4 6.0" fill="#f2eaea" fill-rule="evenodd" stroke="none"/>
    <path d="M22.4 -1.05 L22.55 -1.05 22.55 0.25 22.6 0.3 Q21.8 1.0 20.9 1.0 L20.0 0.8 22.4 -1.05 M28.8 -4.1 L28.85 -4.15 28.85 -4.1 28.8 -4.1 M28.9 -3.85 L29.3 -0.4 29.75 -0.85 29.9 -0.95 33.5 -0.4 34.1 -0.45 Q34.55 -0.55 35.0 -0.8 34.6 -0.35 34.05 0.0 L32.4 0.75 29.5 1.2 26.0 0.9 Q26.95 0.15 27.85 -1.35 28.65 -2.7 28.9 -3.85 M38.9 -6.95 L39.35 -7.4 37.7 -10.3 39.45 -11.05 42.7 -11.95 41.2 -10.8 41.2 -10.6 44.15 -10.85 47.5 -11.0 45.85 -10.0 44.7 -9.1 41.25 -8.05 38.9 -6.95 M48.55 -9.1 L48.65 -9.05 48.7 -9.0 48.65 -9.0 Q47.75 -8.0 47.75 -6.35 47.75 -5.2 48.4 -3.45 49.0 -1.75 49.0 -0.35 L48.85 1.2 49.65 0.9 50.0 0.8 48.85 1.2 48.65 1.25 47.15 1.65 44.9 2.0 44.05 1.85 45.4 0.85 Q46.2 -0.2 46.2 -1.2 L45.9 -2.8 Q45.6 -3.55 45.6 -4.4 45.6 -5.75 46.85 -7.35 L48.6 -9.0 48.55 -9.1 M50.7 1.6 Q49.85 3.3 47.55 5.0 45.05 6.9 42.3 7.8 L45.7 7.55 Q44.0 9.65 39.4 9.75 L36.9 9.9 Q34.9 10.1 33.85 10.65 L34.95 10.7 36.4 10.6 Q33.85 11.35 32.6 12.0 L28.6 12.0 Q30.0 12.75 30.85 13.5 L27.85 12.65 Q23.05 11.6 19.1 11.6 18.0 11.6 17.6 12.0 L18.35 12.95 19.0 13.6 16.75 13.15 15.6 12.85 14.6 12.2 12.55 13.9 9.8 14.4 Q6.7 14.4 4.65 12.9 2.55 11.4 0.4 11.4 -1.85 11.4 -3.0 13.1 -3.65 14.0 -3.85 15.2 L-4.4 14.15 -4.75 12.45 -4.45 11.45 -4.0 10.85 -5.6 11.4 -10.6 11.4 -10.6 11.2 -9.35 10.05 Q-12.95 11.2 -14.6 11.2 L-17.8 10.8 Q-20.0 10.35 -20.8 9.8 -19.5 9.85 -18.9 8.95 -18.4 8.25 -18.4 7.2 -18.4 6.45 -18.85 5.6 L-19.05 5.25 -19.6 4.85 -19.7 4.75 -19.8 4.7 Q-22.3 2.8 -24.0 2.8 L-25.85 3.15 -27.15 3.6 Q-26.5 3.1 -24.35 2.5 -22.45 1.95 -22.2 1.4 L-24.5 1.9 -26.7 2.2 Q-29.2 2.2 -31.3 0.4 -33.45 -1.4 -35.3 -1.4 L-39.15 -0.65 -37.0 -2.5 -34.6 -3.8 -37.4 -3.4 -38.85 -3.5 -40.4 -3.8 Q-39.15 -4.1 -37.15 -5.65 L-37.2 -5.8 Q-37.8 -5.2 -40.6 -5.2 -44.0 -5.2 -47.35 -6.35 L-47.65 -7.05 -47.0 -7.0 Q-45.95 -6.85 -45.05 -7.35 L-45.0 -7.35 Q-41.0 -7.85 -41.0 -9.5 -41.0 -10.75 -42.6 -11.6 -44.15 -12.4 -46.3 -12.4 L-47.65 -12.15 -45.8 -13.2 Q-43.65 -14.3 -41.55 -14.3 -42.45 -15.4 -44.7 -15.75 L-44.75 -15.8 -41.9 -16.3 -38.7 -15.6 -36.25 -14.75 -36.8 -13.9 Q-37.45 -12.85 -37.8 -12.55 -37.6 -11.75 -36.95 -11.6 L-35.7 -11.55 Q-34.5 -11.55 -33.4 -12.05 -32.9 -12.3 -32.0 -12.9 -32.65 -11.65 -33.55 -10.8 -32.45 -10.1 -31.5 -10.1 -29.8 -10.1 -28.4 -10.6 -27.7 -10.85 -27.2 -11.2 L-27.1 -11.15 -28.35 -9.65 -30.0 -7.65 -30.35 -7.6 -30.1 -7.6 -30.0 -7.65 -27.25 -8.1 -24.1 -7.55 -21.4 -6.6 -23.05 -6.1 Q-23.6 -5.75 -23.6 -4.85 -23.6 -3.85 -22.6 -3.05 -21.65 -2.35 -20.5 -2.35 -19.0 -2.35 -18.3 -2.9 -17.45 -3.65 -18.15 -5.1 L-17.2 -4.75 -16.0 -3.45 -15.3 -2.2 Q-14.85 -1.15 -14.8 -0.2 L-16.55 -0.35 -17.95 -0.5 -21.3 -0.6 Q-19.15 0.8 -18.0 1.2 L-12.0 1.2 Q-12.1 0.4 -11.8 -0.3 L-11.7 0.15 Q-11.25 -0.7 -9.45 -1.65 L-6.7 -2.8 -7.95 -1.8 Q-9.6 -0.2 -9.6 1.5 L-9.15 2.85 Q-8.65 3.55 -8.0 3.6 L-11.3 4.0 -12.8 3.95 -12.8 4.0 -10.75 5.35 Q-8.5 6.6 -6.0 6.6 -6.1 7.0 -7.35 7.95 L-9.3 9.5 -9.25 9.5 Q-8.0 8.75 -5.25 8.55 L-0.6 8.2 -3.2 5.95 -3.55 5.65 -6.4 2.6 -5.2 2.3 Q-4.4 2.25 -4.2 1.8 L-5.8 1.75 Q-7.0 1.6 -7.0 0.7 L-6.75 0.1 -6.75 1.1 Q-3.6 -1.15 -1.4 -2.0 L-1.55 -1.7 -2.0 -0.1 Q-2.0 1.05 -0.85 2.15 L-0.35 2.6 Q1.25 3.8 2.6 3.6 L2.6 3.8 0.7 4.2 -1.85 3.65 -3.15 3.3 -2.2 4.2 0.4 5.95 Q3.4 7.6 6.2 7.6 L8.55 7.2 11.35 6.7 9.75 8.4 Q8.85 9.45 8.4 10.4 L10.75 9.3 13.2 8.0 13.4 8.0 Q12.9 8.45 12.5 9.25 12.0 10.25 12.0 11.2 L12.0 11.8 Q12.45 11.0 13.75 10.25 15.15 9.4 16.3 9.4 L17.8 9.55 19.2 9.8 22.1 10.2 25.45 9.55 28.2 8.55 25.95 8.5 Q24.4 8.15 23.95 7.5 L25.8 7.6 Q27.95 7.6 30.9 6.5 32.25 6.0 33.45 5.75 L36.1 5.4 38.35 5.7 38.9 5.85 39.7 6.0 40.2 6.0 39.1 5.55 38.05 5.15 36.0 4.4 39.95 4.0 45.2 3.65 Q48.3 3.1 50.7 1.6 M39.35 -7.4 L40.0 -8.35 39.35 -7.4 M42.3 7.8 L42.2 7.8 42.2 7.85 42.3 7.8 M33.0 11.2 L33.4 10.9 33.85 10.65 33.4 10.9 33.0 11.2 M28.6 12.0 L28.2 11.8 28.1 11.85 28.0 12.0 28.6 12.0 M-39.15 -0.65 L-39.2 -0.6 -39.4 -0.6 -39.15 -0.65" fill="#d2b6b6" fill-rule="evenodd" stroke="none"/>
    <path d="M30.85 13.5 L31.2 13.8 29.8 13.8 27.25 13.35 24.2 13.0 Q21.85 13.0 20.75 13.7 21.25 13.5 22.2 13.7 L23.8 14.0 23.8 14.2 20.7 14.8 17.4 15.2 14.3 14.8 13.8 14.65 13.15 14.45 13.0 14.4 12.05 15.3 Q10.65 16.35 9.0 16.35 7.15 16.35 4.2 15.0 1.25 13.6 -0.95 13.6 -1.45 13.6 -2.2 14.15 -3.1 14.75 -3.5 15.6 L-3.6 15.4 -3.75 15.35 -3.85 15.2 Q-3.65 14.0 -3.0 13.1 -1.85 11.4 0.4 11.4 2.55 11.4 4.65 12.9 6.7 14.4 9.8 14.4 L12.55 13.9 14.6 12.2 15.6 12.85 16.75 13.15 19.0 13.6 18.35 12.95 17.6 12.0 Q18.0 11.6 19.1 11.6 23.05 11.6 27.85 12.65 L30.85 13.5 M-4.45 11.45 Q-5.3 12.2 -6.95 12.85 L-7.2 12.95 -10.75 14.1 -12.15 14.1 -12.15 13.85 -10.15 11.7 -12.15 12.75 Q-13.75 13.35 -16.8 13.35 -19.55 13.35 -21.85 12.35 L-23.5 11.4 Q-24.4 10.65 -24.9 9.75 -22.85 9.45 -22.6 8.55 L-22.35 7.35 Q-22.35 6.45 -23.35 5.85 -24.25 5.35 -25.35 5.35 L-26.9 5.4 Q-27.65 5.45 -27.1 6.6 -26.1 7.1 -25.1 7.1 L-26.2 7.25 -27.25 7.35 Q-29.55 7.35 -32.2 4.85 -34.8 2.35 -37.3 2.35 -38.55 2.35 -41.3 3.6 L-41.3 3.1 -40.45 2.05 Q-39.65 1.2 -39.3 1.1 -42.1 1.35 -44.1 0.35 -45.95 -0.6 -46.75 -2.35 L-46.65 -2.6 -45.15 -2.35 -43.5 -2.65 -43.15 -2.75 -43.35 -2.8 Q-44.5 -3.2 -45.55 -4.1 -46.7 -5.15 -47.35 -6.35 -44.0 -5.2 -40.6 -5.2 -37.8 -5.2 -37.2 -5.8 L-37.15 -5.65 Q-39.15 -4.1 -40.4 -3.8 L-38.85 -3.5 -37.4 -3.4 -34.6 -3.8 -37.0 -2.5 -39.15 -0.65 -35.3 -1.4 Q-33.45 -1.4 -31.3 0.4 -29.2 2.2 -26.7 2.2 L-24.5 1.9 -22.2 1.4 Q-22.45 1.95 -24.35 2.5 -26.5 3.1 -27.15 3.6 L-25.85 3.15 -24.0 2.8 Q-22.3 2.8 -19.8 4.7 L-19.7 4.75 -19.6 4.85 -19.05 5.25 -18.85 5.6 Q-18.4 6.45 -18.4 7.2 -18.4 8.25 -18.9 8.95 -19.5 9.85 -20.8 9.8 -20.0 10.35 -17.8 10.8 L-14.6 11.2 Q-12.95 11.2 -9.35 10.05 L-10.6 11.2 -10.6 11.4 -5.6 11.4 -4.0 10.85 -4.45 11.45 M-47.65 -12.15 L-46.3 -12.4 Q-44.15 -12.4 -42.6 -11.6 -41.0 -10.75 -41.0 -9.5 -41.0 -7.85 -45.0 -7.35 -44.0 -8.0 -44.0 -9.1 -44.0 -9.85 -44.75 -10.8 -45.55 -11.8 -46.5 -11.8 L-48.75 -11.35 -48.75 -11.45 -47.65 -12.15 M-42.2 -3.05 L-43.15 -2.75 -42.2 -3.05 M-39.15 -0.65 L-39.4 -0.6 -39.2 -0.6 -39.15 -0.65" fill="#c29c9c" fill-rule="evenodd" stroke="none"/>
    <path d="M22.55 -1.05 L22.55 -1.1 M22.55 0.25 L22.7 0.2 22.75 0.15 24.45 -0.6 24.95 -0.8 25.5 -1.05 Q27.95 -2.35 28.8 -4.1 M28.85 -4.15 L28.85 -4.1 28.9 -3.85 29.3 -0.4 29.75 -0.85 M29.9 -0.95 L32.95 -4.35 34.75 -5.65 Q36.05 -6.3 37.5 -6.35 L36.9 -5.55 37.75 -6.0 37.85 -6.1 38.65 -6.75 38.9 -6.95 39.35 -7.4 37.7 -10.3 39.45 -11.05 42.7 -11.95 43.85 -12.05 Q45.7 -12.05 47.25 -11.3 L47.3 -11.15 Q47.35 -11.05 47.5 -11.05 L47.5 -11.0 45.85 -10.0 44.7 -9.1 44.55 -8.95 45.45 -9.25 45.7 -9.3 47.0 -9.45 47.4 -9.4 47.6 -9.4 48.15 -9.25 48.55 -9.1 48.65 -9.05 48.7 -9.0 48.65 -9.0 Q47.75 -8.0 47.75 -6.35 47.75 -5.2 48.4 -3.45 49.0 -1.75 49.0 -0.35 L48.85 1.2 49.65 0.9 50.0 0.8 Q51.1 0.3 51.2 -0.2 51.15 0.7 50.7 1.6 49.85 3.3 47.55 5.0 45.05 6.9 42.3 7.8 L45.7 7.55 45.8 7.4 46.0 7.4 45.7 7.55 Q44.0 9.65 39.4 9.75 L36.9 9.9 Q34.9 10.1 33.85 10.65 L34.95 10.7 36.4 10.6 Q33.85 11.35 32.6 12.0 L28.6 12.0 Q30.0 12.75 30.85 13.5 L31.2 13.8 29.8 13.8 27.25 13.35 24.2 13.0 Q21.85 13.0 20.75 13.7 21.25 13.5 22.2 13.7 L23.8 14.0 23.8 14.2 20.7 14.8 17.4 15.2 14.3 14.8 13.8 14.65 13.15 14.45 13.0 14.4 12.05 15.3 Q10.65 16.35 9.0 16.35 7.15 16.35 4.2 15.0 1.25 13.6 -0.95 13.6 -1.45 13.6 -2.2 14.15 -3.1 14.75 -3.5 15.6 L-3.6 15.4 -3.75 15.35 -3.85 15.2 -4.4 14.15 -4.75 12.45 -4.45 11.45 Q-5.3 12.2 -6.95 12.85 L-7.2 12.95 -10.75 14.1 -12.15 14.1 -12.15 13.85 -10.15 11.7 -12.15 12.75 Q-13.75 13.35 -16.8 13.35 -19.55 13.35 -21.85 12.35 L-23.5 11.4 Q-24.4 10.65 -24.9 9.75 -22.85 9.45 -22.6 8.55 L-22.35 7.35 Q-22.35 6.45 -23.35 5.85 -24.25 5.35 -25.35 5.35 L-26.9 5.4 Q-27.65 5.45 -27.1 6.6 -26.1 7.1 -25.1 7.1 L-26.2 7.25 -27.25 7.35 Q-29.55 7.35 -32.2 4.85 -34.8 2.35 -37.3 2.35 -38.55 2.35 -41.3 3.6 L-41.3 3.1 -40.45 2.05 Q-39.65 1.2 -39.3 1.1 -42.1 1.35 -44.1 0.35 -45.95 -0.6 -46.75 -2.35 M-46.65 -2.6 L-47.25 -2.85 M40.0 -8.35 L39.35 -7.4 M47.15 1.65 L48.65 1.25 M-1.4 -2.0 Q-3.6 -1.15 -6.75 1.1 L-6.75 0.1 -6.75 -1.35 -5.1 -2.95 -5.0 -3.1 -5.25 -3.1 -6.7 -2.8 -9.45 -1.65 Q-11.25 -0.7 -11.7 0.15 L-11.8 -0.3 Q-12.3 -1.7 -13.6 -2.85 L-14.4 -3.4 -17.2 -4.75 -18.15 -5.1 Q-17.45 -3.65 -18.3 -2.9 -19.0 -2.35 -20.5 -2.35 -21.65 -2.35 -22.6 -3.05 -23.6 -3.85 -23.6 -4.85 -23.6 -5.75 -23.05 -6.1 L-21.4 -6.6 -24.1 -7.55 -27.25 -8.1 -30.0 -7.65 -30.1 -7.6 -30.35 -7.6 -30.0 -7.65 -28.35 -9.65 -27.1 -11.15 M-27.2 -11.2 Q-27.7 -10.85 -28.4 -10.6 -29.8 -10.1 -31.5 -10.1 -32.45 -10.1 -33.55 -10.8 -32.65 -11.65 -32.0 -12.9 -32.9 -12.3 -33.4 -12.05 -34.5 -11.55 -35.7 -11.55 L-36.95 -11.6 Q-37.6 -11.75 -37.8 -12.55 -37.45 -12.85 -36.8 -13.9 L-36.25 -14.75 -38.7 -15.6 -41.9 -16.3 -44.75 -15.8 -45.0 -15.8 -44.7 -15.75 Q-42.45 -15.4 -41.55 -14.3 -43.65 -14.3 -45.8 -13.2 L-47.65 -12.15 M-45.0 -7.35 L-45.05 -7.35 Q-45.95 -6.85 -47.0 -7.0 L-47.65 -7.05 -47.35 -6.35 M-4.0 10.85 L-4.45 11.45 M12.6 3.0 Q12.7 2.35 13.05 1.95 L12.3 0.95 Q11.1 -0.15 8.9 -0.15 7.7 -0.15 5.2 0.75 L1.3 1.6 Q0.55 1.6 -0.1 1.05 L-0.35 0.85 Q-1.1 0.1 -1.1 -0.85 L-0.75 -1.8 -0.45 -2.15 -0.35 -2.35 -0.45 -2.3 -1.4 -2.0 M33.85 10.65 L33.4 10.9 33.0 11.2 M22.4 -1.05 Q19.25 -0.75 16.1 1.85 16.85 0.35 17.85 -1.1 L14.55 0.7 13.05 1.95 M28.6 12.0 L28.2 11.8 28.1 11.85 28.0 12.0 28.6 12.0 M22.55 -1.05 L22.55 0.25 M-48.75 -11.35 L-46.5 -11.8 Q-45.55 -11.8 -44.75 -10.8 -44.0 -9.85 -44.0 -9.1 -44.0 -8.0 -45.0 -7.35 M-48.75 -11.35 L-49.0 -11.3 -48.75 -11.45 M-43.15 -2.75 L-42.2 -3.05 M-46.65 -2.6 L-45.15 -2.35 -43.5 -2.65 -43.15 -2.75 -43.35 -2.8 Q-44.5 -3.2 -45.55 -4.1 -46.7 -5.15 -47.35 -6.35" fill="none" stroke="#a36a6a" stroke-linecap="round" stroke-linejoin="round" stroke-opacity="0.4" stroke-width="0.05"/>
  </g>
</svg>
