<?xml version="1.0" encoding="UTF-8" standalone="no"?>
<svg xmlns:xlink="http://www.w3.org/1999/xlink" height="10.05px" width="88.4px" xmlns="http://www.w3.org/2000/svg">
  <g transform="matrix(1.0, 0.0, 0.0, 1.0, -6.6, -4.85)">
    <path d="M95.0 14.9 L6.6 14.9 6.6 10.85 Q6.6 4.85 12.6 4.85 L89.0 4.85 Q95.0 4.85 95.0 10.85 L95.0 14.9" fill="#1a1612" fill-rule="evenodd" stroke="none"/>
  </g>
</svg>
