<?xml version="1.0" encoding="UTF-8" standalone="no"?>
<svg xmlns:xlink="http://www.w3.org/1999/xlink" height="210.7px" width="246.25px" xmlns="http://www.w3.org/2000/svg">
  <g transform="matrix(1.0, 0.0, 0.0, 1.0, -115.85, 3.2)">
    <path d="M115.85 166.1 L119.0 -3.2 154.7 -3.2 151.4 192.95 141.95 189.3 Q124.2 182.0 123.85 182.0 L123.15 182.05 Q116.9 175.9 116.3 166.25 L115.85 166.1 M184.9 -3.2 L218.55 -3.2 218.55 3.35 217.9 10.95 217.2 14.45 Q215.1 66.15 215.0 136.1 214.9 167.2 215.25 205.6 L211.5 205.25 198.3 203.85 Q191.65 119.85 188.3 60.8 L184.9 -3.2 M249.1 -3.2 L294.2 -3.2 291.95 202.8 291.35 202.9 Q263.05 207.5 248.85 207.5 L246.4 207.5 249.1 -3.2 M340.5 -3.2 L362.1 -3.2 360.6 173.55 Q351.55 182.45 344.0 188.85 L338.8 191.25 340.5 -3.2" fill="#ffffff" fill-opacity="0.36862746" fill-rule="evenodd" stroke="none"/>
    <path d="M154.7 -3.2 L184.9 -3.2 188.3 60.8 Q191.65 119.85 198.3 203.85 181.1 201.8 171.6 199.5 164.3 197.7 151.4 192.95 L154.7 -3.2 M218.55 -3.2 L249.1 -3.2 246.4 207.5 215.25 205.6 Q214.9 167.2 215.0 136.1 215.1 66.15 217.2 14.45 L217.9 10.95 218.55 3.35 218.55 -3.2 M294.2 -3.2 L340.5 -3.2 338.8 191.25 333.1 193.5 Q320.55 198.1 291.95 202.8 L294.2 -3.2" fill="#ffffff" fill-opacity="0.49803922" fill-rule="evenodd" stroke="none"/>
    <path d="M116.3 166.25 L115.9 166.2 115.85 166.1 116.3 166.25" fill="#ffffff" fill-opacity="0.9019608" fill-rule="evenodd" stroke="none"/>
  </g>
</svg>
