<?xml version="1.0" encoding="UTF-8" standalone="no"?>
<svg xmlns:xlink="http://www.w3.org/1999/xlink" height="41.45px" width="41.5px" xmlns="http://www.w3.org/2000/svg">
  <g transform="matrix(1.0, 0.0, 0.0, 1.0, -1.6, 42.5)">
    <path d="M39.35 -19.0 L39.45 -17.75 Q39.5 -16.6 39.7 -15.45 38.1 -16.55 37.05 -17.45 L36.8 -15.05 36.05 -13.1 35.65 -12.45 32.75 -17.6 32.75 -10.0 31.7 -10.45 30.6 -10.95 28.6 -12.0 25.65 -13.75 22.85 -15.65 20.25 -17.55 20.05 -20.45 15.6 -23.0 9.5 -26.5 7.7 -27.55 8.7 -27.95 8.9 -28.0 9.5 -28.15 11.7 -28.75 11.75 -28.75 13.4 -29.35 13.45 -29.35 13.5 -29.4 13.65 -29.5 17.6 -30.95 17.85 -31.15 Q20.5 -32.2 23.0 -33.65 L27.15 -36.35 27.75 -36.75 27.95 -36.9 29.2 -37.8 39.35 -19.0" fill="#011921" fill-rule="evenodd" stroke="none"/>
    <path d="M29.2 -37.8 L30.45 -38.75 30.7 -38.95 Q31.7 -39.65 32.75 -39.85 L34.0 -40.0 34.65 -39.95 39.55 -26.85 Q39.25 -24.55 39.25 -22.25 L39.25 -21.8 39.3 -19.5 39.35 -19.0 29.2 -37.8 M40.6 -9.65 L40.3 -8.1 40.0 -7.35 40.0 -7.3 39.9 -7.15 39.25 -6.0 35.65 -12.45 36.05 -13.1 36.8 -15.05 40.6 -9.65 M32.75 -3.7 Q31.45 -4.05 30.25 -4.95 L30.6 -10.95 31.7 -10.45 32.75 -10.0 32.75 -3.7 M25.85 -8.05 L23.15 -9.85 23.1 -9.9 22.65 -10.15 22.85 -15.65 25.65 -13.75 25.65 -13.4 25.85 -8.05 M20.5 -11.3 L17.9 -12.55 Q17.75 -12.6 17.7 -12.7 L15.6 -13.55 15.6 -23.0 20.05 -20.45 20.25 -17.55 20.45 -12.05 20.5 -11.3 M9.5 -15.4 L8.9 -15.55 8.85 -15.6 Q7.65 -15.85 6.5 -16.85 L6.5 -26.8 7.7 -27.55 9.5 -26.5 9.5 -15.4" fill="#033d4f" fill-rule="evenodd" stroke="none"/>
    <path d="M39.7 -15.45 L39.9 -14.2 40.4 -11.35 40.6 -9.65 36.8 -15.05 37.05 -17.45 Q38.1 -16.55 39.7 -15.45" fill="#01212e" fill-rule="evenodd" stroke="none"/>
    <path d="M30.25 -4.95 Q29.1 -5.8 27.9 -6.7 L26.95 -7.35 26.9 -7.35 26.7 -7.5 25.85 -8.05 25.65 -13.4 25.65 -13.75 28.6 -12.0 30.6 -10.95 30.25 -4.95 M22.65 -10.15 L20.5 -11.3 20.45 -12.05 20.25 -17.55 22.85 -15.65 22.65 -10.15" fill="#000000" fill-rule="evenodd" stroke="none"/>
    <path d="M35.0 -42.45 Q36.65 -42.3 38.1 -41.6 39.05 -41.2 39.9 -40.45 L40.15 -40.2 40.25 -40.15 Q41.75 -38.8 42.4 -37.2 L42.45 -37.15 42.6 -36.55 43.05 -34.65 43.05 -34.6 Q43.2 -33.2 42.85 -31.7 42.3 -29.15 42.05 -26.6 L42.05 -26.7 42.05 -26.5 Q41.75 -24.4 41.75 -22.25 L41.75 -21.8 41.8 -19.6 41.85 -19.2 41.95 -18.05 41.95 -17.9 41.95 -17.85 41.95 -17.75 42.15 -16.0 42.2 -15.85 42.2 -15.65 42.35 -14.75 42.35 -14.8 42.4 -14.65 42.4 -14.5 42.85 -11.9 43.1 -9.55 42.75 -7.5 42.7 -7.4 42.35 -6.45 42.25 -6.2 42.25 -6.15 42.1 -5.9 42.1 -5.85 41.35 -4.65 41.3 -4.55 41.25 -4.5 Q39.9 -2.75 37.85 -1.85 L37.95 -1.9 37.45 -1.7 37.15 -1.6 32.2 -1.25 32.1 -1.25 Q30.35 -1.75 28.75 -2.95 L26.55 -4.6 26.35 -4.7 25.85 -5.1 25.8 -5.1 25.35 -5.4 25.2 -5.5 24.75 -5.8 24.7 -5.85 24.65 -5.85 24.6 -5.9 24.4 -6.0 21.85 -7.7 21.75 -7.75 21.65 -7.85 21.55 -7.9 21.45 -7.95 19.6 -8.95 19.4 -9.05 17.1 -10.15 16.3 -10.55 14.85 -11.15 14.7 -11.2 12.1 -12.05 12.0 -12.1 11.45 -12.25 11.35 -12.3 11.25 -12.35 8.95 -12.95 8.8 -13.0 8.7 -13.05 8.5 -13.1 7.9 -13.25 Q6.35 -13.7 4.9 -14.95 L4.8 -15.05 4.75 -15.05 4.75 -15.1 4.05 -15.8 Q2.9 -16.9 2.3 -18.3 L2.3 -18.35 2.25 -18.4 Q1.55 -20.05 1.6 -21.95 L1.6 -22.05 1.7 -22.9 Q1.95 -24.85 2.9 -26.4 L2.85 -26.35 2.9 -26.4 Q3.7 -27.8 4.95 -28.7 L5.05 -28.8 6.55 -29.75 6.7 -29.85 7.85 -30.3 7.8 -30.3 8.45 -30.45 8.7 -30.5 8.85 -30.55 11.05 -31.15 11.1 -31.2 11.25 -31.2 12.25 -31.6 12.3 -31.6 12.4 -31.65 12.5 -31.7 12.65 -31.8 12.9 -31.85 12.95 -31.9 16.25 -33.05 17.1 -33.5 17.0 -33.5 Q19.45 -34.5 21.75 -35.8 L25.7 -38.35 25.95 -38.5 25.9 -38.5 25.8 -38.4 26.2 -38.7 26.65 -39.0 27.7 -39.8 27.9 -39.9 28.7 -40.5 29.4 -41.1 29.45 -41.1 29.5 -41.15 29.6 -41.2 Q30.75 -41.95 31.95 -42.2 L32.25 -42.3 34.0 -42.5 34.05 -42.5 34.75 -42.45 35.0 -42.45 M34.85 -40.95 L34.85 -40.9 34.0 -41.0 32.6 -40.85 32.6 -40.8 Q31.35 -40.6 30.25 -39.85 L29.75 -39.45 28.65 -38.6 28.6 -38.6 27.5 -37.8 27.15 -37.5 26.6 -37.15 26.55 -37.15 Q24.55 -35.7 22.5 -34.5 20.1 -33.1 17.55 -32.1 L17.0 -31.75 13.35 -30.45 13.2 -30.4 13.15 -30.35 13.0 -30.25 12.8 -30.2 11.6 -29.75 11.45 -29.7 9.25 -29.1 9.35 -29.1 8.7 -29.0 8.35 -28.9 7.3 -28.45 5.9 -27.55 5.95 -27.6 Q4.85 -26.85 4.2 -25.65 L4.2 -25.6 Q3.4 -24.3 3.2 -22.55 L3.1 -22.15 3.1 -22.05 3.1 -21.95 Q3.05 -20.35 3.65 -18.95 4.15 -17.8 5.1 -16.85 L5.8 -16.15 5.85 -16.1 Q7.1 -15.0 8.45 -14.65 L8.75 -14.55 9.2 -14.45 9.3 -14.4 11.9 -13.7 12.35 -13.55 15.25 -12.6 17.05 -11.85 17.6 -11.6 20.05 -10.4 22.2 -9.25 22.55 -9.05 Q22.55 -9.05 22.65 -9.0 L25.3 -7.2 25.4 -7.15 26.1 -6.7 26.25 -6.6 Q26.4 -6.45 26.6 -6.4 L27.3 -5.9 29.65 -4.15 Q31.0 -3.1 32.5 -2.7 L32.55 -2.7 Q34.6 -2.25 36.9 -3.1 L37.25 -3.25 Q38.95 -3.95 40.05 -5.4 L40.1 -5.45 40.8 -6.6 40.9 -6.85 40.95 -7.0 41.25 -7.75 41.3 -7.85 41.6 -9.6 41.4 -11.55 40.9 -14.3 40.9 -14.4 40.7 -15.5 40.7 -15.6 40.45 -17.8 40.45 -17.85 40.35 -19.05 40.3 -19.55 40.25 -21.8 40.25 -22.25 Q40.25 -24.5 40.55 -26.7 L40.55 -26.75 Q40.8 -29.4 41.4 -32.0 L41.55 -34.45 41.1 -36.25 41.05 -36.6 Q40.45 -37.9 39.25 -39.05 L39.2 -39.05 39.0 -39.25 38.95 -39.3 37.5 -40.25 Q36.25 -40.8 34.85 -40.95" fill="#000000" fill-opacity="0.27058825" fill-rule="evenodd" stroke="none"/>
    <path d="M34.85 -40.95 Q36.25 -40.8 37.5 -40.25 L38.95 -39.3 39.0 -39.25 39.2 -39.05 39.25 -39.05 Q40.45 -37.9 41.05 -36.6 L41.1 -36.25 41.55 -34.45 41.4 -32.0 Q40.8 -29.4 40.55 -26.75 L40.55 -26.7 Q40.25 -24.5 40.25 -22.25 L40.25 -21.8 40.3 -19.55 40.35 -19.05 40.45 -17.85 40.45 -17.8 40.7 -15.6 40.7 -15.5 40.9 -14.4 40.9 -14.3 41.4 -11.55 41.6 -9.6 41.3 -7.85 41.25 -7.75 40.95 -7.0 40.9 -6.85 40.8 -6.6 40.1 -5.45 40.05 -5.4 Q38.95 -3.95 37.25 -3.25 L36.9 -3.1 Q34.6 -2.25 32.55 -2.7 L32.5 -2.7 Q31.0 -3.1 29.65 -4.15 L27.3 -5.9 26.6 -6.4 Q26.4 -6.45 26.25 -6.6 L26.1 -6.7 25.4 -7.15 25.3 -7.2 22.65 -9.0 Q22.55 -9.05 22.55 -9.05 L22.2 -9.25 20.05 -10.4 17.6 -11.6 17.05 -11.85 15.25 -12.6 12.35 -13.55 11.9 -13.7 9.3 -14.4 9.2 -14.45 8.75 -14.55 8.45 -14.65 Q7.1 -15.0 5.85 -16.1 L5.8 -16.15 5.1 -16.85 Q4.15 -17.8 3.65 -18.95 3.05 -20.35 3.1 -21.95 L3.1 -22.05 3.1 -22.15 3.2 -22.55 Q3.4 -24.3 4.2 -25.6 L4.2 -25.65 Q4.85 -26.85 5.95 -27.6 L5.9 -27.55 7.3 -28.45 8.35 -28.9 8.7 -29.0 9.35 -29.1 9.25 -29.1 11.45 -29.7 11.6 -29.75 12.8 -30.2 13.0 -30.25 13.15 -30.35 13.2 -30.4 13.35 -30.45 17.0 -31.75 17.55 -32.1 Q20.1 -33.1 22.5 -34.5 24.55 -35.7 26.55 -37.15 L26.6 -37.15 27.15 -37.5 27.5 -37.8 28.6 -38.6 28.65 -38.6 29.75 -39.45 30.25 -39.85 Q31.35 -40.6 32.6 -40.8 L32.6 -40.85 34.0 -41.0 34.85 -40.9 34.85 -40.95 M34.65 -39.95 L34.0 -40.0 32.75 -39.85 Q31.7 -39.65 30.7 -38.95 L30.45 -38.75 29.2 -37.8 27.95 -36.9 27.75 -36.75 27.15 -36.35 23.0 -33.65 Q20.5 -32.2 17.85 -31.15 L17.6 -30.95 13.65 -29.5 13.5 -29.4 13.45 -29.35 13.4 -29.35 11.75 -28.75 11.7 -28.75 9.5 -28.15 8.9 -28.0 8.7 -27.95 7.7 -27.55 6.5 -26.8 Q5.6 -26.15 5.05 -25.15 4.3 -23.9 4.15 -22.25 L4.1 -22.15 4.1 -22.05 4.1 -21.95 Q4.05 -20.55 4.55 -19.35 5.0 -18.35 5.8 -17.55 L6.5 -16.85 Q7.65 -15.85 8.85 -15.6 L8.9 -15.55 9.5 -15.4 12.35 -14.6 12.55 -14.55 15.6 -13.55 17.7 -12.7 Q17.75 -12.6 17.9 -12.55 L20.5 -11.3 22.65 -10.15 23.1 -9.9 23.15 -9.85 25.85 -8.05 26.7 -7.5 26.9 -7.35 26.95 -7.35 27.9 -6.7 Q29.1 -5.8 30.25 -4.95 31.45 -4.05 32.75 -3.7 34.55 -3.3 36.55 -4.05 L36.8 -4.15 Q38.3 -4.75 39.25 -6.0 L39.9 -7.15 40.0 -7.3 40.0 -7.35 40.3 -8.1 40.6 -9.65 40.4 -11.35 39.9 -14.2 39.7 -15.45 Q39.5 -16.6 39.45 -17.75 L39.35 -19.0 39.3 -19.5 39.25 -21.8 39.25 -22.25 Q39.25 -24.55 39.55 -26.85 39.8 -29.55 40.4 -32.25 L40.55 -34.35 40.1 -36.1 40.1 -36.2 Q39.6 -37.35 38.5 -38.35 L38.3 -38.55 37.05 -39.35 Q35.95 -39.85 34.65 -39.95" fill="#000000" fill-opacity="0.5764706" fill-rule="evenodd" stroke="none"/>
    <path d="M34.65 -39.95 Q35.95 -39.85 37.05 -39.35 L38.3 -38.55 38.5 -38.35 Q39.6 -37.35 40.1 -36.2 L40.1 -36.1 40.55 -34.35 40.4 -32.25 Q39.8 -29.55 39.55 -26.85 L34.65 -39.95 M39.25 -6.0 Q38.3 -4.75 36.8 -4.15 L36.55 -4.05 Q34.55 -3.3 32.75 -3.7 L32.75 -10.0 32.75 -17.6 35.65 -12.45 39.25 -6.0 M15.6 -13.55 L12.55 -14.55 12.35 -14.6 9.5 -15.4 9.5 -26.5 15.6 -23.0 15.6 -13.55 M6.5 -16.85 L5.8 -17.55 Q5.0 -18.35 4.55 -19.35 4.05 -20.55 4.1 -21.95 L4.1 -22.05 4.1 -22.15 4.15 -22.25 Q4.3 -23.9 5.05 -25.15 5.6 -26.15 6.5 -26.8 L6.5 -16.85" fill="#045b7a" fill-rule="evenodd" stroke="none"/>
    <path d="M28.5 -35.8 L28.7 -36.0 28.75 -36.0 31.45 -38.0 31.5 -38.0 Q32.7 -38.9 34.0 -38.9 35.45 -38.9 36.6 -38.25 L28.5 -35.8 M38.85 -33.0 Q37.65 -27.6 37.65 -22.3 L37.7 -21.3 35.1 -21.3 34.85 -22.3 37.1 -32.55 38.85 -33.0 M5.8 -21.3 L5.7 -22.4 5.7 -22.45 Q5.8 -23.6 6.25 -24.45 L9.15 -25.2 8.25 -24.5 8.0 -24.25 Q7.3 -23.4 7.3 -22.35 L7.3 -22.3 7.5 -21.3 5.8 -21.3" fill="#d5f7ff" fill-rule="evenodd" stroke="none"/>
    <path d="M36.6 -38.25 L37.3 -37.8 37.3 -37.75 Q38.25 -36.95 38.6 -36.0 39.2 -34.6 38.85 -33.05 L38.85 -33.0 37.1 -32.55 37.3 -33.4 Q37.5 -34.35 37.2 -35.2 L37.1 -35.4 Q36.7 -36.35 35.85 -36.85 L35.8 -36.9 35.7 -36.95 Q34.9 -37.4 34.0 -37.35 L33.9 -37.35 Q33.05 -37.25 32.35 -36.8 L32.1 -36.6 29.7 -34.6 27.5 -33.1 27.5 -33.05 27.4 -33.0 27.35 -33.0 27.2 -32.95 Q26.0 -32.1 24.7 -31.4 L24.6 -31.25 22.3 -30.05 22.3 -30.0 22.0 -29.95 21.95 -29.9 21.9 -29.9 21.7 -29.8 19.35 -28.65 19.15 -28.6 19.1 -28.6 16.25 -27.35 13.15 -26.4 12.7 -26.2 12.65 -26.2 9.7 -25.4 9.15 -25.2 6.25 -24.45 Q7.1 -26.2 9.2 -26.95 L9.3 -26.95 12.2 -27.75 12.3 -27.75 14.1 -28.4 14.15 -28.45 18.45 -30.1 18.5 -30.15 Q21.15 -31.25 23.8 -32.75 26.2 -34.1 28.5 -35.8 L36.6 -38.25" fill="#eefcff" fill-rule="evenodd" stroke="none"/>
    <path d="M9.15 -25.2 L9.7 -25.4 12.65 -26.2 12.7 -26.2 13.15 -26.4 16.25 -27.35 19.1 -28.6 19.15 -28.6 19.35 -28.65 21.7 -29.8 21.9 -29.9 21.95 -29.9 22.0 -29.95 22.3 -30.0 22.3 -30.05 24.6 -31.25 24.7 -31.4 Q26.0 -32.1 27.2 -32.95 L27.35 -33.0 27.4 -33.0 27.5 -33.05 27.5 -33.1 29.7 -34.6 32.1 -36.6 32.35 -36.8 Q33.05 -37.25 33.9 -37.35 L34.0 -37.35 Q34.9 -37.4 35.7 -36.95 L35.8 -36.9 35.85 -36.85 Q36.7 -36.35 37.1 -35.4 L37.2 -35.2 Q37.5 -34.35 37.3 -33.4 L37.1 -32.55 34.85 -22.3 35.1 -21.3 35.7 -18.4 35.95 -17.15 36.7 -13.7 37.3 -11.2 37.3 -11.15 Q37.5 -10.25 37.25 -9.4 L37.2 -9.4 37.1 -9.15 36.0 -7.8 35.9 -7.75 Q35.05 -7.2 34.1 -7.25 L34.0 -7.25 33.95 -7.25 Q32.95 -7.35 32.15 -8.0 L29.9 -9.7 29.85 -9.75 29.7 -9.85 27.45 -11.45 27.4 -11.45 27.2 -11.6 24.9 -13.05 24.85 -13.05 24.8 -13.1 24.7 -13.15 24.65 -13.2 22.1 -14.55 22.0 -14.6 21.95 -14.6 19.2 -15.9 19.1 -15.95 19.05 -16.0 18.95 -16.0 18.05 -16.4 16.25 -17.2 13.35 -18.2 13.25 -18.2 13.1 -18.2 9.65 -19.2 9.6 -19.2 9.4 -19.25 9.4 -19.3 9.3 -19.35 9.35 -19.3 Q8.6 -19.65 8.1 -20.2 L7.95 -20.4 Q7.65 -20.8 7.5 -21.3 L7.3 -22.3 7.3 -22.35 Q7.3 -23.4 8.0 -24.25 L8.25 -24.5 9.15 -25.2 M9.25 -24.2 Q8.9 -23.8 8.9 -23.25 8.9 -22.75 9.25 -22.3 9.55 -21.85 10.1 -21.7 L11.5 -21.3 13.55 -20.75 13.7 -20.7 16.75 -19.65 19.7 -18.4 19.8 -18.35 22.7 -17.0 22.8 -17.0 25.5 -15.5 25.55 -15.45 25.9 -15.25 28.1 -13.85 28.2 -13.8 28.25 -13.8 30.7 -12.05 30.8 -12.0 33.15 -10.2 Q33.55 -9.85 34.1 -9.8 L35.0 -10.0 35.0 -10.05 35.65 -10.8 Q35.85 -11.25 35.7 -11.8 L33.2 -23.25 35.7 -34.75 35.65 -35.7 35.65 -35.75 35.0 -36.45 34.05 -36.7 33.15 -36.35 33.1 -36.35 30.7 -34.3 28.25 -32.6 28.2 -32.6 28.1 -32.6 25.5 -30.95 25.5 -30.9 Q24.1 -30.1 22.7 -29.45 L22.7 -29.4 22.65 -29.4 19.8 -28.05 19.75 -28.05 19.5 -27.95 16.75 -26.8 13.55 -25.8 13.4 -25.75 13.35 -25.75 10.1 -24.8 9.3 -24.2 9.3 -24.25 9.25 -24.2" fill="#044b61" fill-rule="evenodd" stroke="none"/>
    <path d="M9.3 -24.2 L10.1 -24.8 13.35 -25.75 13.4 -25.75 13.55 -25.8 16.75 -26.8 19.5 -27.95 19.75 -28.05 19.8 -28.05 22.65 -29.4 22.7 -29.4 22.7 -29.45 Q24.1 -30.1 25.5 -30.9 L25.5 -30.95 28.1 -32.6 28.2 -32.6 28.25 -32.6 30.7 -34.3 33.1 -36.35 33.15 -36.35 34.05 -36.7 35.0 -36.45 35.65 -35.75 35.65 -35.7 35.7 -34.75 33.2 -23.25 35.7 -11.8 Q35.85 -11.25 35.65 -10.8 L35.0 -10.05 35.0 -10.0 34.1 -9.8 Q33.55 -9.85 33.15 -10.2 L30.8 -12.0 30.7 -12.05 28.25 -13.8 28.2 -13.8 28.1 -13.85 25.9 -15.25 25.55 -15.45 25.5 -15.5 22.8 -17.0 22.7 -17.0 19.8 -18.35 19.7 -18.4 16.75 -19.65 13.7 -20.7 13.55 -20.75 11.5 -21.3 10.1 -21.7 Q9.55 -21.85 9.25 -22.3 8.9 -22.75 8.9 -23.25 8.9 -23.8 9.25 -24.2 L9.3 -24.2 M32.7 -28.25 L34.15 -35.1 31.7 -33.05 29.05 -31.25 27.2 -30.0 26.3 -29.55 Q24.9 -28.7 23.4 -28.0 L20.4 -26.6 17.3 -25.25 13.95 -24.25 10.5 -23.25 14.0 -22.3 16.9 -21.3 17.3 -21.2 20.4 -19.8 22.1 -19.1 23.4 -18.45 23.85 -18.25 26.3 -16.85 29.05 -15.2 29.75 -14.7 31.7 -13.35 34.15 -11.4 31.65 -22.85 31.55 -23.25 32.7 -28.25" fill="#077496" fill-rule="evenodd" stroke="none"/>
    <path d="M10.5 -23.25 L13.95 -24.25 17.3 -25.25 20.4 -26.6 23.4 -28.0 Q24.9 -28.7 26.3 -29.55 L27.2 -30.0 29.05 -31.25 31.7 -33.05 34.15 -35.1 32.7 -28.25 31.4 -28.2 27.0 -26.7 15.9 -23.25 10.5 -23.25" fill="#c4f3ff" fill-rule="evenodd" stroke="none"/>
    <path d="M15.9 -23.25 L27.0 -26.7 31.4 -28.2 32.7 -28.25 31.55 -23.25 15.9 -23.25" fill="#73deff" fill-rule="evenodd" stroke="none"/>
    <path d="M10.5 -23.25 L15.9 -23.25 31.55 -23.25 31.65 -22.85 27.3 -22.0 Q25.35 -21.35 22.1 -19.1 L20.4 -19.8 17.3 -21.2 16.9 -21.3 14.0 -22.3 10.5 -23.25" fill="#0a9ac7" fill-rule="evenodd" stroke="none"/>
    <path d="M37.7 -21.3 L37.8 -18.45 35.7 -18.4 35.1 -21.3 37.7 -21.3 M37.95 -16.95 L38.45 -13.45 36.7 -13.7 35.95 -17.15 37.95 -16.95 M8.85 -17.75 Q7.9 -18.1 6.95 -19.1 L6.95 -19.15 Q6.0 -20.1 5.8 -21.3 L7.5 -21.3 Q7.65 -20.8 7.95 -20.4 L8.1 -20.2 Q8.6 -19.65 9.35 -19.3 L9.4 -19.25 9.6 -19.2 9.65 -19.2 13.1 -18.2 13.25 -18.2 13.35 -18.2 16.25 -17.2 18.05 -16.4 8.85 -17.75" fill="#61ddfc" fill-rule="evenodd" stroke="none"/>
    <path d="M37.8 -18.45 L37.95 -16.95 35.95 -17.15 35.7 -18.4 37.8 -18.45 M38.45 -13.45 L38.85 -11.5 Q39.2 -9.85 38.55 -8.45 L38.5 -8.4 Q37.7 -6.7 36.05 -6.05 L36.0 -6.0 Q33.35 -5.05 31.2 -6.7 L28.9 -8.45 27.7 -9.25 27.65 -9.3 24.05 -11.7 18.55 -14.5 18.6 -14.5 12.85 -16.6 12.8 -16.6 9.25 -17.6 8.85 -17.75 18.05 -16.4 18.95 -16.0 19.05 -16.0 19.1 -15.95 19.2 -15.9 21.95 -14.6 22.0 -14.6 22.1 -14.55 24.65 -13.2 24.7 -13.15 24.8 -13.1 24.85 -13.05 24.9 -13.05 27.2 -11.6 27.4 -11.45 27.45 -11.45 29.7 -9.85 29.85 -9.75 29.9 -9.7 32.15 -8.0 Q32.95 -7.35 33.95 -7.25 L34.0 -7.25 34.1 -7.25 Q35.05 -7.2 35.9 -7.75 L36.0 -7.8 37.1 -9.15 37.2 -9.4 37.25 -9.4 Q37.5 -10.25 37.3 -11.15 L37.3 -11.2 36.7 -13.7 38.45 -13.45" fill="#9aebfe" fill-rule="evenodd" stroke="none"/>
    <path d="M9.25 -24.2 L9.3 -24.25 9.3 -24.2 9.25 -24.2" fill="#855200" fill-rule="evenodd" stroke="none"/>
    <path d="M9.4 -19.25 L9.35 -19.3 9.3 -19.35 9.4 -19.3 9.4 -19.25" fill="#6c2d2d" fill-rule="evenodd" stroke="none"/>
    <path d="M31.65 -22.85 L34.15 -11.4 31.7 -13.35 29.75 -14.7 29.05 -15.2 26.3 -16.85 23.85 -18.25 23.4 -18.45 22.1 -19.1 Q25.35 -21.35 27.3 -22.0 L31.65 -22.85" fill="#0babd2" fill-rule="evenodd" stroke="none"/>
  </g>
</svg>
