<?xml version="1.0" encoding="UTF-8" standalone="no"?>
<svg xmlns:xlink="http://www.w3.org/1999/xlink" height="22.65px" width="144.65px" xmlns="http://www.w3.org/2000/svg">
  <g transform="matrix(1.0, 0.0, 0.0, 1.0, 11.2, 11.85)">
    <path d="M2.95 6.95 L2.75 6.85 Q3.25 4.95 8.7 4.5 L14.5 4.45 10.05 4.15 Q4.45 3.6 4.45 2.1 4.45 1.45 6.25 1.05 L8.15 0.8 6.3 0.45 Q4.85 0.05 4.7 -0.65 L4.9 -0.9 12.0 -1.1 17.05 -0.75 Q20.05 -0.6 21.6 -1.35 L8.7 -2.65 25.85 -3.8 25.85 -4.0 Q23.0 -3.75 13.05 -4.2 L1.1 -4.9 5.5 -5.15 Q8.75 -5.35 9.15 -6.25 9.0 -6.25 8.95 -6.35 L8.9 -6.45 6.5 -6.9 8.7 -7.35 8.7 -7.7 12.15 -7.05 12.15 -6.95 14.2 -6.9 17.25 -6.85 23.8 -6.75 24.0 -6.75 24.05 -6.75 24.85 -6.75 22.75 -4.9 Q24.6 -6.0 26.0 -6.7 L26.1 -6.7 26.1 -6.75 27.75 -7.55 28.3 -7.8 28.9 -8.0 Q31.6 -8.9 34.5 -8.9 35.3 -8.9 41.95 -6.55 48.65 -4.2 50.15 -4.2 53.9 -4.2 56.55 -5.75 55.85 -4.2 53.65 -3.2 L49.25 -1.75 49.25 -1.55 Q50.0 -2.05 51.35 -2.15 L53.55 -2.2 Q56.1 -2.2 58.5 -1.4 60.9 -0.65 62.6 -0.65 L65.3 -1.1 Q66.8 -1.6 67.3 -2.45 L67.5 -2.45 Q65.2 0.6 62.9 1.55 61.1 2.25 57.35 2.25 L55.65 2.1 53.55 1.6 53.35 1.55 52.8 1.4 52.75 1.45 52.25 1.35 Q50.35 1.65 50.35 2.45 50.35 3.45 51.65 4.3 L49.75 3.65 Q46.7 2.7 44.55 2.65 L40.3 3.0 39.65 3.1 42.5 1.85 Q45.8 0.45 47.8 0.8 43.5 -0.2 40.55 -0.2 34.95 -0.2 29.15 3.25 23.4 6.7 21.95 6.7 L20.3 6.5 20.5 6.25 Q21.35 5.9 22.55 4.2 L24.25 1.15 24.25 1.1 23.05 2.05 20.55 3.9 18.05 5.7 Q14.4 8.25 11.15 8.25 7.75 8.25 6.2 7.0 L4.35 7.05 2.95 6.95 M8.7 -7.7 L2.2 -7.95 2.6 -8.15 2.5 -8.45 4.0 -8.4 6.2 -8.35 8.45 -8.0 8.5 -7.9 Q8.55 -7.8 8.7 -7.8 L8.7 -7.7 M1.95 7.55 L2.25 7.15 1.95 6.95 2.75 6.95 2.7 7.25 2.75 7.45 2.25 7.45 2.2 7.5 1.95 7.55" fill="#fefd81" fill-rule="evenodd" stroke="none"/>
    <path d="M8.7 -7.7 L8.7 -7.35 6.5 -6.9 8.9 -6.45 8.95 -6.35 Q9.0 -6.25 9.15 -6.25 8.75 -5.35 5.5 -5.15 L1.1 -4.9 13.05 -4.2 Q23.0 -3.75 25.85 -4.0 L25.85 -3.8 8.7 -2.65 21.6 -1.35 Q20.05 -0.6 17.05 -0.75 L12.0 -1.1 4.9 -0.9 4.7 -0.65 Q4.85 0.05 6.3 0.45 L8.15 0.8 6.25 1.05 Q4.45 1.45 4.45 2.1 4.45 3.6 10.05 4.15 L14.5 4.45 8.7 4.5 Q3.25 4.95 2.75 6.85 L2.95 6.95 2.75 6.95 1.95 6.95 2.25 7.15 1.95 7.55 Q1.55 7.85 0.75 8.15 L0.4 8.25 -1.05 8.4 -1.2 8.4 -1.35 8.4 -1.5 8.4 -2.4 8.3 -3.05 8.2 Q-5.95 7.65 -8.15 5.8 -11.2 3.2 -11.2 -0.5 -11.2 -4.2 -8.15 -6.8 -5.95 -8.65 -3.05 -9.2 L-2.4 -9.3 -1.5 -9.4 -1.35 -9.4 -1.2 -9.4 -1.05 -9.4 2.2 -8.75 2.2 -8.7 2.5 -8.45 2.6 -8.15 2.2 -7.95 8.7 -7.7 M36.85 5.6 L33.25 5.65 35.5 5.5 36.85 5.6 M56.05 -6.2 L56.0 -6.3 56.05 -6.3 56.05 -6.2 M-1.3 6.25 L-1.3 6.2 -1.4 6.25 -1.3 6.25" fill="#ffffff" fill-rule="evenodd" stroke="none"/>
    <path d="M2.95 6.95 L4.35 7.05 6.2 7.0 Q7.75 8.25 11.15 8.25 14.4 8.25 18.05 5.7 L20.55 3.9 23.05 2.05 24.25 1.1 24.25 1.15 22.55 4.2 Q21.35 5.9 20.5 6.25 L20.3 6.5 21.95 6.7 Q23.4 6.7 29.15 3.25 34.95 -0.2 40.55 -0.2 43.5 -0.2 47.8 0.8 45.8 0.45 42.5 1.85 L39.65 3.1 40.3 3.0 44.55 2.65 Q46.7 2.7 49.75 3.65 L51.65 4.3 Q50.35 3.45 50.35 2.45 50.35 1.65 52.25 1.35 L52.75 1.45 52.8 1.4 53.35 1.55 53.55 1.6 55.65 2.1 57.35 2.25 Q61.1 2.25 62.9 1.55 65.2 0.6 67.5 -2.45 L67.3 -2.45 Q66.8 -1.6 65.3 -1.1 L62.6 -0.65 Q60.9 -0.65 58.5 -1.4 56.1 -2.2 53.55 -2.2 L51.35 -2.15 Q50.0 -2.05 49.25 -1.55 L49.25 -1.75 53.65 -3.2 Q55.85 -4.2 56.55 -5.75 53.9 -4.2 50.15 -4.2 48.65 -4.2 41.95 -6.55 35.3 -8.9 34.5 -8.9 31.6 -8.9 28.9 -8.0 L28.3 -7.8 27.75 -7.55 26.1 -6.75 26.1 -6.7 26.0 -6.7 Q24.6 -6.0 22.75 -4.9 L24.85 -6.75 24.05 -6.75 24.0 -6.75 23.8 -6.75 17.25 -6.85 14.2 -6.9 12.15 -6.95 12.15 -7.05 8.7 -7.7 8.7 -7.8 Q8.55 -7.8 8.5 -7.9 L8.45 -8.0 6.2 -8.35 4.0 -8.4 2.5 -8.45 2.2 -8.7 2.25 -8.7 17.25 -8.5 18.45 -8.5 25.35 -8.35 26.25 -8.6 27.75 -9.15 28.9 -9.75 29.4 -10.1 Q31.75 -11.85 35.6 -11.85 37.5 -11.85 41.15 -10.05 42.85 -9.2 44.0 -8.4 L44.55 -8.05 44.45 -7.95 Q44.6 -7.85 44.85 -7.7 45.35 -7.4 46.15 -7.05 48.15 -6.2 49.9 -6.2 L54.15 -6.85 58.15 -7.55 61.95 -7.1 62.0 -7.0 62.15 -6.9 Q61.8 -5.2 60.4 -4.45 59.1 -3.7 56.6 -3.55 L60.7 -2.65 64.75 -3.65 Q68.8 -4.65 70.7 -4.65 L72.95 -4.25 74.65 -3.75 Q74.4 -2.6 72.55 -2.45 L72.5 -2.45 74.2 -2.1 Q77.75 -1.25 77.75 0.1 77.75 1.0 73.05 1.4 L70.1 1.6 70.15 1.65 Q71.95 1.8 71.95 2.7 71.95 3.9 69.2 3.9 L68.85 3.9 68.2 3.8 63.25 5.05 59.9 5.15 56.2 5.05 Q54.8 4.85 53.05 3.8 L55.4 6.15 57.25 7.8 54.6 8.25 Q49.45 8.25 47.0 6.95 44.05 5.4 36.1 4.9 L36.1 4.7 Q36.3 4.2 37.15 3.75 37.4 3.65 37.7 3.5 L37.9 3.4 38.35 3.15 Q34.0 2.85 27.35 6.5 L20.3 10.55 16.95 10.8 Q13.95 10.8 9.45 9.65 L6.85 8.95 2.85 7.85 2.25 7.7 2.2 7.7 0.4 8.25 0.75 8.15 Q1.55 7.85 1.95 7.55 L2.2 7.5 2.25 7.45 2.75 7.45 2.7 7.25 2.75 6.95 2.95 6.95 M56.05 -6.2 L56.05 -6.3 56.0 -6.3 56.05 -6.2 M-1.3 6.25 L-1.4 6.25 -1.3 6.2 -1.3 6.25" fill="#f7de09" fill-rule="evenodd" stroke="none"/>
    <path d="M46.85 -8.05 L46.75 -8.2 51.8 -9.6 Q55.45 -10.75 59.0 -10.75 62.65 -10.75 67.65 -9.05 72.6 -7.4 82.95 -7.4 L93.05 -7.75 103.25 -8.1 103.85 -8.1 98.35 -5.5 Q103.8 -3.6 105.5 -3.15 109.3 -2.1 112.05 -2.1 115.85 -2.1 123.3 -3.65 131.7 -5.4 133.45 -7.3 129.8 -3.15 125.45 -0.15 120.25 3.35 116.25 3.35 L106.4 2.8 104.85 2.65 104.9 2.45 113.25 1.85 115.6 1.3 Q119.15 0.25 123.9 -2.75 L118.2 -0.8 113.25 -0.65 112.7 -0.65 Q107.8 -0.65 100.95 -2.45 94.15 -4.25 90.1 -4.25 L88.35 -4.25 93.0 -5.85 75.3 -6.25 73.7 -6.0 73.7 -5.9 73.05 -5.9 Q70.65 -6.0 67.85 -6.85 66.25 -7.3 65.15 -7.85 L64.85 -7.85 62.65 -8.7 Q59.25 -10.1 57.2 -10.1 55.15 -10.1 52.5 -8.75 L50.85 -8.0 46.85 -8.05 M84.9 1.3 L83.8 1.8 Q82.8 2.25 82.5 2.6 89.35 4.8 92.0 4.85 L98.7 4.55 98.75 4.8 92.35 6.65 Q86.8 8.15 84.4 8.15 75.3 5.75 71.85 5.75 L67.6 6.35 Q69.35 5.6 70.85 5.15 L74.15 4.9 79.5 5.6 84.95 6.25 88.65 5.8 84.5 5.45 Q80.65 4.85 80.65 3.45 80.65 1.85 83.25 1.45 L84.9 1.3" fill="#f76f09" fill-rule="evenodd" stroke="none"/>
    <path d="M44.55 -8.05 L46.05 -8.05 46.85 -8.05 50.85 -8.0 52.5 -8.75 Q55.15 -10.1 57.2 -10.1 59.25 -10.1 62.65 -8.7 L64.85 -7.85 65.15 -7.85 Q66.25 -7.3 67.85 -6.85 70.65 -6.0 73.05 -5.9 L73.7 -5.9 73.75 -5.9 73.7 -6.0 75.3 -6.25 93.0 -5.85 88.35 -4.25 90.1 -4.25 Q94.15 -4.25 100.95 -2.45 107.8 -0.65 112.7 -0.65 L113.25 -0.65 118.2 -0.8 123.9 -2.75 Q119.15 0.25 115.6 1.3 L113.25 1.85 104.9 2.45 101.1 2.3 94.5 1.65 93.6 1.55 90.0 1.15 89.7 1.1 87.5 1.15 84.9 1.3 83.25 1.45 Q80.65 1.85 80.65 3.45 80.65 4.85 84.5 5.45 L88.65 5.8 84.95 6.25 79.5 5.6 74.15 4.9 70.85 5.15 Q69.35 5.6 67.6 6.35 L66.95 6.6 66.85 6.65 66.4 6.85 65.6 7.15 Q62.35 8.35 58.2 8.9 L51.55 9.25 Q46.55 9.25 42.75 7.15 L42.25 7.15 41.75 6.9 Q39.35 5.8 36.85 5.6 L35.5 5.5 33.25 5.65 31.65 5.9 30.95 6.1 30.9 6.1 30.95 6.25 26.8 8.6 22.1 10.2 20.3 10.55 27.35 6.5 Q34.0 2.85 38.35 3.15 L37.9 3.4 37.7 3.5 Q37.4 3.65 37.15 3.75 36.3 4.2 36.1 4.7 L36.1 4.9 Q44.05 5.4 47.0 6.95 49.45 8.25 54.6 8.25 L57.25 7.8 55.4 6.15 53.05 3.8 Q54.8 4.85 56.2 5.05 L59.9 5.15 63.25 5.05 68.2 3.8 68.85 3.9 69.2 3.9 Q71.95 3.9 71.95 2.7 71.95 1.8 70.15 1.65 L70.1 1.6 73.05 1.4 Q77.75 1.0 77.75 0.1 77.75 -1.25 74.2 -2.1 L72.5 -2.45 72.55 -2.45 Q74.4 -2.6 74.65 -3.75 L72.95 -4.25 70.7 -4.65 Q68.8 -4.65 64.75 -3.65 L60.7 -2.65 56.6 -3.55 Q59.1 -3.7 60.4 -4.45 61.8 -5.2 62.15 -6.9 L62.0 -7.0 61.95 -7.1 58.15 -7.55 54.15 -6.85 49.9 -6.2 Q48.15 -6.2 46.15 -7.05 45.35 -7.4 44.85 -7.7 44.6 -7.85 44.45 -7.95 L44.55 -8.05" fill="#f7a809" fill-rule="evenodd" stroke="none"/>
  </g>
</svg>
