<?xml version="1.0" encoding="UTF-8" standalone="no"?>
<svg xmlns:xlink="http://www.w3.org/1999/xlink" height="36.45px" width="47.9px" xmlns="http://www.w3.org/2000/svg">
  <g transform="matrix(1.0, 0.0, 0.0, 1.0, 23.0, 17.7)">
    <path d="M11.3 -8.45 L11.15 -7.85 Q13.1 -7.25 14.8 -6.05 18.9 -3.25 18.9 0.6 L18.65 2.65 19.0 2.65 Q21.4 2.65 23.1 4.3 24.9 6.1 24.9 8.5 24.9 10.95 23.1 12.6 21.4 14.4 19.0 14.4 16.6 14.4 14.8 12.6 13.1 10.95 13.1 8.5 L13.1 8.3 Q10.55 9.5 7.7 9.85 L8.15 10.35 Q9.6 11.75 9.6 13.8 9.6 15.85 8.15 17.3 6.7 18.75 4.65 18.75 2.65 18.75 1.2 17.3 0.1 16.25 -0.15 14.8 -2.3 17.2 -5.2 17.2 -8.3 17.2 -10.6 14.4 L-11.8 12.4 -14.2 12.6 Q-17.85 12.6 -20.5 10.55 -23.0 8.65 -23.0 5.9 -23.0 3.1 -20.5 1.05 -20.25 0.8 -19.9 0.7 -20.35 -0.25 -20.35 -1.45 -20.35 -4.25 -17.95 -6.3 -17.85 -7.95 -16.65 -9.15 -15.2 -10.6 -13.15 -10.6 L-12.3 -10.5 Q-11.95 -13.0 -10.5 -15.05 -8.3 -17.7 -5.45 -17.7 -2.55 -17.7 -0.5 -15.05 0.8 -13.4 1.3 -11.45 L1.65 -11.45 Q5.65 -11.45 8.4 -10.6 11.3 -9.65 11.3 -8.45" fill="#cccccc" fill-rule="evenodd" stroke="none"/>
  </g>
</svg>
