<?xml version="1.0" encoding="UTF-8" standalone="no"?>
<svg xmlns:xlink="http://www.w3.org/1999/xlink" height="30.0px" width="25.15px" xmlns="http://www.w3.org/2000/svg">
  <g transform="matrix(1.0, 0.0, 0.0, 1.0, -0.25, 0.25)">
    <path d="M6.15 5.1 Q6.35 4.95 6.6 4.95 L7.05 5.05 7.4 5.3 7.4 3.25 7.5 2.8 7.85 2.45 12.4 -0.15 12.85 -0.25 12.9 -0.25 13.3 -0.1 17.75 2.5 17.75 2.45 18.1 2.8 18.15 2.8 18.2 3.25 18.2 5.3 18.65 5.05 19.1 4.95 19.15 4.95 19.55 5.1 23.45 7.4 23.8 7.7 23.85 7.7 23.9 8.15 23.9 14.25 24.95 14.9 24.95 14.85 25.3 15.2 25.35 15.2 25.4 15.65 25.4 23.9 25.35 24.35 25.3 24.35 24.95 24.7 20.45 27.35 20.0 27.45 19.55 27.35 18.05 26.5 17.7 26.15 17.7 26.55 17.6 27.0 17.25 27.35 13.3 29.6 13.3 29.65 12.8 29.75 12.35 29.65 12.35 29.6 8.45 27.35 8.1 27.0 8.0 26.55 8.0 26.1 7.65 26.45 6.15 27.35 5.7 27.45 5.25 27.35 0.7 24.7 0.4 24.35 0.25 23.9 0.25 15.65 Q0.25 15.4 0.4 15.2 L0.7 14.85 0.7 14.9 1.75 14.25 1.75 8.15 1.85 7.7 2.2 7.4 6.15 5.1" fill="#1c1c26" fill-rule="evenodd" stroke="none"/>
    <path d="M1.85 7.7 L2.2 7.4 6.15 5.1 Q6.35 4.95 6.6 4.95 L7.05 5.05 7.5 5.35 7.4 4.9 7.4 3.25 7.5 2.8 7.85 2.45 12.4 -0.15 12.85 -0.25 12.9 -0.25 13.3 -0.1 17.75 2.5 17.75 2.45 18.1 2.8 18.15 2.8 18.2 3.25 18.2 4.9 18.15 5.35 18.1 5.35 18.05 5.4 18.65 5.05 19.1 4.95 19.15 4.95 19.55 5.1 23.45 7.4 23.8 7.7 23.85 7.7 23.9 8.15 23.9 12.7 23.8 13.2 23.45 13.5 22.95 13.8 23.0 13.8 23.4 13.95 24.95 14.9 24.95 14.85 25.3 15.2 25.35 15.2 25.4 15.65 25.4 20.85 25.35 21.3 25.3 21.3 24.95 21.65 20.45 24.3 20.0 24.4 19.55 24.3 18.05 23.4 17.7 23.1 17.7 23.5 17.6 23.95 17.25 24.3 13.3 26.55 13.3 26.6 12.8 26.7 12.35 26.6 12.35 26.55 8.45 24.3 8.1 23.95 8.0 23.5 8.0 23.05 7.65 23.4 6.15 24.3 5.7 24.4 5.25 24.3 0.7 21.65 0.4 21.3 0.25 20.85 0.25 15.65 Q0.25 15.4 0.4 15.2 L0.7 14.85 0.7 14.9 2.3 13.95 2.7 13.8 2.2 13.5 1.85 13.2 1.75 12.7 1.75 8.15 1.85 7.7" fill="#39394d" fill-rule="evenodd" stroke="none"/>
    <path d="M12.75 6.05 L16.2 4.1 12.75 2.1 9.35 4.05 12.75 6.05 M17.25 4.95 L12.75 7.55 8.25 4.9 8.25 3.3 12.8 0.7 17.25 3.3 17.25 4.95 M21.1 9.25 L19.05 8.05 12.75 11.65 6.55 8.05 4.5 9.25 4.5 11.65 10.8 15.2 10.8 22.45 12.75 23.6 14.85 22.4 14.85 15.2 21.1 11.65 21.1 9.25 M22.95 8.2 L22.95 12.75 16.75 16.3 16.75 23.55 12.75 25.8 8.9 23.55 8.9 16.3 2.6 12.75 2.6 8.2 6.55 5.9 12.75 9.5 19.05 5.9 22.95 8.2 M2.7 16.25 L2.4 16.4 2.4 20.15 5.65 22.05 5.9 21.9 5.9 18.05 2.7 16.25 M2.7 14.75 L7.15 17.3 7.15 22.65 5.65 23.5 1.1 20.9 1.1 15.65 2.7 14.75 M23.2 16.4 L22.9 16.25 19.7 18.05 19.7 22.2 23.2 20.15 23.2 16.4 M24.45 15.65 L24.45 20.9 19.95 23.5 18.45 22.65 18.45 17.3 22.9 14.75 24.45 15.65" fill="#801ac4" fill-rule="evenodd" stroke="none"/>
    <path d="M21.1 9.25 L21.1 11.65 14.85 15.2 14.85 22.4 12.75 23.6 10.8 22.45 10.8 15.2 4.5 11.65 4.5 9.25 6.55 8.05 12.75 11.65 19.05 8.05 21.1 9.25 M6.55 9.65 L5.9 10.05 5.9 10.8 12.15 14.45 12.15 21.65 12.75 22.0 13.45 21.6 13.45 14.45 19.7 10.85 19.7 10.05 19.05 9.65 12.75 13.25 6.55 9.65" fill="#ffb521" fill-rule="evenodd" stroke="none"/>
    <path d="M12.75 6.05 L9.35 4.05 12.75 2.1 16.2 4.1 12.75 6.05 M2.7 16.25 L5.9 18.05 5.9 21.9 5.65 22.05 2.4 20.15 2.4 16.4 2.7 16.25 M23.2 16.4 L23.2 20.15 19.7 22.2 19.7 18.05 22.9 16.25 23.2 16.4" fill="#d7acf4" fill-rule="evenodd" stroke="none"/>
    <path d="M6.55 9.65 L12.75 13.25 19.05 9.65 19.7 10.05 19.7 10.85 13.45 14.45 13.45 21.6 12.75 22.0 12.15 21.65 12.15 14.45 5.9 10.8 5.9 10.05 6.55 9.65" fill="#190033" fill-rule="evenodd" stroke="none"/>
  </g>
</svg>
