<?xml version="1.0" encoding="UTF-8" standalone="no"?>
<svg xmlns:xlink="http://www.w3.org/1999/xlink" height="10.55px" width="10.8px" xmlns="http://www.w3.org/2000/svg">
  <g transform="matrix(1.0, 0.0, 0.0, 1.0, -142.6, -20.75)">
    <path d="M152.45 29.5 Q151.1 31.3 148.55 31.3 145.35 31.3 143.65 28.9 142.6 27.4 142.6 26.25 142.6 24.4 144.3 22.8 145.9 21.3 148.0 20.9 153.4 19.9 153.4 26.6 153.4 28.15 152.45 29.5" fill="#d8fdd7" fill-rule="evenodd" stroke="none"/>
  </g>
</svg>
