<?xml version="1.0" encoding="UTF-8" standalone="no"?>
<svg xmlns:xlink="http://www.w3.org/1999/xlink" height="31.9px" width="153.2px" xmlns="http://www.w3.org/2000/svg">
  <g transform="matrix(1.0, 0.0, 0.0, 1.0, 0.0, 0.0)">
    <path d="M148.9 0.0 L150.3 0.0 150.3 0.7 150.25 1.05 149.85 2.25 149.85 2.3 Q149.2 4.3 148.9 6.5 L148.55 10.15 Q148.45 11.85 148.5 13.6 L148.75 16.9 148.95 18.6 149.5 20.85 149.65 21.2 150.3 22.85 150.35 22.85 151.55 25.2 151.6 25.25 152.2 26.1 152.3 26.2 153.0 27.15 153.2 27.75 153.0 28.35 152.5 28.7 Q143.4 31.4 134.05 31.85 L134.0 31.85 131.75 31.9 116.6 31.8 116.55 31.8 111.7 31.5 99.4 30.4 87.95 29.05 87.9 29.05 72.7 27.2 53.05 25.55 45.45 25.35 39.65 25.35 33.8 25.5 22.25 26.05 10.8 26.95 0.0 28.1 0.0 26.05 10.4 24.95 21.85 24.05 33.45 23.5 39.3 23.35 39.65 23.35 45.15 23.35 52.8 23.55 72.5 25.2 87.75 27.05 99.2 28.4 116.3 29.8 117.6 29.85 131.7 29.9 133.7 29.85 Q142.95 29.4 151.9 26.75 L151.15 25.75 150.4 24.7 149.1 22.25 148.75 21.4 148.25 20.15 147.65 17.75 147.55 17.05 147.2 12.7 147.2 10.45 Q147.25 7.85 147.6 5.35 147.9 3.05 148.6 0.95 L148.9 0.0" fill="#2e2e2e" fill-rule="evenodd" stroke="none"/>
    <path d="M148.75 21.4 L149.1 22.25 150.4 24.7 151.15 25.75 151.9 26.75 Q142.95 29.4 133.7 29.85 L131.7 29.9 117.6 29.85 124.05 28.05 131.6 26.0 148.75 21.4" fill="#242424" fill-rule="evenodd" stroke="none"/>
    <path d="M148.9 0.0 L148.6 0.95 Q147.9 3.05 147.6 5.35 147.25 7.85 147.2 10.45 L140.5 12.0 131.45 13.65 Q113.1 16.65 93.25 16.65 L69.6 15.6 46.85 14.5 Q24.5 14.5 2.8 22.85 L0.0 23.95 0.0 0.0 148.9 0.0" fill="#000000" fill-rule="evenodd" stroke="none"/>
    <path d="M147.2 10.45 L147.2 12.7 147.55 17.05 139.4 18.15 131.5 18.9 108.3 19.75 84.55 18.95 70.05 18.1 56.8 19.05 Q48.55 20.3 39.65 23.35 L39.3 23.35 33.45 23.5 21.85 24.05 10.4 24.95 0.0 26.05 0.0 23.95 2.8 22.85 Q24.5 14.5 46.85 14.5 L69.6 15.6 93.25 16.65 Q113.1 16.65 131.45 13.65 L140.5 12.0 147.2 10.45" fill="#121212" fill-rule="evenodd" stroke="none"/>
    <path d="M147.55 17.05 L147.65 17.75 148.25 20.15 148.75 21.4 131.6 26.0 124.05 28.05 117.6 29.85 116.3 29.8 99.2 28.4 87.75 27.05 72.5 25.2 52.8 23.55 45.15 23.35 39.65 23.35 Q48.55 20.3 56.8 19.05 L70.05 18.1 84.55 18.95 108.3 19.75 131.5 18.9 139.4 18.15 147.55 17.05" fill="#1c1c1c" fill-rule="evenodd" stroke="none"/>
  </g>
</svg>
