<?xml version="1.0" encoding="UTF-8" standalone="no"?>
<svg xmlns:xlink="http://www.w3.org/1999/xlink" height="83.05px" width="43.55px" xmlns="http://www.w3.org/2000/svg">
  <g transform="matrix(1.0, 0.0, 0.0, 1.0, 21.75, 41.55)">
    <path d="M7.35 -37.9 L7.6 -37.8 7.55 -37.85 7.65 -37.8 7.8 -37.75 7.95 -37.65 8.15 -37.55 13.25 -34.65 12.95 -31.8 13.05 -31.25 15.7 -25.85 16.35 -24.6 16.45 -24.4 16.5 -24.35 16.6 -24.15 16.65 -24.05 17.05 -23.15 17.15 -23.0 17.55 -22.05 17.6 -21.9 17.75 -21.65 17.85 -21.5 17.9 -21.5 Q19.05 -19.8 19.4 -17.6 L19.5 -16.55 19.5 -16.45 19.5 -16.15 19.5 -15.9 19.45 -15.2 Q19.35 -13.9 18.9 -12.75 L18.85 -12.7 18.8 -12.6 18.75 -12.4 18.2 -11.45 18.15 -11.4 16.95 -10.1 16.9 -9.95 Q15.95 -9.05 14.85 -8.55 L14.7 -8.5 14.5 -8.4 13.95 -8.05 13.75 -7.45 13.75 -7.1 13.75 -7.05 Q13.1 -1.4 15.5 6.85 L15.5 6.95 16.05 8.55 16.05 8.65 18.6 15.9 21.75 23.6 21.8 23.7 Q20.95 29.2 16.95 34.05 14.75 36.6 10.6 40.2 L10.55 40.2 10.5 40.25 Q10.4 40.25 10.35 40.35 L10.1 40.5 10.1 40.55 10.05 40.55 8.9 41.5 Q5.95 39.25 1.9 37.0 L1.75 36.85 -6.05 32.4 Q-12.25 28.55 -15.35 23.25 L-16.85 20.1 -16.9 19.95 -16.4 19.05 -15.9 18.95 -15.9 18.9 -15.45 18.3 -15.5 18.3 -15.15 17.05 -15.1 16.9 -14.95 16.2 -14.85 15.8 -13.8 11.65 -13.8 11.55 -13.8 11.45 -13.8 11.4 -13.5 6.9 -13.15 6.85 -13.2 6.85 Q-12.8 6.7 -12.6 6.35 -12.4 5.95 -12.55 5.6 L-12.85 4.65 -12.9 4.5 -13.15 3.9 -13.2 3.85 -13.2 3.65 -13.25 3.6 -13.3 3.45 -13.4 3.2 Q-15.65 -2.5 -18.55 -8.75 L-18.6 -8.9 Q-20.55 -13.95 -21.3 -18.95 L-21.7 -23.25 -21.7 -23.3 -21.75 -25.7 Q-21.55 -32.9 -20.05 -35.65 L-20.1 -35.6 -20.05 -35.7 Q-19.5 -36.7 -17.95 -38.15 L-17.85 -38.25 -17.15 -38.95 -14.9 -40.8 -14.3 -41.05 -14.15 -41.1 -13.45 -41.3 -13.3 -41.35 -11.1 -41.55 -2.3 -40.4 4.6 -38.75 6.25 -38.25 7.25 -37.95 7.35 -37.9 M-14.0 -25.25 L-14.75 -25.1 -15.2 -24.45 -15.05 -23.7 -14.55 -23.05 -14.55 -22.85 -14.55 -22.15 -14.55 -22.1 -14.7 -19.95 Q-15.15 -18.45 -15.0 -16.65 L-15.0 -16.6 Q-14.8 -12.85 -12.0 -9.8 L-11.9 -9.7 -11.3 -9.1 -10.9 -8.7 -10.8 -8.6 -10.4 -8.3 Q-10.05 -8.05 -9.65 -8.1 -9.25 -8.15 -9.0 -8.5 -8.75 -8.85 -8.8 -9.25 -8.85 -9.65 -9.2 -9.9 L-9.6 -10.2 -9.9 -10.5 -10.4 -11.05 -10.5 -11.2 Q-12.8 -13.65 -13.0 -16.75 L-13.0 -16.8 Q-13.15 -18.3 -12.75 -19.5 L-12.75 -19.45 -12.7 -19.65 -12.7 -19.7 -12.55 -22.1 -12.55 -22.15 -12.55 -22.95 -12.55 -23.1 -12.55 -23.15 -12.65 -23.75 -13.0 -24.35 -13.35 -24.8 Q-13.6 -25.15 -14.0 -25.2 L-14.0 -25.25 M-19.2 9.6 L-19.25 9.4 -19.2 9.35 -19.2 9.6" fill="#00ff00" fill-rule="evenodd" stroke="none"/>
  </g>
</svg>
