<?xml version="1.0" encoding="UTF-8" standalone="no"?>
<svg xmlns:xlink="http://www.w3.org/1999/xlink" height="46.05px" width="108.65px" xmlns="http://www.w3.org/2000/svg">
  <g transform="matrix(1.0, 0.0, 0.0, 1.0, 54.3, 46.05)">
    <path d="M23.95 -37.15 Q25.35 -36.9 26.35 -36.15 L28.2 -34.55 28.65 -33.95 28.7 -33.95 Q29.55 -32.2 29.45 -29.95 29.4 -28.5 28.95 -27.2 L28.6 -26.45 Q29.9 -23.85 33.45 -23.5 L34.05 -23.55 Q35.8 -23.85 36.8 -25.0 L37.6 -26.7 37.65 -26.7 Q37.95 -28.9 37.0 -30.35 L37.0 -30.4 36.2 -31.25 Q35.35 -31.8 34.15 -31.9 L34.15 -31.95 Q31.3 -31.8 30.85 -29.3 L30.85 -29.25 Q30.55 -28.7 30.75 -28.0 31.05 -27.0 31.7 -26.3 32.5 -25.7 33.65 -25.95 34.25 -26.1 34.8 -26.4 L35.0 -26.65 35.05 -26.65 Q35.55 -27.4 35.45 -28.55 L35.45 -28.6 35.25 -29.1 Q34.85 -29.85 33.8 -29.85 L33.15 -29.75 33.0 -29.5 32.95 -29.5 32.75 -29.2 Q32.65 -28.55 32.9 -28.15 33.15 -27.9 33.5 -28.0 L33.55 -28.0 34.25 -28.55 34.25 -28.6 34.65 -28.05 34.65 -28.0 34.35 -27.35 34.35 -27.3 Q33.95 -26.95 33.35 -26.95 L33.3 -26.95 Q32.75 -27.05 32.35 -27.35 L32.3 -27.35 32.05 -27.65 32.0 -27.7 Q31.4 -28.75 32.05 -29.9 L32.45 -30.5 33.3 -30.9 Q34.65 -31.0 35.4 -30.45 L35.45 -30.45 Q36.25 -29.8 36.45 -28.6 36.65 -27.35 36.1 -26.3 L35.9 -26.05 35.9 -26.0 34.65 -25.1 33.15 -24.75 32.9 -24.8 32.9 -24.85 Q31.95 -24.85 31.25 -25.35 L31.2 -25.35 30.7 -25.9 30.65 -25.95 Q29.75 -27.05 29.85 -28.95 29.95 -31.1 31.15 -32.15 32.6 -33.2 34.8 -32.95 L35.45 -32.85 36.7 -32.3 36.75 -32.25 36.85 -32.1 37.45 -31.6 37.45 -31.55 37.6 -31.5 37.65 -31.5 37.85 -31.25 Q38.65 -29.9 38.85 -28.2 L38.8 -26.95 38.8 -26.3 38.8 -26.25 Q39.15 -25.75 39.8 -25.55 L39.85 -25.55 40.0 -25.35 41.45 -24.55 41.45 -24.5 43.8 -23.8 49.75 -23.1 49.8 -23.1 52.15 -22.9 54.3 -22.75 54.35 -22.7 Q54.25 -22.4 53.7 -22.4 L48.5 -22.35 46.05 -22.2 43.8 -21.85 43.55 -21.85 43.5 -21.85 Q41.1 -21.25 39.3 -19.95 L39.25 -19.95 38.8 -19.55 38.8 -17.85 38.4 -15.95 Q37.75 -14.65 36.75 -13.75 35.2 -12.65 32.75 -12.95 32.0 -13.1 31.45 -13.4 L31.05 -13.6 30.45 -14.2 30.4 -14.2 29.5 -16.0 29.45 -16.0 29.4 -17.65 Q29.5 -19.8 31.0 -20.75 L32.3 -21.3 32.95 -21.4 33.25 -21.45 35.2 -20.9 35.25 -20.85 Q36.4 -20.1 36.6 -18.5 L36.45 -16.85 Q36.25 -16.2 35.7 -15.75 34.75 -15.05 33.25 -15.4 32.9 -15.45 32.6 -15.65 31.5 -16.5 31.95 -18.05 32.1 -18.55 32.4 -18.85 L32.7 -19.0 32.7 -19.05 Q33.85 -19.35 34.5 -18.7 L34.5 -18.65 34.7 -18.0 34.7 -17.95 34.55 -17.55 34.55 -17.5 33.4 -18.05 33.35 -18.05 32.8 -17.8 32.8 -17.75 Q32.65 -17.0 33.05 -16.5 L33.45 -16.2 34.65 -16.25 34.65 -16.3 35.5 -16.95 35.55 -17.0 Q35.85 -17.65 35.7 -18.55 L35.7 -18.6 34.8 -19.95 Q33.7 -20.65 32.35 -20.2 L31.6 -19.9 30.9 -19.15 Q30.2 -18.2 30.5 -16.75 30.75 -15.3 31.8 -14.6 L31.9 -14.45 31.95 -14.45 32.2 -14.25 32.2 -14.2 32.75 -14.05 32.75 -14.0 Q34.95 -13.75 36.25 -14.85 L36.3 -14.85 Q37.3 -15.75 37.65 -17.25 L37.75 -18.0 37.75 -18.8 37.45 -19.95 37.45 -20.05 Q37.25 -20.2 37.2 -20.45 L37.2 -20.5 Q36.25 -21.95 34.35 -22.45 L34.35 -22.5 34.1 -22.45 34.05 -22.45 32.8 -22.55 31.55 -22.35 30.55 -21.85 30.5 -21.85 30.4 -21.7 30.1 -21.6 30.05 -21.6 29.25 -20.75 29.2 -20.75 28.9 -20.3 28.85 -20.3 28.45 -19.65 28.45 -19.6 28.75 -18.1 28.95 -17.45 Q29.2 -15.4 28.55 -13.65 L28.05 -12.55 27.85 -12.25 27.85 -12.2 26.65 -10.95 26.6 -10.9 26.2 -10.55 Q24.8 -9.5 22.65 -9.25 L20.5 -9.35 Q19.55 -9.65 18.75 -10.1 L18.6 -10.3 18.35 -10.45 18.3 -10.45 17.6 -11.2 17.2 -11.9 17.15 -11.9 16.75 -11.2 16.05 -9.5 15.8 -8.95 15.3 -8.35 15.25 -8.3 13.75 -6.75 13.7 -6.7 13.2 -6.4 13.15 -6.35 Q11.75 -5.3 9.55 -5.05 L6.45 -5.25 Q5.55 -5.45 4.8 -5.8 L3.95 -6.3 3.55 -6.6 3.5 -6.6 2.5 -5.5 2.45 -5.45 Q1.2 -3.65 1.1 -0.75 L1.1 -0.3 0.9 0.0 Q0.65 0.05 0.55 -0.15 L0.55 -0.2 Q0.5 -4.0 -1.3 -6.1 L-1.9 -6.65 Q-3.65 -5.45 -6.2 -5.1 L-8.15 -4.95 Q-10.75 -5.45 -12.5 -6.75 -14.75 -8.4 -15.75 -11.35 L-16.0 -11.1 Q-17.4 -9.55 -19.8 -9.05 L-21.5 -8.95 Q-23.05 -8.95 -24.15 -9.45 -24.85 -9.75 -25.45 -10.15 L-26.35 -11.0 -26.4 -11.05 -26.5 -11.2 -26.5 -11.25 Q-27.4 -12.4 -27.95 -13.85 L-27.95 -13.9 -28.4 -13.2 -28.4 -13.15 Q-29.3 -12.1 -30.9 -11.7 L-33.7 -11.9 Q-34.95 -12.3 -36.0 -13.0 L-36.95 -14.2 -37.0 -14.2 Q-38.05 -15.75 -37.8 -18.2 L-37.6 -19.75 Q-39.9 -21.45 -43.15 -22.0 L-46.4 -22.3 -46.65 -22.35 -49.85 -22.45 -49.9 -22.45 -51.7 -22.5 -54.1 -22.65 Q-54.3 -22.65 -54.3 -22.95 L-47.1 -23.1 -41.2 -23.8 -40.45 -24.0 Q-38.8 -24.6 -37.5 -25.5 L-37.25 -25.75 -37.25 -25.8 Q-37.75 -27.25 -37.65 -29.1 -37.55 -31.2 -36.5 -32.4 L-36.3 -32.45 -36.15 -32.65 -36.15 -32.7 -35.9 -32.85 -35.85 -32.85 Q-34.25 -34.35 -31.3 -34.05 L-30.6 -33.95 Q-29.2 -33.4 -28.35 -32.3 L-28.3 -32.3 Q-28.05 -34.0 -27.25 -35.15 L-27.2 -35.15 -26.3 -36.45 -26.3 -36.5 -25.4 -37.2 -25.4 -37.25 -23.4 -38.1 -23.35 -38.1 Q-22.3 -38.65 -20.85 -38.6 -19.4 -38.5 -18.45 -38.0 L-18.1 -38.0 -18.05 -38.0 -16.0 -36.3 -15.7 -35.8 -15.65 -35.75 -14.75 -37.7 -14.75 -37.8 -14.6 -37.9 -14.55 -37.9 -13.95 -38.75 -13.9 -38.75 -12.5 -40.25 -12.5 -40.3 Q-10.75 -41.45 -8.25 -41.85 L-6.05 -42.0 Q-4.05 -41.6 -2.55 -40.8 L-2.45 -40.65 -2.4 -40.6 -1.9 -40.35 -1.15 -41.3 Q-0.4 -42.85 -0.15 -44.8 L0.1 -46.0 0.1 -46.05 Q0.55 -46.0 0.55 -45.4 L0.7 -43.95 Q1.2 -41.7 2.35 -40.25 L2.95 -40.5 3.0 -40.5 3.15 -40.65 3.15 -40.7 Q4.85 -41.75 7.3 -42.1 L7.35 -42.1 8.45 -42.1 Q11.5 -41.65 13.45 -40.25 L13.5 -40.25 15.05 -38.7 Q15.35 -38.0 15.8 -37.4 L15.85 -37.4 16.9 -34.1 16.9 -34.05 Q17.55 -35.2 18.5 -36.0 L18.5 -36.05 Q19.7 -36.75 21.2 -37.15 L22.8 -37.3 23.25 -37.35 23.9 -37.15 23.95 -37.15 M-34.15 -23.15 L-34.2 -23.15 Q-35.45 -23.7 -36.4 -24.55 L-36.4 -24.6 Q-38.4 -23.4 -41.05 -22.8 -40.6 -22.5 -40.05 -22.35 L-39.0 -21.85 -36.95 -21.0 -35.35 -22.45 -35.25 -22.6 -35.2 -22.65 -34.15 -23.15 M-28.2 -19.4 L-27.85 -18.75 -27.8 -18.75 -27.3 -19.9 -27.1 -20.1 -26.95 -20.5 -26.95 -20.55 -27.4 -21.0 -27.45 -21.0 -27.6 -21.05 -27.6 -21.1 Q-29.3 -22.7 -32.5 -22.55 -33.9 -22.3 -34.8 -21.65 L-34.8 -21.6 -35.3 -21.25 -35.3 -21.2 -35.6 -20.7 -35.65 -20.65 Q-36.55 -19.8 -36.85 -18.35 L-36.85 -18.3 Q-36.95 -16.4 -36.45 -15.1 L-36.4 -15.1 -35.25 -13.75 -35.2 -13.75 -34.45 -13.15 -33.75 -12.95 -33.1 -12.75 Q-30.4 -12.4 -29.2 -14.05 -28.6 -14.95 -28.5 -16.35 -28.45 -17.8 -29.0 -18.8 L-29.05 -18.8 -29.7 -19.6 -31.35 -20.25 -31.35 -20.2 -32.95 -19.8 -33.2 -19.6 -33.75 -18.95 Q-34.15 -18.35 -34.15 -17.6 -34.05 -16.2 -33.15 -15.55 L-33.1 -15.55 -31.15 -15.65 -31.15 -15.7 -30.8 -16.05 -30.8 -16.1 -30.65 -16.45 -30.65 -16.5 -30.65 -17.2 -30.95 -17.7 -31.0 -17.7 -31.6 -17.95 -32.0 -17.65 -31.85 -17.05 -31.85 -17.0 -32.05 -16.75 -32.1 -16.75 -32.9 -16.85 -32.9 -16.9 -33.1 -17.35 -33.1 -17.4 -32.9 -18.2 -32.85 -18.25 -32.65 -18.5 -32.6 -18.5 -31.8 -18.85 -31.75 -18.85 -30.9 -18.75 -30.9 -18.7 -30.45 -18.45 -30.4 -18.45 -30.05 -18.05 -29.85 -17.45 Q-29.5 -16.4 -30.0 -15.55 L-30.05 -15.55 -30.35 -15.1 -30.4 -15.1 -30.55 -15.05 Q-30.9 -14.6 -31.7 -14.45 -33.05 -14.3 -34.0 -15.05 -34.75 -15.7 -35.05 -16.75 L-35.1 -17.55 Q-34.95 -20.05 -33.05 -20.9 L-31.3 -21.05 Q-30.0 -20.9 -29.15 -20.35 L-29.1 -20.3 -28.2 -19.4 M-20.7 -22.6 L-22.35 -22.3 Q-23.85 -21.85 -25.0 -21.0 L-25.0 -20.95 -25.85 -20.1 -26.2 -19.5 -26.35 -19.4 -26.35 -19.35 -27.2 -16.8 -27.2 -16.75 Q-27.2 -13.7 -25.65 -11.8 L-25.6 -11.8 -25.4 -11.75 -25.4 -11.7 -24.9 -11.2 -24.85 -11.2 -24.7 -11.1 -24.55 -10.9 -23.75 -10.55 Q-22.45 -10.0 -20.9 -10.0 -19.2 -10.1 -17.9 -10.85 L-17.9 -10.9 -17.6 -11.1 -17.1 -11.55 -17.1 -11.6 -17.0 -11.8 Q-15.85 -13.0 -16.0 -15.15 -16.1 -16.9 -16.95 -18.05 L-17.5 -18.75 -17.9 -19.0 -17.95 -19.0 -18.15 -19.25 Q-18.85 -19.7 -19.9 -19.8 -21.8 -20.1 -23.0 -19.2 L-23.4 -18.75 Q-24.05 -18.1 -24.3 -17.1 -24.6 -15.5 -23.8 -14.45 L-23.25 -13.65 -23.2 -13.65 -22.7 -13.35 -22.6 -13.25 -22.6 -13.2 -21.2 -12.8 -21.15 -12.8 -19.75 -13.0 -19.7 -13.0 -18.95 -13.55 -18.95 -13.6 -18.65 -13.95 -18.6 -14.0 -18.35 -14.55 -18.35 -14.6 Q-18.15 -15.65 -18.7 -16.45 L-19.55 -17.15 -21.4 -17.05 -21.45 -17.0 -21.85 -16.4 -21.85 -16.35 -21.7 -15.5 -21.65 -15.5 Q-21.4 -15.25 -20.85 -15.25 L-20.2 -15.35 -20.15 -15.35 -19.9 -14.75 Q-20.1 -14.15 -21.0 -14.2 -21.8 -14.2 -22.2 -14.6 L-22.6 -15.0 -22.7 -15.45 Q-23.0 -16.6 -22.5 -17.5 L-22.45 -17.5 -22.05 -17.95 -22.05 -18.0 -20.65 -18.5 -20.6 -18.5 -18.75 -17.95 -18.75 -17.9 -18.65 -17.75 -18.6 -17.75 -17.9 -17.05 -17.9 -17.0 Q-17.2 -16.05 -17.4 -14.4 L-17.45 -14.4 -17.8 -13.5 -17.85 -13.45 -18.0 -13.35 -18.0 -13.3 -18.1 -13.1 -18.65 -12.65 Q-19.45 -12.05 -20.7 -11.9 -22.55 -11.8 -23.7 -12.6 L-23.75 -12.6 -24.35 -13.15 -24.35 -13.2 Q-25.4 -14.5 -25.5 -16.65 L-25.45 -16.65 Q-25.15 -18.75 -23.8 -19.8 L-23.6 -19.9 -23.6 -19.95 -23.25 -20.25 Q-22.75 -20.35 -22.45 -20.65 L-21.75 -20.85 Q-20.6 -21.1 -19.5 -20.85 -18.1 -20.5 -17.1 -19.75 L-17.1 -19.7 -16.55 -19.25 -16.55 -19.2 -15.45 -17.55 -15.4 -17.6 Q-15.1 -18.2 -14.95 -18.95 L-14.9 -18.95 Q-14.5 -19.5 -14.25 -20.2 L-14.8 -20.8 -14.85 -20.85 -15.6 -21.25 -15.6 -21.3 -15.7 -21.45 Q-17.75 -22.75 -20.7 -22.6 M-26.15 -25.2 L-26.5 -24.95 -26.5 -24.9 -27.3 -24.2 -27.35 -24.15 Q-27.9 -23.8 -28.6 -23.6 L-28.6 -23.55 -29.25 -23.2 -27.05 -22.1 -26.95 -21.95 -26.9 -21.95 Q-26.8 -21.85 -26.65 -21.85 L-26.65 -21.8 -26.1 -21.35 Q-25.55 -21.65 -25.2 -22.05 L-25.15 -22.05 -24.7 -22.35 -24.65 -22.4 -22.85 -23.25 -22.9 -23.3 Q-24.05 -23.65 -24.9 -24.25 L-24.95 -24.25 -25.15 -24.5 -26.1 -25.2 -26.15 -25.2 M-34.65 -31.05 L-34.65 -31.1 Q-33.85 -31.9 -32.25 -31.9 L-32.25 -31.85 Q-31.35 -31.7 -30.7 -31.25 L-30.35 -30.95 -30.1 -30.45 -29.95 -30.3 -29.85 -29.75 Q-29.6 -28.55 -30.1 -27.75 L-30.15 -27.7 -30.8 -27.1 -32.1 -26.85 -32.15 -26.85 -32.75 -26.95 -33.15 -27.2 -33.35 -27.35 -33.35 -27.4 Q-33.9 -28.1 -33.6 -29.1 L-33.55 -29.1 Q-33.2 -29.9 -32.2 -29.8 L-32.15 -29.8 Q-31.85 -29.6 -32.0 -29.1 L-32.65 -28.8 -32.75 -28.35 -32.75 -28.3 -32.45 -27.8 -32.4 -27.8 -31.2 -27.9 Q-30.8 -28.4 -30.75 -29.25 L-30.75 -29.3 -31.05 -30.15 -31.6 -30.55 -33.8 -30.65 -34.55 -29.75 -34.75 -28.45 Q-34.6 -27.05 -33.65 -26.3 L-32.75 -26.0 Q-31.2 -25.55 -29.95 -26.4 L-28.8 -27.6 -28.75 -27.9 -28.6 -28.65 Q-28.25 -31.4 -30.1 -32.45 L-30.1 -32.5 -30.25 -32.65 Q-31.65 -33.4 -33.55 -32.95 -35.1 -32.55 -35.85 -31.35 L-35.9 -31.35 Q-36.55 -30.45 -36.85 -29.15 L-36.85 -29.1 -36.65 -27.2 -36.6 -27.2 -36.15 -25.85 -35.2 -24.85 -34.8 -24.55 Q-34.0 -24.0 -32.95 -23.85 -30.0 -23.35 -28.25 -24.65 L-28.25 -24.7 -28.05 -24.9 -28.0 -24.9 -27.7 -25.05 Q-27.25 -25.45 -26.95 -26.0 L-27.7 -27.6 -27.75 -27.6 -27.95 -27.1 -28.0 -27.1 Q-29.1 -25.55 -31.1 -24.9 L-31.15 -24.9 Q-33.75 -24.75 -34.95 -26.25 L-35.55 -27.6 Q-36.0 -29.45 -35.1 -30.7 L-35.05 -30.75 -34.65 -31.05 M-12.8 -25.45 L-13.25 -25.95 -13.3 -25.9 Q-15.0 -24.3 -17.5 -23.45 L-17.5 -23.4 Q-17.35 -23.2 -17.0 -23.25 L-15.45 -22.55 -15.45 -22.5 -15.35 -22.35 -14.15 -21.6 -13.75 -21.25 -13.7 -21.25 -13.45 -21.15 -13.4 -21.15 Q-12.55 -22.05 -11.3 -22.5 L-11.3 -22.55 -11.2 -22.7 -11.15 -22.7 -9.35 -23.45 Q-10.35 -23.75 -11.1 -24.25 L-11.3 -24.45 -11.85 -24.7 -11.85 -24.75 -12.3 -25.2 -12.35 -25.2 -12.8 -25.45 M-18.55 -35.3 L-18.45 -35.15 -18.4 -35.15 -17.5 -34.45 -16.85 -33.0 -16.8 -32.7 Q-16.4 -30.65 -17.45 -29.4 L-17.5 -29.4 -17.9 -28.95 -17.95 -28.95 Q-18.5 -28.65 -19.1 -28.4 L-19.35 -28.35 -20.85 -28.3 Q-23.3 -28.9 -22.95 -31.9 L-22.05 -33.2 -21.8 -33.4 -21.75 -33.4 Q-21.5 -33.4 -21.4 -33.55 L-21.35 -33.55 -20.3 -33.55 -19.85 -33.4 -19.75 -33.25 -19.65 -33.25 -19.4 -33.1 -19.4 -33.05 -19.0 -32.7 -19.0 -32.65 Q-18.45 -31.25 -19.35 -30.25 L-19.4 -30.25 -20.05 -30.15 -20.3 -30.65 -20.3 -30.7 -19.75 -31.5 -19.75 -31.95 -20.0 -32.35 -20.05 -32.35 -21.05 -32.55 -21.05 -32.5 -21.5 -32.25 Q-22.05 -31.8 -22.15 -31.0 L-22.1 -30.95 -21.55 -29.65 -21.5 -29.65 Q-21.1 -29.35 -20.55 -29.15 L-20.5 -29.15 Q-18.75 -29.2 -18.0 -30.25 L-17.85 -30.7 Q-17.7 -31.0 -17.7 -31.45 -17.65 -33.8 -19.3 -34.55 L-19.8 -34.75 Q-21.75 -35.15 -22.85 -34.2 L-22.9 -34.2 -23.15 -33.95 -23.5 -33.75 -23.5 -33.7 -23.9 -33.2 -24.3 -31.8 -24.2 -30.15 Q-23.8 -28.7 -22.85 -27.75 L-22.15 -27.5 Q-21.2 -26.95 -19.75 -27.0 -17.95 -27.1 -16.95 -28.15 L-16.9 -28.35 -16.15 -29.2 -15.75 -30.4 Q-15.45 -31.8 -15.7 -33.35 L-15.9 -34.1 Q-16.6 -35.7 -17.9 -36.75 L-18.45 -37.0 -20.25 -37.5 -22.8 -37.35 -24.35 -36.55 Q-26.9 -35.2 -27.3 -31.7 L-27.15 -29.2 Q-26.55 -26.8 -24.9 -25.55 L-24.85 -25.5 -24.25 -25.15 -24.25 -25.1 -24.1 -24.9 Q-22.75 -24.25 -21.1 -24.0 L-20.3 -24.0 -17.5 -24.4 -17.15 -24.6 -14.75 -26.1 -14.75 -26.15 -14.0 -26.85 -14.0 -26.9 -15.15 -28.95 -16.6 -27.25 -16.65 -27.2 -16.8 -27.15 -16.85 -27.1 -16.95 -26.95 -17.1 -26.9 Q-18.05 -26.15 -19.45 -26.05 -22.05 -25.9 -23.5 -27.05 L-23.5 -27.1 -23.55 -27.3 Q-24.8 -28.2 -25.2 -30.0 -25.5 -31.15 -25.2 -32.3 -24.85 -33.9 -23.85 -34.85 -22.85 -35.8 -21.05 -35.95 L-21.0 -35.95 -18.55 -35.3 M1.25 -9.9 L0.75 -10.7 0.75 -10.65 -0.3 -8.5 -0.35 -8.5 -0.95 -7.6 -0.4 -6.65 0.1 -5.65 0.4 -5.35 0.4 -5.3 Q0.45 -5.05 0.65 -4.9 L1.85 -6.5 2.0 -6.75 2.65 -7.45 Q1.85 -8.6 1.25 -9.9 M11.3 -18.85 L11.35 -18.8 12.6 -17.5 13.35 -15.8 Q13.7 -14.85 13.55 -13.75 13.3 -10.7 11.0 -9.55 L11.0 -9.5 10.85 -9.35 Q9.8 -8.7 8.2 -8.65 L6.05 -9.2 4.6 -10.4 4.55 -10.4 4.5 -10.6 Q3.55 -11.6 3.7 -13.5 3.85 -15.15 4.95 -15.95 L4.95 -16.0 5.1 -16.2 5.15 -16.25 7.1 -17.05 8.2 -17.0 8.2 -16.95 Q9.2 -16.6 9.85 -16.0 L9.85 -15.95 9.9 -15.8 9.95 -15.8 10.15 -15.65 Q10.75 -14.7 10.6 -13.5 10.4 -12.3 9.65 -11.75 L9.55 -11.75 9.25 -11.5 9.2 -11.45 Q7.9 -11.1 7.05 -11.75 L6.45 -12.3 Q6.2 -12.8 6.2 -13.55 L6.25 -13.55 6.6 -14.25 6.65 -14.3 Q7.0 -14.6 7.65 -14.65 L7.7 -14.65 Q8.15 -14.5 8.2 -14.0 L7.35 -13.35 7.5 -12.6 7.5 -12.55 7.95 -12.25 8.0 -12.25 9.1 -12.5 9.1 -12.55 9.5 -13.0 9.65 -13.75 Q9.65 -15.15 8.8 -15.75 L8.3 -15.8 Q6.75 -16.3 5.7 -15.35 L5.35 -14.95 Q4.85 -14.35 4.8 -13.4 4.7 -12.0 5.35 -11.2 L5.7 -10.7 5.75 -10.7 6.0 -10.45 6.95 -10.0 7.25 -9.9 Q9.5 -9.55 10.95 -10.7 L11.75 -11.6 12.35 -12.8 12.45 -13.6 Q12.6 -15.8 11.55 -17.05 L10.05 -18.35 Q9.25 -18.95 8.05 -19.05 6.1 -19.25 4.75 -18.55 L4.75 -18.5 4.0 -18.05 2.65 -16.6 2.6 -16.6 Q1.45 -14.9 1.45 -12.25 L1.5 -12.25 Q1.95 -10.5 2.75 -9.15 L2.8 -9.15 3.1 -8.65 3.15 -8.65 4.25 -7.7 5.25 -6.95 6.05 -6.65 6.55 -6.5 10.0 -6.25 10.05 -6.3 Q11.8 -6.8 13.15 -7.75 14.6 -9.15 15.45 -11.1 16.1 -12.55 16.05 -14.25 15.95 -17.0 14.75 -18.8 L13.0 -20.6 Q10.9 -22.45 7.1 -22.35 L7.05 -22.35 Q4.6 -22.0 2.95 -20.9 L2.2 -20.35 2.15 -20.35 1.45 -19.75 1.45 -19.7 0.8 -19.15 Q-0.6 -21.15 -3.05 -22.2 L-4.45 -22.65 Q-6.2 -23.05 -7.9 -22.7 -11.15 -22.05 -12.9 -19.9 L-14.0 -18.05 -14.25 -17.35 -14.95 -14.2 Q-14.95 -11.45 -13.75 -9.65 L-13.3 -9.05 -11.7 -7.65 -11.7 -7.6 -11.5 -7.4 -10.8 -7.05 Q-9.8 -6.5 -8.5 -6.25 -6.75 -5.85 -5.1 -6.3 L-5.05 -6.35 -3.4 -7.05 -3.25 -7.25 -3.2 -7.3 Q-3.05 -7.3 -2.95 -7.4 L-2.95 -7.45 -2.05 -8.25 -1.7 -8.45 -1.7 -8.5 -1.2 -9.1 -1.2 -9.15 -0.75 -10.0 -0.7 -10.0 -0.4 -10.3 -0.45 -10.55 -0.3 -11.25 Q0.1 -12.95 -0.2 -14.7 -0.55 -16.35 -1.4 -17.45 L-1.45 -17.45 -2.25 -18.2 -2.3 -18.25 -2.55 -18.35 -2.55 -18.4 -2.7 -18.55 -4.3 -19.3 -5.8 -19.5 Q-8.1 -19.6 -9.4 -18.55 L-9.4 -18.5 Q-10.65 -17.4 -11.3 -15.7 L-11.3 -15.65 -11.3 -15.35 -11.35 -15.35 -11.5 -15.1 -11.55 -14.05 -11.4 -13.0 Q-10.85 -11.15 -9.55 -10.0 L-8.5 -9.45 -7.65 -9.3 Q-6.05 -8.95 -5.0 -9.6 L-5.0 -9.65 -4.45 -10.0 -3.7 -11.05 -3.2 -12.3 Q-2.8 -14.0 -3.65 -15.1 L-4.3 -15.8 Q-4.65 -16.1 -5.15 -16.25 -6.6 -16.7 -7.7 -15.9 L-8.35 -14.85 Q-8.9 -13.75 -8.3 -12.7 L-8.25 -12.7 -7.95 -12.35 -7.95 -12.3 -7.15 -12.05 -7.1 -12.05 Q-6.1 -12.05 -5.8 -12.7 L-5.8 -12.8 Q-5.55 -13.4 -5.95 -13.8 L-6.0 -13.85 -6.45 -14.1 -6.6 -14.45 -6.6 -14.5 Q-6.45 -14.85 -6.05 -14.85 L-6.0 -14.85 -5.3 -14.6 -5.25 -14.55 -4.9 -14.0 -4.9 -13.95 Q-4.6 -12.4 -5.45 -11.55 L-5.5 -11.55 Q-6.3 -10.85 -7.65 -11.15 L-7.7 -11.2 -7.8 -11.35 -8.2 -11.35 -8.2 -11.4 -9.1 -12.2 -9.45 -13.2 Q-9.8 -14.85 -8.9 -16.1 L-8.45 -16.55 Q-7.7 -17.2 -6.65 -17.3 -5.0 -17.5 -3.85 -16.75 L-2.95 -15.8 -2.45 -14.75 Q-2.25 -14.2 -2.2 -13.5 -2.15 -10.55 -4.1 -9.1 L-4.1 -9.05 -4.25 -8.95 -4.3 -8.95 Q-5.3 -8.3 -6.75 -8.15 L-6.85 -8.15 Q-8.5 -8.25 -9.7 -8.95 L-9.8 -9.1 -9.85 -9.1 -10.0 -9.2 -10.25 -9.45 -10.45 -9.55 Q-11.35 -10.35 -11.95 -11.5 L-12.4 -13.05 Q-12.75 -15.65 -11.55 -17.65 -10.9 -18.65 -9.95 -19.3 L-9.7 -19.6 Q-8.1 -20.55 -5.8 -20.55 L-4.35 -20.35 Q-2.75 -19.95 -1.65 -19.1 L-0.55 -18.05 -0.2 -17.65 0.75 -15.1 0.8 -15.1 Q1.05 -16.2 1.6 -16.9 L1.6 -16.95 1.8 -17.25 1.85 -17.25 3.15 -18.55 3.15 -18.6 3.3 -18.75 Q4.3 -19.4 5.5 -19.85 L8.25 -20.2 8.3 -20.2 10.95 -19.15 11.05 -19.0 11.1 -19.0 11.3 -18.85 M15.65 -19.4 L15.95 -18.75 15.95 -18.7 16.45 -17.45 16.45 -17.5 Q17.05 -19.05 18.3 -19.95 L18.35 -20.0 20.7 -21.0 22.3 -20.9 23.75 -20.65 24.95 -19.9 24.95 -19.85 25.3 -19.4 25.35 -19.4 25.65 -19.05 25.9 -18.8 26.55 -17.2 Q26.8 -16.2 26.55 -15.2 26.2 -13.7 25.3 -12.8 L25.25 -12.75 Q24.45 -12.15 23.4 -11.75 L23.35 -11.75 Q21.25 -11.5 19.85 -12.45 L19.85 -12.5 19.7 -12.7 19.65 -12.75 19.15 -13.1 19.15 -13.15 19.05 -13.45 19.0 -13.45 18.75 -13.65 18.65 -13.95 18.45 -14.85 Q18.35 -17.0 19.6 -18.0 L19.65 -18.05 21.3 -18.6 21.35 -18.6 23.2 -17.95 23.2 -17.9 23.75 -17.3 23.9 -16.75 Q24.25 -15.2 23.35 -14.4 L23.3 -14.4 21.1 -14.25 21.1 -14.3 20.8 -14.6 20.75 -14.65 Q20.4 -15.25 20.65 -15.9 L20.7 -15.9 Q20.9 -16.2 21.25 -16.2 L21.3 -16.15 21.75 -15.1 21.8 -15.1 22.4 -15.0 22.85 -15.25 23.1 -16.1 22.95 -16.55 22.55 -17.05 22.5 -17.05 20.35 -17.15 20.3 -17.15 19.75 -16.6 19.7 -16.4 19.6 -15.95 Q19.3 -14.3 20.25 -13.5 L20.25 -13.45 Q21.05 -12.85 22.15 -12.7 23.5 -12.7 24.35 -13.5 25.15 -14.2 25.5 -15.3 L25.5 -15.35 Q25.7 -17.45 24.75 -18.6 L24.7 -18.65 23.85 -19.4 23.0 -19.7 22.7 -19.8 Q20.55 -20.2 19.1 -19.25 L19.1 -19.2 18.95 -19.05 18.9 -19.05 18.5 -18.8 18.5 -18.75 18.25 -18.6 17.95 -18.0 Q17.35 -17.25 17.2 -16.15 17.0 -14.45 17.5 -13.1 L17.65 -12.95 17.7 -12.9 18.05 -12.2 Q18.8 -11.45 19.7 -10.95 20.95 -10.2 22.7 -10.4 24.4 -10.65 25.6 -11.4 L25.6 -11.45 25.7 -11.6 25.75 -11.65 26.25 -12.05 26.35 -12.3 26.4 -12.3 26.9 -12.8 27.4 -13.9 27.8 -15.2 Q28.1 -16.75 27.65 -18.1 26.7 -21.1 23.8 -22.1 L20.45 -22.45 20.45 -22.4 Q18.65 -22.1 17.4 -21.25 L17.4 -21.2 17.0 -21.0 15.65 -19.45 15.65 -19.4 M14.65 -26.1 L14.6 -26.1 14.0 -25.45 13.95 -25.45 13.35 -24.9 13.3 -24.9 11.85 -24.1 11.7 -24.0 11.65 -23.95 9.95 -23.25 Q9.95 -23.2 10.05 -23.2 L12.45 -22.3 12.45 -22.25 12.6 -22.1 13.0 -22.05 13.0 -22.0 13.25 -21.8 13.3 -21.75 13.45 -21.7 13.45 -21.65 14.9 -20.5 16.2 -21.5 16.2 -21.55 16.3 -21.7 16.35 -21.7 16.9 -22.1 17.3 -22.3 17.75 -22.5 Q18.4 -22.65 18.65 -23.0 L18.7 -23.0 16.5 -24.3 16.5 -24.35 15.55 -25.1 15.55 -25.15 14.65 -26.1 M0.45 -25.75 L0.4 -25.7 Q-1.35 -24.25 -3.85 -23.55 L-3.85 -23.5 Q-2.35 -23.15 -1.25 -22.45 L-1.25 -22.4 Q-1.15 -22.25 -0.95 -22.25 L-0.95 -22.2 -0.85 -22.05 -0.8 -22.05 -0.5 -21.85 -0.45 -21.85 0.8 -20.75 1.2 -20.95 1.2 -21.0 1.35 -21.15 1.4 -21.15 2.15 -21.5 2.15 -21.55 Q2.85 -22.1 3.85 -22.35 L3.85 -22.4 4.0 -22.55 4.65 -22.8 4.7 -22.8 5.2 -22.95 5.2 -23.0 Q3.5 -23.5 2.2 -24.35 L2.15 -24.4 2.05 -24.5 2.0 -24.5 1.75 -24.65 1.75 -24.7 0.45 -25.75 M0.9 -40.5 L0.25 -42.1 Q-0.3 -40.65 -1.05 -39.55 L-1.05 -39.45 -0.05 -37.55 -0.05 -37.5 0.3 -36.5 Q0.6 -37.65 1.2 -38.45 L1.2 -38.5 1.6 -39.05 1.6 -39.15 1.3 -39.85 0.9 -40.5 M11.0 -40.4 L10.55 -40.45 7.55 -40.85 Q4.75 -40.8 3.35 -39.25 3.3 -39.15 3.15 -39.15 L1.75 -37.25 Q1.2 -36.15 1.05 -34.65 0.75 -31.65 2.1 -30.05 L2.1 -30.0 2.25 -29.75 3.1 -28.95 Q4.15 -28.15 5.55 -27.8 L7.45 -27.65 Q9.05 -27.8 10.3 -28.65 11.25 -29.35 11.8 -30.4 12.4 -31.45 12.45 -33.0 12.6 -35.0 11.75 -36.15 L10.55 -37.4 Q10.15 -37.55 9.75 -37.8 L8.85 -38.05 Q6.65 -38.45 5.3 -37.5 L5.15 -37.35 5.1 -37.3 3.95 -36.05 Q3.55 -35.25 3.55 -34.1 3.55 -33.0 3.85 -32.15 L3.9 -32.15 4.0 -31.9 4.05 -31.85 4.5 -31.3 4.55 -31.3 5.1 -30.85 5.9 -30.55 Q7.55 -30.15 8.7 -30.95 L9.0 -31.15 9.0 -31.25 9.1 -31.35 9.75 -32.75 Q10.05 -34.35 9.1 -35.15 L9.05 -35.15 Q8.55 -35.6 7.7 -35.75 L7.65 -35.75 Q6.85 -35.65 6.35 -35.25 L6.3 -35.25 6.0 -34.95 6.0 -34.85 Q5.6 -33.95 6.05 -33.1 L6.1 -33.05 6.85 -32.7 6.9 -32.7 Q7.35 -32.8 7.65 -33.05 L7.65 -33.1 7.75 -33.65 Q7.6 -33.95 7.7 -34.35 L7.75 -34.35 8.35 -34.4 8.35 -34.35 Q8.95 -33.55 8.45 -32.6 L8.4 -32.6 8.0 -32.1 7.95 -32.05 Q7.5 -31.75 6.8 -31.7 L6.7 -31.7 Q6.15 -31.85 5.7 -32.1 L5.65 -32.15 5.3 -32.55 5.3 -32.6 Q4.45 -33.8 5.1 -35.25 L5.15 -35.25 5.95 -36.25 6.75 -36.55 9.4 -36.25 9.4 -36.2 9.5 -36.1 9.55 -36.05 9.8 -35.95 9.8 -35.9 10.85 -34.1 10.75 -32.85 Q10.4 -30.95 9.1 -30.0 L8.3 -29.65 6.7 -29.45 Q5.35 -29.55 4.45 -30.15 L3.75 -30.8 3.05 -31.8 Q2.65 -32.4 2.55 -33.2 2.35 -35.0 2.95 -36.3 3.6 -37.65 4.85 -38.35 L5.25 -38.75 5.3 -38.75 Q5.65 -38.8 5.9 -39.0 L6.95 -39.15 8.8 -39.25 Q10.2 -38.95 11.15 -38.2 L11.25 -38.05 11.3 -38.0 11.5 -37.95 12.35 -36.9 12.95 -36.2 Q13.5 -35.05 13.55 -33.65 13.55 -32.1 13.15 -30.9 12.15 -28.0 9.25 -26.95 L6.75 -26.65 Q4.05 -26.8 2.4 -28.15 0.95 -29.35 0.3 -31.35 L-0.2 -30.15 -0.25 -30.1 -1.5 -28.7 -1.55 -28.65 -2.25 -28.0 Q-3.35 -27.35 -4.7 -27.0 L-7.8 -26.95 Q-9.4 -27.35 -10.5 -28.2 L-10.5 -28.25 -11.15 -28.9 -12.1 -30.65 -12.65 -32.8 Q-12.9 -35.4 -11.55 -37.15 L-10.85 -37.85 Q-10.05 -38.7 -8.75 -39.0 L-5.9 -39.15 -5.9 -39.1 -4.2 -38.5 -4.05 -38.35 -3.6 -38.1 -2.45 -36.55 Q-2.05 -35.65 -2.1 -34.3 -2.2 -31.55 -4.05 -30.45 L-4.2 -30.3 -4.7 -30.1 -6.7 -29.9 Q-7.95 -30.15 -8.75 -30.85 L-8.95 -31.1 Q-9.65 -31.95 -9.85 -33.25 -10.1 -34.7 -9.4 -35.65 L-7.5 -36.9 -7.4 -36.9 -6.5 -37.0 -6.45 -37.0 -5.1 -36.5 -5.05 -36.45 -4.7 -36.1 -4.15 -35.2 -4.15 -35.15 Q-3.95 -33.55 -4.75 -32.8 L-4.8 -32.8 Q-4.85 -32.7 -5.0 -32.7 L-5.0 -32.65 -5.15 -32.55 -5.4 -32.45 Q-6.45 -32.05 -7.15 -32.7 -8.0 -33.5 -7.4 -34.6 L-7.25 -34.75 -7.2 -34.75 -7.0 -34.85 -6.95 -34.85 -6.75 -34.8 -6.75 -34.75 -6.6 -34.55 -6.45 -33.45 -6.4 -33.45 Q-6.25 -33.25 -5.9 -33.25 L-5.85 -33.25 -5.25 -33.7 -5.25 -33.75 Q-4.75 -34.95 -5.65 -35.75 L-5.65 -35.8 -6.5 -36.1 -6.55 -36.1 Q-7.55 -36.0 -8.3 -35.5 L-8.35 -35.45 -8.45 -35.25 -8.75 -34.95 Q-9.45 -33.5 -8.7 -32.2 L-8.65 -32.2 -8.3 -31.7 -7.8 -31.3 -7.8 -31.25 -7.65 -31.1 -7.2 -30.95 -6.75 -30.85 -4.7 -31.1 -4.7 -31.15 Q-3.5 -32.05 -3.0 -33.55 L-3.0 -33.65 Q-2.85 -35.65 -3.8 -36.85 L-3.8 -36.9 -4.35 -37.4 Q-5.0 -37.85 -5.85 -38.1 L-6.55 -38.2 Q-8.55 -38.25 -9.9 -37.4 L-9.9 -37.35 -10.2 -37.15 -10.6 -36.65 -11.5 -35.0 Q-11.95 -33.5 -11.7 -31.8 L-11.65 -31.8 -10.75 -30.0 -9.55 -28.7 Q-8.25 -27.85 -6.35 -27.75 L-5.0 -27.9 Q-2.7 -28.45 -1.4 -30.15 -0.7 -31.15 -0.4 -32.6 L-0.3 -33.55 Q-0.3 -37.3 -2.3 -39.2 L-2.35 -39.2 -2.55 -39.3 -2.95 -39.7 -4.6 -40.65 -6.65 -40.95 -8.6 -40.9 -10.25 -40.4 -10.25 -40.35 -10.35 -40.25 -10.4 -40.2 Q-11.5 -39.7 -12.45 -39.0 L-12.5 -38.95 -13.1 -38.5 -13.15 -38.45 -13.45 -37.9 -13.5 -37.9 -13.65 -37.8 -13.65 -37.7 -14.3 -36.5 -14.3 -36.15 -14.7 -34.2 Q-14.75 -32.2 -14.35 -30.7 L-13.4 -27.85 -13.35 -27.85 -12.9 -27.3 -12.85 -27.25 -12.65 -26.95 -11.55 -25.85 -11.2 -25.6 -11.15 -25.6 -10.9 -25.35 -9.6 -24.8 -8.2 -24.4 -5.1 -24.3 -5.05 -24.35 Q-3.15 -24.8 -1.65 -25.6 L-1.65 -25.65 -0.75 -26.25 -0.75 -26.3 -0.35 -26.65 -0.3 -26.65 -0.15 -26.75 -0.15 -26.8 0.5 -27.4 0.55 -27.4 Q1.0 -26.65 1.7 -26.25 L1.75 -26.2 2.0 -25.85 2.05 -25.85 2.65 -25.35 4.25 -24.5 Q4.7 -24.25 5.3 -24.15 L8.6 -24.0 Q10.6 -24.4 12.15 -25.35 L12.35 -25.55 12.6 -25.75 12.8 -25.85 13.7 -26.8 15.05 -29.35 Q15.55 -30.45 15.7 -31.75 L15.75 -33.0 Q15.65 -35.7 14.5 -37.45 L14.45 -37.45 14.3 -37.6 14.3 -37.65 13.15 -39.0 13.1 -39.0 12.75 -39.15 12.75 -39.2 12.45 -39.55 11.25 -40.1 11.25 -40.15 11.0 -40.4 M37.95 -24.85 L37.9 -24.8 36.55 -23.55 36.5 -23.5 35.8 -23.15 35.85 -23.05 36.85 -22.25 36.9 -22.2 37.05 -22.1 38.15 -20.9 38.4 -20.9 38.4 -20.95 38.85 -21.35 38.9 -21.35 39.15 -21.5 39.45 -21.55 40.05 -21.8 42.7 -22.9 42.65 -22.9 Q40.8 -23.55 39.15 -24.3 L39.1 -24.35 39.0 -24.5 38.95 -24.5 37.95 -24.85 M28.05 -25.3 L28.0 -25.25 26.95 -24.35 26.9 -24.35 Q25.85 -23.45 24.3 -23.15 L24.3 -23.1 24.55 -22.95 24.6 -22.95 24.85 -22.95 24.9 -22.9 25.65 -22.55 25.65 -22.5 25.75 -22.35 25.8 -22.35 26.05 -22.25 26.45 -21.95 26.45 -21.9 Q26.7 -21.55 27.1 -21.35 L27.1 -21.3 Q27.3 -20.8 27.7 -20.55 L27.75 -20.55 28.7 -21.45 29.2 -22.05 29.25 -22.05 29.85 -22.5 29.9 -22.5 30.9 -23.05 29.8 -23.7 29.75 -23.7 29.4 -23.85 29.4 -23.9 28.05 -25.3 M26.5 -34.55 L26.45 -34.55 26.05 -34.85 Q25.25 -35.5 24.15 -35.85 L21.65 -36.05 Q18.35 -35.45 17.35 -32.55 L17.3 -31.95 17.25 -31.45 Q17.2 -30.85 17.3 -30.3 17.5 -29.25 18.0 -28.45 L18.2 -28.15 18.25 -28.15 18.9 -27.5 Q19.45 -27.05 20.2 -26.75 L20.65 -26.65 23.4 -26.95 23.4 -27.0 23.5 -27.15 Q24.45 -27.6 24.95 -28.55 L25.3 -29.75 Q25.5 -32.1 23.95 -33.1 L22.55 -33.6 Q20.7 -33.85 19.9 -32.6 L19.85 -32.55 Q19.45 -31.85 19.6 -30.85 L19.65 -30.85 Q20.0 -29.85 20.85 -29.4 L20.9 -29.4 22.3 -29.55 22.3 -29.6 22.65 -29.85 22.65 -29.9 Q23.05 -30.65 22.55 -31.25 L22.5 -31.25 21.75 -31.15 Q21.65 -30.7 21.8 -30.45 L21.8 -30.4 Q21.6 -30.1 21.25 -30.15 L21.25 -30.2 20.8 -30.55 20.8 -30.6 20.65 -30.95 20.65 -31.0 Q20.65 -31.85 21.15 -32.3 L21.2 -32.3 23.0 -32.25 23.1 -32.1 23.15 -32.05 23.35 -32.0 23.35 -31.95 Q24.1 -31.15 23.95 -29.9 L23.65 -29.2 23.6 -29.2 22.95 -28.6 22.55 -28.45 20.05 -28.5 20.05 -28.55 19.95 -28.7 Q19.35 -28.9 19.05 -29.4 18.15 -30.95 18.75 -33.0 L18.8 -33.0 19.35 -33.7 19.4 -33.7 Q20.25 -34.5 21.65 -34.85 L21.7 -34.85 Q23.65 -34.9 24.95 -33.95 L24.95 -33.9 25.6 -33.25 Q26.6 -31.75 26.4 -29.5 L26.1 -28.3 25.3 -27.05 25.25 -27.05 24.65 -26.45 24.6 -26.45 24.2 -26.25 24.2 -26.2 24.1 -26.05 24.05 -26.05 22.0 -25.35 21.95 -25.35 Q18.45 -25.6 17.0 -27.9 L17.0 -27.95 16.7 -28.55 16.7 -28.6 16.4 -29.6 16.35 -29.55 Q16.1 -28.55 15.55 -27.8 L15.55 -27.75 15.4 -27.35 15.4 -27.3 Q15.5 -26.7 15.9 -26.45 L15.95 -26.4 16.25 -25.95 16.3 -25.9 Q17.45 -24.75 19.1 -24.0 L20.5 -23.7 21.9 -23.7 21.95 -23.7 Q24.1 -23.75 25.65 -24.65 27.65 -26.0 28.2 -28.8 L28.3 -30.5 Q28.05 -33.1 26.5 -34.55" fill="#000000" fill-rule="evenodd" stroke="none"/>
  </g>
</svg>
