<?xml version="1.0" encoding="UTF-8" standalone="no"?>
<svg xmlns:xlink="http://www.w3.org/1999/xlink" height="39.45px" width="20.3px" xmlns="http://www.w3.org/2000/svg">
  <g transform="matrix(1.0, 0.0, 0.0, 1.0, 10.15, 16.45)">
    <path d="M-0.2 -9.55 L-5.95 -9.95 -8.5 -10.7 -10.1 -11.35 -10.15 -11.65 -10.15 -12.2 -10.0 -15.15 Q-5.35 -14.05 -0.9 -13.9 L2.95 -14.35 Q2.05 -13.55 0.6 -13.0 0.1 -12.8 0.05 -12.0 L-0.15 -10.15 -0.2 -9.55 M-0.65 10.45 L-1.05 10.15 -2.75 4.3 Q-3.35 2.25 -4.05 0.65 L-4.5 -0.45 -7.35 -4.8 -8.95 -7.4 -9.1 -7.7 -7.85 -7.15 Q-6.9 -6.6 -4.7 -6.4 L-1.45 -5.95 -0.45 -5.85 -0.8 2.45 -0.7 3.0 -0.85 5.7 -0.7 9.8 -0.65 10.45" fill="#b38484" fill-rule="evenodd" stroke="none"/>
    <path d="M3.75 -10.05 L2.2 -9.7 -0.15 -9.55 -0.2 -9.55 -0.15 -10.15 0.05 -12.0 Q0.1 -12.8 0.6 -13.0 2.05 -13.55 2.95 -14.35 L3.5 -14.5 4.25 -14.7 3.75 -10.3 3.75 -10.05 M3.35 -6.1 L2.9 0.65 Q2.85 2.6 3.05 4.25 L3.1 4.9 3.25 5.7 4.2 8.35 Q5.1 10.85 6.1 12.1 7.3 13.45 7.85 14.8 L9.2 18.45 8.85 19.4 7.4 23.0 7.2 22.9 6.7 22.55 Q6.4 22.45 6.95 20.9 7.55 19.3 7.4 17.3 7.2 15.25 5.7 14.0 L3.65 12.0 3.25 11.5 1.2 11.05 -0.65 10.45 -0.7 9.8 -0.85 5.7 -0.7 3.0 -0.8 2.45 -0.45 -5.85 1.3 -5.8 3.35 -6.1" fill="#c29c9c" fill-rule="evenodd" stroke="none"/>
    <path d="M7.45 -16.45 L7.35 -15.9 6.85 -12.8 6.8 -12.35 Q5.4 -10.5 4.45 -10.25 L3.75 -10.05 3.75 -10.3 4.25 -14.7 Q5.6 -15.2 6.75 -15.9 L7.45 -16.45 M3.35 -6.1 L4.75 -6.7 6.5 -8.1 6.5 -7.05 6.3 0.05 6.25 0.9 6.25 1.6 6.25 2.2 6.2 2.15 Q5.95 3.55 5.85 5.35 L5.8 5.95 7.3 9.75 9.95 16.5 9.2 18.45 7.85 14.8 Q7.3 13.45 6.1 12.1 5.1 10.85 4.2 8.35 L3.25 5.7 3.1 4.9 3.05 4.25 Q2.85 2.6 2.9 0.65 L3.35 -6.1" fill="#c9a7a7" fill-rule="evenodd" stroke="none"/>
    <path d="M9.95 16.5 L7.3 9.75 5.8 5.95 5.85 5.35 Q5.95 3.55 6.2 2.15 L6.25 2.2 7.3 5.7 10.15 15.5 9.95 16.5" fill="#d2b6b6" fill-rule="evenodd" stroke="none"/>
    <path d="M7.45 -16.45 L7.35 -15.9 6.85 -12.8 M-10.15 -11.65 L-10.15 -12.2 -10.0 -15.15 M9.2 18.45 L9.95 16.5 M6.25 2.2 L6.25 1.6 6.25 0.9 6.3 0.05 6.5 -7.05 6.5 -8.1 M6.25 2.2 L7.3 5.7 10.15 15.5 9.95 16.5 M9.2 18.45 L8.85 19.4 7.4 23.0 7.2 22.9 6.7 22.55 Q6.4 22.45 6.95 20.9 7.55 19.3 7.4 17.3 7.2 15.25 5.7 14.0 L3.65 12.0 3.25 11.5 1.2 11.05 -0.65 10.45 -1.05 10.15 -2.75 4.3 Q-3.35 2.25 -4.05 0.65 L-4.5 -0.45 -7.35 -4.8 -8.95 -7.4 -9.1 -7.7" fill="none" stroke="#a36a6a" stroke-linecap="round" stroke-linejoin="round" stroke-opacity="0.4" stroke-width="0.05"/>
  </g>
</svg>
