<?xml version="1.0" encoding="UTF-8" standalone="no"?>
<svg xmlns:xlink="http://www.w3.org/1999/xlink" height="70.25px" width="144.7px" xmlns="http://www.w3.org/2000/svg">
  <g transform="matrix(1.0, 0.0, 0.0, 1.0, -104.2, 35.65)">
    <path d="M144.6 -33.2 Q144.6 -32.15 144.3 -31.7 143.9 -31.1 142.8 -31.1 141.15 -31.1 140.6 -32.5 L140.4 -33.55 Q140.4 -35.85 142.5 -35.65 144.6 -35.45 144.6 -33.2 M159.9 -16.6 Q158.35 -15.0 155.4 -15.0 151.25 -15.0 149.7 -17.1 148.9 -18.15 148.9 -19.5 L149.3 -22.8 Q149.35 -23.25 150.5 -24.1 151.75 -25.0 153.2 -25.4 156.7 -26.3 159.3 -23.35 161.2 -21.15 161.2 -20.05 161.2 -17.95 159.9 -16.6 M175.2 -3.6 Q174.7 -3.3 174.2 -3.3 172.9 -3.3 172.5 -4.4 L172.4 -5.3 Q172.4 -7.1 174.15 -6.9 175.9 -6.7 175.9 -4.8 175.9 -4.0 175.2 -3.6 M227.9 -25.0 L228.65 -23.5 229.0 -22.0 Q229.0 -19.7 225.0 -18.3 221.1 -17.0 214.8 -17.0 212.65 -17.0 211.8 -17.8 211.4 -18.2 211.4 -18.7 211.4 -19.4 211.55 -19.65 L212.3 -20.1 214.25 -20.1 Q216.6 -20.15 219.7 -20.9 221.1 -21.2 222.05 -22.4 L223.0 -23.9 220.4 -26.0 Q220.25 -26.3 220.35 -26.9 L220.5 -28.1 Q220.5 -28.65 220.05 -28.9 L219.5 -29.4 Q223.6 -31.45 224.8 -31.25 226.05 -31.1 227.7 -28.3 L227.5 -26.8 Q227.4 -25.7 227.9 -25.0 M248.1 13.9 Q247.2 14.8 245.8 14.8 243.9 14.8 243.1 13.75 242.7 13.15 242.7 12.55 242.7 10.85 245.8 10.6 248.9 10.4 248.9 12.4 248.9 13.15 248.1 13.9 M130.2 27.2 Q128.0 27.2 126.6 25.7 125.6 24.65 125.6 23.9 125.6 21.3 129.4 21.25 133.2 21.2 133.2 24.8 133.2 27.2 130.2 27.2 M107.4 34.2 Q107.0 34.6 106.4 34.6 104.2 34.6 104.2 32.4 104.2 30.85 106.0 31.15 107.8 31.45 107.8 33.15 107.8 33.8 107.4 34.2" fill="#5a1403" fill-rule="evenodd" stroke="none"/>
  </g>
</svg>
