<?xml version="1.0" encoding="UTF-8" standalone="no"?>
<svg xmlns:xlink="http://www.w3.org/1999/xlink" height="160.2px" width="218.05px" xmlns="http://www.w3.org/2000/svg">
  <g transform="matrix(1.0, 0.0, 0.0, 1.0, 109.0, 80.1)">
    <path d="M68.25 -45.8 L59.75 -45.4 58.2 -78.0 101.85 -80.1 109.05 69.95 -101.8 80.1 -109.0 -69.95 49.7 -77.6 51.3 -45.0 -67.45 -39.25 -64.4 25.55 -30.15 37.45 -30.2 36.55 Q-30.5 31.0 -28.75 25.65 -27.5 21.75 -25.65 18.05 -23.8 14.2 -20.6 11.2 L-20.2 13.05 Q-18.7 18.6 -13.35 19.9 -6.75 21.6 -0.5 19.1 3.7 17.45 7.55 15.4 L8.3 14.95 Q9.4 14.35 10.45 13.9 L11.15 13.5 13.25 13.95 13.7 14.1 14.15 14.3 14.75 14.55 14.8 14.55 15.15 18.25 Q15.75 23.95 15.75 26.15 15.75 29.5 15.1 34.6 L14.45 39.75 62.1 39.75 62.1 10.35 70.95 9.9 68.25 -45.8" fill="#000000" fill-rule="evenodd" stroke="none"/>
  </g>
</svg>
