<?xml version="1.0" encoding="UTF-8" standalone="no"?>
<svg xmlns:xlink="http://www.w3.org/1999/xlink" height="27.35px" width="34.9px" xmlns="http://www.w3.org/2000/svg">
  <g transform="matrix(1.0, 0.0, 0.0, 1.0, 17.45, 13.65)">
    <path d="M8.6 -13.0 L12.2 -12.35 13.75 -11.9 13.65 -11.95 14.05 -11.85 14.2 -11.85 16.65 -10.6 16.85 -10.4 Q17.65 -9.75 17.4 -8.9 L17.3 -8.45 17.05 -7.05 Q16.9 -6.35 16.35 -5.9 L16.35 -6.45 16.35 -6.2 13.6 8.6 14.0 8.65 14.3 8.85 14.55 9.15 14.65 9.85 14.4 11.0 Q14.35 11.65 13.55 12.05 L13.5 12.1 13.35 12.2 12.75 12.4 12.6 12.5 12.45 12.55 11.75 12.75 11.7 12.75 10.35 13.05 10.25 13.05 10.2 13.05 9.2 13.2 9.25 13.2 7.5 13.45 7.05 13.5 4.5 13.6 4.4 13.6 3.05 13.7 2.9 13.7 2.2 13.65 1.8 13.65 1.2 13.65 -0.35 13.6 -0.45 13.6 -1.0 13.6 -1.35 13.6 -2.9 13.5 -3.0 13.5 -3.9 13.45 -5.05 13.45 -5.25 13.45 -5.8 13.35 -6.45 13.3 -7.0 13.2 -9.0 12.95 -9.75 12.9 -10.2 12.75 -10.55 12.7 -10.5 12.7 -11.45 12.5 -11.4 12.5 -11.9 12.4 -11.95 12.35 -12.55 12.15 -12.7 12.1 -12.8 12.05 -13.2 11.9 -13.35 11.75 -13.55 11.7 -14.0 11.55 -14.2 11.45 -14.8 10.7 -14.9 10.3 -14.95 9.3 -15.0 8.95 -15.0 8.8 -14.9 8.35 -14.85 8.3 -14.6 7.85 -14.2 7.6 -14.65 5.0 -14.65 4.6 -16.3 -6.2 -16.4 -6.25 -16.55 -6.35 -17.15 -7.05 -17.2 -7.2 -17.35 -7.65 -17.4 -9.25 -17.4 -9.4 -17.4 -9.95 -17.2 -10.55 -16.85 -10.9 -16.65 -11.1 Q-16.05 -11.7 -14.55 -12.15 L-11.9 -12.8 -11.8 -12.85 -10.9 -12.95 -10.95 -12.9 -7.0 -13.35 -6.6 -13.45 -4.8 -13.55 -4.75 -13.55 0.15 -13.65 0.5 -13.65 0.55 -13.65 8.6 -13.0 M12.2 12.1 L12.05 12.0 12.5 12.3 12.2 12.1 M-13.65 7.35 L-14.0 7.55 -13.9 7.55 -13.8 7.55 -13.65 7.35" fill="#ffffff" fill-rule="evenodd" stroke="none"/>
  </g>
</svg>
