<?xml version="1.0" encoding="UTF-8" standalone="no"?>
<svg xmlns:xlink="http://www.w3.org/1999/xlink" height="13.75px" width="13.45px" xmlns="http://www.w3.org/2000/svg">
  <g transform="matrix(1.0, 0.0, 0.0, 1.0, 0.0, 0.0)">
    <path d="M7.05 3.65 L9.75 2.25 9.8 2.2 10.35 1.9 10.6 1.85 10.8 1.8 12.65 0.55 13.45 0.0 12.0 6.4 12.0 6.5 12.0 6.65 12.05 6.85 12.0 7.0 12.0 7.1 12.0 7.2 13.45 13.75 13.3 13.7 13.3 13.65 13.1 13.6 12.8 13.35 12.7 13.25 12.65 13.2 Q11.2 12.2 9.8 11.45 L9.7 11.4 9.65 11.4 9.6 11.4 7.25 10.0 7.15 9.95 7.1 9.95 7.0 9.9 6.8 9.8 5.7 9.3 5.65 9.3 5.65 9.25 5.5 9.15 3.65 8.4 0.75 7.1 0.6 7.05 0.1 6.9 0.0 6.85 0.35 6.75 0.45 6.7 0.5 6.65 0.65 6.65 0.7 6.6 3.4 5.4 3.6 5.35 6.8 3.85 7.05 3.65" fill="#24d2fd" fill-rule="evenodd" stroke="none"/>
  </g>
</svg>
