<?xml version="1.0" encoding="UTF-8" standalone="no"?>
<svg xmlns:xlink="http://www.w3.org/1999/xlink" height="47.25px" width="70.95px" xmlns="http://www.w3.org/2000/svg">
  <g transform="matrix(1.0, 0.0, 0.0, 1.0, 59.65, 81.5)">
    <path d="M-21.6 -55.45 L-21.95 -55.6 -22.4 -55.85 -23.65 -56.35 -24.15 -56.5 -19.85 -59.85 -18.75 -60.75 -18.0 -61.3 -22.6 -56.75 -19.6 -56.55 -18.5 -56.45 -21.35 -55.5 -21.6 -55.45" fill="#a36a6a" fill-rule="evenodd" stroke="none"/>
    <path d="M2.3 -80.4 L2.65 -80.5 4.8 -75.9 5.3 -74.65 7.7 -66.6 Q8.8 -62.35 9.0 -56.85 L9.05 -56.35 Q8.95 -56.1 9.0 -55.7 L8.25 -52.9 7.85 -51.2 Q7.3 -49.35 7.3 -48.75 L6.65 -46.65 6.55 -46.45 6.35 -49.05 6.75 -51.65 6.75 -52.05 Q6.95 -54.85 6.75 -58.25 6.5 -64.9 4.95 -70.85 L2.3 -80.4 M8.15 -38.55 Q5.9 -36.85 3.55 -35.75 L3.45 -37.0 Q3.4 -38.1 4.0 -38.7 L5.1 -40.6 5.3 -41.0 5.9 -42.7 6.85 -43.75 6.95 -43.9 Q7.1 -42.55 7.4 -41.3 7.65 -39.95 8.15 -38.55 M-1.25 -34.55 L-2.2 -34.25 -2.7 -38.2 -2.7 -38.4 -3.45 -38.2 -3.6 -38.2 -3.45 -38.15 -3.3 -34.65 -5.2 -34.3 Q-6.7 -34.45 -8.05 -34.95 L-7.95 -35.85 -7.6 -37.45 -7.5 -37.75 -8.45 -37.8 -8.7 -37.8 -9.4 -37.9 -9.5 -37.95 Q-12.75 -38.85 -15.05 -42.95 -12.3 -40.25 -9.7 -39.25 -7.45 -38.5 -3.35 -38.45 L-3.15 -38.45 -2.55 -38.45 -2.35 -38.45 -1.9 -38.55 0.3 -39.1 0.85 -39.3 1.25 -39.5 1.4 -39.4 1.5 -39.35 -1.15 -38.5 -1.9 -38.45 -1.25 -34.55 M-19.1 -53.35 L-19.4 -53.6 -19.9 -54.2 -19.95 -54.25 -15.85 -57.55 -15.45 -57.85 -13.45 -59.35 -16.85 -58.4 -17.35 -58.25 -20.95 -57.4 -20.95 -57.45 Q-19.85 -58.0 -18.05 -59.9 L-15.8 -62.6 -17.85 -61.35 -18.0 -61.3 -18.75 -60.75 -19.85 -59.85 -24.15 -56.5 -25.45 -55.4 -29.05 -51.95 -29.5 -51.5 -31.8 -48.8 -32.55 -47.95 -29.7 -52.7 -29.7 -52.75 Q-28.3 -55.2 -24.45 -57.95 -25.05 -58.05 -28.2 -56.65 L-24.8 -59.9 -24.05 -60.6 -23.2 -61.5 -21.9 -62.3 -19.0 -63.9 -18.6 -64.2 -16.45 -65.35 -14.0 -66.45 -13.85 -66.3 -15.8 -64.8 -17.55 -62.95 -15.45 -64.35 -11.0 -67.05 -13.7 -63.1 -14.4 -62.2 -16.65 -58.95 -14.65 -60.65 -8.9 -66.0 Q-6.5 -68.5 -5.05 -70.45 L-5.05 -70.5 -4.15 -71.75 -4.0 -71.3 -1.9 -65.6 -1.85 -65.55 -1.85 -65.6 Q-2.55 -68.4 -2.9 -72.05 L-3.15 -74.95 -1.8 -72.8 Q-0.05 -69.6 1.1 -66.1 L2.2 -61.6 2.4 -59.7 2.7 -58.1 2.8 -57.0 3.0 -58.45 3.25 -62.9 Q2.9 -69.05 2.45 -71.0 L4.6 -63.3 6.25 -54.95 Q5.5 -56.65 4.7 -59.2 4.8 -57.9 4.05 -53.7 L4.0 -53.5 3.95 -53.2 3.8 -52.6 Q3.1 -49.85 2.75 -47.65 L2.05 -44.6 2.25 -47.75 2.3 -49.45 2.7 -54.4 2.7 -54.5 2.7 -54.4 2.3 -49.45 1.45 -55.0 0.95 -57.45 0.9 -57.85 0.8 -57.85 -0.2 -60.2 Q-0.9 -60.65 -1.75 -62.05 L-2.9 -63.95 Q-4.8 -67.35 -4.45 -68.45 L-4.55 -68.7 Q-5.65 -67.55 -8.95 -62.2 L-12.4 -56.75 -12.45 -56.75 -12.5 -56.7 -12.75 -56.35 -12.75 -56.25 -12.75 -56.2 -12.5 -54.9 -11.65 -52.1 -10.5 -47.45 -12.75 -50.85 -14.55 -53.9 -14.7 -54.2 -15.75 -56.6 -15.95 -54.0 -15.95 -53.95 Q-16.0 -50.65 -15.15 -47.5 L-14.2 -44.55 Q-13.6 -43.15 -12.55 -41.9 L-12.85 -41.9 Q-14.0 -42.75 -14.8 -44.35 L-16.25 -47.9 Q-16.85 -49.6 -17.65 -53.7 L-17.85 -54.6 -19.1 -53.35 M-36.2 -42.45 L-39.1 -40.55 -40.35 -39.95 -40.35 -40.05 -41.9 -39.45 -41.9 -39.3 -42.8 -39.2 -42.85 -39.2 -43.1 -39.35 -43.1 -39.25 -42.85 -39.2 -43.2 -37.7 -43.2 -36.95 -43.2 -35.55 -43.55 -35.35 -44.2 -35.1 -44.7 -35.0 -44.3 -38.75 -45.6 -38.9 -45.6 -39.2 -46.1 -39.2 -46.35 -39.2 -46.4 -39.0 -47.25 -39.2 -51.8 -40.8 -51.85 -40.85 -53.75 -37.7 -53.75 -37.6 -54.0 -37.75 -54.6 -38.15 -56.4 -39.8 -55.35 -41.8 -55.8 -42.75 -56.45 -43.75 -57.1 -44.9 -57.4 -45.4 -57.2 -45.65 -57.3 -46.0 -57.6 -48.05 -57.55 -48.05 Q-56.2 -45.8 -54.4 -44.15 -50.8 -40.7 -45.75 -39.85 L-45.0 -39.8 -43.4 -40.05 Q-40.75 -40.8 -36.25 -42.5 L-36.2 -42.45 M-59.3 -59.85 L-58.55 -61.75 -57.7 -64.0 -57.7 -64.1 -57.6 -64.25 -57.6 -64.3 -54.85 -70.05 -55.4 -66.5 Q-56.0 -61.7 -55.55 -57.0 L-55.35 -55.2 -55.05 -53.5 Q-54.55 -49.6 -53.25 -46.95 -54.05 -49.65 -54.35 -53.45 L-54.4 -54.85 -54.5 -57.85 -54.3 -61.75 -54.25 -62.05 Q-51.35 -70.35 -48.75 -74.05 -48.6 -71.15 -46.85 -66.85 L-45.85 -64.55 Q-43.85 -60.45 -41.45 -58.9 -43.25 -61.3 -44.35 -65.55 L-44.5 -66.3 Q-45.25 -69.85 -45.3 -72.5 L-45.3 -72.55 Q-45.0 -70.45 -42.95 -67.15 L-42.65 -66.65 Q-40.2 -62.9 -36.45 -60.4 L-37.75 -62.6 -39.0 -65.45 -38.45 -65.25 -35.85 -64.8 Q-33.05 -64.85 -29.85 -65.85 -27.7 -66.6 -25.2 -67.75 L-26.6 -66.4 -29.5 -63.2 -30.1 -62.4 -31.65 -60.4 -35.75 -55.95 -40.05 -51.8 -40.25 -51.65 -42.8 -50.1 -43.0 -49.95 -45.4 -48.9 Q-46.9 -48.4 -47.95 -48.4 L-48.8 -48.65 Q-47.6 -48.85 -46.15 -49.45 -44.25 -50.5 -41.9 -52.35 L-36.0 -58.3 -40.45 -61.95 Q-42.45 -63.85 -43.05 -65.15 L-41.4 -60.05 -40.0 -55.65 Q-43.75 -57.75 -46.45 -61.45 L-47.65 -63.2 Q-49.1 -65.45 -49.55 -67.45 -50.7 -66.5 -53.1 -62.55 L-53.15 -62.45 -53.2 -62.25 -53.15 -62.3 -53.75 -59.5 -53.85 -58.5 -53.9 -58.3 Q-54.25 -55.8 -54.05 -53.4 L-53.85 -51.8 Q-53.6 -49.2 -52.45 -45.75 L-52.2 -44.75 -52.25 -44.7 -52.85 -45.45 -53.05 -45.85 Q-55.3 -48.75 -56.35 -53.25 L-56.35 -53.4 Q-56.8 -54.7 -56.85 -55.85 -57.7 -60.1 -57.1 -64.3 L-58.55 -61.3 -59.3 -59.85 M2.8 -56.9 L2.8 -57.0 2.8 -56.9 Q2.35 -54.85 2.7 -54.5 2.65 -55.5 2.85 -56.35 2.75 -56.65 2.8 -56.9 M0.1 -61.2 L0.9 -57.85 0.1 -61.2 M8.4 -45.25 L8.3 -45.35 8.35 -45.4 8.4 -45.25 M-26.95 -61.45 L-24.7 -62.75 -24.25 -63.05 -20.7 -64.95 -24.2 -61.7 -27.4 -58.6 -30.15 -55.35 -31.55 -53.5 -34.2 -51.15 -37.15 -48.4 -37.75 -48.2 -40.35 -47.2 Q-38.0 -48.4 -35.2 -50.85 -31.4 -54.4 -30.35 -57.4 -31.15 -57.4 -33.0 -56.35 L-34.3 -55.7 -36.35 -54.5 -29.05 -59.9 -27.05 -61.35 -26.95 -61.45" fill="#c29c9c" fill-rule="evenodd" stroke="none"/>
    <path d="M3.55 -35.75 L-0.4 -34.65 -1.25 -34.55 -1.9 -38.45 -1.15 -38.5 1.5 -39.35 2.05 -39.05 2.75 -38.75 3.7 -39.4 4.3 -40.35 4.4 -40.75 4.4 -40.8 5.9 -42.7 5.3 -41.0 5.1 -40.6 4.0 -38.7 Q3.4 -38.1 3.45 -37.0 L3.55 -35.75 M-19.95 -54.25 L-21.6 -55.45 -21.35 -55.5 -18.5 -56.45 -19.6 -56.55 -22.6 -56.75 -18.0 -61.3 -17.85 -61.35 -15.8 -62.6 -18.05 -59.9 Q-19.85 -58.0 -20.95 -57.45 L-20.95 -57.4 -17.35 -58.25 -16.85 -58.4 -13.45 -59.35 -15.45 -57.85 -15.85 -57.55 -19.95 -54.25 M-29.05 -51.95 L-29.4 -50.8 Q-30.6 -47.15 -33.4 -44.95 L-35.1 -43.9 -34.4 -45.1 -34.35 -45.2 -32.6 -47.8 -32.55 -47.9 -32.55 -47.95 -31.8 -48.8 -29.5 -51.5 -29.05 -51.95 M-44.7 -35.0 L-44.75 -34.95 -45.95 -34.85 -45.6 -38.9 -44.3 -38.75 -44.7 -35.0 M-46.4 -39.0 L-46.9 -37.95 Q-47.55 -36.9 -47.85 -35.65 -49.7 -35.9 -51.35 -36.5 -52.7 -36.95 -53.75 -37.6 L-53.75 -37.7 -51.85 -40.85 -51.8 -40.8 -47.25 -39.2 -46.4 -39.0 M-57.6 -64.3 L-56.25 -67.7 -54.85 -71.15 Q-53.4 -74.65 -51.3 -77.4 L-48.15 -81.5 -45.05 -80.05 -42.1 -78.6 -38.95 -77.15 -35.5 -75.45 -33.2 -74.5 -30.95 -74.15 Q-24.5 -73.7 -17.8 -74.5 -11.3 -75.35 -5.0 -77.75 L-1.45 -78.9 2.3 -80.4 4.95 -70.85 Q6.5 -64.9 6.75 -58.25 6.95 -54.85 6.75 -52.05 L6.75 -51.65 6.35 -49.05 6.4 -53.75 6.25 -54.5 6.25 -54.95 4.6 -63.3 2.45 -71.0 Q2.9 -69.05 3.25 -62.9 L3.0 -58.45 2.8 -57.0 2.7 -58.1 2.4 -59.7 2.2 -61.6 1.1 -66.1 Q-0.05 -69.6 -1.8 -72.8 L-3.15 -74.95 -2.9 -72.05 Q-2.55 -68.4 -1.85 -65.6 L-1.9 -65.6 -4.0 -71.3 -4.15 -71.75 -5.05 -70.5 -5.05 -70.45 Q-6.5 -68.5 -8.9 -66.0 L-14.65 -60.65 -16.65 -58.95 -14.4 -62.2 -13.7 -63.1 -11.0 -67.05 -15.45 -64.35 -17.55 -62.95 -15.8 -64.8 -13.85 -66.3 -14.0 -66.45 -16.45 -65.35 -18.6 -64.2 -19.0 -63.9 -21.9 -62.3 -23.2 -61.5 -24.05 -60.6 -24.8 -59.9 -28.2 -56.65 -28.6 -56.3 -30.05 -54.9 -31.55 -53.5 -30.15 -55.35 -27.4 -58.6 -24.2 -61.7 -20.7 -64.95 -24.25 -63.05 -24.7 -62.75 -26.95 -61.45 -27.05 -61.35 -29.05 -59.9 -36.35 -54.5 -38.85 -52.7 -40.05 -51.8 -35.75 -55.95 -31.65 -60.4 -30.1 -62.4 -29.5 -63.2 -26.6 -66.4 -25.2 -67.75 Q-27.7 -66.6 -29.85 -65.85 -33.05 -64.85 -35.85 -64.8 L-38.45 -65.25 -39.0 -65.45 -37.75 -62.6 -36.45 -60.4 Q-40.2 -62.9 -42.65 -66.65 L-42.95 -67.15 Q-45.0 -70.45 -45.3 -72.55 L-45.3 -72.5 Q-45.25 -69.85 -44.5 -66.3 L-44.35 -65.55 Q-43.25 -61.3 -41.45 -58.9 -43.85 -60.45 -45.85 -64.55 L-46.85 -66.85 Q-48.6 -71.15 -48.75 -74.05 -51.35 -70.35 -54.25 -62.05 L-54.3 -61.75 -54.5 -57.85 -54.4 -54.85 -54.35 -53.45 Q-54.05 -49.65 -53.25 -46.95 -54.55 -49.6 -55.05 -53.5 L-55.35 -55.2 -55.55 -57.0 Q-56.0 -61.7 -55.4 -66.5 L-54.85 -70.05 -57.6 -64.3 M6.75 -58.25 L6.25 -62.0 5.75 -63.9 6.25 -62.0 6.75 -58.25 M-20.7 -66.05 L-26.95 -61.45 -20.7 -66.05 M-52.1 -71.8 Q-53.75 -67.45 -54.25 -62.05 -53.75 -67.45 -52.1 -71.8" fill="#b38484" fill-rule="evenodd" stroke="none"/>
    <path d="M5.3 -74.65 L6.6 -71.65 8.2 -67.7 10.1 -62.5 Q10.85 -59.75 11.25 -56.75 L11.3 -55.95 Q11.4 -53.3 10.5 -50.7 L10.05 -49.45 8.95 -46.75 8.75 -46.1 8.65 -45.9 8.55 -45.65 8.4 -45.25 9.45 -39.8 8.15 -38.55 Q7.65 -39.95 7.4 -41.3 7.1 -42.55 6.95 -43.9 L6.85 -43.75 5.9 -42.7 4.4 -40.8 4.4 -40.75 4.3 -40.35 3.7 -39.4 2.75 -38.75 2.05 -39.05 1.5 -39.35 1.4 -39.4 1.25 -39.5 0.85 -39.3 0.3 -39.1 -1.9 -38.55 -2.35 -38.45 -2.55 -38.45 -3.15 -38.45 -3.35 -38.45 Q-7.45 -38.5 -9.7 -39.25 -12.3 -40.25 -15.05 -42.95 L-15.7 -44.15 -16.1 -45.1 Q-17.3 -47.95 -18.6 -52.85 L-19.1 -53.35 -17.85 -54.6 -17.65 -53.7 Q-16.85 -49.6 -16.25 -47.9 L-14.8 -44.35 Q-14.0 -42.75 -12.85 -41.9 L-12.55 -41.9 Q-13.6 -43.15 -14.2 -44.55 L-15.15 -47.5 Q-16.0 -50.65 -15.95 -53.95 L-15.95 -54.0 -15.75 -56.6 -14.7 -54.2 -14.55 -53.9 -12.75 -50.85 -10.5 -47.45 -11.65 -52.1 -12.5 -54.9 -12.75 -56.2 -12.75 -56.25 -12.7 -56.3 -12.5 -56.7 -12.45 -56.75 -12.4 -56.75 -8.95 -62.2 Q-5.65 -67.55 -4.55 -68.7 L-4.45 -68.45 Q-4.8 -67.35 -2.9 -63.95 L-1.75 -62.05 Q-0.9 -60.65 -0.2 -60.2 L0.8 -57.85 0.95 -57.45 1.45 -55.0 2.3 -49.45 2.25 -47.75 2.05 -44.6 2.75 -47.65 Q3.1 -49.85 3.8 -52.6 L3.95 -53.2 4.0 -53.5 4.05 -53.7 Q4.8 -57.9 4.7 -59.2 5.5 -56.65 6.25 -54.95 L6.25 -54.5 6.4 -53.75 6.35 -49.05 5.75 -46.9 3.8 -41.6 5.9 -44.9 6.3 -45.8 Q6.35 -46.2 6.55 -46.45 L6.65 -46.65 7.3 -48.75 Q7.3 -49.35 7.85 -51.2 L8.25 -52.9 9.0 -55.7 Q8.95 -56.1 9.05 -56.35 L9.0 -56.85 Q8.8 -62.35 7.7 -66.6 L5.3 -74.65 M-2.7 -38.2 L-3.45 -38.15 -3.6 -38.2 -3.45 -38.2 -2.7 -38.4 -2.7 -38.2 M-8.05 -34.95 L-8.3 -35.05 -9.7 -35.85 -9.5 -37.95 -9.4 -37.9 -8.7 -37.8 -8.45 -37.8 -7.5 -37.75 -7.6 -37.45 -7.95 -35.85 -8.05 -34.95 M-35.1 -43.9 L-35.4 -43.3 -36.0 -42.65 -36.2 -42.45 -36.25 -42.5 Q-40.75 -40.8 -43.4 -40.05 L-45.0 -39.8 -45.75 -39.85 Q-50.8 -40.7 -54.4 -44.15 -56.2 -45.8 -57.55 -48.05 L-57.6 -48.05 -57.6 -48.2 -57.95 -50.25 -58.05 -51.0 -58.2 -53.0 -58.35 -55.75 -58.55 -61.3 -57.1 -64.3 Q-57.7 -60.1 -56.85 -55.85 -56.8 -54.7 -56.35 -53.4 L-56.35 -53.25 Q-55.3 -48.75 -53.05 -45.85 L-52.85 -45.45 -52.25 -44.7 -52.2 -44.7 -52.2 -44.75 -52.45 -45.75 Q-53.6 -49.2 -53.85 -51.8 L-54.05 -53.4 Q-54.25 -55.8 -53.9 -58.3 L-53.85 -58.5 -53.75 -59.5 -53.15 -62.3 -53.05 -62.3 -53.15 -62.35 -53.15 -62.45 -53.1 -62.55 Q-50.7 -66.5 -49.55 -67.45 -49.1 -65.45 -47.65 -63.2 L-46.45 -61.45 Q-43.75 -57.75 -40.0 -55.65 L-41.4 -60.05 -43.05 -65.15 Q-42.45 -63.85 -40.45 -61.95 L-36.0 -58.3 -41.9 -52.35 Q-44.25 -50.5 -46.15 -49.45 -47.6 -48.85 -48.8 -48.65 L-47.95 -48.4 Q-46.9 -48.4 -45.4 -48.9 L-43.0 -49.95 -42.8 -50.1 -40.65 -51.35 -40.25 -51.65 -40.05 -51.8 -38.85 -52.7 -36.35 -54.5 -34.3 -55.7 -33.0 -56.35 Q-31.15 -57.4 -30.35 -57.4 -31.4 -54.4 -35.2 -50.85 -38.0 -48.4 -40.35 -47.2 L-37.75 -48.2 -37.15 -48.4 -34.2 -51.15 -31.55 -53.5 -30.05 -54.9 -28.6 -56.3 -28.2 -56.65 Q-25.05 -58.05 -24.45 -57.95 -28.3 -55.2 -29.7 -52.75 L-29.7 -52.7 -32.55 -47.95 -32.55 -47.9 -32.6 -47.8 -34.35 -45.2 -34.4 -45.1 -35.1 -43.9 M-41.9 -39.3 L-41.6 -36.25 -42.4 -35.85 -43.2 -35.55 -43.2 -36.95 -43.2 -37.7 -42.85 -39.2 -42.8 -39.2 -41.9 -39.3 M-56.4 -39.8 L-56.95 -40.4 -57.7 -41.3 -58.5 -42.45 -57.4 -45.4 -57.1 -44.9 -56.45 -43.75 -55.8 -42.75 -55.35 -41.8 -56.4 -39.8 M-10.5 -47.45 L-10.45 -47.25 -10.3 -47.25 -10.5 -47.45 M4.1 -52.45 L3.5 -49.2 3.2 -47.55 2.35 -43.8 2.45 -42.85 Q3.45 -43.55 4.25 -46.25 L4.45 -47.25 4.9 -50.2 Q4.8 -51.15 4.1 -52.45 M8.4 -45.25 L8.35 -45.4 8.3 -45.35 8.4 -45.25 M0.8 -48.15 L0.8 -48.45 Q0.65 -50.65 -0.9 -55.85 L-2.85 -62.4 -3.05 -62.4 Q-2.9 -61.95 -4.05 -58.65 L-4.65 -56.55 -6.0 -59.55 Q-7.1 -61.5 -7.3 -61.45 -7.7 -61.5 -9.25 -58.65 L-10.35 -56.7 Q-10.2 -54.25 -8.3 -50.25 L-7.4 -48.3 Q-5.25 -44.1 -2.2 -41.6 L-1.35 -48.6 -1.15 -50.25 Q-0.85 -49.8 -0.45 -48.4 L-0.05 -45.95 0.3 -41.4 0.35 -41.35 0.7 -44.25 0.8 -48.15 M-37.85 -51.15 L-37.9 -51.25 Q-38.85 -50.65 -44.7 -48.35 L-48.8 -46.7 -44.05 -47.25 -43.5 -47.35 Q-40.55 -48.15 -37.85 -51.15 M-51.0 -51.7 Q-50.6 -53.25 -49.55 -53.8 -48.55 -54.65 -46.6 -54.35 L-48.75 -59.1 Q-50.7 -63.55 -50.7 -65.75 -51.8 -64.65 -53.25 -60.8 -53.75 -57.0 -53.0 -53.05 L-52.85 -52.25 Q-52.25 -48.5 -50.75 -45.5 L-51.0 -47.85 -51.15 -50.6 -51.0 -51.7 M-47.0 -44.25 L-46.3 -44.0 Q-45.2 -43.6 -43.6 -43.55 -41.45 -43.65 -39.25 -44.7 -37.65 -45.65 -36.8 -46.75 L-42.2 -45.35 -47.0 -44.25 M-11.65 -48.65 Q-13.4 -52.3 -14.6 -53.3 -14.85 -51.05 -12.7 -47.7 L-11.4 -45.85 -9.4 -42.75 Q-9.9 -44.55 -10.7 -46.35 L-11.65 -48.65" fill="#d2b6b6" fill-rule="evenodd" stroke="none"/>
    <path d="M-58.05 -51.0 L-58.4 -52.95 -59.0 -56.15 -59.65 -58.85 -59.3 -59.85 -58.55 -61.3 -58.35 -55.75 -58.2 -53.0 -58.05 -51.0 M4.1 -52.45 Q4.8 -51.15 4.9 -50.2 L4.45 -47.25 4.25 -46.25 Q3.45 -43.55 2.45 -42.85 L2.35 -43.8 3.2 -47.55 3.5 -49.2 4.1 -52.45 M0.8 -48.15 L0.7 -44.25 0.35 -41.35 0.3 -41.4 -0.05 -45.95 -0.45 -48.4 Q-0.85 -49.8 -1.15 -50.25 L-1.35 -48.6 -2.2 -41.6 Q-5.25 -44.1 -7.4 -48.3 L-8.3 -50.25 Q-10.2 -54.25 -10.35 -56.7 L-9.25 -58.65 Q-7.7 -61.5 -7.3 -61.45 -7.1 -61.5 -6.0 -59.55 L-4.65 -56.55 -4.05 -58.65 Q-2.9 -61.95 -3.05 -62.4 L-2.85 -62.4 -0.9 -55.85 Q0.65 -50.65 0.8 -48.45 L0.8 -48.15 M-37.85 -51.15 Q-40.55 -48.15 -43.5 -47.35 L-44.05 -47.25 -48.8 -46.7 -44.7 -48.35 Q-38.85 -50.65 -37.9 -51.25 L-37.85 -51.15 M-51.0 -51.7 L-51.15 -50.6 -51.0 -47.85 -50.75 -45.5 Q-52.25 -48.5 -52.85 -52.25 L-53.0 -53.05 Q-53.75 -57.0 -53.25 -60.8 -51.8 -64.65 -50.7 -65.75 -50.7 -63.55 -48.75 -59.1 L-46.6 -54.35 Q-48.55 -54.65 -49.55 -53.8 -50.6 -53.25 -51.0 -51.7 M-47.0 -44.25 L-42.2 -45.35 -36.8 -46.75 Q-37.65 -45.65 -39.25 -44.7 -41.45 -43.65 -43.6 -43.55 -45.2 -43.6 -46.3 -44.0 L-47.0 -44.25 M-11.65 -48.65 L-10.7 -46.35 Q-9.9 -44.55 -9.4 -42.75 L-11.4 -45.85 -12.7 -47.7 Q-14.85 -51.05 -14.6 -53.3 -13.4 -52.3 -11.65 -48.65" fill="#e0cdcd" fill-rule="evenodd" stroke="none"/>
    <path d="M6.35 -49.05 L6.55 -46.45 Q6.35 -46.2 6.3 -45.8 L5.9 -44.9 3.8 -41.6 5.75 -46.9 6.35 -49.05 M2.8 -56.9 Q2.75 -56.65 2.85 -56.35 2.65 -55.5 2.7 -54.5 2.35 -54.85 2.8 -56.9 M-1.85 -65.6 L-1.85 -65.55 -1.9 -65.6 -1.85 -65.6 M0.95 -57.45 L0.8 -57.85 0.9 -57.85 0.95 -57.45 M-12.5 -56.7 L-12.7 -56.3 -12.75 -56.25 -12.75 -56.35 -12.5 -56.7 M-10.5 -47.45 L-10.3 -47.25 -10.45 -47.25 -10.5 -47.45 M-40.25 -51.65 L-40.65 -51.35 -42.8 -50.1 -40.25 -51.65 M-53.15 -62.45 L-53.15 -62.35 -53.05 -62.3 -53.15 -62.3 -53.2 -62.25 -53.15 -62.45 M-52.2 -44.75 L-52.2 -44.7 -52.25 -44.7 -52.2 -44.75 M-42.85 -39.2 L-43.1 -39.25 -43.1 -39.35 -42.85 -39.2" fill="url(#gradient0)" fill-rule="evenodd" stroke="none"/>
    <path d="M-57.7 -64.1 L-57.6 -64.3 -57.6 -64.25 -57.7 -64.1" fill="#aa7676" fill-rule="evenodd" stroke="none"/>
    <path d="M2.3 -80.4 L2.65 -80.5 4.8 -75.9 5.3 -74.65 6.6 -71.65 8.2 -67.7 10.1 -62.5 Q10.85 -59.75 11.25 -56.75 L11.3 -55.95 Q11.4 -53.3 10.5 -50.7 L10.05 -49.45 8.95 -46.75 8.75 -46.1 8.65 -45.9 8.55 -45.65 8.4 -45.25 9.45 -39.8 8.15 -38.55 Q5.9 -36.85 3.55 -35.75 L-0.4 -34.65 -1.25 -34.55 -2.2 -34.25 -2.7 -38.2 -3.45 -38.15 -3.3 -34.65 -5.2 -34.3 Q-6.7 -34.45 -8.05 -34.95 L-8.3 -35.05 -9.7 -35.85 -9.5 -37.95 Q-12.75 -38.85 -15.05 -42.95 L-15.7 -44.15 -16.1 -45.1 Q-17.3 -47.95 -18.6 -52.85 L-19.1 -53.35 -19.4 -53.6 -19.9 -54.2 -19.95 -54.25 -21.6 -55.45 -21.95 -55.6 -22.4 -55.85 -23.65 -56.35 -24.15 -56.5 -25.45 -55.4 -29.05 -51.95 -29.4 -50.8 Q-30.6 -47.15 -33.4 -44.95 L-35.1 -43.9 -35.4 -43.3 -36.0 -42.65 -36.2 -42.45 -39.1 -40.55 -40.35 -39.95 -40.35 -40.05 -41.9 -39.45 M-41.9 -39.3 L-41.6 -36.25 -42.4 -35.85 -43.2 -35.55 -43.55 -35.35 -44.2 -35.1 -44.7 -35.0 -44.75 -34.95 -45.95 -34.85 -45.6 -38.9 -45.6 -39.2 -46.1 -39.2 -46.35 -39.2 -46.4 -39.0 -46.9 -37.95 Q-47.55 -36.9 -47.85 -35.65 -49.7 -35.9 -51.35 -36.5 -52.7 -36.95 -53.75 -37.6 L-54.0 -37.75 -54.6 -38.15 -56.4 -39.8 -56.95 -40.4 -57.7 -41.3 -58.5 -42.45 -57.4 -45.4 -57.2 -45.65 -57.3 -46.0 -57.6 -48.05 -57.6 -48.2 -57.95 -50.25 -58.05 -51.0 -58.4 -52.95 -59.0 -56.15 -59.65 -58.85 -59.3 -59.85 -58.55 -61.75 -57.7 -64.0 -57.7 -64.1 -57.6 -64.25 -57.6 -64.3 -56.25 -67.7 -54.85 -71.15 Q-53.4 -74.65 -51.3 -77.4 L-48.15 -81.5 -45.05 -80.05 -42.1 -78.6 -38.95 -77.15 -35.5 -75.45 -33.2 -74.5 -30.95 -74.15 Q-24.5 -73.7 -17.8 -74.5 -11.3 -75.35 -5.0 -77.75 L-1.45 -78.9 2.3 -80.4 M6.75 -58.25 Q6.95 -54.85 6.75 -52.05 L6.75 -51.65 6.35 -49.05 5.75 -46.9 3.8 -41.6 M5.75 -63.9 L6.25 -62.0 6.75 -58.25 M2.8 -57.0 L2.8 -56.9 Q2.75 -56.65 2.85 -56.35 2.65 -55.5 2.7 -54.5 L2.7 -54.4 2.3 -49.45 2.25 -47.75 2.05 -44.6 M-21.9 -62.3 L-23.2 -61.5 M-24.8 -59.9 L-28.2 -56.65 M-32.55 -47.95 L-31.8 -48.8 -29.5 -51.5 -29.05 -51.95 M0.95 -57.45 L0.9 -57.85 0.1 -61.2 M0.95 -57.45 L1.45 -55.0 2.3 -49.45 M-26.95 -61.45 L-27.05 -61.35 M-29.05 -59.9 L-36.35 -54.5 M-37.75 -48.2 L-37.15 -48.4 -34.2 -51.15 M-31.55 -53.5 L-30.05 -54.9 -28.6 -56.3 M-40.05 -51.8 L-38.85 -52.7 -36.35 -54.5 M-40.65 -51.35 L-42.8 -50.1 M-26.95 -61.45 L-20.7 -66.05 M-24.15 -56.5 L-19.85 -59.85 -18.75 -60.75 M-53.25 -46.95 Q-54.05 -49.65 -54.35 -53.45 L-54.4 -54.85 -54.5 -57.85 -54.3 -61.75 -54.25 -62.05 Q-53.75 -67.45 -52.1 -71.8 M-42.85 -39.2 L-42.8 -39.2 -41.9 -39.3 M-42.85 -39.2 L-43.1 -39.35 -43.1 -39.25 -42.85 -39.2 M-8.7 -37.8 L-8.45 -37.8 M-32.55 -47.95 L-32.55 -47.9 -32.6 -47.8 M-34.35 -45.2 L-34.4 -45.1 -35.1 -43.9" fill="none" stroke="#a36a6a" stroke-linecap="round" stroke-linejoin="round" stroke-opacity="0.4" stroke-width="0.05"/>
    <path d="M2.65 -80.5 L7.1 -70.7 Q8.9 -66.15 9.95 -62.5 5.8 -58.75 -0.95 -55.55 L-5.9 -53.4 -6.0 -53.55 -10.8 -55.8 Q-15.3 -58.25 -15.95 -59.9 -15.65 -59.9 -13.0 -61.5 -11.05 -62.8 -10.3 -63.1 -18.3 -60.3 -20.65 -59.9 L-20.75 -59.9 -20.55 -61.75 -23.25 -61.75 Q-35.85 -61.75 -43.8 -67.05 L-45.65 -68.25 Q-48.5 -60.1 -50.5 -52.6 -54.95 -53.65 -58.9 -60.95 -56.2 -68.6 -54.1 -72.8 L-53.2 -74.6 Q-51.05 -78.65 -48.15 -81.5 L-41.85 -78.45 Q-38.9 -77.15 -35.85 -75.65 L-35.45 -75.55 Q-33.7 -74.65 -33.2 -74.5 L-25.6 -73.9 Q-17.65 -74.05 -10.45 -76.0 -6.2 -77.2 2.65 -80.5" fill="url(#gradient1)" fill-rule="evenodd" stroke="none"/>
  </g>
  <defs>
    <radialGradient cx="0" cy="0" gradientTransform="matrix(0.0628, 0.0, 0.0, 0.0703, -23.85, -67.7)" gradientUnits="userSpaceOnUse" id="gradient0" r="819.2" spreadMethod="pad">
      <stop offset="0.00784313725490196" stop-color="#a36a6a"/>
      <stop offset="0.8470588235294118" stop-color="#e0cbcb"/>
    </radialGradient>
    <linearGradient gradientTransform="matrix(0.0, -0.0147, 0.0354, 0.0, -24.0, -67.1)" gradientUnits="userSpaceOnUse" id="gradient1" spreadMethod="pad" x1="-819.2" x2="819.2">
      <stop offset="0.0" stop-color="#000000" stop-opacity="0.0"/>
      <stop offset="0.9803921568627451" stop-color="#000000" stop-opacity="0.28235295"/>
      <stop offset="1.0" stop-color="#a36a6a" stop-opacity="0.6509804"/>
    </linearGradient>
  </defs>
</svg>
