<?xml version="1.0" encoding="UTF-8" standalone="no"?>
<svg xmlns:xlink="http://www.w3.org/1999/xlink" height="72.15px" width="84.95px" xmlns="http://www.w3.org/2000/svg">
  <g transform="matrix(1.0, 0.0, 0.0, 1.0, 24.75, -59.55)">
    <path d="M7.65 125.65 L7.7 125.5 Q8.05 124.6 8.7 124.6 9.4 124.55 10.35 122.9 11.3 121.25 13.65 119.05 16.0 116.85 19.25 116.1 L24.3 114.45 24.7 114.35 Q28.95 112.8 31.4 113.25 L35.05 114.1 35.7 114.25 38.95 116.3 40.7 117.55 39.7 117.75 39.85 117.3 38.85 117.8 38.25 117.55 37.15 118.0 35.85 118.7 34.45 118.25 34.35 118.25 Q32.1 117.45 30.45 117.5 L28.75 117.6 Q23.8 118.0 18.9 120.35 18.35 120.55 17.85 120.85 L17.0 121.3 13.35 123.35 11.7 124.35 11.8 124.2 11.7 124.3 10.75 125.0 9.55 124.95 Q8.45 125.0 7.65 125.95 L7.65 125.75 7.65 125.65" fill="#40175e" fill-rule="evenodd" stroke="none"/>
    <path d="M38.0 119.55 Q36.7 120.5 35.7 121.8 L35.25 121.95 35.25 122.2 35.15 122.35 34.15 123.8 33.15 124.5 31.7 125.55 31.65 125.55 31.2 125.85 31.2 125.8 29.9 126.4 Q26.1 128.25 22.65 128.3 L22.3 128.3 Q20.7 128.25 18.8 127.45 L18.05 127.2 17.25 127.3 14.55 126.4 Q13.35 125.9 12.3 125.85 L11.2 125.95 8.9 126.2 7.65 125.95 Q8.45 125.0 9.55 124.95 L10.75 125.0 13.05 125.0 15.25 125.05 20.55 124.7 Q24.7 124.2 27.8 123.1 L29.95 122.2 31.8 121.05 31.9 121.0 35.85 118.7 37.15 118.0 38.25 117.55 38.85 117.8 39.85 117.3 39.7 117.75 39.05 118.7 Q38.45 119.05 38.0 119.5 L38.0 119.55 M30.2 122.85 L29.15 123.05 Q27.9 123.4 27.9 123.9 27.9 124.45 28.25 124.65 L28.9 124.9 30.45 124.25 30.6 124.15 31.2 123.55 30.95 122.95 30.75 122.9 30.2 122.85 M22.65 124.6 Q21.35 124.8 20.7 125.15 19.85 125.5 19.85 126.0 19.85 126.85 21.25 127.1 L22.6 127.2 23.6 127.1 24.4 126.85 24.75 126.65 Q25.55 126.25 25.55 125.7 25.55 124.15 22.65 124.6" fill="#592280" fill-rule="evenodd" stroke="none"/>
    <path d="M30.2 122.85 L30.75 122.9 30.95 122.95 31.2 123.55 30.6 124.15 30.45 124.25 28.9 124.9 28.25 124.65 Q27.9 124.45 27.9 123.9 27.9 123.4 29.15 123.05 L30.2 122.85 M22.65 124.6 Q25.55 124.15 25.55 125.7 25.55 126.25 24.75 126.65 L24.4 126.85 23.6 127.1 22.6 127.2 21.25 127.1 Q19.85 126.85 19.85 126.0 19.85 125.5 20.7 125.15 21.35 124.8 22.65 124.6" fill="#8030b6" fill-rule="evenodd" stroke="none"/>
    <path d="M28.75 117.6 L29.4 120.3 29.55 120.6 28.1 121.1 Q24.4 122.25 19.8 122.8 L19.2 121.25 18.9 120.35 Q23.8 118.0 28.75 117.6 M34.4 118.3 L34.35 118.25 34.45 118.25 34.4 118.3" fill="#d7d7c1" fill-rule="evenodd" stroke="none"/>
    <path d="M29.55 120.6 Q32.3 119.6 34.4 118.3 L34.45 118.25 35.85 118.7 31.9 121.0 31.8 121.05 29.95 122.2 27.8 123.1 Q24.7 124.2 20.55 124.7 L15.25 125.05 13.05 125.0 10.75 125.0 11.7 124.3 11.7 124.35 13.35 123.35 19.8 122.8 Q24.4 122.25 28.1 121.1 L29.55 120.6" fill="#3b0000" fill-rule="evenodd" stroke="none"/>
    <path d="M29.55 120.6 L29.4 120.3 28.75 117.6 30.45 117.5 Q32.1 117.45 34.35 118.25 L34.4 118.3 Q32.3 119.6 29.55 120.6 M18.9 120.35 L19.2 121.25 19.8 122.8 13.35 123.35 17.0 121.3 17.85 120.85 Q18.35 120.55 18.9 120.35" fill="#a49d82" fill-rule="evenodd" stroke="none"/>
    <path d="M36.1 89.7 Q36.65 85.9 38.05 82.7 40.2 77.7 44.8 75.45 L45.8 75.2 Q46.75 74.7 47.65 74.35 L49.0 73.95 Q49.9 73.8 50.95 73.95 52.05 74.45 53.1 75.6 L53.45 76.05 54.95 77.5 55.0 77.6 Q51.6 79.25 47.95 81.5 39.75 86.4 36.55 90.05 L36.5 90.0 36.1 89.7" fill="#bfc7c7" fill-rule="evenodd" stroke="none"/>
    <path d="M38.95 116.3 L40.35 116.05 42.15 116.2 44.05 116.3 44.1 116.45 44.4 116.65 Q44.0 117.05 43.1 118.6 42.2 120.05 40.95 120.05 L38.0 119.55 38.0 119.5 Q38.45 119.05 39.05 118.7 L39.7 117.75 40.7 117.55 38.95 116.3 M31.7 125.55 Q32.15 126.25 32.4 127.2 L29.25 129.6 Q26.55 131.65 25.15 131.7 24.15 131.7 23.4 130.3 L22.35 128.45 22.65 128.3 Q26.1 128.25 29.9 126.4 L31.2 125.8 31.2 125.85 31.65 125.55 31.7 125.55 M12.3 125.85 L11.3 127.05 Q9.15 129.25 7.2 129.3 L6.25 129.2 5.6 129.05 Q5.8 127.55 7.6 125.6 L7.65 125.65 7.65 125.75 7.65 125.95 8.9 126.2 11.2 125.95 12.3 125.85 M18.15 112.3 L18.05 112.45 Q17.0 112.15 15.9 111.5 14.35 110.65 14.1 109.6 14.0 109.2 14.6 108.55 L15.4 107.85 15.55 107.8 17.6 107.85 18.45 108.0 21.2 108.25 22.55 107.85 25.25 106.3 Q27.85 104.6 28.75 104.4 L29.7 104.35 30.0 105.1 Q30.2 105.95 29.1 107.4 L29.0 107.35 Q28.55 105.15 26.45 106.8 L25.35 107.85 Q24.4 108.95 24.6 110.05 24.5 110.85 25.05 111.1 L22.5 112.35 21.75 112.35 21.65 111.45 Q21.2 109.35 18.25 108.85 15.25 108.35 15.8 110.95 L18.15 112.3" fill="#c98762" fill-opacity="0.56078434" fill-rule="evenodd" stroke="none"/>
    <path d="M18.15 112.3 L15.8 110.95 Q15.25 108.35 18.25 108.85 21.2 109.35 21.65 111.45 L21.75 112.35 21.6 112.8 21.5 112.9 20.05 113.25 19.1 112.8 18.25 112.35 18.15 112.3 M25.05 111.1 Q24.5 110.85 24.6 110.05 24.4 108.95 25.35 107.85 L26.45 106.8 Q28.55 105.15 29.0 107.35 L29.0 107.4 29.05 107.85 Q29.0 108.75 27.85 109.85 26.7 110.9 25.95 111.05 L25.05 111.1" fill="#9c6047" fill-rule="evenodd" stroke="none"/>
    <path d="M54.95 87.6 Q58.65 88.3 59.45 92.15 60.1 95.15 57.3 100.25 53.6 107.1 45.9 108.9 42.6 109.6 40.8 107.65 39.85 106.65 39.55 105.15 38.45 100.15 41.05 95.55 43.3 91.6 47.5 89.25 51.5 87.0 54.95 87.6 M55.85 93.05 Q55.25 90.45 52.95 90.05 50.9 89.75 48.35 91.2 45.75 92.7 44.25 95.0 42.6 97.6 43.1 100.0 L43.7 101.85 Q44.8 103.55 47.4 102.95 52.2 101.9 54.5 98.05 56.25 95.15 55.85 93.05" fill="#ff6696" fill-opacity="0.11372549" fill-rule="evenodd" stroke="none"/>
    <path d="M55.85 93.05 Q56.25 95.15 54.5 98.05 52.2 101.9 47.4 102.95 44.8 103.55 43.7 101.85 L43.1 100.0 Q42.6 97.6 44.25 95.0 45.75 92.7 48.35 91.2 50.9 89.75 52.95 90.05 55.25 90.45 55.85 93.05" fill="#ff6696" fill-opacity="0.28235295" fill-rule="evenodd" stroke="none"/>
    <path d="M7.1 112.0 Q7.4 113.55 7.0 114.9 6.2 117.35 2.85 118.05 -4.9 119.55 -11.15 114.85 -15.75 111.4 -16.35 108.35 -17.2 104.5 -14.1 102.3 -11.25 100.4 -6.65 100.8 -1.85 101.2 1.85 103.9 6.05 107.05 7.1 112.0 M-1.4 104.75 Q-3.65 103.2 -6.65 102.9 -9.55 102.65 -11.3 103.75 -13.25 105.0 -12.7 107.65 -12.25 109.75 -9.45 111.7 -5.75 114.25 -0.95 113.3 1.7 112.75 2.0 110.8 L1.8 108.85 Q1.3 106.4 -1.4 104.75" fill="#ff6696" fill-opacity="0.11372549" fill-rule="evenodd" stroke="none"/>
    <path d="M-1.4 104.75 Q1.3 106.4 1.8 108.85 L2.0 110.8 Q1.7 112.75 -0.95 113.3 -5.75 114.25 -9.45 111.7 -12.25 109.75 -12.7 107.65 -13.25 105.0 -11.3 103.75 -9.55 102.65 -6.65 102.9 -3.65 103.2 -1.4 104.75" fill="#ff6696" fill-opacity="0.28235295" fill-rule="evenodd" stroke="none"/>
    <path d="M36.35 85.7 L36.2 86.9 36.5 87.5 36.75 87.6 37.1 87.3 Q37.55 86.85 37.9 86.8 L38.4 87.35 Q38.4 89.1 37.5 90.85 L39.0 92.7 Q40.5 94.6 40.5 95.0 40.5 96.2 39.4 96.2 37.9 96.2 34.75 93.9 L33.95 93.25 33.45 93.25 Q32.2 93.25 31.7 92.35 L31.35 91.35 Q31.35 90.5 33.65 86.05 L34.2 85.1 Q34.55 69.6 47.15 68.4 51.75 67.95 56.15 69.7 60.2 71.3 60.2 73.05 L59.85 73.85 Q59.5 74.3 58.9 74.3 58.45 74.3 55.65 72.85 52.85 71.4 49.4 71.4 39.6 71.4 37.3 79.9 36.95 81.15 36.35 85.7 M7.8 92.35 Q10.0 93.55 10.0 95.45 L9.7 97.05 Q9.15 97.95 7.4 97.95 L7.25 97.95 Q3.75 102.85 3.1 102.85 2.5 102.85 2.25 102.3 L2.2 101.8 3.4 97.45 3.35 97.4 Q1.8 96.95 1.8 96.6 1.8 95.9 3.15 95.35 L4.05 95.05 3.35 93.65 3.55 93.25 3.7 92.8 3.7 92.35 1.85 89.8 Q-3.0 83.5 -9.6 83.5 -13.35 83.5 -18.4 87.25 L-19.9 88.35 Q-19.65 88.55 -19.65 89.0 -19.65 89.85 -21.35 90.55 L-20.75 91.35 -20.7 91.9 -20.95 93.6 Q-21.35 95.05 -21.85 95.05 -22.8 95.05 -22.95 94.15 L-23.0 93.0 Q-23.05 92.45 -23.75 91.95 L-24.45 91.15 -24.3 90.75 -24.45 90.1 Q-24.45 88.55 -17.65 83.95 -10.3 79.0 -6.8 80.85 -2.45 80.55 2.7 86.35 4.8 88.7 5.9 90.55 L7.5 91.9 7.8 92.35" fill="#c98762" fill-opacity="0.56078434" fill-rule="evenodd" stroke="none"/>
    <path d="M-4.5 86.4 Q-2.25 87.1 -0.25 88.65 1.95 90.4 3.35 92.65 L3.0 93.7 2.95 93.7 -0.05 93.05 0.0 93.0 0.05 92.9 Q0.55 91.9 0.25 90.55 0.05 89.7 -0.8 89.45 L-1.75 89.2 -2.3 89.0 -3.15 89.15 Q-4.25 89.2 -5.05 89.85 -6.15 90.55 -6.25 91.75 L-9.55 91.1 Q-9.3 89.95 -8.4 88.8 -6.85 86.95 -4.8 86.45 L-4.5 86.4 M51.2 82.1 L51.35 81.95 Q51.7 80.95 51.25 79.6 L50.75 78.8 50.1 78.5 49.1 78.2 48.55 78.0 47.7 78.1 Q46.6 78.25 45.85 78.75 44.85 79.45 44.9 80.6 L41.45 79.95 Q41.65 78.75 42.45 77.7 43.8 75.95 45.75 75.4 L48.35 75.25 49.05 75.35 51.75 76.35 52.65 77.3 53.05 77.75 Q54.0 78.75 54.4 79.95 L54.6 80.75 54.3 81.9 53.9 82.75 51.2 82.1" fill="#256273" fill-rule="evenodd" stroke="none"/>
    <path d="M-17.8 91.95 L-17.8 91.9 -17.15 90.1 -16.95 89.55 -16.35 88.25 Q-15.45 87.1 -14.05 86.45 L-13.85 86.4 -12.5 86.05 -10.45 85.95 -9.5 85.65 -8.1 85.65 -6.0 85.95 -4.5 86.4 -4.8 86.45 Q-6.85 86.95 -8.4 88.8 -9.3 89.95 -9.55 91.1 L-9.75 92.0 -9.8 92.0 Q-14.1 91.85 -17.85 92.05 L-17.8 91.95 M3.35 92.65 L4.05 93.95 4.1 94.0 4.05 94.0 4.1 94.05 3.0 93.7 3.35 92.65" fill="#bfc7c7" fill-rule="evenodd" stroke="none"/>
    <path d="M36.85 84.3 Q37.15 82.9 37.7 81.6 L41.2 80.9 41.4 80.9 44.95 80.75 45.65 80.8 46.65 80.9 46.95 81.0 47.25 81.4 Q47.55 82.1 46.75 82.85 L46.55 83.05 Q45.7 83.75 43.8 84.25 L43.55 84.3 40.05 84.8 38.7 84.75 36.85 84.3 M-7.95 95.5 L-12.85 96.0 Q-15.05 95.85 -15.3 94.8 -15.75 92.85 -10.0 92.1 L-9.75 92.05 -9.5 92.05 -6.2 91.85 -5.45 91.9 -4.25 92.1 -4.0 92.4 -4.0 92.45 Q-3.8 93.2 -4.55 93.95 L-4.85 94.1 Q-5.8 94.9 -7.75 95.4 L-7.95 95.5" fill="#ffffff" fill-rule="evenodd" stroke="none"/>
    <path d="M44.9 80.6 Q44.85 79.45 45.85 78.75 46.6 78.25 47.7 78.1 L48.55 78.0 49.1 78.2 50.1 78.5 50.75 78.8 51.25 79.6 Q51.7 80.95 51.35 81.95 L51.2 82.1 48.7 81.45 46.95 81.0 46.65 80.9 45.65 80.8 44.9 80.6 M-0.05 93.05 L-0.9 92.85 -2.5 92.5 -4.25 92.1 -5.45 91.9 -6.25 91.75 Q-6.15 90.55 -5.05 89.85 -4.25 89.2 -3.15 89.15 L-2.3 89.0 -1.75 89.2 -0.8 89.45 Q0.05 89.7 0.25 90.55 0.55 91.9 0.05 92.9 L0.0 93.0 -0.05 93.05" fill="#0d0f0f" fill-rule="evenodd" stroke="none"/>
    <path d="M44.9 80.6 L45.65 80.8 44.95 80.75 44.9 80.6 M46.95 81.0 L48.7 81.45 51.2 82.1 Q50.85 83.15 49.65 83.45 48.2 83.8 46.85 83.1 L46.55 83.05 46.75 82.85 Q47.55 82.1 47.25 81.4 L46.95 81.0 M-4.25 92.1 L-2.5 92.5 -0.9 92.85 -0.05 93.05 Q-0.5 94.1 -1.85 94.45 L-4.55 94.2 -4.85 94.1 -4.55 93.95 Q-3.8 93.2 -4.0 92.45 L-4.0 92.4 -4.25 92.1 M-6.25 91.75 L-5.45 91.9 -6.2 91.85 -6.25 91.75" fill="#2d3131" fill-rule="evenodd" stroke="none"/>
    <path d="M51.2 82.1 L53.9 82.75 Q52.9 84.45 50.75 86.55 L50.65 86.7 Q48.05 87.25 45.05 85.35 L43.55 84.3 43.8 84.25 Q45.7 83.75 46.55 83.05 L46.85 83.1 Q48.2 83.8 49.65 83.45 50.85 83.15 51.2 82.1 M41.45 79.95 L44.9 80.6 44.95 80.75 41.4 80.9 Q41.35 80.35 41.45 79.95 M2.95 93.7 L2.05 95.1 Q0.5 97.3 -0.9 97.65 -3.65 98.4 -6.65 96.45 L-7.95 95.5 -7.75 95.4 Q-5.8 94.9 -4.85 94.1 L-4.55 94.2 -1.85 94.45 Q-0.5 94.1 -0.05 93.05 L2.95 93.7 M-9.75 92.05 L-9.75 92.0 -9.55 91.1 -6.25 91.75 -6.2 91.85 -9.5 92.05 -9.75 92.05" fill="#3791a6" fill-rule="evenodd" stroke="none"/>
    <path d="M54.6 80.75 L54.4 79.95 Q54.0 78.75 53.05 77.75 L54.95 76.95 55.0 76.95 55.0 77.0 55.05 77.3 55.25 78.1 55.2 78.3 54.7 80.4 54.6 80.75 M43.55 84.3 L45.05 85.35 Q48.05 87.25 50.65 86.7 L49.35 87.8 45.15 89.6 45.05 89.65 44.85 89.65 44.7 89.7 41.05 89.75 38.95 89.5 36.5 87.7 40.05 84.8 43.55 84.3 M2.95 93.7 L3.0 93.7 4.1 94.05 3.5 95.05 2.55 96.6 Q0.95 97.65 -0.95 98.5 L-1.4 98.7 -2.9 99.15 -5.15 99.6 -9.3 99.05 -9.45 99.0 -9.65 98.9 Q-13.35 97.6 -15.0 96.2 L-16.8 94.2 -17.6 93.2 -17.8 92.1 -17.85 92.05 Q-14.1 91.85 -9.8 92.0 L-9.75 92.0 -9.75 92.05 -10.0 92.1 Q-15.75 92.85 -15.3 94.8 -15.05 95.85 -12.85 96.0 L-7.95 95.5 -6.65 96.45 Q-3.65 98.4 -0.9 97.65 0.5 97.3 2.05 95.1 L2.95 93.7" fill="#e3eded" fill-rule="evenodd" stroke="none"/>
    <path d="M54.95 76.9 L54.95 76.85 55.0 76.95 54.95 76.9 M4.1 94.05 L4.1 94.0 4.1 94.05" fill="#7a30ad" fill-rule="evenodd" stroke="none"/>
    <path d="M-17.85 92.0 L-17.8 91.95 -17.85 92.05 -17.85 92.0 M54.9 76.85 L54.95 76.85 54.95 76.9 54.9 76.85" fill="#916401" fill-rule="evenodd" stroke="none"/>
    <path d="M-22.7 93.45 L-17.85 92.0 -17.85 92.05 -17.8 92.15 -17.6 93.25 -16.8 94.2 -15.0 96.2 Q-13.35 97.6 -9.65 98.9 L-9.45 99.0 -9.3 99.05 -5.15 99.6 -2.9 99.15 -1.4 98.7 -0.95 98.5 Q0.95 97.65 2.55 96.6 L3.5 95.05 4.1 94.05 4.1 94.0 6.95 94.85 7.0 95.05 6.75 95.45 Q6.55 95.8 5.8 96.0 L4.85 95.85 4.75 95.8 Q4.45 96.8 2.4 98.85 0.4 100.85 -3.6 101.9 -7.6 102.9 -10.35 101.8 -13.05 100.7 -14.6 99.6 -22.65 93.7 -22.6 93.9 L-22.7 93.45 M59.85 76.25 L59.95 76.65 Q59.9 76.5 55.4 85.25 54.45 86.9 52.55 89.05 50.65 91.2 46.7 91.9 42.75 92.5 40.1 91.45 37.35 90.45 36.7 89.6 L36.6 89.7 Q36.25 90.2 35.9 90.25 L35.7 90.3 34.75 90.15 34.35 89.85 34.3 89.6 36.5 87.75 38.95 89.55 41.05 89.75 44.7 89.7 44.85 89.65 45.05 89.65 45.15 89.6 49.35 87.8 50.65 86.7 50.75 86.55 Q52.9 84.45 53.9 82.75 L54.3 81.9 54.6 80.75 54.7 80.4 55.2 78.3 55.25 78.1 55.05 77.3 55.0 77.0 55.0 76.95 54.95 76.85 59.85 76.25" fill="#ba7c02" fill-rule="evenodd" stroke="none"/>
    <path d="M-22.7 93.45 L-21.1 89.9 -22.85 90.4 -23.6 90.15 -23.7 90.1 Q-18.4 84.05 -13.15 82.7 L-6.25 82.3 Q-1.1 83.3 2.15 87.15 5.05 90.7 6.95 94.85 L4.1 94.0 4.05 93.95 3.35 92.65 Q1.95 90.4 -0.25 88.65 -2.25 87.1 -4.5 86.4 L-6.0 85.95 -8.1 85.65 -10.45 85.65 Q-12.55 85.75 -14.05 86.45 -15.45 87.1 -16.35 88.25 -17.45 89.7 -17.8 91.9 L-17.8 91.95 -17.85 92.0 -22.7 93.45 M34.3 89.6 Q34.2 85.1 35.2 80.7 L35.25 80.5 Q36.4 75.6 40.45 72.6 43.15 70.65 46.7 70.15 52.0 69.25 59.3 72.6 L59.2 72.85 58.6 73.3 56.85 73.55 59.85 76.25 54.95 76.85 54.9 76.85 Q51.5 71.6 45.7 74.0 40.35 76.05 38.0 81.0 L37.7 81.6 Q37.15 82.9 36.85 84.3 36.5 86.0 36.45 87.7 L36.5 87.75 34.3 89.6" fill="#966401" fill-rule="evenodd" stroke="none"/>
    <path d="M3.15 73.4 L-4.6 72.4 Q-13.15 71.8 -18.4 75.55 -20.2 76.8 -21.15 78.65 -22.15 80.55 -22.55 80.85 L-23.15 81.25 Q-23.9 81.6 -24.75 81.75 -23.15 69.75 -10.5 68.15 -5.85 67.5 -1.4 68.7 2.7 69.7 3.6 71.35 L3.9 72.45 3.65 72.9 3.15 73.4 M54.25 65.7 L53.5 65.7 Q53.0 65.7 51.0 64.7 49.0 63.6 46.75 63.5 40.2 63.15 33.75 68.05 30.5 70.5 28.25 73.0 L28.15 73.0 27.45 72.85 27.0 72.55 Q26.7 72.3 26.55 71.45 26.15 69.7 28.8 66.65 31.6 63.35 35.7 61.5 46.9 56.2 55.85 65.35 L54.25 65.7" fill="#ba8102" fill-rule="evenodd" stroke="none"/>
    <path d="M3.15 73.4 L4.35 75.05 Q5.85 77.9 4.05 79.15 3.0 79.9 1.2 78.6 L-2.75 75.7 Q-9.2 72.0 -17.6 77.95 L-19.3 79.25 Q-20.25 80.15 -20.65 81.45 L-22.4 82.75 -23.15 81.25 -22.55 80.85 Q-22.15 80.55 -21.15 78.65 -20.2 76.8 -18.4 75.55 -13.15 71.8 -4.6 72.4 L3.15 73.4 M28.15 73.0 L28.25 73.0 Q30.5 70.5 33.75 68.05 40.2 63.15 46.75 63.5 49.0 63.6 51.0 64.7 53.0 65.7 53.5 65.7 L54.25 65.7 54.6 67.35 52.4 67.25 Q51.2 66.35 49.9 66.1 L47.7 65.9 Q37.15 65.35 34.4 71.8 33.7 73.4 33.05 76.25 32.5 78.3 31.2 78.25 28.95 78.1 28.25 74.95 L28.15 73.0" fill="#c98762" fill-opacity="0.56078434" fill-rule="evenodd" stroke="none"/>
  </g>
</svg>
