<?xml version="1.0" encoding="UTF-8" standalone="no"?>
<svg xmlns:xlink="http://www.w3.org/1999/xlink" height="201.85px" width="240.55px" xmlns="http://www.w3.org/2000/svg">
  <g transform="matrix(1.0, 0.0, 0.0, 1.0, 111.95, 147.6)">
    <path d="M18.4 52.85 L16.95 52.8 17.35 52.35 -15.75 50.75 -16.3 51.1 -18.1 51.0 -17.5 50.5 -39.6 49.9 -48.95 49.0 -50.85 49.35 -60.6 48.85 -71.2 31.9 -111.95 -147.6 128.6 -147.6 90.6 37.1 45.8 54.25 19.05 52.3 18.4 52.85" fill="#66ff00" fill-rule="evenodd" stroke="none"/>
  </g>
</svg>
