<?xml version="1.0" encoding="UTF-8" standalone="no"?>
<svg xmlns:xlink="http://www.w3.org/1999/xlink" height="38.7px" width="30.3px" xmlns="http://www.w3.org/2000/svg">
  <g transform="matrix(1.0, 0.0, 0.0, 1.0, 0.5, 1.15)">
    <path d="M22.6 -1.15 Q26.2 2.2 28.15 5.85 L28.15 5.8 Q30.0 9.2 29.75 12.8 L29.75 21.3 Q29.85 23.6 29.05 26.0 28.25 28.25 26.4 29.75 L26.35 29.75 24.45 31.25 Q23.0 32.15 21.4 32.7 L18.7 33.1 18.4 33.15 18.2 32.85 Q16.35 29.35 12.3 27.95 9.3 26.9 6.5 28.35 L6.25 37.55 5.4 36.7 Q2.55 33.85 0.75 29.7 -0.5 26.8 -0.5 23.8 L-0.5 15.2 Q-0.55 12.75 0.4 10.4 1.95 6.4 6.25 4.55 L6.3 4.55 Q8.35 3.7 10.55 3.3 L10.95 3.25 11.1 3.6 Q12.85 7.15 16.95 8.6 L19.25 9.1 Q21.1 9.2 22.75 8.3 L22.8 8.25 Q24.1 7.5 24.35 4.95 24.6 2.35 22.6 -1.15" fill="#dc2c00" fill-rule="evenodd" stroke="none"/>
  </g>
</svg>
