<?xml version="1.0" encoding="UTF-8" standalone="no"?>
<svg xmlns:xlink="http://www.w3.org/1999/xlink" height="7.65px" width="35.4px" xmlns="http://www.w3.org/2000/svg">
  <g transform="matrix(1.0, 0.0, 0.0, 1.0, 41.85, -1.5)">
    <path d="M-6.45 2.2 Q-6.45 3.3 -9.1 4.75 -11.55 6.1 -13.5 6.45 L-19.5 7.95 Q-24.9 9.15 -29.6 9.15 L-33.75 9.0 -38.6 8.65 -39.6 8.2 -41.45 7.4 Q-41.85 7.15 -41.85 6.75 -41.85 6.1 -40.9 6.1 L-38.9 6.65 -29.7 7.15 Q-24.7 7.15 -19.05 5.85 L-13.2 4.2 Q-10.35 3.3 -9.2 2.4 -8.1 1.5 -7.25 1.5 -6.45 1.45 -6.45 2.2" fill="#000000" fill-opacity="0.17254902" fill-rule="evenodd" stroke="none"/>
  </g>
</svg>
