<?xml version="1.0" encoding="UTF-8" standalone="no"?>
<svg xmlns:xlink="http://www.w3.org/1999/xlink" height="291.85px" width="242.75px" xmlns="http://www.w3.org/2000/svg">
  <g transform="matrix(1.0, 0.0, 0.0, 1.0, 97.75, 34.2)">
    <path d="M46.9 232.55 Q47.85 232.55 54.15 230.2 60.45 227.8 62.1 227.8 65.85 227.8 76.9 250.95 L80.1 257.65 -35.3 257.65 Q-35.8 254.4 -33.8 246.0 -31.75 237.8 -28.75 230.5 L-26.75 226.25 -26.35 222.95 Q-25.75 219.1 -24.85 216.15 -23.25 211.3 -18.85 209.1 -14.15 206.85 -13.25 212.0 -13.15 212.9 -13.6 214.0 -14.15 215.05 -14.0 215.95 -13.8 217.0 -10.95 218.35 -7.95 219.85 -7.15 221.95 -6.45 223.85 -4.2 225.95 L-1.5 228.0 10.4 231.9 Q15.85 234.25 17.45 237.55 19.1 234.85 24.15 234.1 27.65 233.55 33.45 234.0 33.95 231.15 35.0 229.7 36.45 227.8 39.35 227.8 42.45 227.8 44.8 230.2 L46.9 232.55" fill="#3f1f2d" fill-rule="evenodd" stroke="none"/>
    <path d="M85.45 152.45 L83.7 151.2 Q79.6 148.2 79.65 146.15 79.65 144.65 82.15 145.55 L84.2 139.85 Q83.8 138.35 83.85 137.05 83.9 132.95 86.0 132.25 L87.0 132.35 87.3 131.55 Q91.1 117.35 94.8 104.7 97.9 94.4 99.9 88.7 L99.5 88.55 101.25 83.55 101.75 83.9 Q103.95 79.0 103.85 84.35 L103.7 85.45 Q106.3 87.5 106.25 88.4 106.25 89.25 105.85 89.75 L107.35 93.05 108.75 96.35 Q111.4 98.45 114.2 102.5 L116.35 105.85 104.15 124.65 92.35 142.3 86.35 151.2 85.45 152.45 M96.5 159.0 L96.15 158.6 96.55 158.75 96.5 159.0 M131.35 153.0 L131.3 153.0 131.2 152.6 131.35 153.0" fill="#3f1f2d" fill-rule="evenodd" stroke="none"/>
    <path d="M90.45 217.35 L89.35 218.2 Q88.35 219.7 87.05 220.0 L81.9 222.5 78.0 224.3 Q77.15 225.7 73.35 225.7 69.1 225.7 66.05 222.95 L65.05 220.45 Q65.35 220.75 67.75 221.8 69.25 222.85 71.05 223.15 L71.95 223.4 72.3 223.25 Q74.45 223.25 75.9 221.8 L92.1 215.05 90.45 217.35 M93.3 201.2 L87.2 203.6 79.4 206.5 Q78.35 203.55 76.6 201.2 73.3 196.8 67.8 195.5 L66.7 195.5 Q70.1 193.8 75.75 191.85 L83.7 189.1 Q86.05 190.05 88.4 191.75 91.2 193.8 92.75 199.0 L93.3 201.2" fill="#b36919" fill-rule="evenodd" stroke="none"/>
    <path d="M66.05 222.95 Q63.9 221.0 62.35 217.7 60.0 212.6 60.1 208.9 L60.3 206.3 60.3 206.4 Q60.25 209.65 62.85 215.35 64.9 219.85 67.75 221.8 65.35 220.75 65.05 220.45 L66.05 222.95 M62.5 199.4 L62.55 199.2 61.75 198.6 61.7 197.85 Q61.75 195.35 71.25 191.4 L74.7 190.1 76.3 189.5 78.55 188.95 Q80.3 188.05 81.5 188.3 L83.7 189.1 75.75 191.85 Q70.1 193.8 66.7 195.5 L67.8 195.5 Q73.3 196.8 76.6 201.2 78.35 203.55 79.4 206.5 L87.2 203.6 93.3 201.2 Q93.95 204.2 93.9 207.0 93.8 210.85 92.75 213.65 L92.1 215.05 75.9 221.8 Q77.2 220.4 77.9 217.75 78.55 215.4 78.65 211.5 78.7 209.1 78.1 206.95 77.45 204.55 75.95 202.5 73.4 198.9 69.75 197.7 65.95 196.55 63.35 198.55 62.85 198.9 62.5 199.4 M71.05 223.15 L72.25 223.25 72.3 223.25 71.95 223.4 71.05 223.15" fill="#995715" fill-rule="evenodd" stroke="none"/>
    <path d="M104.15 124.65 L116.35 105.85 Q118.75 109.95 118.7 112.55 L118.7 113.0 Q123.45 120.65 125.65 124.6 129.5 131.35 138.3 145.8 L141.05 151.2 141.6 152.55 Q145.1 160.85 145.0 166.9 L143.8 172.2 143.5 172.95 142.45 174.05 141.1 175.6 139.65 177.35 139.3 177.4 139.15 177.5 138.15 179.3 138.9 171.35 Q139.0 167.65 136.55 166.0 133.2 164.45 131.45 162.7 133.75 162.7 136.4 161.9 L136.7 161.75 Q136.4 161.75 136.3 161.55 L136.25 161.3 Q133.75 160.2 125.9 157.9 118.7 155.7 115.75 154.3 L123.7 154.3 Q127.95 154.1 131.3 153.0 L131.35 153.0 131.65 152.85 131.2 152.6 131.15 152.4 129.85 151.2 Q122.55 144.9 117.05 139.15 111.85 133.85 104.15 124.65 M74.7 190.1 Q75.2 188.45 76.05 186.6 L76.45 185.85 Q77.95 182.95 80.4 179.45 87.1 169.95 94.0 167.05 91.75 164.9 91.75 163.15 91.85 160.25 96.5 159.0 L96.55 158.75 102.05 160.05 Q106.7 161.25 108.9 163.2 L109.3 163.2 102.35 163.5 95.4 163.7 Q96.6 165.25 102.55 169.7 97.1 171.05 81.2 185.15 L76.3 189.5 74.7 190.1" fill="#5e2c3e" fill-rule="evenodd" stroke="none"/>
    <path d="M85.45 152.45 L86.35 151.2 92.35 142.3 104.15 124.65 Q111.85 133.85 117.05 139.15 122.55 144.9 129.85 151.2 L131.15 152.4 131.2 152.6 131.3 153.0 Q127.95 154.1 123.7 154.3 L115.75 154.3 Q118.7 155.7 125.9 157.9 133.75 160.2 136.25 161.3 L136.3 161.55 136.4 161.9 Q133.75 162.7 131.45 162.7 133.2 164.45 136.55 166.0 139.0 167.65 138.9 171.35 L138.15 179.3 136.6 181.55 125.3 195.4 Q121.15 200.55 109.9 209.0 103.25 214.05 97.5 217.05 L90.45 217.35 92.1 215.05 92.75 213.65 Q93.8 210.85 93.9 207.0 93.95 204.2 93.3 201.2 L92.75 199.0 Q91.2 193.8 88.4 191.75 86.05 190.05 83.7 189.1 L81.5 188.3 Q80.3 188.05 78.55 188.95 L76.3 189.5 81.2 185.15 Q97.1 171.05 102.55 169.7 96.6 165.25 95.4 163.7 L102.35 163.5 109.3 163.2 108.9 163.2 Q106.7 161.25 102.05 160.05 L96.55 158.75 96.15 158.6 95.9 158.25 Q92.8 156.8 89.05 154.65 L85.45 152.45" fill="#4d2431" fill-rule="evenodd" stroke="none"/>
    <path d="M131.2 152.6 L131.65 152.85 131.35 153.0 131.2 152.6 M136.3 161.55 Q136.4 161.75 136.7 161.75 L136.4 161.9 136.3 161.55" fill="#361a25" fill-rule="evenodd" stroke="none"/>
    <path d="M60.3 206.3 Q60.4 201.7 62.5 199.4 62.85 198.9 63.35 198.55 65.95 196.55 69.75 197.7 73.4 198.9 75.95 202.5 77.45 204.55 78.1 206.95 78.7 209.1 78.65 211.5 78.55 215.4 77.9 217.75 77.2 220.4 75.9 221.8 74.45 223.25 72.3 223.25 L72.25 223.25 71.05 223.15 Q69.25 222.85 67.75 221.8 64.9 219.85 62.85 215.35 60.25 209.65 60.3 206.4 L60.3 206.3" fill="#693c0e" fill-rule="evenodd" stroke="none"/>
    <path d="M-69.95 119.1 L-67.85 115.55 Q-65.15 111.2 -62.6 108.85 L-61.2 105.4 -59.75 101.9 Q-60.15 101.45 -60.15 100.6 -60.2 99.7 -57.7 97.45 L-57.85 96.3 Q-57.95 91.0 -55.8 95.7 L-55.3 95.3 -53.6 100.05 -54.0 100.3 Q-52.05 105.8 -49.1 115.75 -45.45 128.0 -41.75 141.85 L-41.45 142.55 Q-41.0 142.2 -40.5 142.35 -38.5 142.85 -38.4 147.0 -38.4 148.25 -38.8 149.75 L-36.8 155.25 Q-34.35 154.1 -34.3 155.6 -34.3 157.6 -38.25 161.1 L-40.0 162.55 -40.8 161.35 -46.7 153.1 -58.1 136.65 -69.95 119.1 M-50.35 169.8 L-50.7 170.2 -50.75 169.95 -50.35 169.8 M-84.5 167.85 L-84.35 167.45 -84.45 167.85 -84.5 167.85" fill="#3f1f2d" fill-rule="evenodd" stroke="none"/>
    <path d="M-50.7 170.2 Q-46.2 171.0 -46.1 173.85 -46.1 175.6 -48.3 178.0 -41.6 180.2 -35.1 189.0 -32.7 192.2 -31.25 194.95 L-30.9 195.7 Q-30.05 197.45 -29.55 199.05 L-31.15 198.6 -35.85 194.75 Q-51.3 182.35 -56.55 181.5 -50.8 176.45 -49.65 174.8 L-56.4 175.3 -63.1 175.75 -62.75 175.7 Q-60.6 173.5 -56.1 171.85 L-50.75 169.95 -50.7 170.2 M-91.1 194.85 L-92.1 193.2 -92.25 193.05 -92.6 193.05 -93.95 191.45 -95.25 190.05 -96.3 189.05 -96.6 188.35 -97.75 183.15 Q-97.85 177.1 -94.45 168.5 L-93.9 167.05 -91.25 161.4 -78.95 138.85 -72.2 126.5 -72.2 126.05 Q-72.25 123.5 -69.95 119.1 L-58.1 136.65 Q-65.6 146.65 -70.6 152.5 -76.0 158.85 -83.0 165.9 L-84.3 167.2 -84.35 167.45 -84.8 167.75 -84.5 167.85 -84.45 167.85 -77.1 168.3 -69.4 167.5 Q-72.25 169.2 -79.25 172.15 -86.85 175.35 -89.25 176.65 L-89.3 176.9 -89.7 177.15 -89.4 177.25 -84.6 177.55 Q-86.3 179.5 -89.55 181.4 -91.95 183.25 -91.85 186.95 L-91.1 194.85" fill="#5e2c3e" fill-rule="evenodd" stroke="none"/>
    <path d="M-40.0 162.55 L-43.5 165.1 -50.1 169.45 -50.35 169.8 -50.75 169.95 -56.1 171.85 Q-60.6 173.5 -62.75 175.7 L-63.1 175.75 -56.4 175.3 -49.65 174.8 Q-50.8 176.45 -56.55 181.5 -51.3 182.35 -35.85 194.75 L-31.15 198.6 -33.35 198.25 Q-35.0 197.55 -36.15 197.95 L-38.3 198.95 Q-40.55 200.2 -42.9 202.15 -45.6 204.45 -47.1 209.85 L-47.65 212.1 Q-48.25 215.15 -48.15 217.95 -48.1 221.8 -47.1 224.5 L-46.45 225.8 Q-45.8 227.05 -44.85 227.95 L-51.65 228.4 Q-57.2 225.9 -63.7 221.6 -74.6 214.3 -78.6 209.65 L-89.6 197.0 -91.1 194.85 -91.85 186.95 Q-91.95 183.25 -89.55 181.4 -86.3 179.5 -84.6 177.55 L-89.4 177.25 -89.3 176.9 -89.25 176.65 Q-86.85 175.35 -79.25 172.15 -72.25 169.2 -69.4 167.5 L-77.1 168.3 -84.45 167.85 -84.35 167.45 -84.3 167.2 -83.0 165.9 Q-76.0 158.85 -70.6 152.5 -65.6 146.65 -58.1 136.65 L-46.7 153.1 -40.8 161.35 -40.0 162.55" fill="#4d2431" fill-rule="evenodd" stroke="none"/>
    <path d="M-84.5 167.85 L-84.8 167.75 -84.35 167.45 -84.5 167.85 M-89.4 177.25 L-89.7 177.15 -89.3 176.9 -89.4 177.25" fill="#361a25" fill-rule="evenodd" stroke="none"/>
    <path d="M-17.75 207.1 Q-15.7 209.15 -15.6 213.75 L-15.6 213.85 Q-15.5 217.1 -18.1 223.05 -20.05 227.75 -22.8 230.0 -24.3 231.2 -26.05 231.7 L-27.2 231.9 -27.25 231.9 Q-29.35 232.15 -30.7 230.85 -32.0 229.6 -32.7 227.0 -33.3 224.75 -33.4 220.85 -33.45 218.45 -32.85 216.25 -32.2 213.8 -30.75 211.55 -28.3 207.75 -24.75 206.15 L-18.6 206.3 -17.75 207.1" fill="#693c0e" fill-rule="evenodd" stroke="none"/>
    <path d="M-29.55 199.05 L-26.25 200.0 Q-17.0 202.95 -16.95 205.4 L-17.0 206.15 Q-17.2 206.7 -17.8 206.9 L-17.75 207.1 -18.6 206.3 -24.75 206.15 Q-28.3 207.75 -30.75 211.55 -32.2 213.8 -32.85 216.25 -33.45 218.45 -33.4 220.85 -33.3 224.75 -32.7 227.0 -32.0 229.6 -30.7 230.85 L-46.45 225.8 -47.1 224.5 Q-48.1 221.8 -48.15 217.95 -48.25 215.15 -47.65 212.1 L-41.7 213.85 -34.15 215.95 Q-33.1 212.85 -31.45 210.35 -28.25 205.55 -22.85 203.75 L-21.8 203.6 Q-25.15 202.25 -30.6 200.9 L-38.3 198.95 -36.15 197.95 Q-35.0 197.55 -33.35 198.25 L-31.15 198.6 -29.55 199.05 M-15.6 213.75 L-15.4 216.3 Q-15.3 220.0 -17.6 225.3 -19.1 228.8 -21.2 230.95 L-20.2 228.4 -22.8 230.0 Q-20.05 227.75 -18.1 223.05 -15.5 217.1 -15.6 213.85 L-15.6 213.75 M-27.25 231.9 L-27.2 231.9 -26.05 231.7 -26.9 232.05 -27.25 231.9" fill="#995715" fill-rule="evenodd" stroke="none"/>
    <path d="M-21.2 230.95 Q-24.15 234.05 -28.25 234.5 -31.95 234.9 -32.75 233.6 L-36.55 232.2 -41.55 230.25 Q-42.8 230.05 -43.8 228.7 L-44.85 227.95 Q-45.8 227.05 -46.45 225.8 L-30.7 230.85 Q-29.35 232.15 -27.25 231.9 L-26.9 232.05 -26.05 231.7 Q-24.3 231.2 -22.8 230.0 L-20.2 228.4 -21.2 230.95 M-38.3 198.95 L-30.6 200.9 Q-25.15 202.25 -21.8 203.6 L-22.85 203.75 Q-28.25 205.55 -31.45 210.35 -33.1 212.85 -34.15 215.95 L-41.7 213.85 -47.65 212.1 -47.1 209.85 Q-45.6 204.45 -42.9 202.15 -40.55 200.2 -38.3 198.95" fill="#b36919" fill-rule="evenodd" stroke="none"/>
    <path d="M55.65 -15.7 L60.55 -13.75 Q63.85 -12.3 67.4 -10.8 L67.75 -10.6 Q72.15 -7.45 75.0 -4.6 L65.15 -9.25 Q60.85 -13.25 55.65 -15.7 M-21.65 -10.6 L-21.3 -10.8 -14.25 -13.75 -9.35 -15.7 Q-14.65 -13.25 -19.05 -9.25 L-29.1 -4.6 Q-26.15 -7.45 -21.65 -10.6" fill="#695e54" fill-rule="evenodd" stroke="none"/>
    <path d="M72.95 -8.35 L79.0 -5.75 Q84.75 -3.3 88.8 -1.7 L88.9 -1.65 89.1 -1.55 89.3 -1.5 89.5 -1.35 89.7 -1.25 Q93.4 0.55 95.9 3.3 98.95 6.4 100.45 10.75 L97.8 9.1 Q90.3 3.55 80.35 -1.85 77.55 -5.8 72.95 -8.35 M100.65 2.4 Q106.25 3.95 111.15 4.7 L113.1 4.95 Q115.8 5.7 117.8 7.55 L116.55 7.55 Q111.35 7.55 104.8 5.5 L100.65 2.4 M121.6 5.15 Q125.75 4.65 128.95 2.9 L129.0 2.85 129.15 2.85 130.8 2.6 132.35 2.85 130.75 3.75 Q127.45 5.55 124.05 6.55 122.85 5.55 121.6 5.15 M132.2 0.45 L133.3 -0.7 Q136.05 -3.9 139.2 -9.5 L139.35 -9.55 139.4 -8.65 139.5 -8.0 139.55 -7.65 139.55 -7.5 139.6 -5.9 Q139.55 -1.95 137.15 3.5 137.0 2.8 136.45 2.05 137.5 0.4 138.4 -3.7 137.3 -1.3 135.05 0.75 134.4 0.25 133.6 0.25 L132.2 0.45 M135.5 6.9 L134.85 8.0 133.5 10.3 Q131.25 13.2 128.5 14.9 128.25 12.6 127.15 10.5 130.4 9.05 133.3 6.05 L134.7 4.5 Q135.4 5.55 135.5 6.9 M105.4 38.5 Q100.85 41.0 96.4 42.05 L100.35 39.05 105.4 38.5 M79.75 41.05 L70.85 38.4 68.8 37.75 68.2 37.5 66.1 36.8 Q77.05 38.95 88.65 39.25 86.2 40.3 83.3 40.7 L79.75 41.05 M46.65 -16.7 L45.35 -19.8 53.2 -16.7 55.65 -15.7 Q60.85 -13.25 65.15 -9.25 L58.1 -12.25 46.65 -16.7 M120.85 11.85 L120.85 11.9 Q121.95 14.35 122.1 17.3 L119.4 17.5 Q117.05 17.5 110.35 15.05 109.9 11.95 108.55 9.65 114.95 11.9 120.75 11.9 L120.85 11.85 M84.7 71.4 L89.45 73.25 91.05 76.1 Q93.0 79.15 94.8 79.15 95.6 79.15 98.45 77.9 L99.0 78.25 99.35 78.4 99.5 79.05 Q100.35 82.25 102.1 82.25 103.1 82.25 105.2 80.9 L108.9 82.6 Q110.05 86.95 109.95 91.05 109.9 93.9 109.35 97.1 L103.7 106.6 100.0 112.65 100.7 107.95 Q101.05 105.3 101.75 103.8 L101.95 103.3 102.0 100.7 101.55 100.7 100.65 102.65 95.0 113.5 Q89.05 124.55 86.6 128.35 L86.65 127.45 92.7 107.1 92.8 102.4 Q91.5 103.4 89.35 107.5 87.65 110.7 86.95 112.65 L87.0 110.65 87.5 108.35 Q87.95 106.3 88.0 102.4 L87.75 93.4 86.65 82.85 Q85.5 73.95 84.7 71.4 M64.25 180.45 Q65.5 183.1 65.45 185.25 65.4 187.05 63.15 190.9 60.85 194.8 60.8 196.45 L62.2 199.45 Q63.65 202.35 63.6 204.65 63.55 207.75 62.25 214.85 L60.9 222.05 59.8 227.7 Q60.8 228.0 60.75 229.4 60.7 231.6 58.6 233.8 L58.25 236.4 57.9 236.4 57.45 234.95 56.5 235.75 Q56.7 231.0 57.5 224.5 L58.5 217.85 Q58.55 217.05 57.9 215.35 L57.75 214.85 57.3 213.2 Q57.3 212.8 58.9 211.15 60.45 209.45 60.45 208.5 60.45 208.0 55.5 196.85 55.5 196.3 57.95 193.75 60.45 191.2 60.45 189.85 60.5 188.9 59.05 186.4 L58.8 185.95 64.25 180.45 M-20.55 224.55 L-24.45 219.6 -24.55 214.85 -24.75 203.1 -24.0 196.85 -23.35 191.6 Q-23.3 189.9 -25.05 187.25 L-26.75 184.55 -25.3 181.7 Q-24.35 179.95 -24.0 178.35 L-23.85 177.15 -22.75 178.35 -19.3 181.8 -20.95 183.9 -23.5 187.1 Q-23.5 188.25 -20.55 192.2 -17.65 196.1 -17.65 197.9 -17.7 198.95 -19.65 202.0 -21.65 205.0 -21.65 205.35 -21.7 206.5 -20.4 207.3 -19.15 208.05 -19.15 209.4 L-19.7 214.85 -20.25 220.2 -20.15 224.6 -20.55 224.55 M-59.8 85.95 L-58.35 84.55 -57.85 84.1 -56.2 84.6 Q-55.45 84.6 -52.85 79.95 L-50.3 78.2 -49.35 77.5 -49.15 77.35 -48.9 77.5 Q-48.05 78.1 -47.3 78.1 L-46.25 77.5 -45.85 77.15 -41.95 73.1 -41.4 72.45 -40.75 72.05 Q-38.1 70.55 -36.2 69.75 -34.5 69.05 -33.35 68.95 L-33.8 69.75 -36.25 74.5 -36.3 74.6 -36.6 74.75 -36.45 74.9 -37.75 77.5 Q-41.35 85.2 -42.7 91.3 L-43.05 93.2 Q-43.8 97.3 -43.9 102.4 -43.95 109.2 -44.5 112.2 L-44.95 112.2 Q-44.95 111.3 -46.05 103.95 L-46.4 101.95 -47.2 95.7 -47.2 95.65 -47.65 95.65 -47.65 95.95 -48.15 100.45 -48.7 104.5 Q-48.8 109.75 -47.15 118.55 L-46.75 120.45 -45.45 126.25 -46.85 123.35 -51.45 113.25 Q-55.35 104.75 -56.05 102.4 -57.05 108.35 -57.15 112.65 L-57.55 112.65 -59.6 103.6 Q-60.75 98.45 -60.65 94.55 L-60.3 90.3 -59.8 85.95 M-8.45 55.75 L-8.55 55.25 -8.15 53.85 -8.1 53.8 -8.0 52.55 -7.65 50.65 -7.6 50.4 -7.35 49.75 -7.6 48.4 -7.7 48.0 -8.55 43.45 -8.65 42.45 -8.75 41.95 Q-8.7 39.7 -7.0 39.85 L-5.9 38.8 -5.4 38.55 Q-3.25 37.65 0.85 37.8 L6.5 38.6 Q8.05 39.0 8.7 39.45 L9.1 39.95 Q9.05 40.8 7.65 41.4 L3.75 41.3 -3.35 41.05 -4.35 41.25 Q-3.95 41.8 -3.7 42.45 L-3.55 42.9 -3.4 43.45 -1.25 48.0 -0.55 49.25 Q1.6 52.95 7.6 56.5 L7.9 56.7 8.15 56.85 11.45 58.55 Q11.0 58.75 10.45 59.1 L9.25 59.95 8.85 60.35 5.85 58.9 Q3.65 57.75 2.35 56.85 L1.85 56.5 1.5 56.25 Q-1.9 53.6 -4.4 48.9 L-4.8 48.9 -5.15 65.4 Q-7.65 62.15 -8.1 58.85 L-8.2 57.05 -8.2 56.85 -8.2 56.5 -8.2 56.35 -8.45 55.75 M38.3 45.5 Q37.7 45.1 36.85 43.45 L36.65 42.9 37.85 42.45 Q46.5 39.4 51.35 42.15 L51.95 42.45 52.65 43.05 53.3 43.2 54.05 43.45 Q57.3 44.65 57.25 47.4 L57.2 48.0 56.7 55.9 56.65 56.5 56.4 59.05 Q55.8 64.1 55.05 64.3 L54.45 65.2 53.75 66.0 53.55 66.2 52.25 67.6 49.65 69.75 48.25 70.8 47.4 71.25 47.55 70.25 47.6 69.75 47.95 66.55 Q48.85 59.55 49.55 56.5 L49.8 55.3 49.85 53.15 43.95 56.5 39.3 59.0 38.55 59.4 36.75 60.15 34.65 60.8 34.35 60.75 32.75 60.2 Q31.2 59.6 30.6 59.1 34.25 58.1 38.0 56.5 40.7 55.35 43.45 53.8 46.55 52.0 50.75 49.1 51.75 48.4 52.45 48.0 L53.5 47.4 53.55 47.0 53.1 46.8 51.5 46.1 48.0 44.8 43.75 44.3 Q41.9 44.45 40.2 45.3 L39.5 45.55 Q38.8 45.75 38.4 45.55 L38.3 45.5 M95.0 75.9 L94.7 76.0 94.6 75.7 95.0 75.9 M-22.0 36.8 L-24.1 37.5 -24.7 37.75 -26.85 38.4 -35.85 41.05 -39.4 40.7 Q-42.2 40.3 -44.65 39.25 -33.05 38.95 -22.0 36.8 M-52.5 42.05 Q-56.95 41.0 -61.4 38.5 L-56.35 39.05 Q-54.5 40.8 -52.5 42.05 M-88.3 10.3 L-89.55 8.0 -90.1 6.9 Q-90.0 5.55 -89.2 4.5 L-87.9 6.05 Q-85.1 9.05 -81.95 10.5 -83.15 12.6 -83.5 14.9 -86.15 13.2 -88.3 10.3 M-91.65 3.5 Q-93.75 -1.95 -93.7 -5.9 L-93.55 -7.5 -93.55 -7.65 -93.5 -8.0 -93.4 -8.65 -93.25 -9.55 -93.1 -9.5 Q-90.25 -3.9 -87.6 -0.7 L-86.5 0.45 -87.9 0.25 Q-88.7 0.25 -89.45 0.75 -91.6 -1.3 -92.6 -3.7 -91.8 0.4 -90.85 2.05 L-91.65 3.5 M-83.4 2.85 L-83.35 2.9 Q-80.25 4.65 -76.1 5.15 -77.45 5.55 -78.65 6.55 -82.05 5.55 -85.25 3.75 L-86.75 2.85 -85.2 2.6 -83.55 2.85 -83.4 2.85 M-67.6 4.95 L-65.65 4.7 Q-60.75 3.95 -55.05 2.4 L-59.4 5.5 Q-65.95 7.55 -71.15 7.55 L-72.4 7.55 Q-70.4 5.7 -67.6 4.95 M-43.6 -1.5 L-43.4 -1.55 -43.2 -1.65 -43.1 -1.7 -33.1 -5.75 -26.95 -8.35 Q-31.65 -5.8 -34.55 -1.85 -44.8 3.55 -52.5 9.1 L-55.25 10.75 Q-53.55 6.4 -50.4 3.3 -47.7 0.55 -44.0 -1.25 L-43.8 -1.35 -43.6 -1.5 M-9.35 -15.7 L-6.8 -16.7 1.15 -19.8 -0.25 -16.7 -11.9 -12.25 -19.05 -9.25 Q-14.65 -13.25 -9.35 -15.7 M-75.65 11.85 L-75.55 11.9 Q-69.75 11.9 -63.25 9.65 -64.7 11.95 -65.35 15.05 -72.15 17.5 -74.5 17.5 L-77.2 17.3 Q-76.85 14.35 -75.65 11.9 L-75.65 11.85" fill="#e3a220" fill-rule="evenodd" stroke="none"/>
    <path d="M133.5 10.3 L133.5 10.35 128.45 17.7 126.75 19.85 127.05 17.15 127.05 15.75 128.5 14.9 Q131.25 13.2 133.5 10.3 M47.65 -14.0 L46.65 -16.7 58.1 -12.25 65.15 -9.25 67.25 -7.15 Q72.25 -1.75 73.85 4.2 63.8 0.45 53.55 -2.2 L53.45 -2.6 Q53.1 -3.9 47.65 -14.0 M82.2 7.45 L84.2 8.35 Q83.65 4.4 82.15 1.3 L80.35 -1.85 Q90.3 3.55 97.8 9.1 L100.45 10.75 101.0 12.35 101.7 16.05 Q91.75 11.45 84.2 8.35 84.75 11.55 84.65 15.3 84.5 23.35 80.75 28.7 L77.55 27.4 Q82.7 21.8 82.9 13.9 82.95 10.55 82.2 7.45 M122.1 17.3 L122.2 19.05 121.85 22.0 120.5 22.05 Q116.95 22.05 110.65 19.8 110.5 27.7 104.1 35.2 L103.45 35.2 102.5 35.2 Q105.9 31.7 107.75 26.9 109.25 23.1 109.15 19.25 L110.6 19.8 110.65 19.75 Q110.7 17.15 110.35 15.05 117.05 17.5 119.4 17.5 L122.1 17.3 M-81.95 19.85 L-83.55 17.7 -88.3 10.35 -88.3 10.3 Q-86.15 13.2 -83.5 14.9 L-82.05 15.75 -82.15 17.15 -81.95 19.85 M-0.25 -16.7 L-1.35 -14.0 Q-7.3 -3.9 -7.65 -2.6 L-7.75 -2.2 Q-18.1 0.45 -28.35 4.2 -26.55 -1.75 -21.25 -7.15 L-19.05 -9.25 -11.9 -12.25 -0.25 -16.7 M-55.25 10.75 L-52.5 9.1 Q-44.8 3.55 -34.55 -1.85 L-36.55 1.3 Q-38.15 4.4 -38.9 8.35 -37.85 7.85 -36.8 7.45 -37.75 10.55 -37.8 13.9 -38.0 21.8 -33.05 27.4 L-36.25 28.7 Q-39.8 23.35 -39.65 15.3 -39.55 11.55 -38.9 8.35 -46.55 11.45 -56.7 16.05 L-55.8 12.35 -55.25 10.75 M-64.25 19.25 Q-64.55 23.1 -63.25 26.9 -61.6 31.7 -58.3 35.2 L-59.25 35.2 -59.9 35.2 Q-66.0 27.7 -65.85 19.8 -72.25 22.05 -75.8 22.05 L-77.15 22.0 -77.3 19.05 -77.2 17.3 -74.5 17.5 Q-72.15 17.5 -65.35 15.05 -65.8 17.15 -65.85 19.75 L-65.8 19.8 -64.25 19.25" fill="#824a12" fill-rule="evenodd" stroke="none"/>
    <path d="M125.9 20.9 L123.15 24.0 120.35 26.85 Q121.45 24.35 121.85 22.0 123.85 21.75 125.9 20.9 M32.35 12.4 Q34.0 9.05 37.2 6.65 L49.7 -3.15 50.2 -3.6 Q49.3 -9.05 47.65 -14.0 53.1 -3.9 53.45 -2.6 L53.55 -2.2 Q54.0 0.0 53.9 4.9 53.75 10.75 51.4 17.35 41.6 14.2 32.35 12.4 M109.15 19.25 Q109.25 23.1 107.75 26.9 105.9 31.7 102.5 35.2 99.6 35.05 95.75 34.15 97.5 32.2 98.85 29.75 102.55 23.1 101.7 16.05 L104.1 17.15 109.15 19.25 M82.2 7.45 Q82.95 10.55 82.9 13.9 82.7 21.8 77.55 27.4 L70.2 24.45 Q74.4 18.35 74.55 10.25 74.65 7.2 73.85 4.2 L79.9 6.55 82.2 7.45 M82.45 98.35 L83.7 98.95 86.1 100.1 86.1 100.45 86.1 103.9 83.85 102.95 82.35 102.3 82.4 101.55 82.45 98.35 M53.2 99.9 L53.4 100.1 54.8 105.6 54.65 105.75 Q49.25 110.9 44.9 113.45 37.15 117.85 21.55 118.45 6.0 117.85 -1.55 113.45 -4.75 111.55 -8.4 108.2 L-8.45 100.7 Q-2.2 106.35 4.6 109.25 11.7 112.2 19.5 112.2 L21.7 112.15 23.85 112.2 Q31.65 112.2 38.9 109.25 46.15 106.2 52.8 100.25 L53.2 99.9 M-75.85 26.85 L-78.45 24.0 -81.1 20.9 Q-79.05 21.75 -77.15 22.0 -76.85 24.35 -75.85 26.85 M-1.35 -14.0 Q-3.2 -9.05 -4.4 -3.6 L-3.9 -3.15 Q1.2 1.3 8.2 6.65 11.3 9.05 12.75 12.4 3.5 14.2 -6.5 17.35 -8.55 10.75 -8.4 4.9 -8.3 0.0 -7.75 -2.2 L-7.65 -2.6 Q-7.3 -3.9 -1.35 -14.0 M-38.2 102.15 L-38.25 102.15 -40.1 102.95 -40.85 103.3 -41.0 102.95 -40.7 99.4 -39.75 98.95 -37.9 98.15 -38.2 102.15 M-36.8 7.45 L-34.5 6.55 -28.35 4.2 Q-29.25 7.2 -29.35 10.25 -29.5 18.35 -25.6 24.45 L-33.05 27.4 Q-38.0 21.8 -37.8 13.9 -37.75 10.55 -36.8 7.45 M-64.25 19.25 L-59.2 17.15 -56.7 16.05 Q-57.85 23.1 -54.45 29.75 -53.2 32.2 -51.55 34.15 L-58.3 35.2 Q-61.6 31.7 -63.25 26.9 -64.55 23.1 -64.25 19.25" fill="#3d3730" fill-rule="evenodd" stroke="none"/>
    <path d="M67.75 -10.6 L69.8 -9.75 72.95 -8.35 Q77.55 -5.8 80.35 -1.85 L75.0 -4.6 Q72.15 -7.45 67.75 -10.6 M95.35 0.75 L100.65 2.4 104.8 5.5 107.35 7.9 108.55 9.65 Q109.9 11.95 110.35 15.05 L108.8 14.4 108.35 14.25 108.25 13.85 Q107.35 10.95 105.75 8.55 104.2 6.25 102.05 4.5 99.25 2.15 95.35 0.75 M119.25 5.3 L121.6 5.15 Q122.85 5.55 124.05 6.55 L125.9 8.5 127.15 10.5 Q128.25 12.6 128.5 14.9 L127.05 15.75 Q126.9 13.0 126.05 11.0 125.6 9.75 124.8 8.85 123.9 7.7 122.65 6.9 121.2 5.9 119.25 5.3 M120.35 26.85 L114.85 32.0 114.55 32.25 112.45 33.9 Q108.45 35.1 104.1 35.2 L103.35 36.05 100.35 39.05 97.25 39.25 Q100.25 37.5 102.5 35.2 L103.45 35.2 104.1 35.2 Q110.5 27.7 110.65 19.8 116.95 22.05 120.5 22.05 L121.85 22.0 Q121.45 24.35 120.35 26.85 M65.2 36.45 L61.3 35.1 Q69.4 34.55 75.5 29.35 L77.55 27.4 80.75 28.7 79.25 30.65 Q73.9 36.45 65.25 36.45 L65.2 36.45 M53.55 -2.2 Q63.8 0.45 73.85 4.2 74.65 7.2 74.55 10.25 74.4 18.35 70.2 24.45 L65.75 22.6 Q58.4 19.65 51.4 17.35 53.75 10.75 53.9 4.9 54.0 0.0 53.55 -2.2 M101.7 16.05 Q102.55 23.1 98.85 29.75 97.5 32.2 95.75 34.15 91.85 33.1 86.85 31.25 L80.75 28.7 Q84.5 23.35 84.65 15.3 84.75 11.55 84.2 8.35 91.75 11.45 101.7 16.05 M80.7 151.8 L79.9 152.95 79.2 154.05 77.1 157.65 76.75 157.5 76.65 157.45 76.4 157.5 76.8 156.65 77.1 157.65 76.85 156.55 77.3 155.55 78.85 151.0 80.75 143.15 82.3 134.1 83.85 125.75 84.55 124.1 87.3 117.7 85.2 127.1 82.5 137.65 82.5 138.1 88.5 131.15 95.55 122.9 Q94.2 124.75 89.95 133.0 84.95 142.6 80.7 151.8 M40.8 243.25 Q33.45 245.65 25.25 246.7 L25.65 241.4 25.75 240.55 Q15.35 238.5 4.5 233.7 -9.5 227.55 -16.3 221.3 -13.65 221.35 -12.85 221.75 L-3.75 221.75 -3.75 221.3 -13.85 215.7 -13.8 215.65 Q-10.3 217.85 1.1 219.15 L18.1 220.0 18.25 220.1 9.4 221.6 -1.55 223.45 Q-0.05 225.25 14.2 230.05 L26.3 233.6 27.05 223.85 25.0 222.45 22.8 221.3 Q32.6 217.75 34.2 215.35 L29.4 215.35 Q28.7 216.05 26.45 216.15 L22.45 216.2 12.5 215.35 9.05 214.85 2.55 213.65 Q5.6 213.65 12.9 212.15 L20.9 210.3 Q12.15 211.8 1.2 207.05 -8.8 202.75 -15.35 195.8 L-12.4 197.6 Q-9.05 199.35 -3.9 200.9 L4.85 203.2 Q17.05 206.0 25.2 206.0 L26.4 206.0 Q33.9 205.85 39.55 204.1 43.05 203.0 54.4 198.05 L55.5 197.5 54.3 198.55 Q51.5 200.55 43.6 204.4 33.85 209.15 30.85 209.85 L30.6 210.3 30.35 210.65 35.6 210.65 Q47.65 208.55 50.1 207.7 L50.1 207.95 Q50.2 208.15 50.5 208.15 49.6 210.0 43.9 214.25 L43.1 214.85 Q38.05 218.6 35.4 219.6 40.8 220.25 46.3 219.6 L46.5 219.6 Q46.7 219.75 46.7 220.4 L45.25 226.65 41.95 228.95 Q36.95 232.6 35.95 234.0 L44.3 230.45 50.75 227.6 53.15 227.6 45.85 233.4 43.35 235.3 43.15 235.0 43.0 235.5 41.15 242.1 40.8 243.25 M-37.0 153.85 Q-39.5 152.15 -47.1 136.3 L-50.25 129.6 -51.35 125.35 -48.35 129.95 -47.0 132.2 -45.0 135.1 -44.1 135.1 Q-44.5 124.35 -43.7 119.3 -43.0 114.55 -41.45 110.55 L-41.3 110.6 -41.05 119.25 Q-40.6 128.95 -39.7 137.15 -38.55 147.5 -36.8 153.8 L-37.0 153.85 M34.35 60.75 L34.65 60.8 36.75 60.15 38.55 59.4 39.3 59.05 39.1 62.7 38.65 69.75 38.6 71.0 38.75 74.75 Q34.65 76.15 33.35 77.5 L32.85 78.15 Q31.6 80.55 31.3 88.15 30.15 94.55 23.7 94.55 19.65 94.55 17.95 91.9 17.25 90.85 16.8 88.9 L15.8 80.05 15.4 77.5 14.25 71.85 Q14.1 70.85 12.7 69.75 11.4 68.75 8.95 67.6 6.1 66.3 4.2 65.05 2.3 63.7 1.4 62.5 L4.65 59.8 5.85 58.9 8.85 60.35 9.25 59.95 12.5 60.75 Q23.45 63.1 34.35 60.75 M-17.1 35.1 L-21.1 36.45 -21.15 36.45 Q-29.8 36.45 -34.85 30.65 L-36.25 28.7 -33.05 27.4 -31.1 29.35 Q-25.2 34.55 -17.1 35.1 M-68.25 33.9 L-70.25 32.25 -70.55 32.0 -75.85 26.85 Q-76.85 24.35 -77.15 22.0 L-75.8 22.05 Q-72.25 22.05 -65.85 19.8 -66.0 27.7 -59.9 35.2 L-59.25 35.2 -58.3 35.2 Q-56.15 37.5 -53.25 39.25 L-56.35 39.05 -59.25 36.05 -59.9 35.2 Q-64.25 35.1 -68.25 33.9 M-76.1 5.15 L-73.75 5.3 Q-75.8 5.9 -77.25 6.9 -78.6 7.7 -79.5 8.85 -80.3 9.75 -80.85 11.0 -81.8 13.0 -82.05 15.75 L-83.5 14.9 Q-83.15 12.6 -81.95 10.5 L-80.6 8.5 -78.65 6.55 Q-77.45 5.55 -76.1 5.15 M-55.05 2.4 L-49.75 0.75 Q-53.65 2.15 -56.55 4.5 -58.8 6.25 -60.45 8.55 -62.15 10.95 -63.15 13.85 L-63.25 14.25 -63.7 14.4 -65.35 15.05 Q-64.7 11.95 -63.25 9.65 L-62.05 7.9 -59.4 5.5 -55.05 2.4 M-26.95 -8.35 L-23.7 -9.75 Q-22.7 -10.15 -21.65 -10.6 -26.15 -7.45 -29.1 -4.6 L-34.55 -1.85 Q-31.65 -5.8 -26.95 -8.35 M-7.75 -2.2 Q-8.3 0.0 -8.4 4.9 -8.55 10.75 -6.5 17.35 -13.6 19.65 -21.05 22.6 L-25.6 24.45 Q-29.5 18.35 -29.35 10.25 -29.25 7.2 -28.35 4.2 -18.1 0.45 -7.75 -2.2 M-38.9 8.35 Q-39.55 11.55 -39.65 15.3 -39.8 23.35 -36.25 28.7 L-42.55 31.25 Q-47.55 33.1 -51.55 34.15 -53.2 32.2 -54.45 29.75 -57.85 23.1 -56.7 16.05 -46.55 11.45 -38.9 8.35" fill="#915314" fill-rule="evenodd" stroke="none"/>
    <path d="M126.75 19.85 L125.9 20.9 Q123.85 21.75 121.85 22.0 L122.2 19.05 122.1 17.3 Q124.75 16.95 127.05 15.75 L127.05 17.15 126.75 19.85 M65.15 -9.25 L75.0 -4.6 77.1 -2.3 Q80.85 2.2 82.2 7.45 L79.9 6.55 73.85 4.2 Q72.25 -1.75 67.25 -7.15 L65.15 -9.25 M109.15 19.25 L104.1 17.15 101.7 16.05 101.0 12.35 100.45 10.75 Q103.45 12.3 108.35 14.25 109.1 16.75 109.15 19.25 M-81.1 20.9 L-81.95 19.85 -82.15 17.15 -82.05 15.75 Q-79.75 16.95 -77.2 17.3 L-77.3 19.05 -77.15 22.0 Q-79.05 21.75 -81.1 20.9 M-29.1 -4.6 L-19.05 -9.25 -21.25 -7.15 Q-26.55 -1.75 -28.35 4.2 L-34.5 6.55 -36.8 7.45 Q-35.25 2.2 -31.3 -2.3 L-29.1 -4.6 M-55.25 10.75 L-55.8 12.35 -56.7 16.05 -59.2 17.15 -64.25 19.25 Q-64.1 16.75 -63.25 14.25 -58.25 12.3 -55.25 10.75" fill="#2b2621" fill-rule="evenodd" stroke="none"/>
    <path d="M75.0 -4.6 L80.35 -1.85 82.15 1.3 Q83.65 4.4 84.2 8.35 L82.2 7.45 Q80.85 2.2 77.1 -2.3 L75.0 -4.6 M108.35 14.25 L108.8 14.4 110.35 15.05 Q110.7 17.15 110.65 19.75 L110.6 19.8 109.15 19.25 Q109.1 16.75 108.35 14.25 M-29.1 -4.6 L-31.3 -2.3 Q-35.25 2.2 -36.8 7.45 -37.85 7.85 -38.9 8.35 -38.15 4.4 -36.55 1.3 L-34.55 -1.85 -29.1 -4.6 M-65.35 15.05 L-63.7 14.4 -63.25 14.25 Q-64.1 16.75 -64.25 19.25 L-65.8 19.8 -65.85 19.75 Q-65.8 17.15 -65.35 15.05" fill="#6e3e0f" fill-rule="evenodd" stroke="none"/>
    <path d="M89.3 -1.5 L89.75 -1.35 95.35 0.75 Q99.25 2.15 102.05 4.5 L101.35 4.2 Q96.1 2.1 89.75 -1.35 L89.7 -1.25 89.5 -1.35 89.3 -1.5 M113.1 4.95 L116.5 5.25 118.65 5.3 119.25 5.3 Q121.2 5.9 122.65 6.9 L117.8 7.55 Q115.8 5.7 113.1 4.95 M129.1 2.8 L129.9 2.25 132.2 0.45 133.6 0.25 Q134.4 0.25 135.05 0.75 L132.35 2.85 130.8 2.6 129.15 2.85 129.1 2.8 M137.15 3.5 L135.5 6.9 Q135.4 5.55 134.7 4.5 L136.45 2.05 Q137.0 2.8 137.15 3.5 M90.4 42.75 L88.85 42.75 Q84.1 42.25 79.75 41.05 L83.3 40.7 Q86.2 40.3 88.65 39.25 L92.5 39.3 97.25 39.25 95.45 40.25 90.4 42.75 M100.45 10.75 Q98.95 6.4 95.9 3.3 99.75 5.75 103.6 7.55 L105.75 8.55 Q107.35 10.95 108.25 13.85 L108.35 14.25 Q103.45 12.3 100.45 10.75 M126.05 11.0 Q126.9 13.0 127.05 15.75 124.75 16.95 122.1 17.3 121.95 14.35 120.85 11.9 123.55 11.9 126.05 11.0 M-35.85 41.05 Q-40.2 42.25 -44.95 42.75 L-46.5 42.75 -51.45 40.25 -53.25 39.25 -48.5 39.3 -44.65 39.25 Q-42.2 40.3 -39.4 40.7 L-35.85 41.05 M-90.1 6.9 L-91.65 3.5 -90.85 2.05 -89.2 4.5 Q-90.0 5.55 -90.1 6.9 M-86.5 0.45 L-84.3 2.25 -83.5 2.8 -83.55 2.85 -85.2 2.6 -86.75 2.85 -89.45 0.75 Q-88.7 0.25 -87.9 0.25 L-86.5 0.45 M-73.75 5.3 L-73.15 5.3 -71.0 5.25 -67.6 4.95 Q-70.4 5.7 -72.4 7.55 L-77.25 6.9 Q-75.8 5.9 -73.75 5.3 M-49.75 0.75 L-44.05 -1.35 -43.6 -1.5 -43.8 -1.35 -44.0 -1.25 -44.05 -1.35 Q-50.5 2.1 -55.85 4.2 L-56.55 4.5 Q-53.65 2.15 -49.75 0.75 M-50.4 3.3 Q-53.55 6.4 -55.25 10.75 -58.25 12.3 -63.25 14.25 L-63.15 13.85 Q-62.15 10.95 -60.45 8.55 L-58.2 7.55 Q-54.35 5.75 -50.4 3.3 M-82.05 15.75 Q-81.8 13.0 -80.85 11.0 -78.35 11.9 -75.65 11.9 -76.85 14.35 -77.2 17.3 -79.75 16.95 -82.05 15.75" fill="#706559" fill-rule="evenodd" stroke="none"/>
    <path d="M95.9 3.3 Q93.4 0.55 89.7 -1.25 L89.75 -1.35 Q96.1 2.1 101.35 4.2 L102.05 4.5 Q104.2 6.25 105.75 8.55 L103.6 7.55 Q99.75 5.75 95.9 3.3 M135.05 0.75 Q135.7 1.1 136.25 1.75 L136.45 2.05 134.7 4.5 134.2 3.9 Q133.4 3.15 132.35 2.85 L135.05 0.75 M122.65 6.9 Q123.9 7.7 124.8 8.85 125.6 9.75 126.05 11.0 123.55 11.9 120.85 11.9 L120.85 11.85 119.6 9.6 117.8 7.55 122.65 6.9 M-44.0 -1.25 Q-47.7 0.55 -50.4 3.3 -54.35 5.75 -58.2 7.55 L-60.45 8.55 Q-58.8 6.25 -56.55 4.5 L-55.85 4.2 Q-50.5 2.1 -44.05 -1.35 L-44.0 -1.25 M-72.4 7.55 L-74.3 9.6 -75.65 11.85 -75.65 11.9 Q-78.35 11.9 -80.85 11.0 -80.3 9.75 -79.5 8.85 -78.6 7.7 -77.25 6.9 L-72.4 7.55 M-86.75 2.85 Q-87.9 3.15 -88.7 3.9 L-89.2 4.5 -90.85 2.05 -90.65 1.75 -89.45 0.75 -86.75 2.85" fill="#8f8072" fill-rule="evenodd" stroke="none"/>
    <path d="M129.0 2.85 L129.1 2.8 129.15 2.85 129.0 2.85 M139.2 -9.5 L139.35 -9.6 139.35 -9.55 139.2 -9.5 M112.45 33.9 Q108.9 36.6 105.4 38.5 L100.35 39.05 96.4 42.05 90.4 42.75 95.45 40.25 97.25 39.25 100.35 39.05 103.35 36.05 104.1 35.2 Q108.45 35.1 112.45 33.9 M66.1 36.8 L65.2 36.45 65.25 36.45 Q73.9 36.45 79.25 30.65 L80.75 28.7 86.85 31.25 Q91.85 33.1 95.75 34.15 92.75 37.55 88.65 39.25 77.05 38.95 66.1 36.8 M55.2 32.85 L55.1 32.8 45.4 29.0 Q48.45 24.85 50.7 19.35 L51.4 17.35 Q58.4 19.65 65.75 22.6 L70.2 24.45 69.15 25.9 Q63.6 32.8 55.2 32.8 L55.2 32.85 M-1.0 29.0 L-10.8 32.8 -10.9 32.85 -10.9 32.8 Q-19.3 32.8 -24.55 25.9 L-25.6 24.45 -21.05 22.6 Q-13.6 19.65 -6.5 17.35 L-5.8 19.35 Q-3.85 24.85 -1.0 29.0 M-21.1 36.45 L-22.0 36.8 Q-33.05 38.95 -44.65 39.25 -48.65 37.55 -51.55 34.15 -47.55 33.1 -42.55 31.25 L-36.25 28.7 -34.85 30.65 Q-29.8 36.45 -21.15 36.45 L-21.1 36.45 M-46.5 42.75 L-52.5 42.05 Q-54.5 40.8 -56.35 39.05 L-53.25 39.25 -51.45 40.25 -46.5 42.75 M-61.4 38.5 Q-64.8 36.6 -68.25 33.9 -64.25 35.1 -59.9 35.2 L-59.25 36.05 -56.35 39.05 -61.4 38.5 M-93.25 -9.55 L-93.25 -9.6 -93.1 -9.5 -93.25 -9.55 M-83.5 2.8 L-83.4 2.85 -83.55 2.85 -83.5 2.8" fill="#b36d19" fill-rule="evenodd" stroke="none"/>
    <path d="M136.45 2.05 L136.25 1.75 Q135.7 1.1 135.05 0.75 137.3 -1.3 138.4 -3.7 137.5 0.4 136.45 2.05 M132.35 2.85 Q133.4 3.15 134.2 3.9 L134.7 4.5 133.3 6.05 Q130.4 9.05 127.15 10.5 L125.9 8.5 124.05 6.55 Q127.45 5.55 130.75 3.75 L132.35 2.85 M117.8 7.55 L119.6 9.6 120.85 11.85 120.75 11.9 Q114.95 11.9 108.55 9.65 L107.35 7.9 104.8 5.5 Q111.35 7.55 116.55 7.55 L117.8 7.55 M-59.4 5.5 L-62.05 7.9 -63.25 9.65 Q-69.75 11.9 -75.55 11.9 L-75.65 11.85 -74.3 9.6 -72.4 7.55 -71.15 7.55 Q-65.95 7.55 -59.4 5.5 M-78.65 6.55 L-80.6 8.5 -81.95 10.5 Q-85.1 9.05 -87.9 6.05 L-89.2 4.5 -88.7 3.9 Q-87.9 3.15 -86.75 2.85 L-85.25 3.75 Q-82.05 5.55 -78.65 6.55 M-89.45 0.75 L-90.65 1.75 -90.85 2.05 Q-91.8 0.4 -92.6 -3.7 -91.6 -1.3 -89.45 0.75" fill="#ffc040" fill-rule="evenodd" stroke="none"/>
    <path d="M61.3 35.1 L59.5 34.45 57.15 33.6 55.2 32.85 55.2 32.8 Q63.6 32.8 69.15 25.9 L70.2 24.45 77.55 27.4 75.5 29.35 Q69.4 34.55 61.3 35.1 M45.4 29.0 L30.95 23.4 Q30.25 17.0 32.35 12.4 41.6 14.2 51.4 17.35 L50.7 19.35 Q48.45 24.85 45.4 29.0 M95.75 34.15 Q99.6 35.05 102.5 35.2 100.25 37.5 97.25 39.25 L92.5 39.3 88.65 39.25 Q92.75 37.55 95.75 34.15 M53.2 99.9 L53.3 99.8 55.45 97.75 60.0 92.65 62.6 89.25 74.0 94.45 82.45 98.35 82.4 101.55 82.35 102.3 69.65 96.8 65.15 94.85 54.8 105.6 53.4 100.1 53.2 99.9 M12.75 12.4 Q14.75 17.0 13.75 23.4 L-1.0 29.0 Q-3.85 24.85 -5.8 19.35 L-6.5 17.35 Q3.5 14.2 12.75 12.4 M-10.9 32.85 L-12.95 33.6 -15.3 34.45 -17.1 35.1 Q-25.2 34.55 -31.1 29.35 L-33.05 27.4 -25.6 24.45 -24.55 25.9 Q-19.3 32.8 -10.9 32.8 L-10.9 32.85 M-8.4 108.2 L-11.0 105.75 -21.1 94.85 -25.6 96.8 -36.0 101.25 -38.2 102.15 -37.9 98.15 -29.85 94.45 -18.25 89.25 -15.85 92.65 -11.5 97.75 -9.0 100.2 -8.45 100.7 -8.4 108.2 M-58.3 35.2 L-51.55 34.15 Q-48.65 37.55 -44.65 39.25 L-48.5 39.3 -53.25 39.25 Q-56.15 37.5 -58.3 35.2" fill="#5c5349" fill-rule="evenodd" stroke="none"/>
    <path d="M-5.9 38.8 L-5.5 38.55 -5.4 38.55 -5.9 38.8 M8.7 39.45 L18.05 40.8 23.4 41.95 25.85 42.45 28.9 43.15 28.9 43.1 31.3 43.45 33.35 43.75 34.45 43.9 Q35.3 45.3 36.9 45.4 L38.3 45.5 38.4 45.55 Q38.8 45.75 39.5 45.55 L43.5 45.55 Q43.55 44.85 43.75 44.3 L48.0 44.8 51.5 46.1 53.1 46.8 53.55 47.0 53.5 47.4 52.45 48.0 Q51.75 48.4 50.75 49.1 46.55 52.0 43.45 53.8 40.7 55.35 38.0 56.5 34.25 58.1 30.6 59.1 25.1 60.5 19.7 60.5 15.9 60.5 11.45 58.55 L8.15 56.85 7.9 56.7 7.6 56.5 Q1.6 52.95 -0.55 49.25 L-1.25 48.0 -3.4 43.45 -3.55 42.9 -3.7 42.45 Q-3.95 41.8 -4.35 41.25 L-3.35 41.05 3.75 41.3 7.65 41.4 Q9.05 40.8 9.1 39.95 L8.7 39.45" fill="#3c2209" fill-rule="evenodd" stroke="none"/>
    <path d="M76.65 157.7 Q73.55 162.2 68.9 167.65 L63.45 173.5 Q62.7 175.8 62.7 176.95 L63.25 178.35 64.05 180.05 64.25 180.45 58.8 185.95 54.65 189.3 54.5 185.85 Q54.15 179.35 57.55 177.25 L57.7 177.15 57.5 177.1 57.3 176.7 52.1 176.3 Q58.1 172.25 62.75 167.15 L64.3 165.85 Q73.55 158.1 76.65 157.7 M-23.85 177.15 L-23.85 177.1 Q-28.15 169.45 -32.55 163.4 L-24.25 170.35 -15.0 178.0 -18.05 178.0 Q-17.4 179.0 -15.6 185.05 L-19.3 181.8 -22.75 178.35 -23.85 177.15 M-30.0 67.7 L-28.15 67.25 Q-18.1 60.7 -11.5 56.85 L-10.9 56.5 -10.5 56.25 -9.9 55.9 -8.45 55.75 -8.2 56.35 -8.2 56.5 -8.2 56.85 -8.2 57.05 -8.1 58.85 -8.4 72.4 -16.9 77.5 -19.7 79.15 -36.4 89.25 -34.1 79.85 -33.4 77.5 Q-32.1 73.05 -30.85 69.75 L-30.0 67.7 M56.4 59.05 L57.85 59.6 Q63.55 60.95 75.6 67.3 L75.65 67.35 79.4 69.25 80.4 69.75 81.8 70.55 Q81.75 74.95 82.15 85.1 L82.3 90.5 74.95 86.7 Q64.8 81.5 58.2 77.5 L54.75 75.35 53.35 74.5 53.55 66.2 53.75 66.0 54.45 65.2 55.05 64.3 Q55.8 64.1 56.4 59.05" fill="#783a54" fill-rule="evenodd" stroke="none"/>
    <path d="M84.7 71.4 Q85.5 73.95 86.65 82.85 L87.75 93.4 88.0 102.4 Q87.95 106.3 87.5 108.35 L87.0 110.65 86.95 112.65 Q87.65 110.7 89.35 107.5 91.5 103.4 92.8 102.4 L92.7 107.1 86.65 127.45 86.6 128.35 Q89.05 124.55 95.0 113.5 L100.65 102.65 101.55 100.7 102.0 100.7 101.95 103.3 101.75 103.8 Q101.05 105.3 100.7 107.95 L100.0 112.65 103.7 106.6 109.35 97.1 Q106.5 112.05 92.0 134.7 L80.7 151.8 Q84.95 142.6 89.95 133.0 94.2 124.75 95.55 122.9 L88.5 131.15 82.5 138.1 82.5 137.65 85.2 127.1 87.3 117.7 84.55 124.1 83.85 125.75 84.75 118.6 86.0 106.15 86.05 104.2 86.1 103.9 86.1 100.45 86.1 100.1 85.8 93.5 85.75 92.3 85.35 87.15 Q85.0 83.7 84.45 81.6 L83.65 71.65 83.65 71.4 Q84.3 71.25 84.7 71.4 M56.5 235.75 Q53.15 238.25 47.25 240.85 L45.45 241.6 40.8 243.25 41.15 242.1 43.0 235.5 43.15 235.0 43.35 235.3 45.85 233.4 53.15 227.6 50.75 227.6 44.3 230.45 35.95 234.0 Q36.95 232.6 41.95 228.95 L45.25 226.65 46.7 220.4 Q46.7 219.75 46.5 219.6 L46.3 219.6 Q40.8 220.25 35.4 219.6 38.05 218.6 43.1 214.85 L43.9 214.25 Q49.6 210.0 50.5 208.15 50.2 208.15 50.1 207.95 L50.1 207.7 Q47.65 208.55 35.6 210.65 L30.35 210.65 30.6 210.3 30.85 209.85 Q33.85 209.15 43.6 204.4 51.5 200.55 54.3 198.55 L55.5 197.5 54.4 198.05 Q43.05 203.0 39.55 204.1 33.9 205.85 26.4 206.0 L25.2 206.0 Q17.05 206.0 4.85 203.2 L-3.9 200.9 Q-9.05 199.35 -12.4 197.6 L-15.35 195.8 Q-8.8 202.75 1.2 207.05 12.15 211.8 20.9 210.3 L12.9 212.15 Q5.6 213.65 2.55 213.65 L9.05 214.85 12.5 215.35 22.45 216.2 26.45 216.15 Q28.7 216.05 29.4 215.35 L34.2 215.35 Q32.6 217.75 22.8 221.3 L25.0 222.45 27.05 223.85 26.3 233.6 14.2 230.05 Q-0.05 225.25 -1.55 223.45 L9.4 221.6 18.25 220.1 18.1 220.0 1.1 219.15 Q-10.3 217.85 -13.8 215.65 L-13.85 215.7 -3.75 221.3 -3.75 221.75 -12.85 221.75 Q-13.65 221.35 -16.3 221.3 -9.5 227.55 4.5 233.7 15.35 238.5 25.75 240.55 L25.65 241.4 25.25 246.7 25.05 246.7 25.05 246.75 Q19.2 247.05 12.8 246.6 0.45 245.75 -12.75 234.5 L-15.15 232.35 Q-16.85 229.6 -20.1 225.15 L-20.4 224.75 -20.55 224.55 -20.15 224.6 -20.25 220.2 -19.7 214.85 -19.15 209.4 Q-19.15 208.05 -20.4 207.3 -21.7 206.5 -21.65 205.35 -21.65 205.0 -19.65 202.0 -17.7 198.95 -17.65 197.9 -17.65 196.1 -20.55 192.2 -23.5 188.25 -23.5 187.1 L-20.95 183.9 -19.3 181.8 -15.6 185.05 Q-10.55 189.1 -4.85 192.05 5.1 197.1 16.95 198.55 L25.9 199.0 Q41.85 198.7 54.65 189.3 L58.8 185.95 59.05 186.4 Q60.5 188.9 60.45 189.85 60.45 191.2 57.95 193.75 55.5 196.3 55.5 196.85 60.45 208.0 60.45 208.5 60.45 209.45 58.9 211.15 57.3 212.8 57.3 213.2 L57.75 214.85 57.9 215.35 Q58.55 217.05 58.5 217.85 L57.5 224.5 Q56.7 231.0 56.5 235.75 M-50.25 129.6 L-52.75 124.2 -62.1 103.2 Q-62.65 99.45 -62.6 97.05 -62.6 94.8 -60.85 87.0 L-59.8 85.95 -60.3 90.3 -60.65 94.55 Q-60.75 98.45 -59.6 103.6 L-57.55 112.65 -57.15 112.65 Q-57.05 108.35 -56.05 102.4 -55.35 104.75 -51.45 113.25 L-46.85 123.35 -45.45 126.25 -46.75 120.45 -47.15 118.55 Q-48.8 109.75 -48.7 104.5 L-48.15 100.45 -47.65 95.95 -47.65 95.65 -47.2 95.65 -47.2 95.7 -46.4 101.95 -46.05 103.95 Q-44.95 111.3 -44.95 112.2 L-44.5 112.2 Q-43.95 109.2 -43.9 102.4 -43.8 97.3 -43.05 93.2 L-42.7 91.3 Q-41.35 85.2 -37.75 77.5 L-36.45 74.9 -36.45 74.95 -36.3 74.6 -36.25 74.5 -33.8 69.75 -33.35 68.95 -33.25 68.95 Q-32.2 67.45 -31.5 67.35 -30.9 67.3 -30.7 68.1 L-31.25 68.55 -32.2 69.75 -33.1 71.4 -34.35 74.4 -35.55 77.5 -36.3 80.15 -38.0 86.3 -39.3 90.95 Q-40.15 94.55 -40.6 98.35 L-40.65 98.95 -40.7 99.4 -41.0 102.95 -41.0 103.35 -41.3 110.15 -41.3 110.6 -41.45 110.55 Q-43.0 114.55 -43.7 119.3 -44.5 124.35 -44.1 135.1 L-45.0 135.1 -47.0 132.2 -48.35 129.95 -51.35 125.35 -50.25 129.6 M30.6 59.1 Q31.2 59.6 32.75 60.2 L34.35 60.75 Q23.45 63.1 12.5 60.75 L9.25 59.95 10.45 59.1 Q11.0 58.75 11.45 58.55 15.9 60.5 19.7 60.5 25.1 60.5 30.6 59.1 M38.55 59.4 L39.3 59.0 43.95 56.5 49.85 53.15 49.8 55.3 49.55 56.5 Q48.85 59.55 47.95 66.55 L47.6 69.75 47.55 70.25 47.4 71.25 47.0 71.5 Q45.55 72.4 38.85 74.7 L38.75 74.75 38.6 71.0 38.65 69.75 39.1 62.7 39.3 59.05 38.55 59.4 M5.85 58.9 L4.65 59.8 1.4 62.5 Q2.3 63.7 4.2 65.05 6.1 66.3 8.95 67.6 11.4 68.75 12.7 69.75 14.1 70.85 14.25 71.85 L15.4 77.5 15.8 80.05 16.8 88.9 16.2 85.85 Q15.55 80.9 14.9 79.2 L14.0 77.5 Q12.65 75.65 10.35 75.05 3.8 73.15 -0.7 69.75 L-2.05 68.65 -3.95 66.85 -5.15 65.4 -4.8 48.9 -4.4 48.9 Q-1.9 53.6 1.5 56.25 L1.85 56.5 2.35 56.85 Q3.65 57.75 5.85 58.9 M-36.8 153.8 L-36.75 154.05 -37.0 153.85 -36.8 153.8" fill="#b36919" fill-rule="evenodd" stroke="none"/>
    <path d="M76.65 157.65 L76.65 157.7 Q73.55 158.1 64.3 165.85 L62.75 167.15 Q58.1 172.25 52.1 176.3 L57.3 176.7 57.5 177.1 57.55 177.25 Q54.15 179.35 54.5 185.85 L54.65 189.3 Q41.85 198.7 25.9 199.0 25.1 193.55 24.3 192.5 25.05 192.5 29.3 191.1 L33.9 189.45 25.1 187.8 13.05 185.3 13.15 185.05 13.2 184.8 Q22.45 184.55 34.8 180.45 47.5 176.25 49.5 172.45 L47.3 172.45 61.2 159.9 Q72.55 149.1 76.65 141.5 L77.35 138.8 Q81.85 120.95 82.35 102.3 L83.85 102.95 86.1 103.9 86.05 104.2 86.0 106.15 84.75 118.6 83.85 125.75 82.3 134.1 80.75 143.15 78.85 151.0 77.3 155.55 76.85 156.55 76.7 155.35 76.45 155.3 76.8 156.65 76.4 157.5 76.65 157.65 M-32.55 163.4 L-34.7 160.5 -36.9 154.1 -36.75 154.05 -36.8 153.8 Q-38.55 147.5 -39.7 137.15 -40.6 128.95 -41.05 119.25 L-41.3 110.6 -41.3 110.15 -41.0 103.35 -40.85 103.3 -40.1 102.95 -38.25 102.15 -38.2 102.35 Q-38.35 110.25 -36.55 120.7 -34.45 132.35 -30.35 143.9 L-31.65 145.65 -31.8 145.85 -31.6 145.7 Q-30.05 148.6 -24.45 155.35 L-16.05 165.3 -16.25 165.65 Q-17.3 165.0 -21.5 162.9 -25.75 160.8 -28.1 159.3 L-20.6 168.15 Q-14.0 175.75 -9.35 181.8 -5.45 187.05 -4.85 192.05 -10.55 189.1 -15.6 185.05 -17.4 179.0 -18.05 178.0 L-15.0 178.0 -24.25 170.35 -32.55 163.4 M86.1 100.1 L83.7 98.95 82.45 98.35 82.3 90.5 85.75 92.3 85.8 93.5 86.1 100.1 M47.4 71.25 L48.25 70.8 53.35 74.5 52.8 100.25 Q46.15 106.2 38.9 109.25 31.65 112.2 23.85 112.2 L21.7 112.15 19.5 112.2 Q11.7 112.2 4.6 109.25 -2.2 106.35 -8.45 100.7 -8.5 99.55 -8.95 98.6 L-8.4 72.4 -3.95 69.75 -2.05 68.65 -0.7 69.75 Q3.8 73.15 10.35 75.05 12.65 75.65 14.0 77.5 L14.9 79.2 Q15.55 80.9 16.2 85.85 L16.8 88.9 Q17.25 90.85 17.95 91.9 19.65 94.55 23.7 94.55 30.15 94.55 31.3 88.15 31.6 80.55 32.85 78.15 L33.35 77.5 Q34.65 76.15 38.75 74.75 L38.85 74.7 Q45.55 72.4 47.0 71.5 L47.4 71.25 M54.65 105.75 L54.8 105.75 Q55.6 109.8 55.55 112.85 55.4 118.35 54.7 120.95 53.95 123.8 51.8 125.75 50.0 127.4 45.45 129.8 L34.15 135.55 39.8 135.55 52.1 134.3 Q56.65 133.75 58.15 133.0 L46.65 139.7 Q36.25 145.85 35.2 147.45 L47.85 147.45 Q48.65 146.6 50.0 146.6 47.45 152.05 43.7 160.85 40.8 167.05 38.7 167.4 L23.95 168.95 10.85 169.9 Q8.2 169.9 5.65 168.2 3.1 166.5 3.15 164.6 L4.35 160.4 5.55 155.95 -0.4 155.25 Q-3.25 154.55 -3.2 152.15 -3.15 150.4 -1.75 147.85 -0.35 145.35 -0.3 143.85 L-4.75 138.05 Q-8.2 133.05 -8.9 129.65 L-8.7 125.4 -8.7 125.35 -8.4 108.2 Q-4.75 111.55 -1.55 113.45 6.0 117.85 21.55 118.45 37.15 117.85 44.9 113.45 49.25 110.9 54.65 105.75 M-40.7 99.4 L-40.65 98.95 -40.6 98.35 Q-40.15 94.55 -39.3 90.95 L-36.4 89.25 Q-37.45 94.15 -37.9 98.15 L-39.75 98.95 -40.7 99.4" fill="#4d2431" fill-rule="evenodd" stroke="none"/>
    <path d="M76.75 157.5 L76.65 157.65 76.4 157.5 76.65 157.45 76.75 157.5 M-36.9 154.1 L-37.0 153.85 -36.75 154.05 -36.9 154.1 M-30.7 68.1 L-30.0 67.7 -30.85 69.75 Q-32.1 73.05 -33.4 77.5 L-34.1 79.85 -36.4 89.25 -19.7 79.15 -16.9 77.5 -8.4 72.4 -8.1 58.85 Q-7.65 62.15 -5.15 65.4 L-3.95 66.85 -2.05 68.65 -3.95 69.75 -8.4 72.4 -8.95 98.6 Q-8.5 99.55 -8.45 100.7 L-9.0 100.2 -11.5 97.75 -15.85 92.65 -18.25 89.25 -29.85 94.45 -37.9 98.15 Q-37.45 94.15 -36.4 89.25 L-39.3 90.95 -38.0 86.3 -36.3 80.15 -35.55 77.5 -34.35 74.4 -33.1 71.4 -32.2 69.75 -31.25 68.55 -30.7 68.1 M81.8 70.55 L82.5 70.95 83.65 71.65 84.45 81.6 Q85.0 83.7 85.35 87.15 L85.75 92.3 82.3 90.5 82.45 98.35 74.0 94.45 62.6 89.25 60.0 92.65 55.45 97.75 53.3 99.8 53.2 99.9 52.8 100.25 53.35 74.5 48.25 70.8 49.65 69.75 52.25 67.6 53.55 66.2 53.35 74.5 54.75 75.35 58.2 77.5 Q64.8 81.5 74.95 86.7 L82.3 90.5 82.15 85.1 Q81.75 74.95 81.8 70.55 M54.8 105.6 L65.15 94.85 69.65 96.8 82.35 102.3 Q81.85 120.95 77.35 138.8 L76.65 141.5 Q72.55 149.1 61.2 159.9 L47.3 172.45 49.5 172.45 Q47.5 176.25 34.8 180.45 22.45 184.55 13.2 184.8 L13.15 185.05 13.05 185.3 25.1 187.8 33.9 189.45 29.3 191.1 Q25.05 192.5 24.3 192.5 25.1 193.55 25.9 199.0 L16.95 198.55 Q5.1 197.1 -4.85 192.05 -5.45 187.05 -9.35 181.8 -14.0 175.75 -20.6 168.15 L-28.1 159.3 Q-25.75 160.8 -21.5 162.9 -17.3 165.0 -16.25 165.65 L-16.05 165.3 -24.45 155.35 Q-30.05 148.6 -31.6 145.7 L-31.8 145.85 -31.65 145.65 -30.35 143.9 Q-34.45 132.35 -36.55 120.7 -38.35 110.25 -38.2 102.35 L-38.25 102.15 -38.2 102.15 -36.0 101.25 -25.6 96.8 -21.1 94.85 -11.0 105.75 -8.4 108.2 -8.7 125.35 -8.7 125.4 -8.9 129.65 Q-8.2 133.05 -4.75 138.05 L-0.3 143.85 Q-0.35 145.35 -1.75 147.85 -3.15 150.4 -3.2 152.15 -3.25 154.55 -0.4 155.25 L5.55 155.95 4.35 160.4 3.15 164.6 Q3.1 166.5 5.65 168.2 8.2 169.9 10.85 169.9 L23.95 168.95 38.7 167.4 Q40.8 167.05 43.7 160.85 47.45 152.05 50.0 146.6 48.65 146.6 47.85 147.45 L35.2 147.45 Q36.25 145.85 46.65 139.7 L58.15 133.0 Q56.65 133.75 52.1 134.3 L39.8 135.55 34.15 135.55 45.45 129.8 Q50.0 127.4 51.8 125.75 53.95 123.8 54.7 120.95 55.4 118.35 55.55 112.85 55.6 109.8 54.8 105.75 L54.65 105.75 54.8 105.6 M57.55 177.25 L57.5 177.1 57.7 177.15 57.55 177.25 M-36.45 74.9 L-36.6 74.75 -36.3 74.6 -36.45 74.95 -36.45 74.9 M-40.85 103.3 L-41.0 103.35 -41.0 102.95 -40.85 103.3" fill="#5e2c3e" fill-rule="evenodd" stroke="none"/>
    <path d="M29.35 -30.35 Q32.65 -30.35 37.65 -28.8 L33.3 -27.95 Q29.65 -27.05 24.8 -25.25 L23.75 -24.85 13.25 -20.6 12.7 -20.4 13.2 -20.4 21.35 -21.85 24.75 -22.55 31.0 -23.35 Q32.55 -23.35 35.75 -22.1 39.2 -20.75 40.5 -20.6 L37.1 -22.95 Q34.2 -24.55 32.65 -24.9 L33.05 -25.0 35.4 -25.55 38.75 -25.85 Q40.45 -25.85 44.05 -24.6 L47.9 -23.35 48.25 -23.35 43.5 -27.95 42.0 -29.2 Q37.7 -32.8 36.3 -32.8 L24.95 -32.05 17.9 -31.6 13.75 -29.95 13.4 -29.75 9.2 -27.95 5.55 -26.3 -1.05 -20.75 Q7.05 -24.3 13.35 -26.55 L17.45 -27.95 24.9 -29.85 29.35 -30.35 M-2.75 -21.5 L-2.65 -21.5 -1.75 -22.5 -1.65 -22.65 -0.1 -24.1 0.05 -24.2 0.15 -24.25 2.05 -25.85 5.0 -27.95 Q8.95 -30.55 13.45 -32.1 18.6 -33.85 24.45 -34.15 L25.0 -34.15 27.0 -34.2 Q39.4 -34.2 48.85 -27.95 51.3 -26.3 53.55 -24.2 L54.25 -23.55 54.4 -23.3 Q55.7 -20.15 55.7 -18.85 55.65 -17.85 54.9 -16.45 L54.1 -14.8 54.4 -14.0 54.75 -13.15 Q55.4 -11.85 55.35 -10.6 55.35 -9.55 54.45 -8.45 53.45 -7.15 51.85 -7.15 50.35 -7.15 48.95 -8.65 L47.1 -11.0 Q46.2 -11.9 42.85 -14.0 L40.65 -15.35 34.35 -19.15 Q30.6 -21.1 26.85 -21.1 L24.75 -21.0 Q19.15 -20.4 13.15 -16.85 L8.1 -13.5 1.8 -8.2 Q-0.95 -5.9 -1.65 -5.9 -2.35 -5.9 -2.85 -7.15 -3.3 -8.2 -3.25 -9.35 L-3.25 -9.6 Q0.05 -13.05 5.4 -17.1 9.35 -20.15 13.25 -22.5 18.65 -25.8 23.9 -27.95 L24.9 -28.35 27.85 -29.4 24.9 -29.25 19.8 -27.95 Q16.85 -26.95 13.35 -25.35 L11.4 -24.4 Q2.2 -19.85 -2.4 -14.55 -2.45 -15.2 -3.0 -16.2 L-3.65 -18.15 Q-3.6 -20.1 -2.75 -21.5 M36.25 -23.5 Q43.6 -19.95 47.9 -15.2 45.95 -18.25 42.35 -21.1 37.7 -24.75 33.05 -25.0 L36.25 -23.5 M-2.5 -14.4 L-2.4 -14.55 -2.4 -14.3 -2.5 -14.4" fill="#edc221" fill-rule="evenodd" stroke="none"/>
    <path d="M-2.75 -21.5 Q-3.6 -20.1 -3.65 -18.15 L-3.0 -16.2 Q-2.45 -15.2 -2.4 -14.55 2.2 -19.85 11.4 -24.4 L13.35 -25.35 Q16.85 -26.95 19.8 -27.95 L24.9 -29.25 27.85 -29.4 24.9 -28.35 23.9 -27.95 Q18.65 -25.8 13.25 -22.5 9.35 -20.15 5.4 -17.1 0.05 -13.05 -3.25 -9.6 L-3.4 -9.45 -3.25 -9.35 Q-3.3 -8.2 -2.85 -7.15 -2.35 -5.9 -1.65 -5.9 -0.95 -5.9 1.8 -8.2 L8.1 -13.5 13.15 -16.85 Q19.15 -20.4 24.75 -21.0 L26.85 -21.1 Q30.6 -21.1 34.35 -19.15 L40.65 -15.35 42.85 -14.0 Q46.2 -11.9 47.1 -11.0 L48.95 -8.65 Q50.35 -7.15 51.85 -7.15 53.45 -7.15 54.45 -8.45 55.35 -9.55 55.35 -10.6 55.4 -11.85 54.75 -13.15 L54.4 -14.0 54.1 -14.8 54.9 -16.45 Q55.65 -17.85 55.7 -18.85 55.7 -20.15 54.4 -23.3 L54.5 -23.4 54.75 -23.1 56.0 -21.7 Q57.8 -19.6 58.9 -16.65 L59.75 -14.0 60.15 -11.85 59.95 -11.8 58.55 -12.1 57.05 -12.4 57.05 -11.65 59.15 -6.25 Q57.1 -0.55 57.05 1.75 57.0 3.0 59.95 15.25 57.4 19.55 53.45 23.3 L53.75 22.6 Q55.85 18.05 55.9 15.25 L55.85 13.65 57.45 14.45 57.8 14.45 Q56.85 6.4 54.1 0.15 L53.5 -1.05 Q49.5 -9.3 42.3 -12.8 L42.2 -12.85 42.25 -12.8 43.85 -9.9 Q40.0 -12.75 35.45 -14.0 31.5 -15.1 27.05 -15.1 L26.9 -15.1 24.6 -15.0 Q21.5 -14.8 18.7 -14.0 15.05 -13.0 11.85 -11.1 L12.85 -11.95 15.1 -14.0 15.2 -14.15 14.85 -14.0 Q13.65 -13.45 11.2 -12.1 L9.2 -11.1 7.75 -10.3 Q2.3 -5.45 -0.95 -1.05 L-1.95 0.35 Q-5.2 5.25 -6.7 10.95 L-4.5 8.55 -4.35 8.6 Q-5.0 9.05 -5.75 11.4 L-6.5 15.0 Q-6.3 16.85 -5.35 19.25 -7.45 16.55 -8.8 13.55 L-8.85 11.9 -8.75 10.65 -7.2 5.75 Q-4.8 -1.5 -4.75 -2.3 -4.75 -3.5 -6.45 -8.1 L-7.85 -12.05 Q-7.3 -14.7 -5.5 -17.95 L-4.8 -19.05 -3.95 -20.15 -2.75 -21.5 M36.25 -23.5 L33.05 -25.0 Q37.7 -24.75 42.35 -21.1 45.95 -18.25 47.9 -15.2 43.6 -19.95 36.25 -23.5 M-2.5 -14.4 L-2.4 -14.3 -2.4 -14.55 -2.5 -14.4" fill="#8a6813" fill-rule="evenodd" stroke="none"/>
    <path d="M29.35 -30.35 L24.9 -29.85 17.45 -27.95 13.35 -26.55 Q7.05 -24.3 -1.05 -20.75 L5.55 -26.3 9.2 -27.95 13.4 -29.75 13.75 -29.95 17.9 -31.6 24.95 -32.05 36.3 -32.8 Q37.7 -32.8 42.0 -29.2 L43.5 -27.95 48.25 -23.35 47.9 -23.35 44.05 -24.6 Q40.45 -25.85 38.75 -25.85 L35.4 -25.55 33.05 -25.0 32.65 -24.9 Q34.2 -24.55 37.1 -22.95 L40.5 -20.6 Q39.2 -20.75 35.75 -22.1 32.55 -23.35 31.0 -23.35 L24.75 -22.55 21.35 -21.85 13.2 -20.4 12.7 -20.4 13.25 -20.6 23.75 -24.85 24.8 -25.25 Q29.65 -27.05 33.3 -27.95 L37.65 -28.8 Q32.65 -30.35 29.35 -30.35" fill="#ffd740" fill-rule="evenodd" stroke="none"/>
    <path d="M-3.25 -9.6 L-3.25 -9.35 -3.4 -9.45 -3.25 -9.6 M54.4 -23.3 L54.25 -23.55 54.5 -23.4 54.4 -23.3 M42.25 -12.8 L42.2 -12.85 42.3 -12.8 42.25 -12.8 M-4.35 8.6 L-4.5 8.55 -4.35 8.55 -4.35 8.6" fill="#997d15" fill-rule="evenodd" stroke="none"/>
    <path d="M53.45 23.3 L52.55 24.1 51.4 25.1 50.85 25.55 50.9 25.1 Q51.15 24.1 52.35 22.05 53.9 19.5 53.95 17.55 54.0 16.85 53.15 15.6 52.5 14.5 51.75 13.95 L52.5 11.7 52.95 9.0 53.05 7.25 Q53.15 2.75 51.45 -1.05 50.6 -2.9 49.35 -4.6 47.8 -6.7 45.55 -8.55 L44.2 -9.65 43.85 -9.9 42.25 -12.8 42.3 -12.8 Q49.5 -9.3 53.5 -1.05 L54.1 0.15 Q56.85 6.4 57.8 14.45 L57.45 14.45 55.85 13.65 55.9 15.25 Q55.85 18.05 53.75 22.6 L53.45 23.3 M1.65 26.35 L0.15 25.1 -0.95 24.1 Q-3.5 21.8 -5.35 19.25 -6.3 16.85 -6.5 15.0 L-5.75 11.4 Q-5.0 9.05 -4.35 8.6 L-4.35 8.55 -4.5 8.55 -6.7 10.95 Q-5.2 5.25 -1.95 0.35 L-0.95 -1.05 Q2.3 -5.45 7.75 -10.3 L9.2 -11.1 11.2 -12.1 Q13.65 -13.45 14.85 -14.0 L15.2 -14.15 15.1 -14.0 12.85 -11.95 11.85 -11.1 10.05 -9.9 8.25 -8.55 Q4.2 -5.15 2.15 -1.05 L1.25 1.2 Q0.25 4.0 0.2 7.25 L0.2 8.25 0.4 10.45 Q0.8 13.35 2.1 16.0 L2.15 16.1 0.5 17.4 Q-0.3 18.3 -0.35 19.85 -0.35 21.35 0.75 23.75 L1.3 25.1 1.65 26.35" fill="#755310" fill-rule="evenodd" stroke="none"/>
    <path d="M25.05 56.7 L23.1 56.0 Q17.8 54.0 13.3 50.5 L9.2 46.7 8.6 46.1 Q7.55 44.85 6.9 43.45 6.3 41.95 6.25 40.25 L6.2 39.45 6.1 35.8 6.1 35.15 6.05 34.95 5.65 29.05 5.5 26.1 5.25 25.1 4.35 22.2 2.75 17.25 2.15 16.1 2.1 16.0 Q0.8 13.35 0.4 10.45 L0.2 8.25 0.2 7.25 Q0.25 4.0 1.25 1.2 L2.15 -1.05 Q4.2 -5.15 8.25 -8.55 L10.05 -9.9 11.85 -11.1 Q15.05 -13.0 18.7 -14.0 21.5 -14.8 24.6 -15.0 L26.9 -15.1 26.55 -14.0 Q26.3 -13.15 26.2 -12.0 L26.35 -11.55 26.05 -8.8 Q25.85 -7.95 25.8 -6.05 L25.75 -2.55 26.2 -1.05 26.7 0.9 25.95 3.05 25.25 4.6 25.85 5.75 Q26.4 6.65 26.4 7.45 L25.65 10.2 24.95 12.6 Q24.95 12.95 25.85 14.3 26.75 15.6 26.7 17.15 L25.65 21.9 25.4 22.95 25.1 25.1 25.0 25.6 24.45 30.4 24.65 32.65 24.85 35.2 25.2 35.8 25.2 35.95 Q26.15 37.5 26.1 38.75 L26.1 39.45 Q25.85 40.7 25.2 41.0 L25.25 43.1 25.25 43.45 25.25 46.1 25.35 46.1 25.75 46.7 Q26.8 48.35 26.8 49.65 L25.75 52.95 25.05 54.95 25.05 56.7" fill="#8f556a" fill-rule="evenodd" stroke="none"/>
    <path d="M46.4 34.5 L46.3 35.8 46.0 39.45 45.95 40.25 Q45.8 41.95 45.15 43.45 44.5 44.85 43.3 46.1 L42.75 46.7 38.4 50.5 Q33.0 54.7 26.4 56.7 L25.75 56.8 25.1 56.7 25.05 56.7 25.05 54.95 25.75 52.95 26.8 49.65 Q26.8 48.35 25.75 46.7 L25.35 46.1 25.25 46.1 25.25 43.45 25.25 43.1 25.2 41.0 Q25.85 40.7 26.1 39.45 L26.1 38.75 Q26.15 37.5 25.2 35.95 L25.2 35.8 24.85 35.2 24.65 32.65 24.45 30.4 25.0 25.6 25.1 25.1 25.4 22.95 25.65 21.9 26.7 17.15 Q26.75 15.6 25.85 14.3 24.95 12.95 24.95 12.6 L25.65 10.2 26.4 7.45 Q26.4 6.65 25.85 5.75 L25.25 4.6 25.95 3.05 26.7 0.9 26.2 -1.05 25.75 -2.55 25.8 -6.05 Q25.85 -7.95 26.05 -8.8 L26.35 -11.55 26.2 -12.0 Q26.3 -13.15 26.55 -14.0 L26.9 -15.1 27.05 -15.1 Q31.5 -15.1 35.45 -14.0 40.0 -12.75 43.85 -9.9 L44.2 -9.65 45.55 -8.55 Q47.8 -6.7 49.35 -4.6 50.6 -2.9 51.45 -1.05 53.15 2.75 53.05 7.25 L52.95 9.0 52.5 11.7 51.75 13.95 50.65 16.25 49.8 18.65 47.6 25.1 47.4 26.2 47.1 28.25 46.4 34.5" fill="#d9913a" fill-rule="evenodd" stroke="none"/>
    <path d="M60.15 -11.85 L60.25 -9.4 59.4 -3.45 59.0 -1.05 58.55 1.75 Q58.5 4.3 59.6 7.7 60.7 10.8 60.75 13.8 L59.95 15.25 Q57.0 3.0 57.05 1.75 57.1 -0.55 59.15 -6.25 L57.05 -11.65 57.05 -12.4 58.55 -12.1 59.95 -11.8 60.15 -11.85 M-8.75 10.65 L-7.7 6.4 Q-6.65 2.75 -6.6 0.45 L-6.65 -1.05 Q-6.75 -2.95 -7.1 -4.75 L-7.35 -5.6 Q-8.1 -8.4 -8.05 -10.15 L-7.85 -12.05 -6.45 -8.1 Q-4.75 -3.5 -4.75 -2.3 -4.8 -1.5 -7.2 5.75 L-8.75 10.65" fill="#b38719" fill-rule="evenodd" stroke="none"/>
    <path d="M50.85 25.55 L51.0 27.55 51.05 27.95 51.3 30.2 Q51.25 32.3 50.3 33.45 49.3 34.7 47.35 34.7 L46.6 34.55 46.4 34.5 47.1 28.25 47.4 26.2 47.6 25.1 49.8 18.65 50.65 16.25 51.75 13.95 Q52.5 14.5 53.15 15.6 54.0 16.85 53.95 17.55 53.9 19.5 52.35 22.05 51.15 24.1 50.9 25.1 L50.85 25.55" fill="#c4771b" fill-rule="evenodd" stroke="none"/>
    <path d="M6.1 35.15 L5.4 35.65 5.15 35.8 4.15 36.05 3.05 35.8 Q2.35 35.45 1.8 34.7 0.9 33.5 0.9 31.75 0.95 31.0 1.35 29.75 L1.45 29.3 1.75 27.55 1.65 26.35 1.3 25.1 0.75 23.75 Q-0.35 21.35 -0.35 19.85 -0.3 18.3 0.5 17.4 L2.15 16.1 2.75 17.25 4.35 22.2 5.25 25.1 5.5 26.1 5.65 29.05 6.05 34.95 6.1 35.15" fill="#70344a" fill-rule="evenodd" stroke="none"/>
    <path d="M6.9 -3.0 Q5.6 -1.45 4.8 0.2 3.85 1.95 3.4 3.85 3.1 5.25 3.05 6.6 3.05 7.45 2.6 7.55 L2.9 8.35 2.5 9.3 2.0 10.25 2.3 11.45 3.0 12.45 2.55 13.4 3.1 14.55 3.0 15.05 Q3.7 15.65 3.7 16.0 3.7 16.5 3.3 17.0 L4.45 17.9 5.15 18.95 4.5 19.95 5.9 21.1 7.0 22.25 Q7.0 22.65 6.6 22.7 L5.55 23.3 5.4 23.6 Q6.65 24.15 6.6 25.1 L6.3 26.1 7.05 26.9 6.95 27.75 8.45 28.75 Q9.85 29.55 9.85 29.95 9.85 30.6 8.95 30.7 L6.8 31.35 6.6 31.4 Q7.3 31.9 8.6 32.1 9.35 32.25 9.35 32.95 L8.85 33.55 8.2 34.2 8.4 34.9 8.6 35.65 Q8.55 36.75 7.25 36.65 L8.85 37.8 Q9.25 37.95 9.2 38.4 9.2 38.9 7.3 41.05 6.5 41.05 5.7 38.6 5.75 38.2 6.15 37.8 L5.45 36.9 5.25 36.05 5.6 35.25 5.9 34.4 5.55 34.0 Q5.35 33.7 5.85 33.0 5.55 32.15 5.1 31.9 L4.75 31.45 Q4.8 30.9 5.2 30.4 5.75 29.75 6.75 29.65 L4.85 27.5 3.8 25.7 Q3.8 25.4 4.3 25.1 L4.55 24.95 Q3.75 24.75 3.55 24.45 L3.6 23.9 Q3.6 23.6 3.95 22.9 L4.3 22.35 Q4.35 21.3 3.6 20.75 2.8 20.15 2.85 19.35 L2.95 19.0 3.25 18.75 1.35 17.95 Q0.95 17.8 0.95 17.25 1.0 16.6 1.7 16.25 L1.95 16.15 Q0.0 16.05 -0.15 15.4 L0.3 14.6 Q-0.65 14.6 -1.1 14.15 L-1.45 13.35 Q-1.45 12.85 -0.85 12.65 L-0.25 12.45 -0.25 12.35 -0.85 10.9 -0.75 10.45 Q-0.6 10.2 -0.2 10.15 L-0.15 9.65 -1.1 9.4 -1.3 9.1 -0.9 8.3 -1.9 8.65 Q-2.5 8.65 -2.5 8.25 L-1.15 6.2 0.6 3.25 Q-0.65 4.4 -1.5 4.35 L-1.5 4.3 -1.3 4.0 -1.5 3.75 -0.2 2.4 1.55 0.35 1.95 -0.15 2.05 -0.75 2.9 -2.4 3.2 -3.0 3.85 -4.15 Q5.55 -7.15 7.85 -9.5 L11.6 -12.55 Q14.4 -14.5 16.45 -15.0 21.0 -16.15 24.65 -16.4 27.3 -16.6 29.5 -16.3 32.5 -15.95 33.5 -14.9 37.1 -14.55 42.7 -10.9 47.75 -7.7 48.95 -6.1 L50.15 -4.4 50.25 -4.25 Q50.35 -4.15 50.45 -4.15 L51.3 -2.75 52.25 -0.1 Q53.1 1.9 54.65 3.75 L56.0 5.25 Q55.95 5.75 55.35 5.75 54.75 5.75 54.1 5.2 53.55 5.0 53.1 4.6 L54.15 6.45 55.25 8.35 55.1 8.65 54.75 8.85 54.45 8.65 54.4 8.65 Q53.8 8.65 53.2 7.8 L53.2 8.2 53.7 9.4 Q54.65 11.85 54.6 12.4 54.6 13.8 51.85 13.8 L52.4 15.05 Q52.4 16.65 51.65 17.15 L51.1 17.25 Q51.1 17.85 51.45 18.25 L51.75 18.9 51.55 19.7 Q51.1 20.3 49.5 20.15 L49.4 21.5 48.4 22.95 48.35 23.05 Q49.5 23.0 49.5 23.95 L49.05 24.65 Q49.5 24.8 49.6 25.1 L49.7 25.55 49.5 26.4 48.45 27.25 48.8 28.0 Q48.8 28.5 48.45 28.8 L47.4 29.6 47.75 29.95 47.9 30.35 Q47.9 30.8 46.95 31.3 L47.55 32.4 47.85 33.05 47.7 33.8 Q47.45 34.2 46.55 34.05 48.0 34.65 48.0 35.2 48.0 35.55 47.1 36.0 L47.65 36.5 47.8 36.9 Q47.8 37.75 46.8 37.75 L47.1 38.1 47.15 38.55 46.9 38.9 46.45 39.45 46.85 40.35 46.65 41.0 45.5 41.8 45.05 41.5 44.95 41.2 45.05 40.7 45.4 40.3 Q44.25 38.5 44.3 38.0 44.3 37.65 45.45 35.25 L44.5 34.6 44.45 34.1 44.85 33.1 Q45.35 32.4 46.3 32.65 L45.45 32.1 45.2 31.55 45.6 30.65 46.0 29.75 46.8 28.1 47.6 26.45 47.3 26.05 Q46.95 25.85 46.95 25.65 L47.15 25.1 47.15 25.05 47.5 24.55 Q46.8 24.1 46.8 23.85 46.8 23.2 47.45 22.55 48.15 21.8 48.25 21.05 48.0 20.2 48.05 19.75 48.25 19.0 50.15 18.6 L49.65 17.55 49.5 17.0 49.6 16.4 Q49.7 16.2 50.8 15.65 L50.25 14.55 Q49.95 14.1 49.95 13.55 49.95 12.9 50.25 12.7 L51.25 12.35 52.75 12.1 51.65 9.5 Q51.15 8.35 51.2 7.15 L51.4 4.9 51.4 4.85 Q50.85 4.0 50.85 3.6 L50.9 3.25 50.35 1.9 Q49.7 0.0 48.8 -0.8 L47.3 1.1 47.25 1.15 45.75 2.3 45.1 2.15 45.0 1.85 Q45.0 1.65 45.9 0.55 L47.1 -1.15 47.4 -2.35 47.4 -2.7 47.45 -2.95 45.5 -2.45 43.9 -2.1 42.0 -1.75 Q41.45 -1.75 41.35 -2.05 L41.3 -2.25 Q41.3 -2.75 43.8 -4.15 L43.95 -4.2 45.15 -4.8 42.5 -5.15 37.95 -4.65 35.55 -4.2 34.2 -3.75 32.75 -3.3 32.3 -3.4 32.25 -3.75 33.0 -4.35 32.95 -4.5 33.85 -5.05 Q33.9 -5.6 34.8 -6.1 L35.9 -6.65 39.4 -8.0 Q35.65 -8.25 30.85 -7.15 L25.9 -5.95 Q24.4 -5.95 24.75 -6.6 L26.1 -8.0 25.8 -8.0 25.1 -7.35 24.7 -6.9 24.45 -6.65 Q21.8 -4.15 21.45 -4.15 L21.1 -4.15 20.85 -4.3 20.8 -4.8 20.9 -5.1 Q21.35 -6.2 23.9 -9.6 L23.0 -8.9 20.85 -6.8 20.7 -6.65 20.35 -6.35 Q18.3 -4.3 18.1 -4.3 17.45 -4.3 17.5 -4.85 L17.55 -4.9 17.55 -4.95 21.85 -13.0 21.85 -13.1 21.8 -13.05 18.2 -8.25 18.1 -8.1 18.05 -8.0 17.85 -7.75 15.05 -3.8 Q14.3 -3.8 14.45 -4.6 L14.65 -5.4 15.95 -9.25 12.05 -4.35 11.75 -4.4 11.55 -4.55 11.55 -5.8 12.55 -8.0 12.4 -7.9 10.1 -3.9 8.5 -0.9 Q7.85 -0.9 7.9 -1.55 L8.5 -5.05 7.0 -3.25 6.9 -3.0 M17.5 -9.9 L17.5 -9.8 17.55 -9.85 17.5 -9.9 M28.9 -8.35 L28.8 -8.2 28.85 -8.2 28.9 -8.35 M25.55 -9.7 L25.55 -9.8 25.5 -9.7 25.55 -9.7 M20.75 -8.65 L20.7 -8.7 20.7 -8.65 20.75 -8.65 M44.6 43.0 Q45.15 42.5 45.65 42.8 L46.0 43.45 46.05 43.95 45.65 44.65 45.1 45.45 44.8 46.1 Q44.4 46.55 43.85 46.55 43.1 46.5 42.75 47.7 42.3 48.85 41.9 48.85 L41.5 48.7 41.35 48.3 Q41.05 48.6 40.85 49.45 L40.15 50.7 40.05 50.6 40.0 50.2 Q40.05 48.95 41.35 47.45 42.35 46.2 43.2 45.9 44.1 45.45 44.0 44.85 43.8 44.05 44.25 43.45 L44.35 43.3 43.95 43.4 Q43.3 43.4 43.15 42.7 L43.1 42.1 Q43.1 41.0 43.95 41.2 44.75 41.35 44.75 42.5 L44.6 43.0 M41.35 45.6 Q40.65 45.6 40.7 44.7 40.7 44.05 41.5 44.0 42.25 43.95 42.25 44.6 42.15 45.6 41.35 45.6 M7.45 41.2 Q8.75 40.25 8.7 41.95 L8.15 43.4 8.15 43.45 Q7.6 44.55 7.15 44.55 6.9 44.55 6.4 43.45 L6.2 42.85 Q6.2 42.2 7.45 41.2 M8.1 46.6 Q7.55 46.1 7.55 45.8 8.75 43.85 9.95 43.75 L10.2 45.3 9.95 46.4 Q9.65 47.25 9.35 47.25 8.75 47.25 8.1 46.6 M15.3 48.85 Q16.65 48.9 16.6 50.05 16.6 50.55 14.95 52.75 14.75 52.75 14.1 50.75 13.75 51.4 12.85 51.4 L12.5 51.35 12.3 51.2 12.2 50.7 Q12.25 48.5 13.35 48.6 14.1 48.65 14.35 49.1 14.7 48.85 15.3 48.85 M12.0 47.35 Q11.95 48.8 10.9 48.8 10.0 48.8 10.0 48.05 10.05 46.95 11.05 46.7 12.0 46.4 12.0 47.35 M38.25 51.4 L37.4 52.5 37.0 52.4 36.95 52.3 36.9 52.0 Q36.9 50.7 38.0 49.7 38.95 48.7 38.95 49.95 L38.25 51.4 M36.2 52.3 L36.3 52.85 35.65 53.8 35.15 53.75 35.1 53.35 35.35 52.5 35.95 51.85 36.2 52.3 M34.25 51.5 Q34.6 52.2 34.55 52.75 34.55 53.35 33.95 53.4 L33.4 52.75 Q33.45 52.3 33.65 51.95 33.9 51.5 34.25 51.5 M31.5 52.4 L31.55 52.1 Q32.05 52.1 32.4 52.65 L32.65 53.4 32.6 53.8 32.55 53.85 32.65 54.15 32.6 54.5 33.15 54.2 33.25 54.25 33.3 54.55 33.05 55.4 32.4 55.9 32.05 55.85 31.7 56.55 31.4 56.65 Q31.15 56.6 31.05 56.2 L30.9 55.75 Q30.9 55.2 31.35 54.4 L30.8 54.7 30.15 54.5 30.1 53.7 Q30.1 52.65 31.0 52.4 L31.5 52.4 M31.65 53.8 L31.5 54.15 31.75 53.85 31.65 53.8 M27.5 53.85 Q28.15 54.05 28.15 54.5 L28.0 54.85 27.45 55.05 Q26.7 55.05 26.85 54.45 26.85 53.75 27.5 53.85 M29.75 55.1 L29.85 55.45 29.65 56.6 Q29.25 57.35 28.75 57.35 28.15 57.35 28.2 56.75 28.2 55.55 28.85 55.2 28.4 55.0 28.45 54.35 28.45 53.3 29.15 53.4 29.85 53.45 29.85 54.5 L29.65 55.1 29.75 55.1 M21.1 55.35 Q21.1 55.85 20.4 55.85 19.45 55.85 19.7 55.0 19.75 53.9 20.3 53.8 L21.1 55.35 M21.8 53.5 Q21.8 54.1 21.2 54.1 20.45 54.1 20.55 53.5 20.55 52.85 21.2 52.85 21.8 52.85 21.8 53.5 M22.1 54.25 Q22.7 54.8 22.7 55.05 L22.55 56.85 22.4 57.35 22.45 57.45 22.1 57.45 Q21.65 57.45 21.55 56.85 L21.45 55.95 21.5 55.15 22.1 54.25 M23.95 56.6 Q23.95 55.3 24.8 55.35 25.45 55.35 25.55 56.3 L25.6 56.3 25.55 55.95 Q25.6 53.65 26.4 54.25 27.15 54.95 27.15 56.7 L27.1 57.05 27.1 57.1 26.8 57.75 25.8 58.1 Q25.3 58.1 25.2 57.45 L24.8 57.5 Q23.9 57.5 23.95 56.6 M19.45 52.05 Q19.4 52.45 19.05 52.65 19.55 53.05 19.55 54.35 L19.45 55.0 19.35 55.1 19.0 55.2 18.65 55.15 18.5 55.0 18.5 54.25 Q18.5 53.55 18.8 52.7 L18.65 52.7 Q17.85 52.7 17.9 52.0 17.9 50.8 18.7 51.0 19.45 51.15 19.45 52.05 M17.1 51.1 Q17.75 51.15 17.7 52.6 17.7 53.5 17.0 53.5 16.25 53.5 16.35 52.55 16.4 51.05 17.1 51.1" fill="#451e15" fill-rule="evenodd" stroke="none"/>
    <path d="M51.25 12.35 L51.15 10.8 Q50.7 4.05 49.55 0.75 L47.75 3.25 45.9 5.35 45.9 5.25 47.3 1.1 48.8 -0.8 Q49.7 0.0 50.35 1.9 L50.9 3.25 50.85 3.6 Q50.85 4.0 51.4 4.85 L51.4 4.9 51.2 7.15 Q51.15 8.35 51.65 9.5 L52.75 12.1 51.25 12.35 M47.4 -2.35 L45.6 -1.6 42.55 -0.25 42.55 -0.35 Q42.55 -0.9 43.9 -2.1 L45.5 -2.45 47.45 -2.95 47.4 -2.7 47.4 -2.35 M43.95 -4.2 Q35.85 -3.75 30.9 -1.25 L33.65 -3.35 34.2 -3.75 35.55 -4.2 37.95 -4.65 42.5 -5.15 45.15 -4.8 43.95 -4.2 M34.8 -6.1 L31.85 -5.6 Q27.55 -4.7 24.35 -3.5 22.1 -2.65 20.4 -1.65 L20.35 -1.75 25.1 -7.35 25.8 -8.0 26.1 -8.0 24.75 -6.6 Q24.4 -5.95 25.9 -5.95 L30.85 -7.15 Q35.65 -8.25 39.4 -8.0 L35.9 -6.65 34.8 -6.1 M20.9 -5.1 L17.6 -2.55 19.5 -5.05 20.7 -6.65 20.85 -6.8 23.0 -8.9 23.9 -9.6 Q21.35 -6.2 20.9 -5.1 M17.5 -4.85 L14.25 -1.05 14.2 -1.15 18.05 -8.0 18.1 -8.1 18.2 -8.15 18.2 -8.25 21.8 -13.05 21.85 -13.0 17.55 -4.95 17.55 -4.9 17.5 -4.85 M14.65 -5.4 L10.2 -2.05 10.15 -2.1 11.2 -4.3 6.65 1.55 6.9 -3.0 7.0 -3.25 8.5 -5.05 7.9 -1.55 Q7.85 -0.9 8.5 -0.9 L10.1 -3.9 12.4 -7.9 12.55 -8.0 11.55 -5.8 11.55 -4.55 11.75 -4.4 12.05 -4.35 15.95 -9.25 14.65 -5.4 M11.3 -4.45 L11.3 -4.55 11.2 -4.3 11.3 -4.45" fill="#752d2d" fill-opacity="0.34509805" fill-rule="evenodd" stroke="none"/>
    <path d="M4.35 19.25 Q3.7 18.95 3.4 18.05 L3.2 16.6 3.65 14.9 Q2.6 14.8 2.25 12.95 L2.15 11.0 Q2.25 6.75 3.65 3.3 3.8 -0.45 5.05 -2.05 5.9 -3.1 6.1 -1.6 L6.8 -1.8 Q7.4 -1.8 8.0 -1.15 10.25 -4.15 11.75 -5.25 13.4 -6.4 13.75 -4.9 16.85 -6.65 17.45 -4.0 L20.5 -5.0 23.1 -5.7 Q24.55 -5.7 25.3 -5.05 L25.35 -5.0 Q27.05 -6.05 28.35 -6.05 29.4 -6.05 33.9 -8.25 37.05 -9.85 37.0 -7.55 37.0 -6.75 35.9 -6.05 L35.9 -5.6 Q35.9 -5.05 35.4 -4.4 L34.3 -2.9 34.2 -2.75 38.65 -3.65 44.5 -4.35 Q47.05 -4.35 48.15 -3.4 L48.8 -2.4 Q48.8 -1.8 48.4 -1.4 L48.55 -0.8 48.4 -0.5 48.85 0.05 49.3 0.9 Q50.6 -0.25 50.55 2.15 L50.3 3.3 50.55 5.15 Q52.05 5.15 52.0 7.35 L51.7 8.6 51.4 9.65 52.75 13.75 Q52.7 14.8 51.85 16.55 50.85 18.5 49.8 18.75 L49.4 19.25 49.2 19.45 48.9 19.9 Q48.0 20.95 47.35 20.95 L46.75 20.9 46.0 20.25 45.85 19.5 46.25 18.4 46.35 18.25 45.05 16.3 Q43.25 15.55 42.15 15.55 L37.15 16.2 32.25 16.85 29.95 16.4 Q30.55 17.05 30.85 18.15 31.3 19.6 31.3 21.1 L31.05 22.85 Q30.7 23.95 29.5 23.95 L28.9 23.85 30.65 28.75 31.3 29.25 Q32.75 30.65 32.7 31.3 L32.35 33.15 Q31.8 34.7 30.95 34.7 L30.8 34.7 Q30.0 34.55 30.05 33.05 L30.15 32.35 26.15 35.2 25.85 35.35 25.55 35.55 Q24.05 35.55 22.7 34.15 L21.45 32.95 21.4 33.05 21.65 33.8 Q21.65 34.25 21.3 34.5 L20.75 34.65 Q19.7 34.65 19.1 32.85 L18.7 30.95 Q18.7 29.5 20.65 28.55 L20.85 28.45 22.4 25.1 22.8 24.35 Q21.55 23.85 20.95 22.35 L20.5 19.95 Q20.55 19.05 21.25 18.2 L22.2 17.1 19.9 17.15 Q15.75 17.15 12.15 15.65 L11.15 15.25 7.1 14.9 6.75 15.55 6.3 16.6 Q6.15 17.15 6.4 18.4 L6.15 19.05 5.95 19.3 5.25 19.45 4.75 19.4 4.35 19.25 M28.9 0.45 L28.75 0.3 28.55 -0.35 28.65 -0.5 31.7 -4.2 30.05 -3.5 26.7 -1.55 Q24.0 0.05 23.4 0.3 L23.25 0.35 23.15 0.35 Q22.2 0.3 21.85 -0.35 21.65 -0.7 21.7 -1.15 L21.8 -1.6 18.25 -0.8 Q16.2 -0.25 14.35 0.85 L14.2 0.95 12.95 1.45 12.3 1.55 11.1 2.6 12.9 3.95 13.5 4.45 14.45 4.35 Q18.15 4.05 19.65 4.9 L18.85 4.75 17.1 5.2 16.15 5.4 12.8 5.95 11.85 5.75 10.35 5.35 10.1 5.5 9.7 5.65 7.7 6.3 7.45 6.55 7.6 10.25 8.95 10.25 Q13.25 10.5 13.6 12.55 L20.85 13.7 22.25 13.95 Q23.55 13.1 26.8 12.75 L28.0 12.65 28.65 12.65 Q31.7 12.6 32.15 14.05 L36.6 13.35 42.2 12.7 45.2 13.1 46.65 13.25 46.6 12.95 46.65 11.3 45.0 9.5 Q43.55 8.15 43.6 7.35 43.6 7.1 44.1 6.4 L44.6 5.6 44.35 4.05 44.15 2.75 Q42.05 4.2 41.75 4.2 40.35 4.2 39.9 3.45 L39.7 2.55 Q39.7 1.65 40.85 0.0 L40.9 0.0 41.3 -0.6 41.5 -0.85 40.55 -0.8 39.65 -0.7 37.05 -0.1 30.55 1.0 Q29.35 1.0 28.9 0.45 M26.45 24.1 L26.0 23.2 25.1 24.3 24.25 26.4 23.2 29.05 22.8 30.7 22.85 30.8 23.95 32.2 25.4 33.4 27.8 31.45 28.85 30.65 Q28.85 29.75 27.45 26.35 L26.45 24.1 M9.0 4.0 L8.85 3.85 8.75 4.1 9.0 4.0" fill="#752d2d" fill-opacity="0.15294118" fill-rule="evenodd" stroke="none"/>
    <path d="M5.0 22.0 L4.85 22.4 5.3 24.0 Q4.65 22.65 4.65 21.8 L4.7 21.75 4.8 21.15 5.0 22.0 M28.65 -0.5 L28.55 -0.35 28.75 0.3 28.9 0.45 27.2 0.75 24.25 1.35 21.0 1.65 13.05 1.5 12.95 1.45 14.2 0.95 14.35 0.85 23.15 0.35 23.25 0.35 23.4 0.3 24.3 0.15 28.65 -0.5 M37.05 -0.1 L39.65 -0.7 40.55 -0.8 40.8 -0.75 41.3 -0.6 40.9 0.0 40.85 0.0 39.2 -0.15 37.05 -0.1 M10.1 5.5 L10.35 5.35 11.85 5.75 12.8 5.95 16.15 5.4 17.1 5.2 19.15 5.35 24.2 5.15 29.0 4.6 36.65 4.2 Q43.05 5.35 43.05 6.5 43.05 7.15 42.2 7.15 L39.1 6.55 34.0 5.9 25.9 6.45 24.15 6.75 22.4 6.95 12.35 6.0 10.1 5.5 M40.7 37.35 L40.75 38.25 40.35 39.3 40.7 37.35 M17.45 41.7 L17.05 42.85 Q17.0 43.75 18.05 44.8 L19.05 46.1 Q19.05 46.65 18.45 46.65 17.9 46.65 16.15 45.1 15.05 44.05 15.05 43.6 15.1 42.55 16.45 40.8 17.85 39.0 17.85 40.5 L17.45 41.7 M32.2 34.95 Q32.2 34.35 34.05 33.85 L36.4 33.7 37.6 35.0 38.65 36.5 Q38.65 37.35 37.55 37.35 L36.35 36.7 35.25 36.05 34.05 35.85 32.75 35.6 Q32.2 35.4 32.2 34.95 M21.15 34.75 L22.4 34.95 23.2 35.7 23.3 35.8 23.5 36.0 Q24.85 36.8 26.1 36.8 26.8 36.8 27.55 35.9 L27.65 35.8 Q28.25 34.9 28.6 34.9 L29.45 35.35 30.3 35.15 30.3 35.2 30.2 35.8 29.9 36.3 28.85 36.5 26.55 37.6 24.95 38.3 24.15 38.45 23.75 38.45 23.5 37.95 23.2 37.4 21.85 36.05 21.8 35.95 21.75 35.8 21.15 34.75 M28.9 41.6 L29.6 42.0 Q30.6 42.65 30.55 43.4 30.5 45.45 29.5 46.25 28.35 47.2 25.4 47.2 L23.65 47.0 Q23.65 46.5 24.15 45.75 L24.65 44.7 24.2 43.8 23.7 43.0 23.8 42.9 24.3 43.0 24.7 42.95 25.0 42.95 Q25.85 42.95 28.9 41.6" fill="#752d2d" fill-opacity="0.29803923" fill-rule="evenodd" stroke="none"/>
    <path d="M4.75 19.4 L5.25 19.45 5.95 19.3 Q7.2 21.8 9.75 25.1 L11.1 26.85 11.5 27.3 Q13.05 29.3 13.55 32.95 L13.7 35.8 13.65 36.7 Q13.65 38.05 13.25 39.2 L12.9 40.3 12.2 36.65 12.3 35.8 12.35 34.6 12.3 32.95 11.1 29.45 9.35 26.85 7.85 25.1 7.1 24.3 Q5.65 22.7 5.1 21.3 L4.85 20.65 4.65 19.5 4.75 19.4 M46.75 20.9 L47.35 20.95 Q48.0 20.95 48.9 19.9 48.65 21.75 46.2 24.3 L45.45 25.1 43.9 26.85 42.0 29.45 Q40.6 32.35 40.55 34.6 L40.65 35.8 40.7 37.35 40.35 39.3 39.85 40.4 39.5 39.2 Q39.15 38.05 39.15 36.7 L39.25 35.8 Q39.5 30.0 41.75 27.3 L42.1 26.85 43.6 25.1 46.75 20.9" fill="#752d2d" fill-opacity="0.62352943" fill-rule="evenodd" stroke="none"/>
    <path d="M49.2 19.45 Q48.75 21.6 47.25 24.85 L47.55 25.95 46.8 29.95 45.85 35.55 45.6 40.85 Q45.3 44.3 44.05 44.65 L44.0 44.7 Q42.25 49.9 40.25 49.9 39.7 49.9 39.55 49.25 L39.55 49.05 Q34.95 55.4 29.75 55.55 L28.6 56.1 Q26.75 56.9 25.0 56.9 19.9 56.9 17.0 53.25 L15.55 50.95 14.8 51.1 Q11.0 51.1 8.2 46.05 6.05 42.15 6.1 40.3 6.15 37.4 6.45 35.45 5.9 30.95 5.9 26.55 5.95 25.35 6.15 24.85 L5.0 22.0 4.8 21.15 4.35 19.25 4.75 19.4 4.65 19.5 4.85 20.65 5.1 21.3 Q5.65 22.7 7.1 24.3 L7.85 25.1 9.35 26.85 11.1 29.45 12.3 32.95 12.35 34.6 12.3 35.8 12.2 36.65 12.9 40.3 13.1 43.1 13.1 43.45 13.7 44.3 14.15 45.0 15.8 47.9 16.4 48.3 18.55 50.9 19.45 51.75 20.5 52.05 Q24.0 53.25 26.15 53.25 L26.2 53.25 29.6 51.05 34.2 48.25 36.05 45.55 36.9 44.3 37.05 44.2 Q38.7 41.75 39.85 40.4 L40.35 39.3 40.75 38.25 40.7 37.35 40.65 35.8 40.55 34.6 Q40.6 32.35 42.0 29.45 L43.9 26.85 45.45 25.1 46.2 24.3 Q48.65 21.75 48.9 19.9 L49.2 19.45" fill="#752d2d" fill-opacity="0.3529412" fill-rule="evenodd" stroke="none"/>
    <path d="M23.2 29.05 L24.25 26.4 25.1 24.3 26.0 23.2 26.45 24.1 26.65 25.1 27.1 27.1 27.95 31.25 27.8 31.45 25.4 33.4 23.95 32.2 22.85 30.8 23.2 29.05" fill="#ffee70" fill-opacity="0.34509805" fill-rule="evenodd" stroke="none"/>
    <path d="M20.75 34.65 L21.3 34.5 Q21.65 34.25 21.65 33.8 L21.4 33.05 21.45 32.95 22.7 34.15 Q24.05 35.55 25.55 35.55 L25.85 35.35 25.95 35.35 26.15 35.2 30.15 32.35 30.05 33.05 Q30.0 34.55 30.8 34.7 L30.3 35.15 29.45 35.35 28.6 34.9 Q28.25 34.9 27.65 35.8 L27.55 35.9 Q26.8 36.8 26.1 36.8 24.85 36.8 23.5 36.0 L23.3 35.8 23.2 35.7 22.4 34.95 21.15 34.75 20.75 34.65" fill="#332e28" fill-opacity="0.7254902" fill-rule="evenodd" stroke="none"/>
    <path d="M23.8 42.9 L23.65 42.85 23.65 42.8 23.6 42.8 Q23.2 42.5 22.95 41.9 21.85 41.3 20.5 41.6 L20.3 41.35 Q20.3 41.2 20.9 40.95 L21.2 40.85 21.05 40.75 Q21.1 40.15 22.45 39.95 L23.45 40.0 Q24.65 39.35 26.75 38.85 L28.4 38.1 Q29.05 37.7 29.7 37.8 30.55 37.2 31.5 37.2 32.05 37.2 32.25 37.45 33.75 36.8 33.75 37.8 33.75 38.2 32.65 38.45 L32.4 38.55 32.4 38.6 32.0 39.45 32.1 39.75 Q32.1 40.15 28.95 41.55 L28.9 41.6 Q25.85 42.95 25.0 42.95 L24.7 42.95 24.3 43.0 23.8 42.9 M24.85 41.25 Q24.85 40.85 24.35 40.7 23.85 40.55 23.8 41.45 23.8 41.9 24.15 41.9 L24.85 41.25 M25.6 41.5 L25.9 41.1 Q25.95 40.6 25.55 40.55 25.15 40.5 25.1 40.95 25.1 41.5 25.6 41.5 M28.2 40.25 Q28.2 40.55 28.5 40.55 30.4 40.0 30.4 39.6 30.4 38.9 29.3 39.35 28.2 39.8 28.2 40.25" fill="#c46356" fill-rule="evenodd" stroke="none"/>
    <path d="M28.2 40.25 Q28.2 39.8 29.3 39.35 30.4 38.9 30.4 39.6 30.4 40.0 28.5 40.55 28.2 40.55 28.2 40.25 M25.6 41.5 Q25.1 41.5 25.1 40.95 25.15 40.5 25.55 40.55 25.95 40.6 25.9 41.1 L25.6 41.5 M24.85 41.25 L24.15 41.9 Q23.8 41.9 23.8 41.45 23.85 40.55 24.35 40.7 24.85 40.85 24.85 41.25" fill="#dda7a2" fill-rule="evenodd" stroke="none"/>
    <path d="M45.1 12.3 Q46.3 13.15 46.3 13.8 46.3 14.55 45.55 14.4 L44.2 13.55 Q42.9 12.8 41.6 12.5 L37.7 12.15 32.3 11.4 Q31.25 11.2 29.75 9.95 28.35 8.7 28.35 8.2 28.4 7.45 30.1 8.55 L32.35 10.0 37.35 10.55 41.6 10.95 Q43.7 11.4 45.1 12.3 M19.2 9.1 Q21.15 7.2 21.1 8.9 21.05 11.05 16.6 13.25 11.8 15.7 6.05 15.7 5.5 15.7 5.5 15.25 5.5 14.8 9.6 13.95 14.35 13.0 15.9 12.15 L19.2 9.1" fill="#332e28" fill-opacity="0.7254902" fill-rule="evenodd" stroke="none"/>
    <path d="M46.75 16.55 Q46.75 17.0 46.2 17.15 L43.55 19.5 43.5 19.5 42.05 22.25 Q39.5 26.45 35.9 26.45 31.8 26.45 28.85 21.1 L29.65 18.5 30.9 15.0 29.7 13.95 29.0 13.15 29.1 12.85 29.05 12.7 Q29.05 12.4 29.35 12.25 29.65 12.05 30.3 12.5 L30.9 12.9 33.85 12.85 36.85 12.75 Q37.75 12.8 39.95 13.5 L41.4 14.2 42.95 14.9 Q43.45 14.95 44.55 15.8 L46.35 16.05 Q46.75 16.15 46.75 16.55 M41.15 15.95 Q39.8 14.35 34.1 14.15 L32.45 15.65 32.3 15.9 31.5 17.9 30.35 21.05 30.6 21.35 31.9 21.1 33.85 21.3 39.05 20.2 41.1 19.4 41.9 19.35 42.7 17.5 42.05 17.15 41.15 15.95 M21.05 14.7 L21.5 14.5 Q22.2 14.15 22.5 14.3 L22.75 14.6 22.7 14.75 22.75 14.95 22.05 15.5 Q20.95 16.15 20.8 16.25 L21.95 18.75 22.65 20.65 Q19.5 24.4 15.4 24.4 11.8 24.4 9.4 21.4 L8.0 19.45 7.95 19.45 5.4 17.8 4.9 17.35 Q4.95 17.1 5.35 17.05 L7.15 16.85 Q8.25 16.2 8.75 16.2 L10.35 15.7 11.8 15.2 14.95 14.65 17.95 14.75 20.75 14.75 19.4 15.15 17.45 15.2 16.7 15.2 12.1 15.5 Q11.45 15.55 9.4 16.55 L8.0 17.2 7.35 17.7 Q7.35 18.15 8.0 18.15 L8.05 18.15 Q8.25 19.05 9.45 19.75 9.45 20.35 12.15 21.15 14.7 21.95 16.15 21.95 L19.3 21.6 Q20.1 21.35 20.1 21.0 L20.1 20.95 20.25 20.95 20.95 21.15 Q21.85 21.15 21.8 20.7 L21.8 20.65 21.35 20.05 21.35 19.8 Q21.4 17.8 19.0 16.1 L18.6 15.8 19.0 15.8 Q21.75 15.5 21.75 15.0 21.8 14.55 21.05 14.7 M42.05 19.9 Q42.1 19.05 41.0 19.6 L39.2 20.45 34.8 21.5 32.05 21.3 31.7 21.4 Q31.4 21.5 31.4 21.6 31.35 22.15 32.15 22.55 L35.25 23.0 Q36.7 23.0 39.3 21.9 42.05 20.75 42.05 19.9 M33.4 23.25 L33.55 23.35 33.65 23.4 33.4 23.25" fill="#752d2d" fill-opacity="0.48235294" fill-rule="evenodd" stroke="none"/>
    <path d="M21.05 14.7 Q21.8 14.55 21.75 15.0 21.75 15.5 19.0 15.8 L18.6 15.8 19.0 16.1 Q21.4 17.8 21.35 19.8 L21.35 20.05 21.8 20.65 21.8 20.7 Q21.85 21.15 20.95 21.15 L20.25 20.95 20.1 20.95 16.3 21.0 Q11.95 21.0 9.7 19.85 L9.45 19.75 Q8.25 19.05 8.05 18.15 L8.0 18.15 Q7.35 18.15 7.35 17.7 L8.0 17.2 9.4 16.55 Q11.45 15.55 12.1 15.5 L16.7 15.2 17.45 15.2 19.4 15.15 20.75 14.75 20.9 14.7 21.05 14.7 M10.7 17.1 L10.05 17.35 9.95 17.4 9.2 17.8 9.25 17.85 9.3 17.95 10.5 19.15 Q11.4 20.05 16.4 20.15 L20.15 20.35 20.3 20.0 20.05 19.55 20.05 19.35 19.45 18.0 17.55 16.3 17.05 16.0 13.1 16.35 Q11.95 16.5 10.7 17.1" fill="#5e2c3e" fill-rule="evenodd" stroke="none"/>
    <path d="M20.05 19.55 L20.3 20.0 20.15 20.35 16.4 20.15 Q11.4 20.05 10.5 19.15 L9.3 17.95 9.25 17.85 9.2 17.8 9.95 17.4 10.05 17.35 10.7 17.1 14.6 17.6 14.6 17.7 Q14.6 19.05 15.45 19.05 15.9 19.05 16.15 18.5 L16.25 18.1 17.9 18.65 20.05 19.55" fill="#cfd2d6" fill-rule="evenodd" stroke="none"/>
    <path d="M10.7 17.1 Q11.95 16.5 13.1 16.35 L17.05 16.0 17.55 16.3 19.45 18.0 20.05 19.35 20.05 19.55 17.9 18.65 16.25 18.1 16.3 17.85 Q16.35 16.65 15.5 16.7 14.7 16.8 14.6 17.6 L10.7 17.1" fill="#afb2b5" fill-rule="evenodd" stroke="none"/>
    <path d="M16.25 18.1 L16.15 18.5 Q15.9 19.05 15.45 19.05 14.6 19.05 14.6 17.7 L14.6 17.6 Q14.7 16.8 15.5 16.7 16.35 16.65 16.3 17.85 L16.25 18.1" fill="#2b2f4d" fill-rule="evenodd" stroke="none"/>
    <path d="M44.3 17.05 Q44.25 17.65 43.6 17.65 L43.55 17.65 Q43.35 19.05 41.8 20.05 39.55 21.6 35.2 21.6 L31.25 21.55 Q31.0 21.9 30.5 21.9 29.6 21.9 29.7 21.2 L29.7 21.1 Q29.75 20.6 30.15 20.3 L30.15 19.95 Q30.2 17.15 32.7 14.8 L33.15 14.4 32.75 14.35 Q30.0 13.95 30.0 13.2 30.0 12.5 30.9 12.8 L32.35 13.4 34.3 13.5 35.05 13.55 39.65 13.95 Q40.3 14.05 42.3 15.35 L43.65 16.35 44.3 17.05 M31.45 19.6 L31.2 20.25 31.35 20.75 35.1 20.45 Q40.1 20.3 41.1 19.05 L42.35 17.25 42.4 17.15 41.6 16.55 41.0 16.15 Q39.75 15.3 38.6 15.15 L34.7 14.65 34.15 15.1 Q33.0 16.15 32.15 17.45 L31.55 19.35 31.45 19.6" fill="#7d4c11" fill-rule="evenodd" stroke="none"/>
    <path d="M41.0 16.15 L41.6 16.55 42.4 17.15 42.35 17.25 41.1 19.05 Q40.1 20.3 35.1 20.45 L31.35 20.75 31.2 20.25 31.45 19.6 33.7 18.35 Q34.55 17.9 35.35 17.55 L35.45 18.1 Q35.7 18.95 36.15 18.95 37.0 18.95 37.05 17.05 L37.05 16.95 Q39.15 16.25 41.0 16.15" fill="#cfd2d6" fill-rule="evenodd" stroke="none"/>
    <path d="M37.05 16.95 L37.05 17.05 Q37.0 18.95 36.15 18.95 35.7 18.95 35.45 18.1 L35.35 17.55 35.3 17.2 Q35.35 15.5 36.2 15.6 37.0 15.75 37.05 16.95" fill="#2b2f4d" fill-rule="evenodd" stroke="none"/>
    <path d="M41.0 16.15 Q39.15 16.25 37.05 16.95 37.0 15.75 36.2 15.6 35.35 15.5 35.3 17.2 L35.35 17.55 Q34.55 17.9 33.7 18.35 L31.45 19.6 31.55 19.35 32.15 17.45 Q33.0 16.15 34.15 15.1 L34.7 14.65 38.6 15.15 Q39.75 15.3 41.0 16.15" fill="#afb2b5" fill-rule="evenodd" stroke="none"/>
    <path d="M18.95 42.4 Q18.65 42.4 18.6 41.95 18.6 41.75 20.1 40.0 21.6 38.25 21.8 38.25 L24.1 38.45 24.15 38.45 24.95 38.3 26.55 37.6 28.85 36.5 29.9 36.3 33.25 36.6 Q36.15 37.25 36.15 37.9 36.1 38.5 35.45 38.5 L33.55 38.1 31.15 37.7 30.35 38.1 28.9 38.5 Q28.75 38.55 28.1 38.95 L27.55 39.25 27.3 39.4 25.8 39.85 24.45 39.7 22.65 40.25 Q22.55 40.3 20.95 41.3 L19.25 42.25 18.95 42.4" fill="#451d18" fill-rule="evenodd" stroke="none"/>
    <path d="M26.95 198.5 Q25.55 198.5 24.15 197.5 22.9 196.65 22.9 196.3 L25.4 194.35 28.0 192.65 28.15 192.65 29.6 191.6 30.2 191.15 34.25 188.15 34.8 188.1 41.95 187.15 43.65 187.15 Q35.65 188.3 35.6 189.15 35.6 190.0 36.85 190.0 L40.85 189.5 41.3 189.45 41.55 189.4 43.35 189.95 Q44.55 190.35 44.55 190.8 44.55 191.05 43.65 191.25 L42.1 191.65 Q38.95 193.0 38.1 193.0 L35.5 192.65 34.7 192.65 36.6 193.6 36.75 193.75 Q35.85 193.95 34.6 194.5 32.5 195.3 29.5 197.0 L26.95 198.5 M63.95 191.6 L64.15 191.75 64.1 191.75 63.95 191.6 M71.75 202.0 Q74.35 206.85 75.1 211.65 L75.0 211.8 74.6 212.8 73.05 217.8 70.15 219.4 66.5 220.7 59.9 222.15 59.35 221.3 Q58.85 220.35 58.45 220.35 L57.2 221.05 Q55.5 221.85 53.05 222.15 L52.85 222.3 58.3 223.25 58.25 225.2 53.25 225.8 Q46.25 225.8 44.7 222.85 L43.75 220.8 44.35 220.0 47.25 216.6 46.65 216.6 Q41.8 218.4 38.9 219.9 37.35 219.35 36.5 218.25 L36.2 217.15 35.6 215.65 35.5 215.15 35.45 214.9 38.45 212.15 41.45 209.35 41.4 209.35 37.75 211.25 34.65 213.1 34.15 212.7 31.4 210.4 31.05 210.7 31.7 209.2 Q32.9 206.2 34.3 205.1 L34.0 205.1 23.55 212.15 Q22.95 212.15 22.05 211.1 L20.95 209.55 21.4 208.9 Q24.45 205.35 25.15 202.75 L32.35 198.35 Q32.8 198.0 33.35 197.7 L34.55 197.4 35.6 197.15 36.15 197.05 Q35.4 197.7 35.4 198.2 L35.85 199.65 Q36.7 201.1 38.1 201.1 L39.75 200.75 Q40.65 200.4 41.7 200.4 L42.35 200.65 42.75 201.1 Q42.75 201.6 41.25 202.35 39.7 203.05 39.7 204.2 39.65 205.55 42.1 207.55 43.3 208.5 45.9 208.3 47.6 208.1 47.6 210.1 L47.05 211.05 Q46.45 211.95 46.35 212.6 46.35 214.25 48.95 214.75 51.35 215.2 51.35 216.1 L50.95 217.65 Q50.95 218.2 51.65 219.2 52.65 220.55 54.5 220.55 L55.1 220.5 Q56.25 220.3 57.8 219.25 60.2 218.7 64.0 216.05 66.45 214.9 71.5 213.05 72.05 209.9 72.1 207.1 72.15 204.4 71.75 202.0 M49.1 212.8 L49.1 212.7 49.2 212.85 49.15 212.85 49.1 212.85 49.1 212.8 M40.85 200.8 L40.9 200.7 40.75 200.8 40.85 200.8" fill="#553341" fill-rule="evenodd" stroke="none"/>
    <path d="M43.65 187.15 L44.35 187.05 48.15 186.6 50.0 186.15 51.2 186.3 Q51.95 186.3 53.55 185.7 55.15 185.15 56.0 185.15 L57.85 185.35 59.9 187.6 59.9 187.7 59.85 187.85 61.1 188.8 63.05 190.7 63.9 191.55 63.95 191.6 64.1 191.75 64.15 191.75 65.4 192.95 Q69.35 197.5 71.75 202.0 72.15 204.4 72.1 207.1 72.05 209.9 71.5 213.05 66.45 214.9 64.0 216.05 60.2 218.7 57.8 219.25 56.25 220.3 55.1 220.5 L54.5 220.55 Q52.65 220.55 51.65 219.2 50.95 218.2 50.95 217.65 L51.35 216.1 Q51.35 215.2 48.95 214.75 46.35 214.25 46.35 212.6 46.45 211.95 47.05 211.05 L47.6 210.1 Q47.6 208.1 45.9 208.3 43.3 208.5 42.1 207.55 39.65 205.55 39.7 204.2 39.7 203.05 41.25 202.35 42.75 201.6 42.75 201.1 L42.35 200.65 41.7 200.4 Q40.65 200.4 39.75 200.75 L38.1 201.1 Q36.7 201.1 35.85 199.65 L35.4 198.2 Q35.4 197.7 36.15 197.05 37.5 196.0 41.2 194.55 44.05 193.45 45.5 193.1 L46.65 192.3 49.5 190.6 50.25 190.25 48.0 188.2 44.95 188.75 41.55 189.4 41.3 189.45 40.85 189.5 36.85 190.0 Q35.6 190.0 35.6 189.15 35.65 188.3 43.65 187.15 M41.7 197.15 L44.65 198.0 Q46.8 198.55 46.8 198.8 46.8 199.3 43.95 201.6 41.0 203.9 41.0 204.2 40.95 206.4 44.7 206.4 L47.3 205.7 50.7 204.6 51.95 203.75 54.3 202.45 Q55.15 202.05 56.4 201.8 L57.6 201.6 57.7 201.7 55.05 203.75 52.6 205.8 60.3 202.25 65.7 199.5 63.8 195.95 Q62.9 194.25 60.2 192.55 L57.7 191.1 Q53.25 191.8 48.35 193.5 42.2 195.6 41.7 197.15 M60.4 188.4 Q60.0 187.7 57.3 186.85 L54.75 186.05 53.9 185.85 50.65 187.0 50.55 187.1 53.4 188.25 Q53.7 188.35 54.3 188.75 54.7 189.1 54.95 189.1 L57.6 188.7 60.4 188.4 M49.15 212.85 L49.3 213.15 49.4 213.25 Q49.75 212.3 51.7 211.6 L55.25 210.6 53.15 210.35 51.35 210.15 50.7 210.4 Q48.95 211.25 48.95 211.75 L49.1 212.8 49.1 212.85 49.15 212.85" fill="#6e4252" fill-rule="evenodd" stroke="none"/>
    <path d="M73.05 217.8 L72.9 218.4 72.7 218.95 72.3 219.25 69.8 220.25 67.75 221.05 64.15 222.3 Q59.75 222.3 59.45 224.05 59.25 224.75 58.25 225.2 L58.3 223.25 52.85 222.3 53.05 222.15 Q55.5 221.85 57.2 221.05 L58.45 220.35 Q58.85 220.35 59.35 221.3 L59.9 222.15 66.5 220.7 70.15 219.4 73.05 217.8 M43.75 220.8 L43.7 220.75 Q42.9 219.85 41.1 219.85 L39.4 220.0 38.9 219.9 Q41.8 218.4 46.65 216.6 L47.25 216.6 44.35 220.0 43.75 220.8 M35.45 214.9 L35.25 214.3 35.55 213.75 34.7 213.15 34.65 213.1 37.75 211.25 41.4 209.35 41.45 209.35 38.45 212.15 35.45 214.9 M31.05 210.7 Q28.05 213.0 25.45 213.0 23.0 213.0 21.1 210.05 L20.9 209.65 20.95 209.55 22.05 211.1 Q22.95 212.15 23.55 212.15 L34.0 205.1 34.3 205.1 Q32.9 206.2 31.7 209.2 L31.05 210.7 M33.35 197.7 L34.55 197.0 35.85 196.3 34.7 196.15 34.55 196.05 33.35 196.55 Q28.8 198.5 26.95 198.5 L29.5 197.0 Q32.5 195.3 34.6 194.5 35.85 193.95 36.75 193.75 L36.6 193.6 34.7 192.65 35.5 192.65 38.1 193.0 Q38.95 193.0 42.1 191.65 L43.65 191.25 Q44.55 191.05 44.55 190.8 44.55 190.35 43.35 189.95 L41.55 189.4 44.95 188.75 48.0 188.2 50.25 190.25 49.5 190.6 46.65 192.3 45.5 193.1 Q44.05 193.45 41.2 194.55 37.5 196.0 36.15 197.05 L35.6 197.15 34.55 197.4 33.35 197.7" fill="#4a2c37" fill-rule="evenodd" stroke="none"/>
    <path d="M60.4 188.4 L57.6 188.7 54.95 189.1 Q54.7 189.1 54.3 188.75 53.7 188.35 53.4 188.25 L50.55 187.1 50.65 187.0 53.9 185.85 54.75 186.05 57.3 186.85 Q60.0 187.7 60.4 188.4 M41.7 197.15 Q42.2 195.6 48.35 193.5 53.25 191.8 57.7 191.1 L60.2 192.55 Q62.9 194.25 63.8 195.95 L65.7 199.5 60.3 202.25 52.6 205.8 55.05 203.75 57.7 201.7 57.6 201.6 56.4 201.8 Q55.15 202.05 54.3 202.45 L51.95 203.75 50.7 204.6 47.3 205.7 44.7 206.4 Q40.95 206.4 41.0 204.2 41.0 203.9 43.95 201.6 46.8 199.3 46.8 198.8 46.8 198.55 44.65 198.0 L41.7 197.15 M49.1 212.8 L48.95 211.75 Q48.95 211.25 50.7 210.4 L51.35 210.15 53.15 210.35 55.25 210.6 51.7 211.6 Q49.75 212.3 49.4 213.25 L49.3 213.15 49.15 212.85 49.2 212.85 49.1 212.7 49.1 212.8" fill="#824e5f" fill-rule="evenodd" stroke="none"/>
    <path d="M-6.75 196.6 L-5.25 196.2 1.35 195.4 1.85 195.3 6.2 197.15 6.8 197.45 8.4 198.1 8.5 198.1 11.25 199.05 Q13.95 200.05 14.0 200.25 L13.2 201.7 Q12.15 203.0 10.95 203.35 L8.3 202.5 Q5.2 201.6 3.15 201.35 L1.05 201.15 1.1 201.0 2.55 199.7 1.85 199.85 Q1.5 199.95 -0.4 200.8 L-4.25 200.5 -5.75 200.45 -6.65 200.25 Q-6.75 199.8 -5.75 199.2 L-4.35 198.25 -4.15 198.25 -3.7 198.2 0.0 197.7 Q1.1 197.4 0.9 196.6 0.6 195.8 -6.75 196.6 M5.05 204.05 L6.1 204.45 13.6 206.85 Q14.85 209.15 18.45 211.75 L19.05 212.25 18.45 213.95 Q17.9 215.2 17.35 215.3 17.15 215.4 6.3 211.15 L6.05 211.25 Q7.55 211.95 9.4 214.45 L10.35 215.75 9.95 215.55 8.1 218.35 7.75 218.85 Q6.95 218.4 4.55 217.85 L0.8 216.9 0.75 216.95 4.1 218.85 7.5 220.7 7.5 220.95 7.55 221.5 7.35 223.05 7.4 224.1 Q6.9 225.35 5.7 226.2 L-2.05 225.0 -2.55 225.1 0.9 227.6 1.6 228.25 1.25 230.4 Q0.65 233.55 -5.6 235.2 -8.7 236.05 -10.2 235.85 L-10.75 234.0 -6.1 231.8 -6.35 231.75 Q-8.6 232.05 -10.3 231.7 L-11.6 231.35 Q-11.95 231.4 -12.15 232.45 L-12.45 233.4 -18.65 233.55 -22.2 233.2 Q-24.3 232.85 -25.15 232.4 L-27.85 228.05 -28.45 227.2 -28.5 227.1 Q-29.1 222.4 -28.0 217.25 -27.8 219.6 -27.05 222.15 -26.3 224.75 -25.0 227.6 L-17.6 228.6 Q-13.55 230.2 -11.25 230.1 -9.65 230.75 -8.6 230.7 L-8.05 230.6 Q-6.4 230.15 -5.8 228.6 -5.45 227.5 -5.6 227.0 L-6.35 225.65 Q-6.55 224.8 -4.55 223.8 -2.35 222.7 -2.8 221.15 -3.0 220.55 -3.75 219.85 L-4.5 219.1 Q-5.0 217.25 -3.45 217.05 -1.05 216.55 -0.25 215.4 1.4 212.95 1.0 211.7 0.75 210.6 -0.8 210.35 -2.35 210.0 -2.45 209.5 L-2.25 209.0 -1.7 208.6 0.1 208.5 1.65 208.4 Q2.95 208.05 3.3 206.5 L3.35 205.05 Q3.25 204.55 2.35 204.1 L2.9 204.1 3.9 204.1 5.05 204.05 M-23.8 205.85 L-23.7 205.7 -23.75 205.8 -23.8 205.85 M-0.9 208.7 L-0.85 208.8 -0.75 208.75 -0.9 208.7 M-5.2 222.0 L-5.15 222.05 -5.2 222.05 -5.25 222.1 -5.2 221.9 -5.2 222.0" fill="#553341" fill-rule="evenodd" stroke="none"/>
    <path d="M-6.75 196.6 Q0.6 195.8 0.9 196.6 1.1 197.4 0.0 197.7 L-3.7 198.2 -4.15 198.25 -4.35 198.25 -7.5 198.4 -10.35 198.65 Q-11.05 199.35 -11.85 201.1 L-11.1 201.25 -8.15 202.2 -6.85 202.65 -2.7 202.95 Q0.9 203.5 2.35 204.1 3.25 204.55 3.35 205.05 L3.3 206.5 Q2.95 208.05 1.65 208.4 L0.1 208.5 -1.7 208.6 -2.25 209.0 -2.45 209.5 Q-2.35 210.0 -0.8 210.35 0.75 210.6 1.0 211.7 1.4 212.95 -0.25 215.4 -1.05 216.55 -3.45 217.05 -5.0 217.25 -4.5 219.1 L-3.75 219.85 Q-3.0 220.55 -2.8 221.15 -2.35 222.7 -4.55 223.8 -6.55 224.8 -6.35 225.65 L-5.6 227.0 Q-5.45 227.5 -5.8 228.6 -6.4 230.15 -8.05 230.6 L-8.6 230.7 Q-9.65 230.75 -11.25 230.1 -13.55 230.2 -17.6 228.6 L-25.0 227.6 Q-26.3 224.75 -27.05 222.15 -27.8 219.6 -28.0 217.25 -27.0 212.5 -24.6 207.25 L-23.8 205.85 -23.75 205.8 -23.7 205.7 -23.7 205.65 -23.65 205.6 -23.1 204.6 -21.85 202.3 -21.0 201.15 -21.1 201.05 -21.1 200.95 -19.8 198.35 Q-19.1 197.95 -18.2 197.7 L-15.95 197.6 Q-14.4 197.8 -13.7 197.6 L-12.65 197.2 -10.9 197.2 -7.4 196.65 -6.75 196.6 M-5.2 222.0 L-5.3 220.95 Q-5.4 220.5 -7.2 220.15 L-7.85 220.05 -9.4 220.65 Q-10.75 221.15 -11.2 221.4 L-7.8 221.55 Q-5.9 221.7 -5.3 222.5 L-5.25 222.4 -5.2 222.05 -5.15 222.05 -5.2 222.0 M-12.9 198.2 L-13.0 198.15 -16.2 197.85 -16.9 198.25 Q-17.45 198.55 -19.0 199.6 -21.15 201.05 -21.35 201.8 L-18.8 201.4 -16.3 201.15 -15.8 200.65 -15.15 199.95 -12.9 198.2 M-4.95 207.05 Q-2.8 205.95 -2.5 205.55 -3.35 204.2 -9.3 203.7 -14.15 203.3 -18.25 203.7 L-20.1 205.65 Q-22.1 207.9 -22.45 209.7 L-23.25 213.45 -17.7 214.75 -10.05 216.3 Q-10.4 215.95 -12.7 214.9 L-15.6 213.65 -15.55 213.55 -14.45 213.4 -12.35 213.55 -10.0 214.2 -8.65 214.7 -5.35 214.95 -2.9 214.95 Q0.45 214.05 -0.15 212.05 -0.2 211.75 -3.4 210.3 -6.5 208.8 -6.65 208.3 L-4.95 207.05" fill="#6e4252" fill-rule="evenodd" stroke="none"/>
    <path d="M-4.35 198.25 L-5.75 199.2 Q-6.75 199.8 -6.65 200.25 L-5.75 200.45 -4.25 200.5 -0.4 200.8 Q1.5 199.95 1.85 199.85 L2.55 199.7 1.1 201.0 1.05 201.15 3.15 201.35 Q5.2 201.6 8.3 202.5 L10.95 203.35 4.75 203.0 3.55 202.85 3.45 202.95 2.5 203.35 3.8 203.7 5.05 204.05 3.9 204.1 2.9 204.1 2.35 204.1 Q0.9 203.5 -2.7 202.95 L-6.85 202.65 -8.15 202.2 -11.1 201.25 -11.85 201.1 Q-11.05 199.35 -10.35 198.65 L-7.5 198.4 -4.35 198.25 M19.05 212.25 L19.15 212.35 19.0 212.75 Q18.05 216.0 15.85 216.6 13.55 217.2 10.35 215.75 L9.4 214.45 Q7.55 211.95 6.05 211.25 L6.3 211.15 Q17.15 215.4 17.35 215.3 17.9 215.2 18.45 213.95 L19.05 212.25 M7.75 218.85 L7.7 218.95 7.1 219.7 7.5 220.1 7.5 220.7 4.1 218.85 0.75 216.95 0.8 216.9 4.55 217.85 Q6.95 218.4 7.75 218.85 M5.7 226.2 L5.25 226.45 3.75 226.7 Q2.1 227.15 1.6 228.15 L1.6 228.25 0.9 227.6 -2.55 225.1 -2.05 225.0 5.7 226.2 M-10.2 235.85 Q-11.2 235.6 -11.55 235.0 -12.25 233.45 -16.15 234.5 L-19.65 234.2 -21.65 233.95 -24.15 233.55 -24.6 233.4 -24.85 232.9 -25.15 232.4 Q-24.3 232.85 -22.2 233.2 L-18.65 233.55 -12.45 233.4 -12.15 232.45 Q-11.95 231.4 -11.6 231.35 L-10.3 231.7 Q-8.6 232.05 -6.35 231.75 L-6.1 231.8 -10.75 234.0 -10.2 235.85" fill="#4a2c37" fill-rule="evenodd" stroke="none"/>
    <path d="M-4.95 207.05 L-6.65 208.3 Q-6.5 208.8 -3.4 210.3 -0.2 211.75 -0.15 212.05 0.45 214.05 -2.9 214.95 L-5.35 214.95 -8.65 214.7 -10.0 214.2 -12.35 213.55 -14.45 213.4 -15.55 213.55 -15.6 213.65 -12.7 214.9 Q-10.4 215.95 -10.05 216.3 L-17.7 214.75 -23.25 213.45 -22.45 209.7 Q-22.1 207.9 -20.1 205.65 L-18.25 203.7 Q-14.15 203.3 -9.3 203.7 -3.35 204.2 -2.5 205.55 -2.8 205.95 -4.95 207.05 M-12.9 198.2 L-15.15 199.95 -15.8 200.65 -16.3 201.15 -18.8 201.4 -21.35 201.8 Q-21.15 201.05 -19.0 199.6 -17.45 198.55 -16.9 198.25 L-16.2 197.85 -13.0 198.15 -12.9 198.2 M-5.2 222.05 L-5.25 222.4 -5.3 222.5 Q-5.9 221.7 -7.8 221.55 L-11.2 221.4 Q-10.75 221.15 -9.4 220.65 L-7.85 220.05 -7.2 220.15 Q-5.4 220.5 -5.3 220.95 L-5.2 222.0 -5.2 221.9 -5.25 222.1 -5.2 222.05" fill="#824e5f" fill-rule="evenodd" stroke="none"/>
    <path d="M139.2 -9.5 L139.35 -9.6 139.35 -9.5 139.2 -9.5 M94.6 75.7 L95.0 75.9 94.7 76.0 94.6 75.7 M77.05 157.4 L76.85 156.55 77.5 156.9 77.1 157.65 76.75 157.5 77.05 157.4 M-93.25 -9.6 L-93.1 -9.5 -93.25 -9.5 -93.25 -9.6 M-5.9 38.8 L-5.5 38.55 -5.4 38.55 -5.9 38.8" fill="#000000" fill-rule="evenodd" stroke="none"/>
  </g>
</svg>
