<?xml version="1.0" encoding="UTF-8" standalone="no"?>
<svg xmlns:xlink="http://www.w3.org/1999/xlink" height="37.75px" width="54.9px" xmlns="http://www.w3.org/2000/svg">
  <g transform="matrix(1.0, 0.0, 0.0, 1.0, 27.45, 18.85)">
    <path d="M9.15 -18.85 L9.6 -18.75 14.85 -16.1 Q15.2 -15.9 15.35 -15.5 L17.3 -9.6 Q17.45 -9.25 17.25 -8.85 L16.65 -7.6 18.4 -8.45 18.85 -8.55 19.3 -8.4 25.85 -4.6 26.15 -4.3 26.35 -3.95 27.45 1.5 27.35 2.15 19.3 18.35 18.9 18.8 18.3 18.9 0.65 16.65 0.4 16.65 -0.15 16.5 -0.5 16.0 -0.55 15.4 1.4 7.6 1.55 7.25 2.65 5.85 -6.65 4.7 -9.2 9.85 -9.65 10.3 -10.25 10.4 -26.55 8.4 -27.1 8.15 -27.4 7.7 -27.4 7.1 -25.15 0.25 -25.0 -0.05 -15.7 -12.2 -15.35 -12.5 -10.45 -14.95 -10.0 -15.05 -9.55 -14.95 -4.3 -12.3 -3.8 -11.7 -2.6 -8.1 3.45 -16.0 3.8 -16.3 8.7 -18.75 9.15 -18.85" fill="#ffffff" fill-rule="evenodd" stroke="none"/>
  </g>
</svg>
