<?xml version="1.0" encoding="UTF-8" standalone="no"?>
<svg xmlns:xlink="http://www.w3.org/1999/xlink" height="28.5px" width="28.5px" xmlns="http://www.w3.org/2000/svg">
  <g transform="matrix(1.0, 0.0, 0.0, 1.0, 0.0, 0.0)">
    <path d="M27.5 14.25 Q27.5 8.75 23.65 4.85 19.75 1.0 14.25 1.0 8.75 1.0 4.9 4.85 1.0 8.75 1.0 14.25 1.0 19.75 4.9 23.6 8.75 27.5 14.25 27.5 19.75 27.5 23.65 23.6 27.5 19.75 27.5 14.25 M24.35 24.3 Q20.15 28.5 14.25 28.5 8.35 28.5 4.2 24.3 0.0 20.15 0.0 14.25 0.0 8.35 4.2 4.15 8.35 0.0 14.25 0.0 20.15 0.0 24.35 4.15 28.5 8.35 28.5 14.25 28.5 20.15 24.35 24.3" fill="#ffaa00" fill-rule="evenodd" stroke="none"/>
    <path d="M27.5 14.25 Q27.5 19.75 23.65 23.6 19.75 27.5 14.25 27.5 8.75 27.5 4.9 23.6 1.0 19.75 1.0 14.25 1.0 8.75 4.9 4.85 8.75 1.0 14.25 1.0 19.75 1.0 23.65 4.85 27.5 8.75 27.5 14.25" fill="url(#gradient0)" fill-rule="evenodd" stroke="none"/>
    <path d="M24.35 24.3 Q20.15 28.5 14.25 28.5 8.35 28.5 4.2 24.3 0.0 20.15 0.0 14.25 0.0 8.35 4.2 4.15 8.35 0.0 14.25 0.0 20.15 0.0 24.35 4.15 28.5 8.35 28.5 14.25 28.5 20.15 24.35 24.3 Z" fill="none" stroke="#ff4300" stroke-linecap="square" stroke-linejoin="miter" stroke-miterlimit="3.0" stroke-opacity="0.49019608" stroke-width="0.05"/>
  </g>
  <defs>
    <radialGradient cx="0" cy="0" gradientTransform="matrix(0.0171, 0.0, 0.0, 0.0171, 14.1, 14.05)" gradientUnits="userSpaceOnUse" id="gradient0" r="819.2" spreadMethod="pad">
      <stop offset="0.047058823529411764" stop-color="#ffffff"/>
      <stop offset="0.47058823529411764" stop-color="#ffff99"/>
      <stop offset="0.7215686274509804" stop-color="#ffff33"/>
      <stop offset="1.0" stop-color="#ffcc00"/>
    </radialGradient>
  </defs>
</svg>
