<?xml version="1.0" encoding="UTF-8" standalone="no"?>
<svg xmlns:xlink="http://www.w3.org/1999/xlink" height="37.85px" width="52.3px" xmlns="http://www.w3.org/2000/svg">
  <g transform="matrix(1.0, 0.0, 0.0, 1.0, 27.25, 15.45)">
    <path d="M-1.45 19.25 L-1.5 19.2 -1.45 19.3 -1.45 19.25 M18.55 -1.2 L17.1 -3.35 17.1 -3.4 12.4 -9.65 11.4 -10.75 11.2 -11.0 -0.6 -6.3 -0.85 -6.2 -1.3 -6.2 -1.55 -6.3 -13.2 -10.95 -13.0 -10.95 -13.3 -11.0 -14.55 -9.65 -19.25 -3.4 -19.25 -3.35 -19.3 -3.2 -19.45 -3.1 -20.4 -1.65 -20.65 -1.2 -20.7 -1.2 -20.9 -0.8 -21.5 0.15 -21.7 0.35 -21.55 0.55 -20.7 1.85 -20.65 1.9 -20.45 2.2 -20.4 2.3 -18.15 5.3 -14.8 8.95 -13.95 9.8 -13.35 10.35 -13.15 10.35 -12.65 10.4 -12.1 10.4 -10.25 10.7 -9.4 10.95 -8.75 11.1 -8.35 11.25 Q-6.1 12.1 -4.3 13.6 L-4.35 13.6 -4.0 13.85 -3.7 14.1 -3.5 14.25 -3.45 14.35 -3.35 14.45 -3.2 14.6 -3.05 14.75 -3.05 14.8 -2.75 15.0 -1.95 15.95 -1.95 16.0 -1.4 16.75 -1.4 16.8 -1.1 17.2 -0.75 16.8 -0.7 16.75 -0.2 16.0 -0.15 15.95 0.85 14.8 0.95 14.75 2.2 13.6 Q4.15 11.9 6.65 11.1 8.75 10.4 11.05 10.35 L11.2 10.35 11.3 10.3 12.65 8.95 15.1 6.35 15.75 5.55 16.0 5.3 16.25 5.0 18.25 2.3 18.35 2.2 18.55 1.9 18.55 1.85 18.7 1.6 19.4 0.6 19.5 0.35 19.4 0.15 18.55 -1.2 M12.7 -15.05 L13.35 -15.2 13.9 -15.45 16.0 -13.05 21.65 -5.55 23.4 -2.9 25.05 -0.25 23.4 2.35 23.05 2.85 20.3 6.55 16.2 11.0 14.0 13.1 Q11.15 13.0 8.5 13.9 5.85 14.8 3.7 16.6 L2.3 17.9 1.15 19.15 0.5 20.1 -0.9 22.4 -2.7 20.1 -3.35 19.15 -4.5 17.9 -5.9 16.6 Q-8.05 14.8 -10.7 13.9 -13.35 13.0 -16.2 13.1 L-18.4 11.0 -22.5 6.55 -25.25 2.85 -25.6 2.35 -27.25 -0.25 -25.6 -2.9 -23.85 -5.55 -18.2 -13.05 -16.1 -15.45 -15.55 -15.2 -14.9 -15.05 -1.1 -9.5 12.7 -15.05" fill="#641f02" fill-rule="evenodd" stroke="none"/>
    <path d="M-15.6 -13.7 L-15.2 -13.6 -15.45 -13.65 -15.6 -13.7" fill="#fa9104" fill-opacity="0.33333334" fill-rule="evenodd" stroke="none"/>
    <path d="M-15.45 -13.65 L-1.65 -8.1 -1.35 -8.0 -0.85 -8.0 -0.55 -8.1 13.25 -13.65 13.45 -13.7 13.7 -13.4 14.85 -12.1 20.45 -4.7 20.45 -4.65 22.15 -2.1 22.15 -2.05 23.15 -0.5 23.3 -0.25 23.15 0.05 22.35 1.25 22.15 1.55 22.15 1.6 21.9 1.95 21.8 2.05 19.45 5.25 19.15 5.6 18.85 5.95 18.05 6.9 15.15 9.95 13.55 11.55 13.45 11.6 13.3 11.6 Q10.55 11.65 8.05 12.5 5.1 13.45 2.8 15.45 1.95 16.05 1.3 16.8 L1.2 16.9 0.0 18.25 -0.05 18.3 -0.65 19.2 -0.7 19.25 -1.1 19.75 -1.45 19.25 -1.45 19.3 -1.5 19.2 -2.1 18.3 -2.15 18.25 -3.1 17.15 -3.4 16.9 -3.45 16.8 -3.6 16.65 -3.8 16.45 -3.9 16.35 -3.95 16.25 -4.2 16.05 -4.55 15.75 -4.95 15.45 -4.9 15.45 Q-7.05 13.7 -9.7 12.7 L-10.2 12.5 -10.95 12.3 -11.95 12.0 -14.15 11.7 -14.8 11.65 -15.4 11.6 -15.65 11.6 -16.35 10.95 -17.35 9.95 -21.35 5.6 -24.0 2.05 -24.05 1.95 -24.3 1.6 -24.35 1.55 -25.35 0.0 -25.5 -0.25 -25.3 -0.5 -24.6 -1.6 -24.35 -2.05 -24.3 -2.1 -24.0 -2.6 -22.85 -4.3 -22.7 -4.45 -22.6 -4.65 -22.6 -4.7 -17.05 -12.1 -15.6 -13.7 -15.45 -13.65" fill="url(#gradient0)" fill-rule="evenodd" stroke="none"/>
  </g>
  <defs>
    <radialGradient cx="0" cy="0" gradientTransform="matrix(0.0311, 0.0, 0.0, 0.0311, -1.05, -5.95)" gradientUnits="userSpaceOnUse" id="gradient0" r="819.2" spreadMethod="pad">
      <stop offset="0.0" stop-color="#fa8b04" stop-opacity="0.62352943"/>
      <stop offset="1.0" stop-color="#d13f04" stop-opacity="0.3019608"/>
    </radialGradient>
  </defs>
</svg>
