<?xml version="1.0" encoding="UTF-8" standalone="no"?>
<svg xmlns:xlink="http://www.w3.org/1999/xlink" height="5.25px" width="5.4px" xmlns="http://www.w3.org/2000/svg">
  <g transform="matrix(1.0, 0.0, 0.0, 1.0, 16.6, 5.35)">
    <path d="M-15.85 -4.6 Q-15.0 -5.35 -13.9 -5.35 -12.8 -5.35 -12.05 -4.6 -11.2 -3.85 -11.2 -2.75 -11.2 -1.7 -12.05 -0.95 -12.8 -0.1 -13.9 -0.1 -15.0 -0.1 -15.85 -0.95 -16.6 -1.7 -16.6 -2.75 -16.6 -3.85 -15.85 -4.6 M-13.65 -3.0 Q-13.65 -3.8 -14.5 -3.85 -15.35 -3.9 -15.35 -3.05 -15.35 -2.2 -14.5 -2.2 -14.15 -2.2 -13.9 -2.45 -13.65 -2.7 -13.65 -3.0" fill="#ffff00" fill-rule="evenodd" stroke="none"/>
  </g>
</svg>
