<?xml version="1.0" encoding="UTF-8" standalone="no"?>
<svg xmlns:xlink="http://www.w3.org/1999/xlink" height="32.5px" width="33.3px" xmlns="http://www.w3.org/2000/svg">
  <g transform="matrix(1.0, 0.0, 0.0, 1.0, 12.95, 38.0)">
    <path d="M-12.95 -21.45 L-12.95 -5.5 20.35 -5.5 20.35 -21.45 -12.95 -21.45" fill="#00ff00" fill-rule="evenodd" stroke="none">
      <animate attributeName="fill" dur="2s" repeatCount="indefinite" values="#00ff00;#00ff01"/>
      <animate attributeName="fill-opacity" dur="2s" repeatCount="indefinite" values="1.0;1.0"/>
      <animate attributeName="d" dur="2s" repeatCount="indefinite" values="M-12.95 -21.45 L-12.95 -5.5 20.35 -5.5 20.35 -21.45 -12.95 -21.45;M-11.55 -38.0 L-11.55 -17.25 18.95 -17.25 18.95 -38.0 -11.55 -38.0"/>
    </path>
    <path d="M-12.95 -21.45 L20.35 -21.45 20.35 -5.5 -12.95 -5.5 -12.95 -21.45" fill="none" stroke="#000000" stroke-linecap="round" stroke-linejoin="round" stroke-opacity="0.0" stroke-width="1.0">
      <animate attributeName="stroke" dur="2s" repeatCount="indefinite" values="#000000;#000001"/>
      <animate attributeName="stroke-width" dur="2s" repeatCount="indefinite" values="0.0;0.0"/>
      <animate attributeName="fill-opacity" dur="2s" repeatCount="indefinite" values="0.0;0.0"/>
      <animate attributeName="d" dur="2s" repeatCount="indefinite" values="M-12.95 -21.45 L20.35 -21.45 20.35 -5.5 -12.95 -5.5 -12.95 -21.45;M-11.55 -38.0 L18.95 -38.0 18.95 -17.25 -11.55 -17.25 -11.55 -38.0"/>
    </path>
  </g>
</svg>
