<?xml version="1.0" encoding="UTF-8" standalone="no"?>
<svg xmlns:xlink="http://www.w3.org/1999/xlink" height="27.6px" width="56.8px" xmlns="http://www.w3.org/2000/svg">
  <g transform="matrix(1.0, 0.0, 0.0, 1.0, 26.3, 34.6)">
    <path d="M8.65 -33.55 L8.5 -33.05 8.0 -32.55 Q9.25 -32.0 9.25 -31.5 9.25 -31.0 6.4 -28.75 L6.5 -28.65 Q9.8 -26.45 14.75 -21.5 L22.25 -14.3 26.9 -10.2 30.5 -7.15 30.5 -7.0 28.75 -7.4 Q26.25 -7.4 20.4 -12.85 L13.0 -20.35 4.9 -27.55 2.0 -25.4 -2.7 -22.5 Q-5.6 -20.9 -7.25 -20.15 L-17.75 -15.3 -22.25 -12.95 -25.75 -11.05 -26.2 -11.25 -26.3 -11.8 Q-26.3 -13.0 -19.75 -16.3 L-17.4 -17.4 -15.55 -18.4 Q-15.3 -18.65 -15.0 -19.7 -14.6 -20.7 -13.75 -20.85 L-13.75 -21.05 -14.35 -21.0 Q-15.4 -21.0 -15.4 -21.9 -15.4 -22.5 -13.45 -23.65 -11.55 -24.85 -11.55 -25.55 -11.55 -26.75 -4.75 -31.1 L-4.0 -30.35 Q-4.0 -30.0 -4.65 -29.5 L-6.05 -28.35 -6.05 -28.3 0.4 -31.3 -1.65 -33.05 Q-1.65 -34.8 2.15 -32.15 L3.1 -32.6 Q4.2 -33.1 6.7 -34.35 8.65 -35.1 8.65 -33.55" fill="#000000" fill-opacity="0.17254902" fill-rule="evenodd" stroke="none"/>
  </g>
</svg>
