<?xml version="1.0" encoding="UTF-8" standalone="no"?>
<svg xmlns:xlink="http://www.w3.org/1999/xlink" height="46.95px" width="51.3px" xmlns="http://www.w3.org/2000/svg">
  <g transform="matrix(1.0, 0.0, 0.0, 1.0, 8.6, 3.15)">
    <path d="M-6.45 36.0 L-6.65 35.95 -6.6 35.95 Q-7.5 35.85 -8.0 35.15 L-8.25 34.8 -8.55 34.0 -8.6 33.8 -8.6 24.4 -8.55 24.4 -8.6 24.2 -8.6 24.1 -8.55 23.7 -8.5 23.4 -8.25 22.9 Q-7.85 21.95 -6.9 21.8 L-6.45 21.6 -4.45 20.3 -4.05 19.7 -3.1 18.25 -2.85 17.95 -1.05 14.75 -0.9 14.3 Q0.3 11.95 3.0 10.95 L3.05 10.95 Q5.05 10.05 7.05 9.65 L7.1 3.25 Q7.05 2.3 7.15 1.3 L7.2 0.75 Q7.3 -0.25 8.15 -0.8 L8.1 -0.8 8.15 -0.85 Q8.9 -1.4 9.75 -1.3 L9.9 -1.25 Q10.65 -1.15 11.25 -0.35 L11.3 -0.3 Q12.1 0.8 13.6 1.45 L14.25 1.65 16.2 2.35 Q16.9 -0.15 19.15 -2.45 19.85 -3.15 20.8 -3.15 21.7 -3.2 22.45 -2.35 23.0 -1.75 23.0 -0.75 23.0 0.2 23.75 1.1 L24.0 1.35 24.0 1.4 24.1 1.55 25.5 3.0 25.55 3.05 25.6 3.1 Q27.1 4.6 29.0 5.9 L29.1 5.95 Q31.2 7.45 31.65 9.55 L31.8 10.65 31.8 10.75 31.8 10.85 31.8 13.15 31.8 18.6 Q35.6 18.55 38.9 20.2 40.05 20.7 41.1 21.45 L41.8 21.95 Q42.35 22.3 42.55 23.1 L42.6 23.2 42.55 23.15 42.6 23.25 42.65 23.6 42.7 23.95 42.65 24.2 42.65 32.8 42.6 32.8 42.55 32.75 42.6 32.9 42.65 33.2 42.7 33.75 42.55 34.25 42.45 34.5 41.7 35.4 41.65 35.4 41.1 35.65 41.1 23.25 38.9 23.5 36.35 24.25 Q33.95 25.25 33.95 26.45 L35.65 29.15 37.45 32.1 37.75 32.8 37.85 33.15 37.85 35.8 37.85 40.6 37.8 40.6 37.8 40.7 37.85 40.9 37.9 41.9 37.85 42.15 37.2 43.15 37.15 43.25 Q36.7 43.6 36.15 43.75 L35.95 43.8 35.15 43.8 35.15 32.75 34.1 32.65 33.5 32.6 30.2 32.3 25.55 32.0 25.55 42.5 22.75 42.8 18.75 42.55 18.75 31.15 Q17.95 30.7 17.1 29.7 L14.6 27.1 14.15 26.75 13.5 26.25 12.4 25.95 Q11.9 25.95 10.8 26.75 L8.25 28.95 7.9 29.25 4.45 31.85 4.45 41.9 1.05 43.1 0.25 43.15 0.25 32.2 0.15 32.15 -0.35 31.9 -1.5 30.8 0.3 29.2 Q2.45 27.1 2.45 24.8 2.45 23.8 0.35 23.4 L-4.05 23.05 -5.0 23.05 -6.45 23.15 -6.45 36.0 M10.8 35.9 L10.75 35.8 10.8 35.8 10.8 35.9 M27.2 17.4 Q26.35 14.65 23.7 12.6 21.2 10.65 18.8 10.25 L17.95 10.35 Q16.45 10.35 14.85 10.95 13.25 11.55 11.55 12.75 7.95 15.25 7.95 17.8 7.95 19.65 9.0 21.9 9.95 23.8 10.65 24.35 L10.8 24.45 Q11.85 25.15 13.5 25.55 L14.15 25.7 17.75 25.95 18.75 25.95 21.95 25.65 Q23.95 25.35 25.15 24.65 27.1 23.55 27.5 21.15 L27.5 20.85 27.55 20.1 27.55 20.05 27.3 17.75 27.2 17.4 M28.9 18.6 Q30.15 22.8 30.6 23.2 L30.7 23.15 30.75 13.8 30.25 15.95 28.9 18.6 M7.85 8.7 L7.95 10.35 9.3 10.1 10.9 10.1 9.25 8.15 Q8.25 6.9 8.1 6.1 L7.85 8.7" fill="#35a6c1" fill-rule="evenodd" stroke="none"/>
    <path d="M41.1 35.65 L40.2 35.75 40.15 35.75 39.45 35.7 38.9 35.7 38.9 23.5 41.1 23.25 41.1 35.65 M35.15 43.8 L34.65 43.55 34.1 43.3 Q32.6 42.6 31.05 42.45 L30.85 42.45 30.55 42.45 30.2 42.45 30.2 32.3 33.5 32.6 34.1 32.65 35.15 32.75 35.15 43.8 M8.25 39.4 Q6.7 40.85 4.45 41.9 L4.45 31.85 7.9 29.25 8.25 28.95 8.25 39.4 M-4.05 36.2 L-4.45 36.2 -6.45 36.0 -6.45 23.15 -5.0 23.05 -4.05 23.05 -4.05 36.2 M27.2 17.4 L27.3 17.75 27.55 20.05 27.55 20.1 27.5 20.85 27.5 21.15 Q27.1 23.55 25.15 24.65 23.95 25.35 21.95 25.65 L18.75 25.95 17.75 25.95 14.15 25.7 13.5 25.55 Q11.85 25.15 10.8 24.45 L10.65 24.35 Q9.95 23.8 9.0 21.9 7.95 19.65 7.95 17.8 7.95 15.25 11.55 12.75 13.25 11.55 14.85 10.95 16.45 10.35 17.95 10.35 L18.8 10.25 Q21.2 10.65 23.7 12.6 26.35 14.65 27.2 17.4 M21.4 17.15 L15.75 17.65 15.0 17.85 13.5 18.3 13.5 21.75 14.65 22.7 Q15.7 23.85 17.05 23.85 18.75 23.85 21.35 22.7 L21.95 22.45 21.95 17.2 21.4 17.15" fill="#3398b8" fill-rule="evenodd" stroke="none"/>
    <path d="M38.9 35.7 L37.85 35.8 37.85 33.15 37.75 32.8 37.45 32.1 35.65 29.15 33.95 26.45 Q33.95 25.25 36.35 24.25 L38.9 23.5 38.9 35.7 M30.2 42.45 L28.0 42.4 25.55 42.5 25.55 32.0 30.2 32.3 30.2 42.45 M10.75 35.8 L10.75 35.85 Q9.85 37.85 8.25 39.4 L8.25 28.95 10.8 26.75 10.8 35.8 10.75 35.8 M-2.0 36.2 L-4.05 36.2 -4.05 23.05 0.35 23.4 Q2.45 23.8 2.45 24.8 2.45 27.1 0.3 29.2 L-1.5 30.8 -2.0 31.15 -2.0 36.2 M28.9 18.6 L30.25 15.95 30.75 13.8 30.7 23.15 30.6 23.2 Q30.15 22.8 28.9 18.6 M7.85 8.7 L8.1 6.1 Q8.25 6.9 9.25 8.15 L10.9 10.1 9.3 10.1 7.95 10.35 7.85 8.7" fill="#2e8aa6" fill-rule="evenodd" stroke="none"/>
    <path d="M18.75 42.55 L17.2 41.85 17.15 41.85 Q15.45 41.0 14.15 39.95 L14.15 26.75 14.6 27.1 17.1 29.7 Q17.95 30.7 18.75 31.15 L18.75 42.55 M0.25 43.15 L-0.4 43.0 -0.5 42.95 -1.45 41.9 -1.75 40.85 -1.75 40.55 -1.9 36.2 -2.0 36.2 -2.0 31.15 -1.5 30.8 -0.35 31.9 0.15 32.15 0.25 32.2 0.25 43.15 M17.9 32.6 L17.7 32.6 17.7 32.7 18.1 32.7 17.9 32.6" fill="#39accf" fill-rule="evenodd" stroke="none"/>
    <path d="M14.15 39.95 Q12.1 38.35 11.05 36.35 L10.8 35.9 10.8 35.8 10.8 26.75 Q11.9 25.95 12.4 25.95 L13.5 26.25 14.15 26.75 14.15 39.95" fill="#3cb0d9" fill-rule="evenodd" stroke="none"/>
    <path d="M21.4 17.15 L21.95 17.2 21.95 22.45 21.35 22.7 Q18.75 23.85 17.05 23.85 15.7 23.85 14.65 22.7 L13.5 21.75 13.5 18.3 15.0 17.85 15.75 17.65 21.4 17.15" fill="#26718c" fill-rule="evenodd" stroke="none"/>
    <path d="M9.65 -0.3 L9.15 -0.25 8.7 0.0 Q8.25 0.3 8.2 0.85 7.4 6.8 12.75 10.5 7.95 9.8 3.4 11.85 1.0 12.75 -0.05 14.85 L-0.1 15.0 Q-0.95 16.85 -2.15 18.7 L-2.25 18.7 -3.35 20.4 -3.6 20.8 -3.65 20.85 Q-4.85 22.05 -6.7 22.75 -7.15 22.85 -7.35 23.3 L-7.6 24.15 -7.2 24.95 -6.5 25.35 -3.25 25.65 0.85 25.1 0.85 25.15 0.95 26.95 0.95 27.7 Q0.7 29.05 -0.35 30.25 L-0.75 31.05 -0.55 31.85 0.0 32.45 0.8 32.5 Q3.45 31.8 5.45 30.6 8.75 28.6 10.0 25.35 L9.95 25.5 Q10.7 23.9 10.35 22.2 9.85 19.6 9.7 17.0 10.5 15.7 11.45 14.65 L11.55 14.45 11.75 14.3 Q12.65 13.65 14.05 13.7 L14.65 13.55 15.15 13.1 15.3 12.9 15.45 12.1 15.45 11.9 15.95 12.05 16.0 12.05 22.8 13.75 25.2 16.2 25.4 16.45 Q25.55 17.0 25.15 17.5 L24.9 18.2 25.05 18.9 25.45 19.45 25.65 19.6 26.4 19.8 27.15 19.55 Q29.1 17.85 30.05 15.8 31.1 13.5 30.8 10.75 L30.8 10.7 Q30.7 8.35 28.5 6.75 L28.45 6.7 Q26.45 5.35 24.9 3.8 L24.85 3.75 23.3 2.1 23.15 2.0 23.05 1.8 Q22.0 0.6 22.0 -0.75 L21.7 -1.7 Q21.3 -2.15 20.8 -2.15 20.25 -2.15 19.85 -1.75 17.35 0.8 16.95 3.6 L16.4 3.45 16.45 3.45 13.9 2.6 13.35 2.45 Q11.45 1.65 10.45 0.25 L9.65 -0.3 M8.1 -0.8 Q8.85 -1.4 9.75 -1.3 L9.9 -1.25 Q10.65 -1.15 11.25 -0.35 L11.3 -0.3 Q12.1 0.8 13.6 1.45 L14.25 1.65 16.2 2.35 Q16.9 -0.15 19.15 -2.45 19.85 -3.15 20.8 -3.15 21.7 -3.2 22.45 -2.35 23.0 -1.75 23.0 -0.75 23.0 0.2 23.75 1.1 L24.0 1.35 24.0 1.4 24.1 1.55 25.5 3.0 25.55 3.05 25.6 3.1 Q27.1 4.6 29.0 5.9 L29.1 5.95 Q31.7 7.85 31.8 10.65 L31.8 10.75 Q32.15 14.05 30.65 16.85 L29.35 18.75 31.5 18.6 Q37.2 18.5 41.8 21.95 42.4 22.35 42.6 23.2 L42.55 23.15 42.65 24.4 42.55 24.65 41.7 25.8 41.65 25.8 Q40.9 26.25 40.2 26.15 L40.15 26.15 Q38.15 25.85 36.55 26.6 L36.25 26.7 36.1 26.7 36.05 26.7 36.0 26.75 35.95 26.75 35.9 26.75 35.3 27.05 Q36.85 28.7 37.8 31.0 L37.8 31.1 37.9 32.3 37.85 32.55 37.2 33.55 37.15 33.65 Q36.7 34.0 36.15 34.15 L35.95 34.2 34.65 33.95 Q32.9 33.0 31.05 32.85 L30.85 32.85 30.55 32.85 28.0 32.8 22.75 33.2 Q19.6 33.65 17.2 32.25 L17.15 32.25 Q14.7 31.0 13.1 29.4 L12.3 28.6 Q11.35 27.45 10.75 26.2 9.3 29.6 5.65 31.65 3.65 32.75 1.05 33.5 L-0.4 33.4 -0.5 33.35 -1.45 32.3 Q-1.85 31.65 -1.75 30.95 -1.65 30.1 -1.1 29.6 L-1.05 29.55 -1.0 29.5 Q-0.3 28.65 -0.05 27.7 L-0.05 26.85 -0.05 26.35 -4.05 26.6 -6.65 26.35 -6.6 26.35 Q-7.5 26.25 -8.0 25.55 L-8.55 24.4 -8.6 24.15 -8.25 22.9 Q-7.85 21.95 -6.9 21.8 -5.45 21.2 -4.45 20.3 L-4.05 19.7 -3.1 18.25 -2.85 17.95 -1.05 14.75 -0.9 14.3 Q0.3 11.95 3.0 10.95 L3.05 10.95 Q6.4 9.45 9.85 9.35 6.5 5.75 7.2 0.75 7.3 -0.25 8.15 -0.8 L8.1 -0.8 M41.6 24.35 L41.6 24.3 41.6 23.4 41.2 22.75 Q35.95 18.8 29.2 19.8 27.2 20.05 25.95 20.95 L25.9 20.95 19.8 24.1 15.85 24.0 15.3 23.95 Q14.15 23.6 13.65 22.75 L13.0 22.15 12.1 22.2 11.8 22.35 Q11.3 22.45 11.1 22.95 10.95 23.4 11.05 23.9 11.75 27.0 14.4 29.25 15.75 30.4 17.65 31.35 19.8 32.6 22.6 32.2 L27.95 31.8 30.55 31.85 30.85 31.85 31.05 31.85 Q33.15 32.0 35.1 33.05 L35.85 33.2 36.5 32.85 36.9 32.2 36.85 31.35 Q35.7 28.5 33.5 26.7 L35.6 25.8 35.9 25.75 36.1 25.7 Q38.0 24.8 40.3 25.15 L41.1 24.95 41.6 24.35 M23.9 18.05 Q23.95 17.5 24.3 17.0 L24.4 16.9 24.4 16.85 22.3 14.65 16.3 13.15 16.25 13.3 16.1 13.5 16.05 13.6 15.1 14.45 15.05 14.5 15.0 14.5 14.05 14.7 Q13.05 14.65 12.4 15.05 L12.35 15.1 12.2 15.35 Q11.4 16.2 10.75 17.25 10.85 19.35 11.25 21.5 L11.35 21.45 11.45 21.45 11.65 21.3 13.3 21.2 13.25 21.2 Q14.05 21.35 14.55 22.3 L14.5 22.25 15.5 22.95 15.9 23.0 19.6 23.1 24.95 20.35 24.85 20.25 24.8 20.25 Q24.25 19.75 24.1 19.25 L24.15 19.25 23.9 18.2 23.9 18.05" fill="#57bad2" fill-rule="evenodd" stroke="none"/>
    <path d="M9.65 -0.3 L10.45 0.25 Q11.45 1.65 13.35 2.45 L13.9 2.6 16.45 3.45 16.4 3.45 16.95 3.6 Q17.35 0.8 19.85 -1.75 20.25 -2.15 20.8 -2.15 21.3 -2.15 21.7 -1.7 L22.0 -0.75 Q22.0 0.6 23.05 1.8 L23.15 2.0 23.3 2.1 24.85 3.75 24.9 3.8 Q26.45 5.35 28.45 6.7 L28.5 6.75 Q30.7 8.35 30.8 10.7 L30.8 10.75 Q31.1 13.5 30.05 15.8 29.1 17.85 27.15 19.55 L26.4 19.8 25.65 19.6 25.45 19.45 25.05 18.9 24.9 18.2 25.15 17.5 Q25.55 17.0 25.4 16.45 L25.2 16.2 22.8 13.75 16.0 12.05 15.95 12.05 15.45 11.9 15.45 12.1 15.3 12.9 15.15 13.1 14.65 13.55 14.05 13.7 Q12.65 13.65 11.75 14.3 L11.55 14.45 11.45 14.65 Q10.5 15.7 9.7 17.0 9.85 19.6 10.35 22.2 10.7 23.9 9.95 25.5 L10.0 25.35 Q8.75 28.6 5.45 30.6 3.45 31.8 0.8 32.5 L0.0 32.45 -0.55 31.85 -0.75 31.05 -0.35 30.25 Q0.7 29.05 0.95 27.7 L0.95 26.95 0.85 25.15 0.85 25.1 -3.25 25.65 -6.5 25.35 -7.2 24.95 -7.6 24.15 -7.35 23.3 Q-7.15 22.85 -6.7 22.75 -4.85 22.05 -3.65 20.85 L-3.6 20.8 -3.35 20.4 -2.25 18.7 -2.15 18.7 Q-0.95 16.85 -0.1 15.0 L-0.05 14.85 Q1.0 12.75 3.4 11.85 7.95 9.8 12.75 10.5 7.4 6.8 8.2 0.85 8.25 0.3 8.7 0.0 L9.15 -0.25 9.65 -0.3 M41.6 24.35 L41.1 24.95 40.3 25.15 Q38.0 24.8 36.1 25.7 L35.9 25.75 35.6 25.8 33.5 26.7 Q35.7 28.5 36.85 31.35 L36.9 32.2 36.5 32.85 35.85 33.2 35.1 33.05 Q33.15 32.0 31.05 31.85 L30.85 31.85 30.55 31.85 27.95 31.8 22.6 32.2 Q19.8 32.6 17.65 31.35 15.75 30.4 14.4 29.25 11.75 27.0 11.05 23.9 10.95 23.4 11.1 22.95 11.3 22.45 11.8 22.35 L12.1 22.2 13.0 22.15 13.65 22.75 Q14.15 23.6 15.3 23.95 L15.85 24.0 19.8 24.1 25.9 20.95 25.95 20.95 Q27.2 20.05 29.2 19.8 35.95 18.8 41.2 22.75 L41.6 23.4 41.6 24.3 41.6 24.35 M29.15 14.65 Q29.8 12.9 29.55 10.85 29.4 9.1 27.7 7.85 L24.0 4.75 22.35 3.05 22.05 2.8 Q20.6 1.15 20.7 -0.8 17.85 2.15 18.1 5.3 L16.0 4.75 13.4 3.9 13.0 3.75 Q10.65 2.9 9.45 1.1 L9.45 1.25 Q8.8 6.35 13.5 9.55 14.65 10.4 16.15 10.7 19.85 11.5 23.45 12.6 L26.05 15.25 26.4 15.75 Q27.0 17.1 26.1 18.35 L26.3 18.5 Q28.35 16.75 29.15 14.65 M19.2 9.05 L19.15 9.1 19.1 9.05 19.2 9.05 M35.25 24.6 L35.5 24.4 Q37.8 23.5 40.4 23.85 35.5 20.25 29.25 21.15 27.65 21.35 26.45 22.1 L20.0 25.4 15.7 25.35 15.0 25.25 Q13.25 24.85 12.5 23.45 L12.2 23.6 Q12.95 26.75 16.0 28.9 L18.1 30.15 Q20.0 31.2 22.4 30.85 L27.85 30.5 30.6 30.55 31.05 30.55 Q33.55 30.65 35.6 31.85 34.2 28.35 30.85 26.6 31.8 26.05 32.65 25.65 L35.1 24.6 35.25 24.6 M5.15 29.2 Q7.75 27.5 8.8 24.85 9.35 23.7 9.1 22.45 8.55 19.55 8.35 16.6 L10.45 13.7 Q10.6 13.45 10.95 13.3 12.2 12.3 14.05 12.4 L14.15 12.15 Q8.9 10.85 3.8 13.05 1.8 13.85 1.0 15.55 0.1 17.55 -1.2 19.45 L-2.5 21.3 -2.75 21.6 Q-4.1 23.25 -6.35 24.05 L-2.1 24.25 Q0.05 24.1 1.9 23.35 L2.1 25.05 2.15 27.2 2.15 27.55 Q2.0 29.55 0.45 31.2 3.25 30.45 5.15 29.2" fill="#ffffff" fill-rule="evenodd" stroke="none"/>
    <path d="M9.45 1.25 L9.45 1.1 Q10.65 2.9 13.0 3.75 L13.4 3.9 16.0 4.75 18.1 5.3 Q17.85 2.15 20.7 -0.8 20.6 1.15 22.05 2.8 L22.35 3.05 24.0 4.75 27.7 7.85 Q29.4 9.1 29.55 10.85 29.8 12.9 29.15 14.65 27.8 13.15 26.2 12.4 L21.55 10.3 Q19.4 9.3 19.15 9.1 L19.2 9.05 Q20.2 9.65 23.95 9.65 L27.35 9.3 23.2 8.95 Q19.15 8.0 15.5 6.65 12.05 5.35 10.4 3.05 L9.45 1.25 M16.0 28.9 Q12.95 26.75 12.2 23.6 L12.5 23.45 Q13.25 24.85 15.0 25.25 L15.7 25.35 20.0 25.4 26.45 22.1 Q27.65 21.35 29.25 21.15 35.5 20.25 40.4 23.85 37.8 23.5 35.5 24.4 L35.25 24.6 Q28.3 25.1 22.8 26.9 L16.0 28.9 M-2.1 24.25 L5.85 15.05 Q4.4 17.95 4.4 22.95 4.4 25.15 5.15 29.2 3.25 30.45 0.45 31.2 2.0 29.55 2.15 27.55 L2.15 27.2 2.1 25.05 1.9 23.35 Q0.05 24.1 -2.1 24.25" fill="#ade8ff" fill-rule="evenodd" stroke="none"/>
    <path d="M9.45 1.25 L10.4 3.05 Q12.05 5.35 15.5 6.65 19.15 8.0 23.2 8.95 L27.35 9.3 23.95 9.65 Q20.2 9.65 19.2 9.05 L19.1 9.05 19.15 9.1 Q19.4 9.3 21.55 10.3 L26.2 12.4 Q27.8 13.15 29.15 14.65 28.35 16.75 26.3 18.5 L26.1 18.35 Q27.0 17.1 26.4 15.75 L26.05 15.25 23.45 12.6 Q19.85 11.5 16.15 10.7 14.65 10.4 13.5 9.55 8.8 6.35 9.45 1.25 M16.0 28.9 L22.8 26.9 Q28.3 25.1 35.25 24.6 L35.1 24.6 32.65 25.65 Q31.8 26.05 30.85 26.6 34.2 28.35 35.6 31.85 33.55 30.65 31.05 30.55 L30.6 30.55 27.85 30.5 22.4 30.85 Q20.0 31.2 18.1 30.15 L16.0 28.9 M5.15 29.2 Q4.4 25.15 4.4 22.95 4.4 17.95 5.85 15.05 L-2.1 24.25 -6.35 24.05 Q-4.1 23.25 -2.75 21.6 L-2.5 21.3 -1.2 19.45 Q0.1 17.55 1.0 15.55 1.8 13.85 3.8 13.05 8.9 10.85 14.15 12.15 L14.05 12.4 Q12.2 12.3 10.95 13.3 10.6 13.45 10.45 13.7 L8.35 16.6 Q8.55 19.55 9.1 22.45 9.35 23.7 8.8 24.85 7.75 27.5 5.15 29.2" fill="#d4f3ff" fill-rule="evenodd" stroke="none"/>
    <path d="M22.0 17.8 Q22.0 20.0 20.75 21.55 19.5 23.0 17.7 23.0 15.9 23.0 14.65 21.55 13.4 20.0 13.4 17.8 13.4 15.65 14.65 14.1 15.9 12.65 17.7 12.65 19.5 12.65 20.75 14.1 22.0 15.65 22.0 17.8 M20.2 14.75 L20.1 14.7 20.1 14.75 Q19.15 13.55 17.7 13.55 16.25 13.55 15.3 14.75 14.2 16.05 14.2 17.8 14.2 19.65 15.3 20.95 16.25 22.15 17.7 22.15 19.15 22.15 20.1 20.95 L20.2 20.95 Q21.2 19.65 21.2 17.8 21.2 16.05 20.2 14.75" fill="#57bad2" fill-rule="evenodd" stroke="none"/>
    <path d="M20.2 14.75 L20.1 14.75 20.1 14.7 20.2 14.75" fill="#72c6da" fill-rule="evenodd" stroke="none"/>
    <path d="M20.1 14.75 L20.2 14.75 Q21.2 16.05 21.2 17.8 21.2 19.65 20.2 20.95 L20.1 20.95 Q19.15 22.15 17.7 22.15 16.25 22.15 15.3 20.95 14.2 19.65 14.2 17.8 14.2 16.05 15.3 14.75 16.25 13.55 17.7 13.55 19.15 13.55 20.1 14.75 M17.7 14.45 Q16.65 14.45 15.9 15.4 L15.8 15.5 Q15.1 16.45 15.1 17.8 15.1 19.2 15.8 20.2 L15.9 20.35 Q16.65 21.2 17.7 21.2 18.75 21.2 19.5 20.35 L19.65 20.2 Q20.3 19.2 20.3 17.8 20.3 16.45 19.65 15.5 L19.5 15.4 Q18.75 14.45 17.7 14.45" fill="#aedeea" fill-rule="evenodd" stroke="none"/>
    <path d="M17.7 14.45 Q18.75 14.45 19.5 15.4 L19.65 15.5 Q20.3 16.45 20.3 17.8 20.3 19.2 19.65 20.2 L19.5 20.35 Q18.75 21.2 17.7 21.2 16.65 21.2 15.9 20.35 L15.8 20.2 Q15.1 19.2 15.1 17.8 15.1 16.45 15.8 15.5 L15.9 15.4 Q16.65 14.45 17.7 14.45" fill="#ffffff" fill-rule="evenodd" stroke="none"/>
  </g>
</svg>
