<?xml version="1.0" encoding="UTF-8" standalone="no"?>
<svg xmlns:xlink="http://www.w3.org/1999/xlink" height="29.8px" width="20.45px" xmlns="http://www.w3.org/2000/svg">
  <g transform="matrix(1.0, 0.0, 0.0, 1.0, 9.95, 14.8)">
    <path d="M-2.95 -2.75 L0.25 -2.75 0.25 5.65 -2.95 5.65 -2.95 -2.75" fill="#5c6567" fill-rule="evenodd" stroke="none"/>
    <path d="M6.7 -5.5 L6.7 -2.75 5.6 -2.75 5.6 5.65 0.25 5.65 0.25 -2.75 5.6 -2.75 5.6 -5.5 6.7 -5.5 M-6.2 -2.75 L-6.2 -5.5 -5.1 -5.5 -5.1 -2.75 -4.05 -2.75 -4.05 5.65 -5.1 5.65 -5.1 -2.75 -6.2 -2.75" fill="#687275" fill-rule="evenodd" stroke="none"/>
    <path d="M0.25 -5.5 L0.25 -2.75 -2.95 -2.75 -2.95 -5.5 0.25 -5.5 M-4.05 -2.75 L-2.95 -2.75 -2.95 5.65 -4.05 5.65 -4.05 -2.75" fill="#34393a" fill-rule="evenodd" stroke="none"/>
    <path d="M0.25 -2.75 L0.25 -5.5 5.6 -5.5 5.6 -2.75 0.25 -2.75 M-5.1 -2.75 L-5.1 -5.5 -4.05 -5.5 -4.05 -2.75 -5.1 -2.75" fill="#4a5254" fill-rule="evenodd" stroke="none"/>
    <path d="M6.9 -10.3 L6.9 -8.95 -6.2 -8.95 -6.2 -10.3 6.9 -10.3 M6.9 9.25 L6.9 10.45 -6.2 10.45 -6.2 9.25 6.9 9.25" fill="#7b898c" fill-rule="evenodd" stroke="none"/>
    <path d="M6.7 -2.75 L6.7 5.65 5.6 5.65 5.6 -2.75 6.7 -2.75 M-6.2 5.65 L-6.2 -2.75 -5.1 -2.75 -5.1 5.65 -6.2 5.65" fill="#7c888c" fill-rule="evenodd" stroke="none"/>
    <path d="M-2.95 -5.5 L-2.95 -2.75 -4.05 -2.75 -4.05 -5.5 -2.95 -5.5" fill="#17191a" fill-rule="evenodd" stroke="none"/>
    <path d="M-6.2 -10.3 L-8.9 -10.3 -8.9 -11.25 Q-5.1 -14.75 0.1 -14.8 L0.25 -14.8 0.3 -14.8 0.4 -14.8 0.55 -14.8 Q5.75 -14.75 9.65 -11.25 L9.65 -10.3 6.9 -10.3 -6.2 -10.3 M6.9 -8.95 L9.65 -8.95 9.65 -7.9 -8.9 -7.9 -8.9 -8.95 -6.2 -8.95 6.9 -8.95 M6.9 10.45 L9.65 10.45 9.65 11.45 Q5.75 14.95 0.55 15.0 L0.4 15.0 0.3 15.0 0.25 15.0 0.1 15.0 Q-5.1 14.95 -8.9 11.45 L-8.9 10.45 -6.2 10.45 6.9 10.45" fill="url(#gradient0)" fill-rule="evenodd" stroke="none"/>
    <path d="M9.65 -7.9 L10.5 -7.9 10.5 -5.5 6.7 -5.5 5.6 -5.5 0.25 -5.5 -2.95 -5.5 -4.05 -5.5 -5.1 -5.5 -6.2 -5.5 -9.95 -5.5 -9.95 -7.9 -8.9 -7.9 9.65 -7.9 M6.7 5.65 L10.5 5.65 10.5 8.1 9.65 8.1 -8.9 8.1 -9.95 8.1 -9.95 5.65 -6.2 5.65 -5.1 5.65 -4.05 5.65 -2.95 5.65 0.25 5.65 5.6 5.65 6.7 5.65" fill="url(#gradient1)" fill-rule="evenodd" stroke="none"/>
    <path d="M9.65 8.1 L9.65 9.25 6.9 9.25 -6.2 9.25 -8.9 9.25 -8.9 8.1 9.65 8.1" fill="url(#gradient2)" fill-rule="evenodd" stroke="none"/>
  </g>
  <defs>
    <radialGradient cx="0" cy="0" fx="288.0" fy="0" gradientTransform="matrix(0.0118, 0.0, 0.0, 0.0534, 0.25, -0.25)" gradientUnits="userSpaceOnUse" id="gradient0" r="819.2" spreadMethod="pad">
      <stop offset="0.2235294117647059" stop-color="#ffffff"/>
      <stop offset="0.34901960784313724" stop-color="#d1d6d8"/>
      <stop offset="1.0" stop-color="#e3e5e6"/>
    </radialGradient>
    <radialGradient cx="0" cy="0" fx="288.0" fy="0" gradientTransform="matrix(0.0118, 0.0, 0.0, 0.0534, 2.3, -0.05)" gradientUnits="userSpaceOnUse" id="gradient1" r="819.2" spreadMethod="pad">
      <stop offset="0.2235294117647059" stop-color="#ffffff"/>
      <stop offset="0.34901960784313724" stop-color="#a5acaf"/>
      <stop offset="1.0" stop-color="#c1c6c5"/>
    </radialGradient>
    <radialGradient cx="0" cy="0" fx="288.0" fy="0" gradientTransform="matrix(0.0113, 0.0, 0.0, 0.0113, 0.35, 8.65)" gradientUnits="userSpaceOnUse" id="gradient2" r="819.2" spreadMethod="pad">
      <stop offset="0.2235294117647059" stop-color="#ffffff"/>
      <stop offset="0.34901960784313724" stop-color="#d1d6d8"/>
      <stop offset="1.0" stop-color="#e3e5e6"/>
    </radialGradient>
  </defs>
</svg>
