<?xml version="1.0" encoding="UTF-8" standalone="no"?>
<svg xmlns:xlink="http://www.w3.org/1999/xlink" height="29.75px" width="32.4px" xmlns="http://www.w3.org/2000/svg">
  <g transform="matrix(1.0, 0.0, 0.0, 1.0, 21.15, 23.2)">
    <path d="M10.95 -16.95 L11.0 -16.25 11.05 -14.45 9.65 -14.85 9.55 -14.8 9.55 -16.55 5.55 -17.85 10.95 -16.95 M-1.45 -17.2 L-0.1 -9.2 -0.55 -7.55 -0.85 -2.7 -2.7 -13.3 Q-2.5 -14.7 -1.45 -17.2" fill="#ffc900" fill-rule="evenodd" stroke="none"/>
    <path d="M9.6 -18.2 L11.05 -17.85 10.95 -16.95 5.55 -17.85 -1.9 -19.75 -1.45 -17.2 Q-2.5 -14.7 -2.7 -13.3 L-3.1 -15.4 -2.9 -20.9 9.6 -18.2" fill="#ffdc5d" fill-rule="evenodd" stroke="none"/>
    <path d="M11.05 -14.45 L11.1 -9.65 10.2 -7.8 9.55 -6.6 9.55 -14.8 9.65 -14.85 11.05 -14.45 M2.9 6.0 L2.4 6.2 0.9 6.5 0.5 4.05 -0.75 -2.2 -0.8 -2.45 -0.85 -2.7 -0.55 -7.55 -0.1 -9.2 2.15 3.6 3.4 3.4 2.9 6.0" fill="#ffb700" fill-rule="evenodd" stroke="none"/>
    <path d="M5.55 -17.85 L9.55 -16.55 9.55 -14.8 5.35 -14.45 Q2.4 -13.85 1.35 -12.55 0.4 -11.25 -0.1 -9.2 L-1.45 -17.2 -0.9 -18.65 5.55 -17.85" fill="#ffe757" fill-rule="evenodd" stroke="none"/>
    <path d="M-0.1 -9.2 Q0.4 -11.25 1.35 -12.55 2.4 -13.85 5.35 -14.45 L9.55 -14.8 9.55 -6.6 Q8.0 -4.4 6.55 -3.5 4.55 -2.35 3.85 0.65 L3.4 3.4 2.15 3.6 -0.1 -9.2" fill="#f7d701" fill-rule="evenodd" stroke="none"/>
    <path d="M3.4 3.4 L3.85 0.65 Q4.55 -2.35 6.55 -3.5 8.0 -4.4 9.55 -6.6 L9.25 2.15 3.4 3.4" fill="#f7cc01" fill-rule="evenodd" stroke="none"/>
    <path d="M11.1 -9.65 L11.15 1.9 11.25 3.6 9.2 4.25 2.9 6.0 3.4 3.4 9.25 2.15 9.55 -6.6 10.2 -7.8 11.1 -9.65" fill="#ff9a00" fill-rule="evenodd" stroke="none"/>
    <path d="M0.9 6.5 L-0.1 6.55 -1.35 1.95 Q-2.35 -1.7 -3.25 -3.8 L-6.8 -18.95 -14.35 -14.65 -18.25 -14.7 -13.9 -17.35 Q-12.65 -17.75 -9.5 -19.25 L-5.85 -20.4 -3.8 -12.15 -0.8 -2.45 -0.75 -2.2 0.5 4.05 0.9 6.5" fill="#d75e13" fill-rule="evenodd" stroke="none"/>
    <path d="M-4.75 -23.2 L9.6 -18.2 -2.9 -20.9 -3.1 -15.4 -4.15 -20.6 -4.75 -23.2" fill="#fff4cc" fill-rule="evenodd" stroke="none"/>
    <path d="M-13.9 -17.35 L-4.75 -23.2 -4.15 -20.6 -3.1 -15.4 -2.7 -13.3 -0.85 -2.7 -0.8 -2.45 -3.8 -12.15 -5.85 -20.4 -9.5 -19.25 Q-12.65 -17.75 -13.9 -17.35" fill="#bf510c" fill-rule="evenodd" stroke="none"/>
    <path d="M5.55 -17.85 L-0.9 -18.65 -1.45 -17.2 -1.9 -19.75 5.55 -17.85" fill="#ffee8c" fill-rule="evenodd" stroke="none"/>
    <path d="M-0.1 6.55 L-0.9 6.55 -4.85 6.4 -5.15 4.1 -1.45 4.05 -3.25 -3.8 Q-2.35 -1.7 -1.35 1.95 L-0.1 6.55 M-19.6 -8.5 L-21.15 -12.9 -18.25 -14.7 -14.35 -14.65 -19.25 -11.9 -17.9 -7.45 -19.6 -8.5" fill="#f06d17" fill-rule="evenodd" stroke="none"/>
    <path d="M-14.35 -14.65 Q-12.3 -14.45 -11.15 -13.8 -9.7 -12.85 -5.15 -7.3 -4.2 -6.15 -3.25 -3.8 L-1.45 4.05 -5.15 4.1 -5.45 2.3 -8.75 -1.6 Q-10.15 -3.45 -13.75 -5.25 L-17.9 -7.45 -19.25 -11.9 -14.35 -14.65" fill="#f09a0f" fill-rule="evenodd" stroke="none"/>
    <path d="M-3.25 -3.8 Q-4.2 -6.15 -5.15 -7.3 -9.7 -12.85 -11.15 -13.8 -12.3 -14.45 -14.35 -14.65 L-6.8 -18.95 -3.25 -3.8" fill="#e68e0d" fill-rule="evenodd" stroke="none"/>
    <path d="M-4.85 6.4 L-8.85 6.05 -10.65 4.15 -5.15 4.1 -4.85 6.4 M-19.3 -7.55 L-19.55 -8.2 -19.6 -8.5 -17.9 -7.45 -15.75 -1.05 -17.1 -3.3 -19.3 -7.55" fill="#ff771e" fill-rule="evenodd" stroke="none"/>
    <path d="M-17.9 -7.45 L-13.75 -5.25 Q-10.15 -3.45 -8.75 -1.6 L-5.45 2.3 -5.15 4.1 -10.65 4.15 -12.5 2.35 -15.75 -1.05 -17.9 -7.45" fill="#f5a31f" fill-rule="evenodd" stroke="none"/>
    <path d="M-8.85 6.05 L-13.25 5.8 -14.7 5.8 -19.3 -7.55 -17.1 -3.3 -15.75 -1.05 -13.8 4.05 -10.65 4.15 -8.85 6.05" fill="#ff7f2c" fill-rule="evenodd" stroke="none"/>
    <path d="M-15.75 -1.05 L-12.5 2.35 -10.65 4.15 -13.8 4.05 -15.75 -1.05" fill="#ffaf2e" fill-rule="evenodd" stroke="none"/>
  </g>
</svg>
