<?xml version="1.0" encoding="UTF-8" standalone="no"?>
<svg xmlns:xlink="http://www.w3.org/1999/xlink" height="229.6px" width="231.5px" xmlns="http://www.w3.org/2000/svg">
  <g transform="matrix(1.0, 0.0, 0.0, 1.0, 138.3, 112.65)">
    <path d="M69.55 -112.1 Q70.05 -111.6 70.05 -110.9 70.05 -110.2 69.55 -109.65 69.0 -109.15 68.3 -109.15 67.6 -109.15 67.1 -109.65 66.55 -110.2 66.55 -110.9 66.55 -111.6 67.1 -112.1 67.6 -112.65 68.3 -112.65 69.0 -112.65 69.55 -112.1 M32.9 -30.4 Q30.35 -29.0 29.7 -31.65 28.8 -35.2 32.75 -35.45 37.8 -33.15 32.9 -30.4 M25.85 -39.75 Q24.6 -39.3 24.15 -40.6 23.1 -43.4 26.05 -43.9 30.65 -41.55 25.85 -39.75 M92.4 -60.45 L92.4 -60.2 Q89.05 -56.2 88.4 -61.25 88.25 -62.45 89.6 -62.75 L90.1 -62.85 Q92.25 -62.55 92.4 -60.45 M90.55 -14.05 Q88.65 -12.65 87.25 -14.65 84.75 -18.3 88.95 -20.45 L90.1 -20.85 Q96.1 -18.05 90.55 -14.05 M44.65 42.65 Q45.05 43.05 45.05 43.65 45.05 44.25 44.65 44.7 44.25 45.1 43.65 45.1 43.05 45.1 42.65 44.7 42.25 44.25 42.25 43.65 42.25 43.05 42.65 42.65 43.05 42.2 43.65 42.2 44.25 42.2 44.65 42.65 M22.2 25.9 Q21.2 28.25 18.45 28.3 11.65 28.3 13.5 22.05 13.9 20.75 15.25 20.1 16.65 19.45 17.95 19.25 24.9 19.7 22.2 25.9 M28.8 66.9 Q27.45 69.2 25.05 67.85 21.05 65.55 23.25 61.8 24.15 60.35 25.7 60.25 32.2 61.3 28.8 66.9 M-112.1 -55.45 Q-111.6 -56.0 -110.9 -56.0 -110.2 -56.0 -109.65 -55.45 -109.15 -54.95 -109.15 -54.25 -109.15 -53.55 -109.65 -53.0 -110.2 -52.5 -110.9 -52.5 -111.6 -52.5 -112.1 -53.0 -112.65 -53.55 -112.65 -54.25 -112.65 -54.95 -112.1 -55.45 M-42.05 -39.6 Q-41.55 -40.15 -40.85 -40.15 -40.15 -40.15 -39.6 -39.6 -39.1 -39.1 -39.1 -38.4 -39.1 -37.7 -39.6 -37.15 -40.15 -36.65 -40.85 -36.65 -41.55 -36.65 -42.05 -37.15 -42.6 -37.7 -42.6 -38.4 -42.6 -39.1 -42.05 -39.6 M-50.7 -8.15 Q-50.1 -8.75 -49.25 -8.75 -48.4 -8.75 -47.8 -8.15 -47.2 -7.55 -47.2 -6.7 -47.2 -5.85 -47.8 -5.25 -48.4 -4.65 -49.25 -4.65 -50.1 -4.65 -50.7 -5.25 -51.3 -5.85 -51.3 -6.7 -51.3 -7.55 -50.7 -8.15 M-27.55 -19.3 L-27.5 -19.05 Q-29.6 -13.7 -33.05 -18.6 -33.6 -19.4 -32.95 -20.2 -32.1 -21.1 -31.0 -21.15 -28.45 -21.5 -27.55 -19.3 M-31.55 20.45 Q-32.75 20.9 -33.25 19.6 -34.25 16.8 -31.3 16.3 -26.7 18.65 -31.55 20.45 M-6.45 3.0 Q-7.55 -0.4 -4.25 -1.15 1.7 1.75 -4.45 4.0 -5.95 4.55 -6.45 3.0 M-133.85 55.35 L-133.8 55.6 Q-136.3 61.0 -138.2 55.35 -138.5 54.55 -137.6 54.0 -136.9 53.55 -136.25 53.5 -134.45 53.7 -133.85 55.35 M-54.55 116.7 L-56.5 116.55 Q-58.15 113.75 -55.35 112.05 L-54.6 111.7 Q-49.95 114.2 -54.55 116.7" fill="#ffffff" fill-opacity="0.49803922" fill-rule="evenodd" stroke="none"/>
    <path d="M-3.8 1.3 L-3.8 1.7 -4.2 1.7 -4.2 1.3 -3.8 1.3 M-30.15 -18.95 L-30.05 -18.7 -30.15 -18.45 Q-30.25 -18.35 -30.35 -18.35 -30.45 -18.35 -30.55 -18.45 L-30.65 -18.7 -30.55 -18.95 -30.35 -19.05 -30.15 -18.95 M-40.3 -37.9 L-40.35 -37.9 -40.35 -37.85 -40.3 -37.9 M-40.35 -38.9 L-40.35 -38.85 -40.3 -38.9 -40.35 -38.9 M-49.9 -7.35 L-48.6 -7.35 -48.6 -6.05 -49.9 -6.05 -49.9 -7.35 M-40.8 -39.1 L-40.65 -39.55 -39.7 -38.6 -40.15 -38.4 -39.7 -38.2 -40.65 -37.25 -40.85 -37.7 -40.85 -38.0 -41.0 -38.05 -41.2 -38.25 -41.3 -37.9 -41.35 -37.9 -41.35 -37.85 -41.3 -37.9 -41.0 -38.05 -40.85 -37.7 -41.05 -37.25 -42.0 -38.2 -41.55 -38.4 -42.0 -38.6 -41.05 -39.55 -40.8 -39.1 M-110.7 -53.5 Q-110.2 -53.7 -110.65 -53.55 L-110.7 -53.5 M-110.4 -53.7 L-110.35 -53.75 -110.4 -53.75 -110.4 -53.7 M-111.15 -54.25 L-111.2 -54.4 -111.05 -54.6 -110.75 -54.6 -110.55 -54.4 -110.55 -54.35 Q-109.9 -54.0 -110.55 -54.4 L-110.4 -54.7 -110.35 -54.75 -110.4 -54.75 -110.4 -54.7 -110.75 -54.6 -110.9 -54.95 -110.7 -55.4 -109.75 -54.45 -110.15 -54.25 -109.75 -54.05 -110.7 -53.1 -110.9 -53.55 -110.9 -53.85 -111.05 -53.9 -111.25 -54.1 -111.15 -54.25 M-111.6 -54.25 L-112.05 -54.45 -111.1 -55.4 -110.9 -54.95 -111.05 -54.6 -111.35 -54.75 -111.2 -54.4 -111.6 -54.25 -111.25 -54.1 -111.35 -53.75 -111.4 -53.75 -111.4 -53.7 -111.35 -53.75 -111.05 -53.9 -110.9 -53.55 -111.1 -53.1 -112.05 -54.05 -111.6 -54.25 M25.35 64.3 Q25.35 63.9 25.65 63.65 25.9 63.35 26.3 63.35 26.7 63.35 27.0 63.65 L27.25 64.3 27.0 65.0 26.3 65.25 25.65 65.0 Q25.35 64.7 25.35 64.3 M19.35 22.55 Q19.85 23.05 19.85 23.75 19.85 24.45 19.35 25.0 18.8 25.5 18.1 25.5 17.4 25.5 16.9 25.0 16.35 24.45 16.35 23.75 16.35 23.05 16.9 22.55 17.4 22.0 18.1 22.0 18.8 22.0 19.35 22.55 M43.95 43.8 L43.7 44.05 43.4 43.55 43.6 43.3 43.95 43.8 M90.2 -17.55 L90.35 -17.15 90.2 -16.7 Q90.05 -16.55 89.8 -16.55 89.55 -16.55 89.4 -16.7 89.25 -16.9 89.25 -17.15 L89.4 -17.55 Q89.55 -17.75 89.8 -17.75 L90.2 -17.55 M90.4 -61.5 L91.0 -61.25 91.25 -60.65 91.0 -60.05 Q90.75 -59.8 90.4 -59.8 L89.8 -60.05 Q89.55 -60.3 89.55 -60.65 L89.8 -61.25 90.4 -61.5 M32.5 -32.55 L32.4 -32.8 32.65 -32.8 32.5 -32.55 M25.65 -42.35 L26.15 -42.6 26.65 -42.35 26.85 -41.75 26.65 -41.15 Q26.45 -40.9 26.15 -40.9 25.85 -40.9 25.65 -41.15 L25.45 -41.75 25.65 -42.35 M68.45 -111.25 L68.65 -111.05 68.65 -110.75 68.55 -110.7 68.8 -110.4 68.8 -110.35 68.85 -110.4 68.8 -110.4 68.65 -110.75 69.0 -110.9 69.45 -110.7 68.5 -109.75 68.3 -110.2 68.1 -109.75 67.15 -110.7 67.6 -110.9 68.0 -110.75 67.85 -110.4 67.8 -110.4 67.8 -110.35 67.85 -110.4 68.05 -110.55 68.0 -110.75 67.95 -111.05 68.2 -111.25 68.45 -111.25 68.3 -111.55 68.2 -111.25 67.85 -111.35 67.95 -111.05 67.6 -110.9 67.15 -111.1 68.1 -112.05 68.3 -111.55 68.5 -112.05 69.45 -111.1 69.0 -110.9 68.65 -111.05 68.8 -111.4 68.45 -111.25 M-3.8 1.7 L-3.75 1.7 -3.8 1.75 -3.8 1.7 M-54.3 114.0 L-54.15 114.3 -54.3 114.65 -54.65 114.75 -55.0 114.65 -55.15 114.3 -55.0 114.0 Q-54.85 113.85 -54.65 113.85 L-54.3 114.0 M-136.0 55.2 L-135.5 55.4 -135.3 55.85 -135.5 56.3 -136.0 56.5 Q-136.3 56.5 -136.5 56.3 L-136.7 55.85 -136.5 55.4 -136.0 55.2 M-31.9 18.45 L-31.7 17.85 Q-31.5 17.6 -31.2 17.6 -30.9 17.6 -30.7 17.85 L-30.5 18.45 -30.7 19.05 -31.2 19.3 -31.7 19.05 -31.9 18.45" fill="#ffffff" fill-rule="evenodd" stroke="none"/>
  </g>
</svg>
