<?xml version="1.0" encoding="UTF-8" standalone="no"?>
<svg xmlns:xlink="http://www.w3.org/1999/xlink" height="58.05px" width="66.7px" xmlns="http://www.w3.org/2000/svg">
  <g transform="matrix(1.0, 0.0, 0.0, 1.0, -9.6, -32.8)">
    <path d="M19.2 59.6 Q21.85 54.7 27.1 48.0 28.1 47.2 28.95 46.7 30.45 45.85 31.5 45.3 L31.85 44.4 31.65 43.3 33.55 43.1 33.15 42.0 34.95 41.85 35.1 39.6 35.25 37.75 35.3 37.55 35.55 35.9 35.5 35.15 36.2 35.4 37.75 35.8 Q40.2 35.8 43.15 34.3 46.15 32.8 47.2 32.8 49.1 32.8 50.65 33.85 52.25 34.85 54.7 34.85 58.1 34.85 59.75 33.4 60.5 37.3 60.3 38.3 L60.1 39.6 Q59.7 42.25 60.2 45.15 L60.45 46.3 68.4 55.05 68.9 56.8 Q69.3 58.65 68.75 60.15 L70.25 60.75 Q70.25 61.15 71.6 64.25 L76.3 76.05 75.0 76.25 72.9 76.75 70.1 77.65 70.25 79.2 65.4 79.8 63.15 80.3 59.45 81.15 58.7 82.3 56.75 83.25 54.2 84.5 49.55 86.45 Q48.05 86.8 46.85 87.4 L46.65 87.45 39.1 90.85 Q38.7 90.45 39.3 89.4 L28.0 89.85 28.85 88.7 34.75 80.9 38.65 75.75 39.75 74.6 39.75 74.4 38.65 75.75 25.85 88.8 24.65 90.05 20.7 90.15 17.25 89.9 14.05 89.6 14.8 85.6 Q12.1 84.35 9.6 82.75 L10.45 80.35 10.6 79.9 Q14.45 69.1 17.85 62.2 L19.2 59.6 M14.8 85.6 L16.7 74.35 Q17.5 69.2 17.8 68.05 17.5 69.2 16.7 74.35 L14.8 85.6 M67.45 61.45 Q66.85 61.35 64.05 62.3 L61.55 63.25 63.05 61.85 Q64.4 60.75 64.85 60.75 64.4 60.75 63.05 61.85 L61.55 63.25 64.05 62.3 Q66.85 61.35 67.45 61.45 M61.25 63.35 L61.45 63.35 61.55 63.25 61.25 63.35 M66.35 62.95 Q63.8 63.95 59.95 66.9 56.7 69.35 56.2 70.1 56.7 69.35 59.95 66.9 63.8 63.95 66.35 62.95 M48.9 68.95 L44.45 78.9 39.3 89.4 44.45 78.9 48.9 68.95 M62.4 60.55 Q55.9 66.0 52.8 74.1 50.8 79.3 50.8 83.0 50.8 79.3 52.8 74.1 55.9 66.0 62.4 60.55 M66.5 71.25 Q61.9 77.55 59.45 81.15 61.9 77.55 66.5 71.25 M69.3 66.9 L70.1 77.65 69.3 66.9" fill="url(#gradient0)" fill-rule="evenodd" stroke="none"/>
    <path d="M28.85 88.7 L27.3 88.75 25.85 88.8 38.65 75.75 34.75 80.9 28.85 88.7 M10.6 79.9 Q9.95 76.7 9.95 74.5 9.95 73.55 13.7 68.2 L17.85 62.2 Q14.45 69.1 10.6 79.9" fill="#c29b9b" fill-rule="evenodd" stroke="none"/>
    <path d="M54.2 84.5 L57.05 88.4 57.55 89.05 53.1 89.75 53.05 89.6 53.2 87.9 52.75 87.75 52.1 88.55 51.15 89.95 48.2 89.4 45.35 89.0 46.35 87.9 46.65 87.45 46.85 87.4 49.3 86.5 49.45 86.6 49.55 86.45 54.2 84.5" fill="#a3a3a3" fill-rule="evenodd" stroke="none"/>
    <path d="M19.2 59.6 Q21.85 54.7 27.1 48.0 28.1 47.2 28.95 46.7 30.45 45.85 31.5 45.3 L31.85 44.4 31.65 43.3 33.55 43.1 33.15 42.0 34.95 41.85 35.1 39.6 35.25 37.75 35.3 37.55 35.55 35.9 35.5 35.15 36.2 35.4 37.75 35.8 Q40.2 35.8 43.15 34.3 46.15 32.8 47.2 32.8 49.1 32.8 50.65 33.85 52.25 34.85 54.7 34.85 58.1 34.85 59.75 33.4 60.5 37.3 60.3 38.3 L60.1 39.6 Q59.7 42.25 60.2 45.15 L60.45 46.3 68.4 55.05 68.9 56.8 Q69.3 58.65 68.75 60.15 L70.25 60.75 Q70.25 61.15 71.6 64.25 L76.3 76.05 75.0 76.25 72.9 76.75 70.1 77.65 70.25 79.2 65.4 79.8 63.15 80.3 59.45 81.15 58.7 82.3 56.75 83.25 54.2 84.5 57.05 88.4 57.55 89.05 53.1 89.75 53.05 89.75 53.05 89.6 53.2 87.9 M52.75 87.75 L52.1 88.55 51.15 89.95 48.2 89.4 45.35 89.0 46.35 87.9 46.65 87.45 39.1 90.85 Q38.7 90.45 39.3 89.4 L28.0 89.85 28.85 88.7 27.3 88.75 25.85 88.8 24.65 90.05 20.7 90.15 17.25 89.9 14.05 89.6 14.8 85.6 Q12.1 84.35 9.6 82.75 L10.45 80.35 10.6 79.9 Q9.95 76.7 9.95 74.5 9.95 73.55 13.7 68.2 L17.85 62.2 19.15 59.65 19.2 59.6 17.85 62.2 Q14.45 69.1 10.6 79.9 M17.8 68.05 Q17.5 69.2 16.7 74.35 L14.8 85.6 M39.75 74.6 L39.75 74.4 38.65 75.75 39.75 74.6 M38.65 75.75 L34.75 80.9 28.85 88.7 M25.85 88.8 L38.65 75.75 M64.85 60.75 Q64.4 60.75 63.05 61.85 L61.55 63.25 64.05 62.3 Q66.85 61.35 67.45 61.45 M61.25 63.35 L61.45 63.35 61.55 63.25 61.25 63.35 M56.2 70.1 Q56.7 69.35 59.95 66.9 63.8 63.95 66.35 62.95 M49.55 86.45 L49.3 86.5 49.45 86.6 M46.65 87.45 L46.85 87.4 Q48.05 86.8 49.55 86.45 L54.2 84.5 M46.85 87.4 L49.3 86.5 M70.1 77.65 L69.3 66.9 M59.45 81.15 Q61.9 77.55 66.5 71.25 M50.8 83.0 Q50.8 79.3 52.8 74.1 55.9 66.0 62.4 60.55 M39.3 89.4 L44.45 78.9 48.9 68.95" fill="none" stroke="#a36a6a" stroke-linecap="round" stroke-linejoin="round" stroke-opacity="0.4" stroke-width="0.05"/>
  </g>
  <defs>
    <radialGradient cx="0" cy="0" gradientTransform="matrix(0.144, 0.054, -0.0223, 0.0593, 11.7, 105.0)" gradientUnits="userSpaceOnUse" id="gradient0" r="819.2" spreadMethod="pad">
      <stop offset="0.00784313725490196" stop-color="#a36a6a"/>
      <stop offset="0.8470588235294118" stop-color="#e0cbcb"/>
    </radialGradient>
  </defs>
</svg>
