<?xml version="1.0" encoding="UTF-8" standalone="no"?>
<svg xmlns:xlink="http://www.w3.org/1999/xlink" height="18.1px" width="18.1px" xmlns="http://www.w3.org/2000/svg">
  <g transform="matrix(1.0, 0.0, 0.0, 1.0, 0.0, 0.0)">
    <path d="M15.0 2.4 L14.3 2.4 8.95 3.2 Q4.75 3.95 4.75 6.9 L4.7 8.5 3.55 12.1 2.3 13.85 2.2 13.9 Q3.9 14.95 4.4 14.95 L7.75 14.15 Q7.85 12.75 9.1 12.75 L9.75 13.1 10.2 13.55 13.4 12.9 15.0 3.9 15.0 2.4 M7.9 1.45 L16.6 1.45 16.6 2.15 16.6 5.65 Q16.05 8.7 15.8 14.35 L14.85 15.35 14.45 15.45 9.1 15.95 4.05 16.6 1.5 16.6 1.5 11.85 2.0 7.4 2.35 2.8 2.6 2.7 Q4.25 2.05 7.9 1.45" fill="#536679" fill-rule="evenodd" stroke="none"/>
    <path d="M0.8 18.1 L0.9 5.5 1.5 5.2 1.5 11.85 1.5 16.6 4.05 16.6 16.6 16.6 16.6 5.65 16.6 2.15 18.1 2.2 18.1 18.1 0.8 18.1" fill="#212e3a" fill-rule="evenodd" stroke="none"/>
    <path d="M0.8 18.1 L0.0 18.1 0.0 0.0 18.1 0.0 18.1 2.2 16.6 2.15 16.6 1.45 7.9 1.45 1.5 1.45 1.5 5.2 0.9 5.5 0.8 18.1" fill="#151b21" fill-rule="evenodd" stroke="none"/>
    <path d="M12.55 6.5 L12.45 6.45 Q9.25 7.4 7.55 8.35 5.0 9.65 5.5 10.9 L6.6 10.9 6.4 10.3 12.55 6.5 M15.0 2.4 L15.0 3.9 13.4 12.9 10.2 13.55 9.75 13.1 9.1 12.75 Q7.85 12.75 7.75 14.15 L4.4 14.95 Q3.9 14.95 2.2 13.9 L2.3 13.85 3.55 12.1 4.7 8.5 4.75 6.9 Q4.75 3.95 8.95 3.2 L14.3 2.4 15.0 2.4 M7.55 12.1 L8.3 11.7 Q8.5 11.55 8.65 11.5 L9.3 11.25 8.95 10.9 8.7 10.45 Q8.6 10.45 8.35 10.6 L7.85 10.85 Q7.25 11.15 7.1 11.35 L7.55 12.1" fill="#4d5d70" fill-rule="evenodd" stroke="none"/>
    <path d="M12.55 6.5 L6.4 10.3 6.6 10.9 5.5 10.9 Q5.0 9.65 7.55 8.35 9.25 7.4 12.45 6.45 L12.55 6.5 M7.55 12.1 L7.1 11.35 Q7.25 11.15 7.85 10.85 L8.35 10.6 Q8.6 10.45 8.7 10.45 L8.95 10.9 9.3 11.25 8.65 11.5 Q8.5 11.55 8.3 11.7 L7.55 12.1" fill="#465566" fill-rule="evenodd" stroke="none"/>
    <path d="M1.5 5.2 L1.5 1.45 7.9 1.45 Q4.25 2.05 2.6 2.7 L2.35 2.8 2.0 7.4 1.5 11.85 1.5 5.2 M4.05 16.6 L9.1 15.95 14.45 15.45 14.85 15.35 15.8 14.35 Q16.05 8.7 16.6 5.65 L16.6 16.6 4.05 16.6" fill="#677d96" fill-rule="evenodd" stroke="none"/>
  </g>
</svg>
