<?xml version="1.0" encoding="UTF-8" standalone="no"?>
<svg xmlns:xlink="http://www.w3.org/1999/xlink" height="65.3px" width="70.5px" xmlns="http://www.w3.org/2000/svg">
  <g transform="matrix(1.0, 0.0, 0.0, 1.0, 35.25, 32.65)">
    <path d="M5.25 6.75 L5.4 6.8 Q6.35 8.5 6.3 10.6 L5.95 12.15 4.95 13.85 3.75 13.7 Q3.0 11.95 3.25 10.0 L3.35 9.2 3.4 9.1 3.35 9.05 Q3.45 8.1 4.05 7.35 L4.45 6.8 5.25 6.75 M2.7 19.6 L2.8 20.25 Q4.15 20.95 6.15 20.95 L7.85 20.6 8.05 20.55 8.2 20.4 8.9 19.8 Q9.95 19.15 11.7 19.15 13.55 19.15 15.2 20.95 L15.6 21.5 18.85 22.2 25.4 23.2 30.8 23.5 32.45 23.15 33.1 21.75 34.3 22.25 34.3 23.8 34.45 24.5 35.25 26.8 34.95 27.9 34.1 28.25 Q29.95 29.8 25.35 29.05 19.95 28.15 14.8 26.6 14.9 24.4 14.55 23.05 L14.5 22.95 13.95 21.95 13.15 21.15 Q12.45 20.6 11.35 20.6 10.35 20.6 9.35 21.8 8.05 23.2 7.6 26.7 L7.15 26.9 3.5 26.55 2.65 26.25 1.7 20.3 2.7 19.6 M-16.65 9.0 L-14.7 9.0 -14.65 9.1 -14.5 9.6 -14.05 11.25 Q-13.4 13.8 -14.5 15.95 L-14.85 16.0 -14.9 16.4 -14.95 16.0 Q-15.6 12.2 -16.5 9.35 L-16.65 9.0 M-14.45 20.2 L-13.05 20.75 -13.05 20.9 -12.75 23.4 -13.0 25.05 -13.3 27.85 -13.3 28.1 -13.35 29.25 Q-19.8 34.25 -27.3 31.85 -31.4 30.65 -34.65 28.1 L-35.25 22.8 -34.2 21.9 -33.7 24.55 -32.75 25.05 -32.1 25.45 -26.3 26.95 Q-20.7 28.25 -14.55 25.05 L-14.45 25.0 Q-14.1 24.5 -14.15 23.7 L-14.2 22.4 -14.3 21.9 -14.3 21.65 -14.45 20.2 M-31.6 15.95 L-32.3 15.9 Q-33.3 12.2 -32.4 8.75 L-32.3 8.65 -30.6 8.95 Q-31.3 10.85 -31.1 13.6 L-31.15 14.05 -31.2 15.85 -31.25 15.95 -31.6 15.95 M-14.95 16.0 L-14.85 16.0 -14.95 16.0" fill="#4a463f" fill-rule="evenodd" stroke="none"/>
    <path d="M5.4 6.8 L6.75 6.75 Q8.15 8.6 7.8 10.75 L7.6 12.15 Q7.5 12.95 6.9 13.4 L6.15 13.9 5.55 13.9 5.55 14.0 5.5 13.9 6.15 13.9 5.5 13.9 5.55 13.9 5.5 13.9 5.45 13.85 5.4 13.9 4.95 13.9 4.95 13.85 5.95 12.15 6.3 10.6 Q6.35 8.5 5.4 6.8 M7.6 26.7 Q8.05 23.2 9.35 21.8 10.35 20.6 11.35 20.6 12.45 20.6 13.15 21.15 L13.95 21.95 Q13.15 22.25 12.7 23.05 12.3 23.85 12.3 24.85 L12.3 25.1 9.55 26.0 7.6 26.7" fill="#2e2b27" fill-rule="evenodd" stroke="none"/>
    <path d="M30.6 19.0 Q32.0 20.4 24.6 19.0 L18.25 14.2 Q13.6 10.3 13.6 6.8 13.6 5.0 14.6 5.0 15.9 5.0 17.25 6.85 L18.65 9.0 18.85 9.65 Q19.7 12.35 22.4 14.3 26.8 17.55 30.6 19.0 M-17.55 19.45 L-17.05 20.0 -16.7 20.45 -18.7 21.85 -19.85 22.35 -21.4 22.5 -24.95 21.85 Q-27.95 21.05 -28.65 20.25 L-27.1 19.75 -25.85 19.5 -23.7 19.9 -21.75 20.3 -20.4 19.85 -20.35 19.85 -19.25 19.45 -18.45 19.35 -17.6 19.45 -17.55 19.45 M-19.2 14.1 Q-19.2 15.45 -20.15 16.1 L-21.0 16.4 -24.3 16.55 -26.15 16.55 Q-27.75 16.45 -27.75 15.8 -27.75 15.05 -26.25 11.6 L-25.95 10.85 Q-24.5 7.65 -23.75 6.9 L-23.4 6.65 Q-22.6 6.65 -21.2 7.5 -20.85 8.0 -20.05 10.45 -19.2 13.1 -19.2 14.1 M-18.95 19.9 L-20.4 20.25 -20.6 20.25 Q-21.85 20.6 -21.8 21.35 L-20.85 21.65 -20.25 21.55 -19.5 21.2 -18.45 20.6 Q-18.55 20.25 -18.8 20.0 L-18.95 19.9 M-22.55 7.5 Q-22.85 7.3 -23.3 7.1 L-24.2 8.6 Q-24.75 9.8 -24.75 10.6 -24.75 11.3 -24.45 11.5 L-23.7 11.6 -23.0 11.4 -22.25 10.55 -21.8 9.65 -21.65 8.85 Q-21.65 8.05 -22.55 7.5" fill="#e0cdcd" fill-rule="evenodd" stroke="none"/>
    <path d="M-18.95 19.9 L-18.8 20.0 Q-18.55 20.25 -18.45 20.6 L-19.5 21.2 -20.25 21.55 -20.85 21.65 -21.8 21.35 Q-21.85 20.6 -20.6 20.25 L-20.4 20.25 -18.95 19.9 M-22.55 7.5 Q-21.65 8.05 -21.65 8.85 L-21.8 9.65 -22.25 10.55 -23.0 11.4 -23.7 11.6 -24.45 11.5 Q-24.75 11.3 -24.75 10.6 -24.75 9.8 -24.2 8.6 L-23.3 7.1 Q-22.85 7.3 -22.55 7.5" fill="#f2eaea" fill-rule="evenodd" stroke="none"/>
    <path d="M5.25 6.75 L6.75 2.4 6.95 1.65 7.4 -0.4 7.75 -4.75 Q8.1 -10.35 6.95 -14.1 L6.6 -15.0 6.15 -15.95 5.3 -17.15 5.95 -21.75 Q6.3 -24.9 7.8 -28.05 L8.3 -29.05 8.6 -29.35 10.45 -30.75 Q12.95 -32.3 14.85 -32.3 16.3 -32.3 18.5 -31.5 15.8 -25.55 14.35 -20.35 L12.05 -11.3 Q9.7 -2.7 8.85 5.9 L8.8 6.4 9.85 8.65 Q10.2 9.75 10.2 11.55 10.2 12.7 9.85 13.75 L9.8 13.95 9.6 14.5 Q10.7 17.75 17.45 19.7 23.05 21.35 28.35 21.35 L32.95 20.9 33.5 20.85 33.1 21.75 32.45 23.15 30.8 23.5 25.4 23.2 18.85 22.2 15.6 21.5 15.2 20.95 Q13.55 19.15 11.7 19.15 9.95 19.15 8.9 19.8 L8.2 20.4 8.05 20.55 7.85 20.6 6.15 20.95 Q4.15 20.95 2.8 20.25 L2.7 19.6 1.85 10.85 3.35 9.2 3.25 10.0 Q3.0 11.95 3.75 13.7 L4.95 13.85 4.95 13.9 5.4 13.9 5.55 14.0 5.55 13.9 6.15 13.9 6.9 13.4 Q7.5 12.95 7.6 12.15 L7.8 10.75 Q8.15 8.6 6.75 6.75 L5.4 6.8 5.25 6.75 M-28.1 2.0 L-28.1 1.95 -28.35 -0.05 Q-28.65 -2.9 -30.55 -9.4 -31.45 -12.3 -31.85 -15.0 -32.25 -17.4 -31.9 -24.95 L-31.65 -29.65 -27.35 -31.6 Q-24.95 -32.45 -22.65 -32.6 L-21.45 -32.65 -17.9 -32.4 Q-16.7 -32.05 -15.15 -31.15 L-14.7 -30.9 -11.95 -29.25 Q-10.3 -28.15 -9.55 -27.15 L-9.55 -27.05 Q-10.55 -17.45 -11.65 -15.0 -12.4 -13.15 -13.7 -10.85 L-14.2 -9.9 Q-16.95 -4.95 -17.35 -0.45 L-17.75 2.4 -18.1 5.05 -18.5 4.4 Q-18.9 3.5 -18.9 1.4 L-18.35 -3.0 Q-17.8 -6.15 -17.85 -7.85 L-17.75 -18.0 -17.8 -21.55 -17.85 -25.5 -18.05 -29.55 Q-18.6 -31.85 -20.4 -31.85 -23.3 -31.85 -25.8 -25.9 -27.9 -20.8 -27.9 -17.0 L-27.8 -14.85 -27.75 -12.35 -28.05 -7.7 -27.75 -1.4 -28.05 1.65 -28.1 2.0 M-34.2 21.9 L-34.3 21.05 -34.25 21.05 -34.25 21.0 Q-33.55 22.8 -29.45 24.05 -25.7 25.25 -22.35 25.25 -18.95 25.25 -17.65 24.65 L-17.55 24.6 Q-16.85 24.25 -14.3 21.9 L-14.2 22.4 -14.15 23.7 Q-14.1 24.5 -14.45 25.0 L-14.55 25.05 Q-20.7 28.25 -26.3 26.95 L-32.1 25.45 -32.75 25.05 -33.7 24.55 -34.2 21.9 M-30.05 7.85 L-29.6 7.05 Q-28.65 5.85 -28.25 4.7 -28.0 3.85 -28.05 3.05 L-27.95 3.8 -27.75 6.1 -27.95 8.5 -28.0 8.85 -28.05 9.0 -28.35 10.7 -28.8 12.15 -28.8 10.35 -28.9 9.55 -28.95 9.3 Q-29.2 8.0 -30.05 7.85" fill="#b38484" fill-rule="evenodd" stroke="none"/>
    <path d="M33.5 20.85 L32.95 20.9 28.35 21.35 Q23.05 21.35 17.45 19.7 10.7 17.75 9.6 14.5 L9.8 13.95 9.85 13.75 Q10.2 12.7 10.2 11.55 10.2 9.75 9.85 8.65 L8.8 6.4 8.85 5.9 Q9.7 -2.7 12.05 -11.3 L14.35 -20.35 Q15.8 -25.55 18.5 -31.5 L22.75 -29.65 Q28.35 -26.85 28.2 -24.7 L28.2 -24.55 27.65 -23.25 27.5 -22.85 24.9 -16.55 24.3 -15.0 24.25 -14.7 23.6 -12.9 Q23.1 -11.3 22.2 -9.7 L20.4 -6.6 19.6 -5.15 18.75 -3.6 16.6 1.65 16.95 2.4 17.35 3.7 17.25 3.7 15.3 3.3 Q12.8 3.3 11.45 4.95 10.4 6.25 10.4 8.05 10.4 9.3 11.05 10.55 11.85 12.1 12.05 13.5 L12.3 14.4 Q12.65 15.3 13.45 16.05 L15.8 17.7 Q16.9 18.5 21.9 19.55 L27.4 20.45 32.85 20.0 34.0 19.9 33.8 20.3 33.75 20.4 33.55 20.85 33.5 20.85 M-28.1 2.0 L-28.05 1.65 -27.75 -1.4 -28.05 -7.7 -27.75 -12.35 -27.8 -14.85 -27.9 -17.0 Q-27.9 -20.8 -25.8 -25.9 -23.3 -31.85 -20.4 -31.85 -18.6 -31.85 -18.05 -29.55 L-17.85 -25.5 -17.8 -21.55 -17.75 -18.0 -17.85 -7.85 Q-17.8 -6.15 -18.35 -3.0 L-18.9 1.4 Q-18.9 3.5 -18.5 4.4 L-18.1 5.05 -18.2 5.5 -17.95 6.0 -16.8 8.55 -16.7 8.85 -16.65 9.0 -16.5 9.35 Q-15.6 12.2 -14.95 16.0 L-14.9 16.4 -14.9 16.75 -14.7 17.65 -14.6 18.65 -14.45 20.2 -14.3 21.65 -14.3 21.9 Q-16.85 24.25 -17.55 24.6 L-17.65 24.65 Q-18.95 25.25 -22.35 25.25 -25.7 25.25 -29.45 24.05 -33.55 22.8 -34.25 21.0 L-34.15 20.85 -33.35 19.6 Q-31.6 16.8 -31.6 15.95 L-31.25 15.95 -31.2 15.95 -31.2 15.85 -31.15 14.05 -31.1 13.6 Q-31.3 10.85 -30.6 8.95 L-30.05 7.85 Q-29.2 8.0 -28.95 9.3 L-28.9 9.55 -28.8 10.35 -28.8 12.15 -28.35 10.7 -28.05 9.0 -28.0 8.85 -27.95 8.5 -27.75 6.1 -27.95 3.8 -28.05 3.05 -28.05 2.85 -28.05 2.4 -28.1 2.0 M-17.85 22.65 L-16.0 21.85 -15.45 20.85 Q-15.45 19.25 -17.1 14.05 L-18.8 9.0 Q-20.65 5.9 -22.65 5.9 -24.15 5.9 -25.5 6.95 L-26.9 8.5 -27.2 9.05 -27.35 9.65 -27.7 11.05 -27.95 12.1 Q-28.55 14.5 -29.4 15.65 L-31.5 17.9 Q-33.3 19.85 -33.3 20.6 -33.3 21.7 -30.5 22.1 L-26.7 22.75 -23.65 23.05 -20.6 23.25 -19.15 23.05 -17.85 22.65 M-29.4 9.95 L-29.55 9.6 -30.15 9.8 -30.2 9.95 -30.45 11.45 -30.45 12.3 -30.3 12.45 Q-29.9 12.25 -29.6 11.3 L-29.4 10.2 -29.4 9.95" fill="#c29c9c" fill-rule="evenodd" stroke="none"/>
    <path d="M17.35 3.7 L17.35 3.75 17.7 5.15 17.8 5.75 22.9 12.75 22.85 12.75 23.0 12.9 23.6 13.5 23.75 13.6 24.35 14.2 Q26.9 16.5 30.1 18.1 L31.1 18.55 31.95 18.95 33.85 19.55 34.1 19.65 34.0 19.9 32.85 20.0 27.4 20.45 21.9 19.55 Q16.9 18.5 15.8 17.7 L13.45 16.05 Q12.65 15.3 12.3 14.4 L12.05 13.5 Q11.85 12.1 11.05 10.55 10.4 9.3 10.4 8.05 10.4 6.25 11.45 4.95 12.8 3.3 15.3 3.3 L17.25 3.7 17.35 3.7 M30.6 19.0 Q26.8 17.55 22.4 14.3 19.7 12.35 18.85 9.65 L18.65 9.0 17.25 6.85 Q15.9 5.0 14.6 5.0 13.6 5.0 13.6 6.8 13.6 10.3 18.25 14.2 L24.6 19.0 Q32.0 20.4 30.6 19.0 M-19.2 14.1 Q-19.2 13.1 -20.05 10.45 -20.85 8.0 -21.2 7.5 -22.6 6.65 -23.4 6.65 L-23.75 6.9 Q-24.5 7.65 -25.95 10.85 L-26.25 11.6 Q-27.75 15.05 -27.75 15.8 -27.75 16.45 -26.15 16.55 L-24.3 16.55 -21.0 16.4 -20.15 16.1 Q-19.2 15.45 -19.2 14.1 M-17.55 19.45 L-17.6 19.45 -18.45 19.35 -19.25 19.45 -20.35 19.85 -20.4 19.85 -21.75 20.3 -23.7 19.9 -25.85 19.5 -27.1 19.75 -28.65 20.25 Q-27.95 21.05 -24.95 21.85 L-21.4 22.5 -19.85 22.35 -18.7 21.85 -16.7 20.45 -17.05 20.0 -17.55 19.45 M-17.85 22.65 L-19.15 23.05 -20.6 23.25 -23.65 23.05 -26.7 22.75 -30.5 22.1 Q-33.3 21.7 -33.3 20.6 -33.3 19.85 -31.5 17.9 L-29.4 15.65 Q-28.55 14.5 -27.95 12.1 L-27.7 11.05 -27.35 9.65 -27.2 9.05 -26.9 8.5 -25.5 6.95 Q-24.15 5.9 -22.65 5.9 -20.65 5.9 -18.8 9.0 L-17.1 14.05 Q-15.45 19.25 -15.45 20.85 L-16.0 21.85 -17.85 22.65 M-29.4 9.95 L-29.4 10.2 -29.6 11.3 Q-29.9 12.25 -30.3 12.45 L-30.45 12.3 -30.45 11.45 -30.2 9.95 -30.15 9.8 -29.55 9.6 -29.4 9.95" fill="#d2b6b6" fill-rule="evenodd" stroke="none"/>
    <path d="M18.5 -31.5 Q16.3 -32.3 14.85 -32.3 12.95 -32.3 10.45 -30.75 L8.6 -29.35 8.3 -29.05 7.8 -28.05 Q6.3 -24.9 5.95 -21.75 L5.3 -17.15 6.15 -15.95 6.6 -15.0 6.95 -14.1 Q8.1 -10.35 7.75 -4.75 L7.4 -0.4 6.95 1.65 6.75 2.4 5.25 6.75 M3.35 9.2 L1.85 10.85 2.7 19.6 2.8 20.25 Q4.15 20.95 6.15 20.95 L7.85 20.6 8.05 20.55 8.2 20.4 8.9 19.8 Q9.95 19.15 11.7 19.15 13.55 19.15 15.2 20.95 L15.6 21.5 18.85 22.2 25.4 23.2 30.8 23.5 32.45 23.15 33.1 21.75 33.5 20.85 M18.5 -31.5 L22.75 -29.65 Q28.35 -26.85 28.2 -24.7 L28.2 -24.55 27.65 -23.25 27.5 -22.85 24.9 -16.55 24.3 -15.0 24.25 -14.7 23.6 -12.9 Q23.1 -11.3 22.2 -9.7 L20.4 -6.6 19.6 -5.15 18.75 -3.6 16.6 1.65 16.95 2.4 17.35 3.7 17.35 3.75 17.7 5.15 M23.75 13.6 L24.35 12.8 M34.0 19.9 L34.1 19.65 33.85 19.55 31.95 18.95 31.1 18.55 30.1 18.1 Q26.9 16.5 24.35 14.2 L23.75 13.6 M34.0 19.9 L33.8 20.3 33.75 20.4 33.55 20.85 33.5 20.85 M13.95 21.95 L14.5 22.95 14.55 23.05 Q14.9 24.4 14.8 26.6 19.95 28.15 25.35 29.05 29.95 29.8 34.1 28.25 L34.95 27.9 35.25 26.8 34.45 24.5 34.3 23.8 34.3 22.25 33.1 21.75 M3.4 9.1 L3.35 9.2 M2.7 19.6 L1.7 20.3 2.65 26.25 3.5 26.55 7.15 26.9 7.6 26.7 Q8.05 23.2 9.35 21.8 10.35 20.6 11.35 20.6 12.45 20.6 13.15 21.15 L13.95 21.95 M12.3 25.1 L9.55 26.0 7.6 26.7 M-18.1 5.05 L-17.75 2.4 -17.35 -0.45 Q-16.95 -4.95 -14.2 -9.9 L-13.7 -10.85 Q-12.4 -13.15 -11.65 -15.0 -10.55 -17.45 -9.55 -27.05 L-9.55 -27.15 Q-10.3 -28.15 -11.95 -29.25 L-14.7 -30.9 -15.15 -31.15 Q-16.7 -32.05 -17.9 -32.4 L-21.45 -32.65 -22.65 -32.6 Q-24.95 -32.45 -27.35 -31.6 L-31.65 -29.65 -31.9 -24.95 Q-32.25 -17.4 -31.85 -15.0 -31.45 -12.3 -30.55 -9.4 -28.65 -2.9 -28.35 -0.05 L-28.1 1.95 -28.1 2.0 M-18.1 5.05 L-18.2 5.5 -17.95 6.0 -16.8 8.55 -16.7 8.85 M-14.85 16.0 L-14.9 16.4 -14.9 16.75 -14.7 17.65 -14.6 18.65 -14.45 20.2 -14.3 21.65 -14.3 21.9 -14.2 22.4 -14.15 23.7 Q-14.1 24.5 -14.45 25.0 L-14.55 25.05 Q-20.7 28.25 -26.3 26.95 L-32.1 25.45 -32.75 25.05 -33.7 24.55 -34.2 21.9 -34.3 21.05 -34.25 21.05 -34.25 21.0 M-13.05 20.75 L-13.05 20.9 -12.75 23.4 M-13.35 29.25 Q-19.8 34.25 -27.3 31.85 -31.4 30.65 -34.65 28.1 L-35.25 22.8 -34.2 21.9 M-34.15 20.85 L-33.35 19.6 Q-31.6 16.8 -31.6 15.95 L-32.3 15.9 Q-33.3 12.2 -32.4 8.75 L-32.3 8.65 -30.6 8.95 -30.05 7.85 -29.6 7.05 Q-28.65 5.85 -28.25 4.7 -28.0 3.85 -28.05 3.05 L-28.05 2.85 -28.05 2.4 -28.1 2.0 M-9.55 -27.15 L-9.45 -28.35 M-32.7 -29.15 L-31.65 -29.65 -31.6 -30.75 M-14.9 16.4 L-14.95 16.0 Q-15.6 12.2 -16.5 9.35 L-16.65 9.0 M-27.75 6.1 L-27.95 3.8 -28.05 3.05 M-31.6 15.95 L-31.25 15.95 -31.2 15.85 -31.15 14.05 -31.1 13.6 Q-31.3 10.85 -30.6 8.95 M-31.25 15.95 L-31.2 15.95 -31.2 15.85" fill="none" stroke="#a36a6a" stroke-linecap="round" stroke-linejoin="round" stroke-opacity="0.4" stroke-width="0.05"/>
    <path d="M5.25 6.75 L5.4 6.8 6.75 6.75 Q8.15 8.6 7.8 10.75 L7.6 12.15 Q7.5 12.95 6.9 13.4 L6.15 13.9 5.55 13.9 M5.4 13.9 L4.95 13.9 M4.95 13.85 L3.75 13.7 Q3.0 11.95 3.25 10.0 L3.35 9.2 3.35 9.05 Q3.45 8.1 4.05 7.35 L4.45 6.8 5.25 6.75 M17.7 5.15 L17.8 5.75 22.9 12.75 23.0 12.9 23.6 13.5 M5.4 6.8 Q6.35 8.5 6.3 10.6 L5.95 12.15 4.95 13.85 M6.15 13.9 L5.5 13.9 5.55 13.9 M5.4 13.9 L5.5 13.9 M13.95 21.95 Q13.15 22.25 12.7 23.05 12.3 23.85 12.3 24.85 L12.3 25.1 M-16.7 8.85 L-16.65 9.0 -14.7 9.0 -14.65 9.1 -14.5 9.6 -14.05 11.25 Q-13.4 13.8 -14.5 15.95 L-14.85 16.0 -14.95 16.0 M-14.45 20.2 L-13.05 20.75 M-12.75 23.4 L-13.0 25.05 -13.3 27.85 -13.3 28.1 -13.35 29.25" fill="none" stroke="#a36a6a" stroke-linecap="butt" stroke-linejoin="miter" stroke-miterlimit="3.0" stroke-opacity="0.4" stroke-width="0.05"/>
  </g>
</svg>
