<?xml version="1.0" encoding="UTF-8" standalone="no"?>
<svg xmlns:xlink="http://www.w3.org/1999/xlink" height="16.0px" width="93.4px" xmlns="http://www.w3.org/2000/svg">
  <g transform="matrix(1.0, 0.0, 0.0, 1.0, 0.4, -30.75)">
    <path d="M88.55 34.15 L88.65 34.15 91.5 33.85 91.35 33.4 92.6 33.3 Q92.9 34.55 93.0 37.25 L90.85 37.45 90.8 37.25 90.35 35.2 Q90.2 34.65 89.75 34.45 L88.7 34.2 88.55 34.15 M1.6 44.7 L-0.4 43.95 -0.4 40.5 0.35 40.05 0.4 40.45 Q5.0 42.35 10.05 42.7 L10.25 42.7 10.55 42.75 Q9.75 43.4 8.35 43.4 L5.95 43.3 1.6 42.3 1.5 43.15 1.6 44.7 M34.05 31.25 L35.35 31.25 35.35 31.2 35.4 30.75 36.0 30.75 36.0 37.2 34.1 37.35 34.15 34.65 34.05 31.25" fill="#7d7d7d" fill-rule="evenodd" stroke="none"/>
    <path d="M90.85 37.45 L88.65 37.65 88.6 37.45 88.35 36.1 80.95 35.9 74.85 35.7 74.85 35.6 76.85 35.05 78.55 34.95 85.15 34.5 85.9 34.45 88.55 34.15 88.7 34.2 89.75 34.45 Q90.2 34.65 90.35 35.2 L90.8 37.25 90.85 37.45 M53.05 37.55 L50.0 37.55 50.6 31.85 50.6 31.8 51.3 31.55 51.3 31.6 51.35 31.95 52.7 31.9 56.45 31.6 Q58.3 31.4 63.25 31.65 L61.3 32.0 56.25 32.6 Q55.25 32.7 55.0 33.15 L54.35 34.7 53.05 37.55 M10.55 42.75 Q14.55 42.95 18.65 42.75 L18.95 42.75 21.15 42.35 Q20.75 43.1 19.75 43.35 L17.0 43.6 Q14.7 43.8 14.4 44.1 L14.25 44.45 Q14.0 45.1 13.8 46.75 L10.65 46.6 10.45 46.6 Q6.25 46.3 1.6 44.7 L1.5 43.15 1.6 42.3 5.95 43.3 8.35 43.4 Q9.75 43.4 10.55 42.75" fill="#737373" fill-rule="evenodd" stroke="none"/>
    <path d="M88.65 37.65 L85.15 38.0 75.65 38.55 72.75 38.1 Q70.45 36.3 69.05 35.5 L63.8 35.15 63.15 35.15 Q60.75 36.05 59.65 37.55 L53.05 37.55 54.35 34.7 55.0 33.15 Q55.25 32.7 56.25 32.6 L61.3 32.0 63.25 31.65 69.05 32.0 Q70.45 32.8 72.75 34.6 L75.65 35.05 76.85 35.05 74.85 35.6 74.85 35.7 80.95 35.9 88.35 36.1 88.6 37.45 88.65 37.65 M21.15 42.35 L24.4 41.15 27.7 39.3 28.4 38.25 Q28.8 37.35 28.8 36.45 L28.85 36.2 Q28.95 34.5 29.75 33.5 L30.9 32.5 Q31.85 31.8 33.3 31.3 L33.35 31.25 34.05 31.25 34.15 34.65 34.1 37.35 33.55 37.45 Q32.75 37.65 32.25 37.95 L32.2 37.9 Q31.35 37.1 30.65 36.9 L30.15 37.4 29.8 37.9 Q29.25 38.9 29.25 40.45 L29.3 40.85 29.3 41.05 29.5 42.25 Q27.25 43.9 24.8 45.05 22.1 46.3 19.35 46.65 L13.8 46.75 Q14.0 45.1 14.25 44.45 L14.4 44.1 Q14.7 43.8 17.0 43.6 L19.75 43.35 Q20.75 43.1 21.15 42.35" fill="#666666" fill-rule="evenodd" stroke="none"/>
    <path d="M32.2 37.9 L29.8 37.9 30.15 37.4 30.65 36.9 Q31.35 37.1 32.2 37.9" fill="#4a4a4a" fill-rule="evenodd" stroke="none"/>
    <path d="M88.55 34.15 L88.65 34.15 91.5 33.85 91.35 33.4 92.6 33.3 Q92.9 34.55 93.0 37.25 L90.85 37.45 88.65 37.65 85.15 38.0 75.65 38.55 72.75 38.1 Q70.45 36.3 69.05 35.5 L63.8 35.15 63.15 35.15 Q60.75 36.05 59.65 37.55 L53.05 37.55 50.0 37.55 50.6 31.85 50.6 31.8 51.3 31.55 51.3 31.6 51.35 31.95 52.7 31.9 56.45 31.6 Q58.3 31.4 63.25 31.65 L69.05 32.0 Q70.45 32.8 72.75 34.6 L75.65 35.05 76.85 35.05 M78.55 34.95 L85.15 34.5 85.9 34.45 88.55 34.15 M1.6 44.7 L-0.4 43.95 -0.4 40.5 0.35 40.05 0.4 40.45 Q5.0 42.35 10.05 42.7 L10.25 42.7 10.55 42.75 Q14.55 42.95 18.65 42.75 L18.95 42.75 21.15 42.35 24.4 41.15 27.7 39.3 28.4 38.25 Q28.8 37.35 28.8 36.45 L28.85 36.2 Q28.95 34.5 29.75 33.5 L30.9 32.5 Q31.85 31.8 33.3 31.3 L33.35 31.25 34.05 31.25 35.35 31.25 35.35 31.2 35.4 30.75 36.0 30.75 36.0 37.2 34.1 37.35 33.55 37.45 Q32.75 37.65 32.25 37.95 L32.2 37.9 29.8 37.9 Q29.25 38.9 29.25 40.45 L29.3 40.85 29.3 41.05 29.5 42.25 Q27.25 43.9 24.8 45.05 22.1 46.3 19.35 46.65 L13.8 46.75 10.65 46.6 10.45 46.6 Q6.25 46.3 1.6 44.7 M29.8 37.9 L30.15 37.4 30.65 36.9 Q31.35 37.1 32.2 37.9" fill="none" stroke="#3d3d3d" stroke-linecap="round" stroke-linejoin="round" stroke-opacity="0.4" stroke-width="0.05"/>
  </g>
</svg>
