<?xml version="1.0" encoding="UTF-8" standalone="no"?>
<svg xmlns:xlink="http://www.w3.org/1999/xlink" height="248.45px" width="141.65px" xmlns="http://www.w3.org/2000/svg">
  <g transform="matrix(1.0, 0.0, 0.0, 1.0, 1.0, 142.8)">
    <path d="M99.0 86.3 L103.85 83.25 Q114.4 75.9 119.15 66.35 L118.85 66.35 Q115.65 70.25 111.55 72.75 108.65 74.55 104.05 76.3 110.85 70.3 114.8 64.45 120.3 56.3 119.6 49.5 L119.95 49.65 Q120.85 50.85 120.85 53.3 L120.8 57.55 124.25 48.65 Q125.15 45.75 125.15 39.7 L125.05 34.25 122.75 27.85 Q122.4 30.9 121.0 34.2 120.1 36.4 119.0 37.85 119.55 30.0 111.15 22.15 102.4 14.05 92.95 15.05 L94.55 14.65 Q96.95 14.0 98.2 14.0 L93.15 11.65 Q89.35 10.05 86.7 10.05 L80.9 10.45 75.2 11.2 74.55 11.2 Q78.25 8.1 82.55 6.1 88.1 3.65 96.15 5.3 102.85 6.75 105.9 9.3 109.4 11.55 122.0 18.1 127.15 21.05 129.75 28.6 131.65 34.0 131.65 39.25 131.65 42.9 130.05 49.35 127.8 58.3 123.7 65.7 114.6 82.15 99.0 86.3 M110.1 29.8 Q111.55 31.25 112.7 34.05 114.45 38.4 114.45 42.3 114.45 47.0 111.95 52.85 109.6 58.45 107.3 59.1 108.35 53.05 110.3 47.75 111.65 44.05 111.65 39.3 111.65 35.7 110.0 29.9 L110.1 29.8" fill="#666b6b" fill-rule="evenodd" stroke="none"/>
    <path d="M74.55 11.2 L75.2 11.2 80.9 10.45 86.7 10.05 Q89.35 10.05 93.15 11.65 L98.2 14.0 Q96.95 14.0 94.55 14.65 L92.95 15.05 Q102.4 14.05 111.15 22.15 119.55 30.0 119.0 37.85 120.1 36.4 121.0 34.2 122.4 30.9 122.75 27.85 L125.05 34.25 125.15 39.7 Q125.15 45.75 124.25 48.65 L120.8 57.55 120.85 53.3 Q120.85 50.85 119.95 49.65 L119.6 49.5 Q120.3 56.3 114.8 64.45 110.85 70.3 104.05 76.3 108.65 74.55 111.55 72.75 115.65 70.25 118.85 66.35 L119.15 66.35 Q114.4 75.9 103.85 83.25 L99.0 86.3 Q93.7 87.65 87.7 87.65 71.8 87.65 63.45 71.45 57.55 60.0 57.55 47.95 57.55 37.6 63.3 26.0 67.95 16.8 74.55 11.2 M110.1 29.8 L110.0 29.9 Q111.65 35.7 111.65 39.3 111.65 44.05 110.3 47.75 108.35 53.05 107.3 59.1 109.6 58.45 111.95 52.85 114.45 47.0 114.45 42.3 114.45 38.4 112.7 34.05 111.55 31.25 110.1 29.8" fill="#5a5e5e" fill-rule="evenodd" stroke="none"/>
    <path d="M138.65 -133.2 Q137.05 -124.15 125.8 -99.6 L112.5 -72.0 Q108.55 -60.8 105.55 -39.7 L101.35 -6.35 101.1 -3.9 Q100.4 4.6 98.55 16.85 L95.0 39.6 Q94.1 46.35 93.0 51.2 91.9 56.3 90.0 62.2 L86.1 73.25 83.8 78.6 Q77.0 84.35 67.85 85.15 L51.6 87.1 39.5 87.55 23.45 86.75 Q16.95 85.9 8.15 83.15 5.35 82.35 2.05 79.25 0.1 77.4 -0.9 75.75 -1.3 70.95 0.1 65.0 2.95 52.55 5.15 40.3 7.45 28.0 9.5 6.9 L8.75 -24.35 8.5 -36.7 Q8.75 -54.75 12.35 -72.1 16.0 -89.65 22.0 -101.0 29.25 -114.95 42.15 -127.0 56.1 -140.05 66.0 -140.05 L67.35 -139.95 67.6 -135.15 Q67.35 -119.3 56.25 -104.1 50.65 -96.85 48.6 -93.65 45.1 -88.25 45.05 -83.9 44.95 -79.25 50.1 -76.3 L54.6 -74.2 Q55.65 -73.35 57.05 -72.5 58.1 -71.9 59.1 -71.4 63.7 -69.05 67.75 -69.05 70.5 -69.05 76.05 -80.55 L88.15 -105.9 Q107.35 -142.8 128.75 -142.8 133.75 -142.8 137.35 -135.9 L138.65 -133.2 M52.05 -72.9 L50.2 -73.55 Q48.25 -73.55 46.5 -72.75 45.2 -72.1 44.45 -71.15 44.65 -70.15 45.95 -69.5 47.15 -68.85 48.35 -69.1 L48.7 -69.55 48.7 -69.2 48.35 -69.1 Q46.45 -66.6 44.75 -63.2 L44.7 -61.3 Q45.1 -61.3 45.1 -60.9 47.7 -61.6 48.8 -62.95 49.8 -64.1 50.75 -67.2 L50.5 -65.7 50.3 -64.25 Q50.25 -61.7 51.85 -61.7 53.9 -61.7 54.6 -65.4 55.35 -69.0 57.9 -68.8 L53.95 -72.0 53.7 -72.1 52.05 -72.9 M45.65 -17.9 L45.45 -17.85 45.75 -17.5 45.65 -17.9 M81.65 -76.15 L81.9 -76.55 81.6 -76.45 81.65 -76.15" fill="#929898" fill-rule="evenodd" stroke="none"/>
    <path d="M-0.9 75.75 Q0.1 77.4 2.05 79.25 5.35 82.35 8.15 83.15 16.95 85.9 23.45 86.75 L39.5 87.55 51.6 87.1 67.85 85.15 Q77.0 84.35 83.8 78.6 L86.1 73.25 90.0 62.2 Q91.9 56.3 93.0 51.2 94.1 46.35 95.0 39.6 L98.55 16.85 Q100.4 4.6 101.1 -3.9 L101.35 -6.35 105.55 -39.7 Q108.55 -60.8 112.5 -72.0 L125.8 -99.6 Q137.05 -124.15 138.65 -133.2 140.75 -128.1 140.65 -122.65 140.5 -110.95 129.75 -87.3 117.3 -62.05 113.85 -53.75 111.3 -47.5 109.35 -37.7 107.25 -27.25 107.15 -18.9 L106.45 4.35 105.85 18.95 105.85 27.4 106.15 71.0 106.2 77.05 104.55 86.35 103.4 91.55 Q100.1 105.65 93.85 105.65 89.55 105.65 86.05 101.4 82.85 97.45 82.55 92.55 L83.2 92.45 71.4 92.45 71.5 92.9 Q62.2 92.35 45.5 92.5 L24.1 93.15 Q20.65 94.75 19.8 98.5 18.9 102.6 15.2 104.4 4.7 109.45 6.25 93.65 6.5 92.0 1.85 84.75 -0.55 80.9 -0.9 75.75 M54.6 -74.2 L50.1 -76.3 Q44.95 -79.25 45.05 -83.9 45.1 -88.25 48.6 -93.65 50.65 -96.85 56.25 -104.1 67.35 -119.3 67.6 -135.15 L67.35 -139.95 Q70.4 -139.6 71.9 -137.25 73.35 -135.25 73.3 -132.1 73.25 -127.8 70.6 -121.25 67.8 -114.4 62.1 -105.1 56.3 -95.65 54.5 -91.9 51.0 -84.9 50.95 -80.2 50.9 -77.15 54.6 -74.2" fill="#7f8585" fill-rule="evenodd" stroke="none"/>
    <path d="M52.05 -72.9 L53.7 -72.1 53.95 -72.0 57.9 -68.8 Q55.35 -69.0 54.6 -65.4 53.9 -61.7 51.85 -61.7 50.25 -61.7 50.3 -64.25 L50.5 -65.7 50.75 -67.2 Q49.8 -64.1 48.8 -62.95 47.7 -61.6 45.1 -60.9 45.1 -61.3 44.7 -61.3 L44.75 -63.2 Q46.45 -66.6 48.35 -69.1 L48.7 -69.2 48.7 -69.55 48.35 -69.1 Q47.15 -68.85 45.95 -69.5 44.65 -70.15 44.45 -71.15 45.2 -72.1 46.5 -72.75 48.25 -73.55 50.2 -73.55 L52.05 -72.9" fill="#a1a8a8" fill-rule="evenodd" stroke="none"/>
    <path d="M36.85 -113.95 L37.2 -113.55 39.6 -111.05 38.8 -109.5 35.05 -101.3 33.35 -98.65 Q29.75 -93.1 27.95 -88.55 L26.3 -89.75 Q25.7 -89.75 24.8 -88.0 L23.15 -85.25 23.2 -87.1 Q23.4 -94.35 28.0 -102.15 30.8 -106.75 36.85 -113.95" fill="#6b7070" fill-rule="evenodd" stroke="none"/>
    <path d="M36.85 -113.95 L38.45 -115.9 Q46.1 -124.75 51.7 -129.2 L53.65 -126.6 54.55 -125.25 51.0 -121.55 Q44.45 -112.9 41.6 -109.8 L41.25 -109.35 Q37.95 -105.6 35.05 -101.3 L38.8 -109.5 39.6 -111.05 37.2 -113.55 36.85 -113.95" fill="#5a5e5e" fill-rule="evenodd" stroke="none"/>
    <path d="M35.05 -101.3 Q37.95 -105.6 41.25 -109.35 L41.6 -109.8 Q44.45 -112.9 51.0 -121.55 L54.55 -125.25 Q58.4 -128.55 61.3 -128.55 62.9 -128.55 63.45 -127.45 L63.85 -125.9 Q62.8 -121.75 58.7 -114.75 57.4 -112.45 54.9 -108.7 L52.25 -106.9 Q46.3 -103.4 40.7 -99.05 32.35 -92.5 29.45 -87.05 L29.1 -87.45 27.95 -88.55 Q29.75 -93.1 33.35 -98.65 L35.05 -101.3" fill="#c28787" fill-rule="evenodd" stroke="none"/>
    <path d="M54.55 -125.25 L53.65 -126.6 51.7 -129.2 Q57.4 -133.85 60.9 -133.85 63.0 -133.85 63.75 -132.0 64.25 -130.8 64.25 -128.55 64.25 -127.45 63.85 -125.9 L63.45 -127.45 Q62.9 -128.55 61.3 -128.55 58.4 -128.55 54.55 -125.25" fill="#505454" fill-rule="evenodd" stroke="none"/>
    <path d="M54.9 -108.7 L50.7 -102.4 38.65 -83.95 39.55 -88.15 39.55 -90.55 Q38.55 -89.95 36.5 -85.25 L34.35 -90.8 Q33.4 -90.05 32.75 -87.75 L31.8 -84.7 Q31.45 -84.9 29.45 -87.05 32.35 -92.5 40.7 -99.05 46.3 -103.4 52.25 -106.9 L54.9 -108.7" fill="#b37c7c" fill-rule="evenodd" stroke="none"/>
    <path d="M96.8 -109.7 L100.7 -109.1 101.6 -108.9 Q98.55 -102.65 97.35 -99.25 96.4 -96.45 96.05 -94.05 L94.8 -91.45 Q92.1 -85.25 91.5 -81.95 89.75 -81.15 87.85 -79.45 86.0 -77.85 85.1 -76.55 L84.85 -76.1 84.6 -77.7 Q84.6 -89.3 96.0 -108.45 L96.8 -109.7" fill="#6b7070" fill-rule="evenodd" stroke="none"/>
    <path d="M96.8 -109.7 Q100.5 -115.1 109.6 -123.2 113.6 -126.8 117.0 -129.1 L121.7 -125.8 Q113.25 -121.75 104.2 -108.3 L103.4 -107.15 Q99.25 -100.8 96.05 -94.05 96.4 -96.45 97.35 -99.25 98.55 -102.65 101.6 -108.9 L100.7 -109.1 96.8 -109.7" fill="#5a5e5e" fill-rule="evenodd" stroke="none"/>
    <path d="M96.05 -94.05 Q99.25 -100.8 103.4 -107.15 L104.2 -108.3 Q113.25 -121.75 121.7 -125.8 125.35 -127.6 128.85 -127.6 L133.5 -126.95 135.25 -126.0 135.55 -121.5 Q135.55 -119.25 134.95 -116.55 132.6 -114.9 130.6 -113.75 125.55 -111.05 123.0 -109.45 115.35 -104.55 94.8 -82.65 L94.0 -82.65 Q92.8 -82.6 91.5 -81.95 92.1 -85.25 94.8 -91.45 L96.05 -94.05" fill="#c28787" fill-rule="evenodd" stroke="none"/>
    <path d="M121.7 -125.8 L117.0 -129.1 Q123.7 -133.8 127.9 -133.8 134.0 -133.8 135.25 -126.0 L133.5 -126.95 128.85 -127.6 Q125.35 -127.6 121.7 -125.8" fill="#505454" fill-rule="evenodd" stroke="none"/>
    <path d="M134.95 -116.55 Q133.65 -111.2 129.9 -104.2 L128.8 -102.9 119.95 -92.55 Q116.35 -87.3 110.85 -85.4 101.1 -82.1 93.95 -77.95 94.3 -79.55 95.25 -81.25 L95.25 -82.65 94.8 -82.65 Q115.35 -104.55 123.0 -109.45 125.55 -111.05 130.6 -113.75 132.6 -114.9 134.95 -116.55" fill="#b37c7c" fill-rule="evenodd" stroke="none"/>
    <path d="M129.9 -104.2 Q127.2 -99.05 123.2 -93.0 117.95 -85.1 105.0 -68.7 L104.9 -68.8 105.9 -72.15 Q106.95 -75.25 106.85 -75.7 L103.9 -75.7 101.2 -75.1 98.45 -74.55 97.25 -74.55 97.95 -76.4 97.95 -78.25 96.1 -77.6 93.9 -76.7 93.75 -76.85 93.9 -77.5 93.95 -77.95 Q101.1 -82.1 110.85 -85.4 116.35 -87.3 119.95 -92.55 L128.8 -102.9 129.9 -104.2" fill="#a37171" fill-rule="evenodd" stroke="none"/>
    <path d="M44.9 35.05 Q49.7 32.45 55.75 32.45 65.6 32.45 69.9 37.2 73.95 41.6 73.95 51.55 73.95 61.65 67.85 71.15 60.25 82.85 47.65 82.85 40.65 82.85 33.55 77.1 25.0 70.3 25.0 60.2 25.0 52.85 32.2 45.35 34.35 43.05 36.9 41.15 L38.75 39.7 Q41.75 36.7 44.9 35.05" fill="#a1a8a8" fill-rule="evenodd" stroke="none"/>
    <path d="M66.2 23.9 Q66.3 23.0 67.75 21.85 L67.95 21.7 Q68.5 21.3 69.35 21.0 L70.45 20.7 Q71.4 19.4 72.45 18.4 73.6 17.25 76.9 17.25 78.75 17.25 80.8 18.35 82.9 19.5 83.15 20.7 L83.75 22.15 84.35 23.55 84.85 25.8 85.1 27.15 85.5 28.3 85.65 30.95 85.65 31.5 85.35 32.3 Q81.2 43.0 79.25 43.0 76.35 43.0 75.35 32.55 L74.65 19.45 Q73.95 22.45 73.8 28.8 72.0 28.6 69.85 26.9 L67.75 25.05 67.4 24.75 66.8 24.3 66.2 23.9" fill="#929898" fill-rule="evenodd" stroke="none"/>
    <path d="M66.2 23.9 L66.8 24.3 67.4 24.75 67.75 25.05 69.85 26.9 Q72.0 28.6 73.8 28.8 73.95 22.45 74.65 19.45 L75.35 32.55 Q76.35 43.0 79.25 43.0 81.2 43.0 85.35 32.3 L85.65 31.5 86.25 29.75 85.5 34.9 85.05 38.35 84.95 39.25 Q83.5 48.3 78.5 49.95 74.9 48.55 74.05 41.9 73.75 39.8 73.75 31.5 L73.75 30.95 73.75 30.85 Q70.3 30.4 67.75 26.8 L66.8 25.4 65.75 23.55 66.2 23.9" fill="#5a5e5e" fill-rule="evenodd" stroke="none"/>
    <path d="M84.95 39.25 L84.0 48.55 Q82.1 57.25 77.4 57.25 73.2 57.25 72.15 49.95 71.5 45.3 72.05 41.15 72.95 35.4 69.9 33.05 68.0 31.5 67.15 29.55 66.5 28.05 66.5 26.3 66.5 25.8 66.8 25.4 L67.75 26.8 Q70.3 30.4 73.75 30.85 L73.75 30.95 73.75 31.5 Q73.75 39.8 74.05 41.9 74.9 48.55 78.5 49.95 83.5 48.3 84.95 39.25" fill="#818787" fill-rule="evenodd" stroke="none"/>
    <path d="M26.4 12.75 L26.35 12.7 Q27.8 11.05 30.05 11.1 32.2 11.05 33.8 12.6 34.45 13.15 36.1 15.35 L38.0 18.05 38.8 19.4 40.4 21.35 42.55 23.6 43.8 24.85 44.6 25.6 45.65 25.95 Q44.1 26.75 41.1 27.6 L39.1 28.3 39.0 28.3 38.9 28.35 38.65 28.25 38.25 28.2 37.3 27.85 33.65 26.6 33.0 26.0 34.55 23.85 Q35.65 21.95 37.4 20.0 L28.6 27.9 Q17.35 37.2 14.6 34.6 11.65 31.85 18.6 22.6 26.35 13.3 26.8 12.3 L26.4 12.75" fill="#929898" fill-rule="evenodd" stroke="none"/>
    <path d="M26.4 12.75 L26.8 12.3 Q26.35 13.3 18.6 22.6 11.65 31.85 14.6 34.6 17.35 37.2 28.6 27.9 L37.4 20.0 Q35.65 21.95 34.55 23.85 L33.0 26.0 33.65 26.6 37.3 27.85 38.25 28.2 38.65 28.25 38.9 28.35 39.0 28.3 39.1 28.3 40.45 28.4 37.75 28.9 35.15 29.25 Q33.1 29.2 31.2 28.05 31.05 28.0 31.15 28.1 L22.05 36.8 Q19.65 38.75 15.65 39.65 11.3 40.65 9.75 39.15 7.8 37.35 10.4 32.05 L11.75 29.55 12.6 28.35 Q14.6 25.15 17.45 21.9 L23.05 16.15 26.4 12.75" fill="#5a5e5e" fill-rule="evenodd" stroke="none"/>
    <path d="M37.75 28.9 Q35.7 30.2 34.35 30.4 32.8 30.6 32.55 30.85 L27.95 36.7 Q24.25 40.9 18.0 44.2 9.8 48.25 5.95 44.65 3.55 42.4 5.85 37.6 7.45 34.3 10.7 30.6 L11.75 29.55 10.4 32.05 Q7.8 37.35 9.75 39.15 11.3 40.65 15.65 39.65 19.65 38.75 22.05 36.8 L31.15 28.1 Q31.05 28.0 31.2 28.05 33.1 29.2 35.15 29.25 L37.75 28.9" fill="#818787" fill-rule="evenodd" stroke="none"/>
    <path d="M16.65 -50.95 Q17.95 -52.75 19.65 -53.4 L20.6 -53.7 23.05 -54.2 23.45 -54.25 Q26.7 -54.25 28.75 -52.8 30.9 -51.25 30.9 -48.5 30.9 -45.25 28.9 -43.3 26.9 -41.25 23.55 -41.25 L23.05 -41.25 Q20.25 -41.35 18.3 -42.25 15.2 -43.6 15.2 -46.9 15.2 -49.0 16.65 -50.95" fill="#e1e1e1" fill-rule="evenodd" stroke="none"/>
    <path d="M16.65 -50.95 Q15.2 -49.0 15.2 -46.9 15.2 -43.6 18.3 -42.25 20.25 -41.35 23.05 -41.25 L23.55 -41.25 Q26.9 -41.25 28.9 -43.3 30.9 -45.25 30.9 -48.5 30.9 -51.25 28.75 -52.8 26.7 -54.25 23.45 -54.25 L23.05 -54.2 20.6 -53.7 19.65 -53.4 Q17.95 -52.75 16.65 -50.95 M15.0 -50.0 L15.2 -50.55 Q16.0 -52.35 17.45 -53.6 19.75 -55.7 23.05 -56.15 L25.1 -56.3 28.75 -55.8 Q30.9 -55.2 32.8 -53.9 36.2 -51.35 36.2 -47.55 36.2 -44.8 33.05 -41.1 29.05 -36.4 23.2 -36.4 L23.05 -36.4 Q16.35 -36.45 14.55 -40.4 13.6 -42.4 13.95 -44.55 13.95 -47.65 15.0 -50.0" fill="#c4c4c4" fill-rule="evenodd" stroke="none"/>
    <path d="M28.75 -55.8 L32.1 -55.8 Q35.05 -55.5 36.9 -54.05 36.65 -54.7 36.65 -56.55 37.85 -55.4 38.85 -53.15 39.75 -50.95 39.75 -49.35 39.75 -43.7 34.45 -38.4 29.05 -33.0 23.05 -33.0 20.3 -33.0 15.6 -35.25 10.3 -37.85 10.3 -40.5 L10.45 -41.05 10.6 -41.5 11.85 -41.5 Q10.95 -43.95 12.3 -46.9 13.35 -49.15 15.0 -50.0 13.95 -47.65 13.95 -44.55 13.6 -42.4 14.55 -40.4 16.35 -36.45 23.05 -36.4 L23.2 -36.4 Q29.05 -36.4 33.05 -41.1 36.2 -44.8 36.2 -47.55 36.2 -51.35 32.8 -53.9 30.9 -55.2 28.75 -55.8 M14.45 -57.15 Q16.0 -59.0 17.75 -59.95 19.8 -61.0 23.05 -61.2 L24.75 -61.25 28.6 -60.75 Q30.6 -60.05 31.55 -58.3 L31.35 -58.2 28.05 -58.8 23.05 -58.3 Q17.0 -57.05 13.0 -52.6 12.8 -53.7 13.55 -55.1 L13.65 -55.25 14.45 -56.4 14.45 -57.15" fill="#818787" fill-rule="evenodd" stroke="none"/>
    <path d="M39.15 -12.95 Q37.85 -13.4 35.9 -14.55 32.65 -16.55 32.65 -18.25 32.65 -18.55 32.8 -18.5 L32.9 -18.55 37.1 -18.1 37.55 -17.65 Q38.25 -17.0 39.25 -16.5 L39.6 -16.3 39.6 -16.25 39.15 -12.95 M69.25 -17.75 L69.25 -17.85 71.85 -18.7 68.5 -16.2 Q65.8 -14.3 65.35 -12.35 L63.1 -2.85 52.35 -2.85 51.8 -8.65 50.95 -8.65 Q50.95 -6.6 49.85 -3.7 L45.0 -3.95 40.4 -4.3 40.4 -6.8 42.05 -6.55 42.45 -7.9 43.2 -9.25 43.75 -8.0 43.95 -6.8 45.7 -6.8 49.0 -6.95 49.25 -15.3 49.85 -15.5 52.4 -16.35 Q53.45 -15.75 54.55 -15.3 L54.3 -10.65 Q53.9 -7.25 57.05 -6.95 L57.4 -7.6 57.6 -8.4 59.0 -7.45 60.15 -7.2 Q62.25 -7.2 62.05 -7.85 L63.1 -7.2 Q64.5 -8.4 64.7 -11.6 64.9 -13.55 64.65 -15.5 L65.2 -15.65 69.3 -17.55 69.55 -17.75 69.25 -17.75" fill="#818787" fill-rule="evenodd" stroke="none"/>
    <path d="M39.15 -12.95 L39.6 -16.25 39.65 -16.3 Q42.2 -15.05 45.9 -15.05 L49.25 -15.3 49.0 -6.95 45.7 -6.8 43.95 -6.8 43.75 -8.0 43.2 -9.25 42.45 -7.9 42.05 -6.55 40.4 -6.8 39.65 -6.85 Q38.5 -6.95 38.5 -7.95 L38.9 -11.7 39.15 -12.95 M54.55 -15.3 Q58.65 -13.8 63.8 -14.75 L63.8 -15.25 64.65 -15.5 Q64.9 -13.55 64.7 -11.6 64.5 -8.4 63.1 -7.2 L62.05 -7.85 Q62.25 -7.2 60.15 -7.2 L59.0 -7.45 57.6 -8.4 57.4 -7.6 57.05 -6.95 Q53.9 -7.25 54.3 -10.65 L54.55 -15.3" fill="#d1c188" fill-rule="evenodd" stroke="none"/>
    <path d="M39.6 -16.3 L39.25 -16.5 Q38.25 -17.0 37.55 -17.65 L37.1 -18.1 Q36.3 -19.0 36.1 -20.05 42.35 -17.1 45.3 -17.1 L48.05 -17.45 49.2 -17.65 50.25 -17.8 50.95 -18.05 50.45 -17.9 50.2 -17.85 Q46.15 -21.1 44.5 -26.5 L44.6 -26.55 44.7 -27.15 48.4 -26.6 Q49.75 -23.9 52.1 -21.65 57.05 -17.05 64.25 -17.15 L65.15 -17.15 69.25 -17.75 69.3 -17.55 65.2 -15.65 64.65 -15.5 63.8 -15.25 63.8 -14.75 Q58.65 -13.8 54.55 -15.3 53.45 -15.75 52.4 -16.35 L49.85 -15.5 49.25 -15.3 45.9 -15.05 Q42.2 -15.05 39.65 -16.3 L39.6 -16.3" fill="#5a5e5e" fill-rule="evenodd" stroke="none"/>
    <path d="M35.1 -33.2 L34.2 -35.9 33.7 -37.6 33.65 -37.8 34.6 -38.75 42.55 -38.8 41.85 -38.65 Q36.7 -37.35 35.7 -36.5 34.6 -35.6 35.1 -33.2" fill="#ffd1d1" fill-rule="evenodd" stroke="none"/>
    <path d="M42.55 -38.8 L59.6 -39.05 58.4 -33.45 49.4 -34.85 38.3 -35.25 36.8 -34.85 37.95 -30.9 39.95 -27.35 Q40.75 -26.0 41.5 -25.2 40.2 -25.8 39.15 -26.7 37.4 -28.3 36.05 -31.0 L35.1 -33.2 Q34.6 -35.6 35.7 -36.5 36.7 -37.35 41.85 -38.65 L42.55 -38.8" fill="#ffb2b2" fill-rule="evenodd" stroke="none"/>
    <path d="M58.4 -33.45 L57.45 -30.15 Q56.7 -28.6 55.05 -27.45 L54.6 -28.35 Q53.3 -30.4 51.75 -30.0 51.15 -29.85 51.2 -29.5 L51.55 -28.25 52.1 -26.6 52.5 -25.95 48.9 -24.85 44.85 -24.4 44.45 -25.5 Q43.65 -27.1 42.0 -27.2 L42.0 -24.95 41.5 -25.2 Q40.75 -26.0 39.95 -27.35 L37.95 -30.9 36.8 -34.85 38.3 -35.25 49.4 -34.85 58.4 -33.45" fill="#f0a8a8" fill-rule="evenodd" stroke="none"/>
    <path d="M55.05 -27.45 Q53.95 -26.65 52.5 -25.95 L52.1 -26.6 51.55 -28.25 51.2 -29.5 Q51.15 -29.85 51.75 -30.0 53.3 -30.4 54.6 -28.35 L55.05 -27.45 M44.85 -24.4 L44.6 -24.4 42.0 -24.95 42.0 -27.2 Q43.65 -27.1 44.45 -25.5 L44.85 -24.4" fill="#bf8585" fill-rule="evenodd" stroke="none"/>
    <path d="M80.2 -50.6 L80.7 -50.8 81.4 -50.8 82.25 -50.85 Q85.45 -50.9 87.85 -49.1 91.15 -46.55 91.15 -41.8 91.15 -38.9 89.1 -36.1 86.9 -33.05 84.15 -33.05 81.0 -33.05 77.85 -34.85 73.65 -37.3 73.65 -41.55 73.65 -44.0 75.95 -47.05 78.0 -49.75 80.2 -50.6" fill="#e1e1e1" fill-rule="evenodd" stroke="none"/>
    <path d="M90.65 -49.45 Q94.5 -45.75 94.5 -38.95 94.5 -36.0 91.95 -31.7 88.4 -25.9 82.95 -25.9 74.65 -25.9 71.3 -32.2 69.6 -35.4 69.45 -38.9 L69.7 -41.2 Q70.3 -45.6 73.4 -48.7 77.0 -52.15 82.0 -52.45 87.1 -52.7 90.65 -49.45 M80.2 -50.6 Q78.0 -49.75 75.95 -47.05 73.65 -44.0 73.65 -41.55 73.65 -37.3 77.85 -34.85 81.0 -33.05 84.15 -33.05 86.9 -33.05 89.1 -36.1 91.15 -38.9 91.15 -41.8 91.15 -46.55 87.85 -49.1 85.45 -50.9 82.25 -50.85 L81.4 -50.8 80.7 -50.8 80.2 -50.6" fill="#c4c4c4" fill-rule="evenodd" stroke="none"/>
    <path d="M90.65 -49.45 L91.05 -49.6 Q92.0 -50.05 92.0 -50.8 92.0 -52.0 89.05 -54.05 86.05 -56.1 86.0 -57.6 90.05 -57.5 94.5 -53.2 99.3 -48.6 99.3 -43.45 99.3 -39.85 97.85 -36.5 L94.4 -30.15 94.7 -30.15 Q95.1 -30.8 96.45 -31.25 L98.55 -31.85 Q92.05 -20.65 80.7 -20.65 76.1 -20.65 70.3 -24.95 64.55 -29.15 63.4 -33.25 L65.65 -31.45 68.6 -29.8 68.8 -29.75 68.95 -29.75 68.6 -29.8 Q66.65 -31.35 65.85 -33.65 65.2 -35.6 65.2 -39.2 65.2 -41.6 66.1 -45.0 67.0 -48.6 68.2 -50.05 L68.25 -49.95 Q66.95 -47.7 66.95 -46.5 66.95 -45.25 67.95 -43.35 68.85 -41.75 69.7 -41.2 L69.45 -38.9 Q69.6 -35.4 71.3 -32.2 74.65 -25.9 82.95 -25.9 88.4 -25.9 91.95 -31.7 94.5 -36.0 94.5 -38.95 94.5 -45.75 90.65 -49.45 M73.1 -54.05 L73.75 -54.2 Q74.6 -54.45 75.35 -55.15 76.65 -56.35 78.6 -56.35 L80.95 -55.9 Q82.6 -55.4 82.95 -54.95 77.1 -54.0 71.2 -51.4 L73.1 -54.05" fill="#818787" fill-rule="evenodd" stroke="none"/>
    <path d="M28.7 -45.45 Q28.7 -48.35 30.65 -48.9 32.5 -49.45 32.5 -46.85 32.5 -46.15 31.95 -45.0 31.2 -43.6 30.3 -43.6 29.05 -43.6 28.7 -44.55 L28.7 -45.45" fill="#585a5a" fill-rule="evenodd" stroke="none"/>
    <path d="M73.65 -42.1 Q73.65 -45.45 75.75 -44.95 77.75 -44.5 77.75 -42.15 L77.45 -40.95 Q77.0 -39.9 76.25 -39.9 74.25 -39.9 73.75 -40.9 L73.65 -42.1" fill="#585a5a" fill-rule="evenodd" stroke="none"/>
  </g>
</svg>
