<?xml version="1.0" encoding="UTF-8" standalone="no"?>
<svg xmlns:xlink="http://www.w3.org/1999/xlink" height="274.0px" width="186.0px" xmlns="http://www.w3.org/2000/svg">
  <g transform="matrix(1.0, 0.0, 0.0, 1.0, -18.9, -13.3)">
    <path d="M21.9 13.3 L204.9 16.3 204.9 284.3 18.9 287.3 21.9 13.3" fill="#b5bcca" fill-rule="evenodd" stroke="none"/>
  </g>
</svg>
