<?xml version="1.0" encoding="UTF-8" standalone="no"?>
<svg xmlns:xlink="http://www.w3.org/1999/xlink" height="160.55px" width="198.45px" xmlns="http://www.w3.org/2000/svg">
  <g transform="matrix(1.0, 0.0, 0.0, 1.0, -133.95, -44.85)">
    <path d="M186.35 110.25 L186.3 110.3 186.3 108.4 186.35 110.25 M183.1 52.4 Q183.1 62.9 187.5 75.7 191.9 88.5 191.9 90.7 191.9 95.2 190.25 101.2 188.85 106.05 187.2 108.95 187.75 92.75 183.5 82.95 179.1 72.85 179.1 63.6 179.1 56.0 181.1 50.1 181.9 47.65 183.3 44.85 L183.1 52.4" fill="#983010" fill-rule="evenodd" stroke="none"/>
    <path d="M332.4 189.15 Q327.8 191.4 324.0 192.95 L323.7 193.0 Q314.55 194.3 311.95 195.25 L311.3 195.1 307.15 194.15 Q296.85 198.8 293.0 200.05 L292.25 199.95 284.85 199.4 Q280.5 200.95 278.75 201.3 277.75 201.5 274.7 202.75 L271.85 204.0 Q271.1 204.0 270.05 203.4 269.0 202.75 268.6 202.75 L264.5 203.65 260.75 204.45 259.9 204.4 259.3 204.25 259.3 204.4 Q247.0 203.8 230.1 205.0 L220.45 205.4 219.75 205.1 Q212.85 201.95 210.85 201.95 L204.8 202.5 199.0 203.0 Q189.15 203.0 182.75 200.2 L178.95 198.25 Q177.15 197.35 175.95 197.35 L173.1 197.15 169.05 197.75 153.0 192.95 Q141.9 189.4 133.95 185.45 L134.3 184.75 Q138.95 187.0 140.35 187.0 L149.4 187.8 Q153.95 189.35 165.85 191.0 L183.65 191.95 195.85 192.0 Q224.4 192.0 244.85 188.05 281.8 180.85 281.85 162.55 288.5 166.05 290.95 173.4 293.35 180.7 292.65 183.55 291.95 186.35 294.05 188.95 297.25 193.0 306.85 193.0 315.2 193.0 325.8 190.75 L332.4 189.15" fill="#201800" fill-rule="evenodd" stroke="none"/>
  </g>
</svg>
