<?xml version="1.0" encoding="UTF-8" standalone="no"?>
<svg xmlns:xlink="http://www.w3.org/1999/xlink" height="83.55px" width="83.4px" xmlns="http://www.w3.org/2000/svg">
  <g transform="matrix(1.0, 0.0, 0.0, 1.0, 41.65, 41.8)">
    <path d="M21.95 -35.25 Q22.8 -35.25 23.35 -34.7 23.95 -34.1 23.95 -33.25 23.95 -32.55 23.6 -32.1 L25.25 -30.75 26.65 -29.55 26.65 -29.6 Q27.25 -30.15 28.1 -30.15 28.95 -30.15 29.5 -29.6 30.1 -29.0 30.1 -28.15 30.1 -27.3 29.5 -26.75 L29.45 -26.7 29.6 -26.55 30.75 -25.3 32.2 -23.45 Q32.7 -23.8 33.35 -23.8 34.2 -23.8 34.75 -23.25 35.35 -22.65 35.35 -21.8 35.35 -20.95 34.75 -20.4 L34.4 -20.1 35.2 -18.75 36.25 -16.65 37.05 -16.8 Q37.9 -16.8 38.45 -16.25 39.05 -15.65 39.05 -14.8 39.05 -13.95 38.45 -13.4 38.15 -13.05 37.75 -12.9 L38.15 -11.6 38.85 -9.0 39.2 -9.05 Q40.05 -9.05 40.6 -8.5 41.2 -7.9 41.2 -7.05 41.2 -6.2 40.6 -5.65 40.15 -5.15 39.5 -5.05 L39.6 -3.85 39.75 -1.05 Q40.6 -1.05 41.15 -0.5 41.75 0.1 41.75 0.95 41.75 1.8 41.15 2.35 40.6 2.95 39.75 2.95 L39.7 2.95 39.6 3.9 39.2 7.2 Q39.8 7.3 40.2 7.7 40.8 8.3 40.8 9.15 40.8 10.0 40.2 10.55 39.65 11.15 38.8 11.15 L38.3 11.1 38.15 11.65 36.95 15.05 37.55 15.45 Q38.15 16.05 38.15 16.9 38.15 17.75 37.55 18.3 37.0 18.9 36.15 18.9 L35.25 18.7 35.2 18.8 33.1 22.25 33.3 22.4 Q33.9 23.0 33.9 23.85 33.9 24.7 33.3 25.25 32.75 25.85 31.9 25.85 31.2 25.85 30.65 25.45 L29.6 26.6 28.15 28.1 Q28.75 28.7 28.75 29.55 28.75 30.4 28.15 30.95 27.6 31.55 26.75 31.55 25.9 31.55 25.3 30.95 L25.25 30.9 22.1 33.2 22.4 34.3 Q22.4 35.15 21.8 35.7 21.25 36.3 20.4 36.3 19.55 36.3 18.95 35.7 L18.65 35.3 15.3 36.9 15.4 37.6 Q15.4 38.45 14.8 39.0 14.25 39.6 13.4 39.6 12.55 39.6 11.95 39.0 L11.5 38.25 7.25 39.25 7.25 39.5 Q7.25 40.35 6.65 40.9 6.1 41.5 5.25 41.5 4.4 41.5 3.8 40.9 3.3 40.4 3.25 39.7 L0.0 39.8 -0.8 39.8 Q-0.8 40.6 -1.4 41.15 -1.95 41.75 -2.8 41.75 -3.65 41.75 -4.25 41.15 -4.8 40.6 -4.8 39.75 L-4.8 39.55 -8.75 38.95 Q-8.85 39.5 -9.3 39.9 -9.85 40.5 -10.7 40.5 -11.55 40.5 -12.15 39.9 -12.7 39.35 -12.7 38.5 L-12.6 37.9 -16.15 36.5 -16.6 37.05 Q-17.15 37.65 -18.0 37.65 -18.85 37.65 -19.45 37.05 -20.0 36.5 -20.0 35.65 L-19.75 34.7 -23.05 32.55 -23.2 32.7 Q-23.75 33.3 -24.6 33.3 -25.45 33.3 -26.05 32.7 -26.6 32.15 -26.6 31.3 -26.6 30.55 -26.2 30.05 L-28.15 28.15 -29.05 27.2 Q-29.6 27.7 -30.4 27.7 -31.25 27.7 -31.85 27.1 -32.4 26.55 -32.4 25.7 -32.4 24.85 -31.85 24.25 L-31.7 24.15 -33.95 20.95 -35.0 21.2 Q-35.85 21.2 -36.45 20.6 -37.0 20.05 -37.0 19.2 -37.0 18.35 -36.45 17.75 L-35.9 17.4 -37.6 13.5 -38.2 13.55 Q-39.05 13.55 -39.65 12.95 -40.2 12.4 -40.2 11.55 -40.2 10.7 -39.65 10.1 L-38.75 9.6 -39.5 5.4 -39.65 5.4 Q-40.5 5.4 -41.1 4.8 -41.65 4.25 -41.65 3.4 -41.65 2.55 -41.1 1.95 -40.55 1.45 -39.75 1.4 L-39.8 0.0 -39.75 -2.45 Q-40.5 -2.5 -41.05 -3.05 -41.6 -3.6 -41.6 -4.45 -41.6 -5.3 -41.05 -5.9 -40.45 -6.45 -39.6 -6.45 L-39.35 -6.4 -38.45 -10.45 Q-39.0 -10.6 -39.4 -11.0 -39.95 -11.55 -39.95 -12.4 -39.95 -13.25 -39.4 -13.85 -38.8 -14.4 -37.95 -14.4 L-37.25 -14.3 -35.55 -18.05 -36.05 -18.45 Q-36.6 -19.0 -36.6 -19.85 -36.6 -20.7 -36.05 -21.3 -35.45 -21.85 -34.6 -21.85 L-33.5 -21.55 -31.1 -24.85 -31.25 -24.95 Q-31.8 -25.5 -31.8 -26.35 -31.8 -27.2 -31.25 -27.8 -30.65 -28.35 -29.8 -28.35 -29.0 -28.35 -28.45 -27.85 L-28.15 -28.15 -25.45 -30.6 Q-25.9 -31.15 -25.9 -31.9 -25.9 -32.75 -25.35 -33.35 -24.75 -33.9 -23.9 -33.9 -23.05 -33.9 -22.5 -33.35 L-22.25 -33.05 -18.75 -35.2 -18.7 -35.2 -18.9 -36.15 Q-18.9 -37.0 -18.35 -37.6 -17.75 -38.15 -16.9 -38.15 -16.05 -38.15 -15.5 -37.6 L-15.05 -36.95 Q-13.4 -37.65 -11.65 -38.15 L-11.15 -38.3 -11.2 -38.75 Q-11.2 -39.6 -10.65 -40.2 -10.05 -40.75 -9.2 -40.75 -8.35 -40.75 -7.8 -40.2 -7.35 -39.75 -7.25 -39.15 L-3.9 -39.6 -3.2 -39.65 -3.2 -39.8 Q-3.2 -40.65 -2.65 -41.25 -2.05 -41.8 -1.2 -41.8 -0.35 -41.8 0.2 -41.25 0.8 -40.65 0.8 -39.8 L3.85 -39.6 4.9 -39.5 Q4.95 -40.15 5.4 -40.65 6.0 -41.2 6.85 -41.2 7.7 -41.2 8.25 -40.65 8.85 -40.05 8.85 -39.2 L8.85 -38.85 11.6 -38.15 13.0 -37.7 13.4 -38.45 Q14.0 -39.0 14.85 -39.0 15.7 -39.0 16.25 -38.45 16.85 -37.85 16.85 -37.0 L16.7 -36.2 18.8 -35.2 20.25 -34.35 20.5 -34.7 Q21.1 -35.25 21.95 -35.25 M0.0 -7.5 Q3.1 -7.5 5.3 -5.25 7.55 -3.1 7.55 0.05 7.55 3.1 5.3 5.3 3.1 7.55 0.0 7.55 -2.5 7.55 -4.4 6.15 L-5.3 5.3 Q-7.55 3.1 -7.55 0.05 -7.55 -3.1 -5.3 -5.25 L-4.4 -6.15 Q-2.5 -7.5 0.0 -7.5 M14.9 -27.95 L13.2 -28.75 7.65 -15.25 Q7.35 -14.55 7.6 -13.8 7.8 -13.1 8.45 -12.65 9.05 -12.2 9.85 -12.3 10.6 -12.35 11.15 -12.9 L21.45 -23.2 20.05 -24.4 Q17.6 -26.5 14.9 -27.95 M3.05 -31.45 L1.2 -31.55 1.2 -16.95 Q1.2 -16.2 1.7 -15.55 2.2 -15.0 2.95 -14.85 L4.35 -15.05 Q5.05 -15.4 5.35 -16.1 L11.0 -29.7 9.2 -30.3 Q6.25 -31.15 3.05 -31.45 M0.0 -10.95 Q-3.65 -10.95 -6.4 -8.95 L-7.75 -7.7 Q-11.0 -4.55 -11.0 0.05 -11.0 4.55 -7.75 7.75 L-6.4 9.0 Q-3.65 11.0 0.0 11.0 4.55 11.0 7.75 7.75 11.0 4.55 11.0 0.05 11.0 -4.55 7.75 -7.7 4.55 -10.95 0.0 -10.95 M13.75 -7.5 L15.2 -7.6 28.8 -13.2 27.95 -14.9 Q26.45 -17.6 24.4 -20.05 L23.5 -21.05 23.2 -21.45 12.85 -11.1 Q12.3 -10.55 12.25 -9.8 12.15 -9.05 12.55 -8.4 13.0 -7.75 13.75 -7.5 M14.8 -2.95 Q15.0 -2.2 15.6 -1.7 16.15 -1.2 16.95 -1.2 L31.55 -1.2 31.45 -3.05 Q31.15 -6.25 30.3 -9.25 L29.7 -11.0 16.1 -5.35 Q15.4 -5.1 15.05 -4.4 14.65 -3.7 14.8 -2.95 M31.55 1.2 L16.95 1.2 Q16.15 1.2 15.6 1.7 15.0 2.2 14.8 2.95 14.65 3.7 15.05 4.4 15.4 5.1 16.1 5.4 L29.7 11.0 30.3 9.25 Q31.15 6.3 31.45 3.1 L31.55 1.2 M28.8 13.25 L15.2 7.6 13.7 7.55 Q13.0 7.8 12.55 8.45 12.1 9.05 12.2 9.85 12.25 10.6 12.85 11.15 L23.2 21.5 23.5 21.1 24.4 20.1 Q26.5 17.6 27.95 14.9 L28.8 13.25 M4.35 15.05 L2.95 14.85 Q2.2 15.0 1.7 15.6 1.2 16.2 1.2 16.95 L1.2 31.6 3.05 31.45 Q6.25 31.2 9.2 30.3 L11.0 29.75 5.35 16.15 Q5.05 15.45 4.35 15.05 M7.55 15.2 L13.2 28.8 14.9 27.95 Q17.6 26.5 20.1 24.45 L21.45 23.2 11.1 12.8 Q10.5 12.25 9.75 12.2 9.0 12.1 8.35 12.55 7.7 12.95 7.5 13.7 7.25 14.45 7.55 15.2 M-31.45 -3.05 L-31.55 -1.2 -16.95 -1.2 Q-16.2 -1.2 -15.6 -1.7 -15.0 -2.2 -14.85 -2.95 -14.7 -3.7 -15.05 -4.4 -15.45 -5.1 -16.15 -5.35 L-29.7 -11.0 -30.3 -9.25 Q-31.2 -6.25 -31.45 -3.05 M-23.2 -21.45 L-24.4 -20.05 Q-26.5 -17.6 -27.95 -14.9 L-28.8 -13.2 -15.2 -7.6 -13.75 -7.5 Q-13.0 -7.75 -12.6 -8.4 -12.15 -9.05 -12.2 -9.8 -12.3 -10.55 -12.85 -11.1 L-23.2 -21.45 M-1.25 -31.55 L-3.1 -31.45 -9.25 -30.3 -11.05 -29.7 -5.4 -16.1 Q-5.1 -15.4 -4.4 -15.05 -3.7 -14.65 -2.95 -14.8 -2.25 -14.95 -1.75 -15.55 -1.25 -16.15 -1.25 -16.95 L-1.25 -31.55 M-13.25 -28.8 L-14.9 -27.95 Q-17.65 -26.5 -20.1 -24.4 L-21.5 -23.15 -11.1 -12.8 Q-10.55 -12.25 -9.8 -12.15 -9.0 -12.1 -8.35 -12.5 -7.75 -12.95 -7.5 -13.7 -7.3 -14.4 -7.55 -15.15 L-13.25 -28.8 M-12.6 8.45 Q-13.05 7.8 -13.8 7.55 L-15.25 7.6 -28.8 13.25 -27.95 14.9 Q-26.5 17.6 -24.45 20.1 L-23.2 21.45 -12.85 11.15 Q-12.35 10.6 -12.25 9.85 -12.2 9.05 -12.6 8.45 M-16.25 5.4 Q-15.55 5.1 -15.15 4.4 -14.8 3.7 -14.95 2.95 -15.1 2.2 -15.7 1.7 -16.3 1.2 -17.05 1.2 L-31.55 1.2 -31.45 3.1 Q-31.2 6.25 -30.3 9.25 L-29.75 11.0 -16.25 5.4 M-7.55 13.75 Q-7.8 13.0 -8.4 12.6 -9.05 12.15 -9.85 12.25 -10.6 12.3 -11.15 12.85 L-21.5 23.2 -20.1 24.45 Q-17.65 26.5 -14.9 27.95 L-13.25 28.8 -7.6 15.2 Q-7.35 14.5 -7.55 13.75 M-2.95 14.85 L-4.4 15.05 Q-5.1 15.45 -5.4 16.15 L-11.0 29.75 -9.25 30.3 -3.1 31.45 -1.25 31.6 -1.25 16.95 Q-1.25 16.2 -1.75 15.6 -2.25 15.0 -2.95 14.85" fill="#000000" fill-rule="evenodd" stroke="none"/>
  </g>
</svg>
