<?xml version="1.0" encoding="UTF-8" standalone="no"?>
<svg xmlns:xlink="http://www.w3.org/1999/xlink" height="345.35px" width="1230.85px" xmlns="http://www.w3.org/2000/svg">
  <g transform="matrix(1.0, 0.0, 0.0, 1.0, 0.0, 0.0)">
    <path d="M1205.15 31.05 Q1185.3 16.65 1171.2 36.3 1164.4 45.85 1168.05 58.45 1160.95 56.65 1156.3 62.3 1152.3 67.15 1151.8 73.55 1134.55 64.35 1110.05 64.55 1081.25 64.8 1076.45 93.2 1068.85 90.15 1063.75 97.3 1059.6 103.2 1059.7 109.65 1041.0 104.65 1022.2 109.05 987.05 117.05 970.6 153.8 L969.35 156.7 Q961.25 181.5 972.1 203.95 L993.2 247.35 1016.1 293.7 964.3 343.35 948.0 311.4 Q915.75 326.8 883.6 342.75 874.2 347.5 864.4 343.6 861.5 342.35 858.7 340.9 853.15 337.85 848.5 333.45 830.05 316.05 813.25 296.8 792.5 273.1 766.35 255.85 736.8 236.45 701.85 256.55 L712.1 235.15 Q687.7 250.15 661.05 258.85 L649.95 251.45 634.7 258.35 652.85 266.35 Q639.75 267.45 627.05 270.9 604.65 276.95 584.75 265.5 L585.85 263.3 600.4 255.15 601.15 254.65 600.05 254.65 Q577.8 256.05 560.7 241.95 L557.55 239.4 569.5 229.6 496.5 246.0 Q509.65 252.75 515.0 265.2 469.35 260.95 426.8 243.8 L443.75 233.15 Q384.2 246.85 334.05 279.4 331.4 281.2 329.0 283.45 L324.35 288.1 Q309.5 298.85 291.5 303.8 L289.8 304.5 288.25 301.1 Q275.5 301.35 263.4 307.95 L261.15 304.5 306.0 279.3 313.95 279.45 347.3 249.65 Q346.9 245.0 343.6 241.2 340.6 237.7 336.65 235.15 300.35 236.95 269.05 256.35 260.4 251.65 251.2 255.65 245.3 258.3 240.9 262.95 L234.8 259.05 Q269.25 209.9 254.2 192.7 239.15 175.5 233.85 175.75 228.55 175.95 222.9 174.0 220.1 173.0 217.2 172.4 211.55 171.05 205.8 170.45 163.5 166.3 126.95 188.95 116.15 195.7 106.45 203.75 106.15 210.55 103.85 216.95 102.55 220.5 99.6 223.05 L92.25 221.1 Q92.1 218.85 90.35 217.55 84.45 212.95 76.65 211.95 L61.8 216.15 51.65 208.5 Q24.25 224.7 4.65 202.65 L38.1 178.8 36.05 174.45 Q19.1 178.95 1.65 177.15 L0.0 171.3 0.0 171.0 Q14.5 158.35 25.45 142.55 33.45 131.05 45.3 124.3 67.5 111.75 84.25 98.45 119.5 88.0 156.25 91.35 L160.05 83.1 238.8 67.25 231.6 64.05 234.45 56.4 Q184.6 74.15 134.85 74.1 L108.65 81.9 94.5 75.45 Q66.95 88.8 37.0 84.3 L37.05 83.8 Q49.1 82.15 50.85 70.35 L51.3 67.2 41.55 67.2 39.0 59.7 83.85 46.05 53.25 43.35 Q54.9 40.35 56.7 37.4 62.3 28.05 72.25 23.4 82.6 18.7 93.8 20.65 152.0 30.65 207.45 9.6 L201.15 10.3 Q171.55 14.2 151.8 0.0 L1230.85 0.0 Q1214.05 10.45 1206.15 28.65 L1205.15 31.05" fill="#84ab27" fill-opacity="0.011764706" fill-rule="evenodd" stroke="none"/>
  </g>
</svg>
