<?xml version="1.0" encoding="UTF-8" standalone="no"?>
<svg xmlns:xlink="http://www.w3.org/1999/xlink" height="12.25px" width="8.6px" xmlns="http://www.w3.org/2000/svg">
  <g transform="matrix(1.0, 0.0, 0.0, 1.0, 1.6, 1.8)">
    <path d="M3.9 0.0 L3.9 0.05 3.95 0.1 3.9 0.1 4.1 0.8 4.3 1.2 4.8 2.05 5.95 3.7 6.95 5.7 6.9 5.9 Q6.7 6.25 6.1 6.25 L5.2 5.7 Q5.05 4.15 3.55 3.1 L0.45 1.35 0.75 1.0 1.15 0.95 2.95 0.55 3.9 0.0" fill="#647862" fill-rule="evenodd" stroke="none"/>
    <path d="M3.95 0.1 L4.15 0.3 5.35 1.8 Q7.0 4.0 7.0 5.25 L6.95 5.7 5.95 3.7 4.8 2.05 4.3 1.2 4.1 0.8 3.9 0.1 3.95 0.1" fill="#c0ebe1" fill-rule="evenodd" stroke="none"/>
    <path d="M3.7 7.65 L3.9 7.15 4.6 5.4 4.5 5.35 3.65 4.75 Q1.35 3.3 0.35 3.1 L0.3 2.9 Q-1.6 2.05 -1.6 0.45 -1.6 -0.75 -0.55 -1.35 0.2 -1.8 1.1 -1.8 1.9 -1.8 3.05 -0.95 L4.0 0.0 3.9 0.0 2.95 0.55 1.15 0.95 0.75 1.0 0.45 1.35 3.55 3.1 Q5.05 4.15 5.2 5.7 L6.1 6.25 Q6.7 6.25 6.9 5.9 L6.75 6.9 6.35 8.35 6.25 8.6 5.4 9.65 Q4.7 10.45 4.0 10.45 3.55 10.45 3.35 10.1 L3.3 9.85 3.25 9.45 3.35 8.6 3.5 8.15 3.7 7.65" fill="#4c5c4b" fill-rule="evenodd" stroke="none"/>
    <path d="M3.3 9.85 L2.35 8.75 2.2 8.6 1.6 7.85 1.4 7.05 1.65 6.85 2.05 6.75 Q2.85 6.75 3.35 7.2 L3.7 7.65 3.5 8.15 3.35 8.6 3.25 9.45 3.3 9.85" fill="#2e382d" fill-rule="evenodd" stroke="none"/>
  </g>
</svg>
