<?xml version="1.0" encoding="UTF-8" standalone="no"?>
<svg xmlns:xlink="http://www.w3.org/1999/xlink" height="24.95px" width="167.8px" xmlns="http://www.w3.org/2000/svg">
  <g transform="matrix(1.0, 0.0, 0.0, 1.0, 0.0, -0.05)">
    <path d="M157.25 17.25 L157.2 18.15 Q157.2 19.3 157.65 21.05 158.1 22.9 158.7 23.85 L159.2 24.55 155.0 24.8 154.95 24.8 152.6 24.85 148.65 24.95 136.35 25.0 136.3 25.0 130.9 24.85 116.8 24.3 103.5 23.6 103.45 23.6 85.7 22.6 62.9 21.8 54.15 21.75 Q50.65 21.7 47.35 21.8 43.9 21.8 40.6 21.95 L27.0 22.4 13.3 23.1 0.0 23.95 0.0 22.65 12.65 21.8 26.25 21.15 39.8 20.75 40.45 20.7 40.55 20.7 46.55 20.55 Q46.75 20.4 47.0 20.55 50.1 20.3 53.35 20.45 57.6 20.3 62.05 20.55 L66.3 20.7 84.7 21.4 102.45 22.35 115.55 23.05 134.85 23.8 136.25 23.8 151.2 23.7 153.3 23.6 157.9 23.35 157.35 22.1 157.1 20.7 157.05 19.5 157.05 19.05 157.25 17.25" fill="#2e2e2e" fill-rule="evenodd" stroke="none"/>
    <path d="M161.6 6.15 L160.7 7.4 Q157.5 12.15 157.25 17.25 L157.05 19.05 157.05 19.5 157.1 20.7 157.35 22.1 157.9 23.35 153.3 23.6 151.2 23.7 136.25 23.8 141.95 22.6 148.5 21.3 151.7 20.7 155.65 19.5 155.6 18.85 Q155.6 16.1 156.15 14.35 L156.3 13.95 157.15 11.95 158.75 9.25 Q159.75 7.65 161.6 6.15" fill="#242424" fill-rule="evenodd" stroke="none"/>
    <path d="M166.0 0.05 L166.75 0.05 166.75 0.3 Q166.2 0.3 166.0 0.05 M0.0 21.3 L0.0 0.05 150.8 0.05 Q150.45 1.25 150.35 2.55 L150.3 3.55 Q150.3 6.15 151.6 8.65 L148.55 9.4 140.7 10.8 Q123.9 13.45 103.45 13.65 95.0 13.75 78.05 12.95 L53.05 12.15 Q28.1 12.3 3.4 20.5 L2.7 20.7 0.0 21.3" fill="#000000" fill-rule="evenodd" stroke="none"/>
    <path d="M0.0 22.65 L0.0 21.3 2.7 20.7 3.4 20.5 Q28.1 12.3 53.05 12.15 L78.05 12.95 Q95.0 13.75 103.45 13.65 123.9 13.45 140.7 10.8 L148.55 9.4 151.6 8.65 Q150.3 6.15 150.3 3.55 L150.35 2.55 Q150.45 1.25 150.8 0.05 L162.05 0.05 Q159.95 1.35 158.4 3.05 156.95 4.65 156.0 6.55 155.3 7.85 154.9 9.3 154.2 11.6 154.1 14.25 L151.3 14.6 143.9 15.35 120.7 16.3 Q104.25 16.4 95.35 15.8 L79.45 15.2 65.2 16.2 Q56.4 17.45 47.0 20.55 46.75 20.4 46.55 20.55 L40.55 20.7 40.45 20.7 39.8 20.75 26.25 21.15 12.65 21.8 0.0 22.65" fill="#121212" fill-rule="evenodd" stroke="none"/>
    <path d="M162.05 0.05 L166.0 0.05 Q166.2 0.3 166.75 0.3 L166.9 0.3 167.8 0.3 Q164.15 2.8 161.6 6.15 159.75 7.65 158.75 9.25 L157.15 11.95 156.3 13.95 156.15 14.35 Q155.6 16.1 155.6 18.85 L155.65 19.5 151.7 20.7 148.5 21.3 141.95 22.6 136.25 23.8 134.85 23.8 115.55 23.05 102.45 22.35 84.7 21.4 66.3 20.7 62.05 20.55 Q57.6 20.3 53.35 20.45 50.1 20.3 47.0 20.55 56.4 17.45 65.2 16.2 L79.45 15.2 95.35 15.8 Q104.25 16.4 120.7 16.3 L143.9 15.35 151.3 14.6 154.1 14.25 Q154.2 11.6 154.9 9.3 155.3 7.85 156.0 6.55 156.95 4.65 158.4 3.05 159.95 1.35 162.05 0.05" fill="#1c1c1c" fill-rule="evenodd" stroke="none"/>
  </g>
</svg>
