<?xml version="1.0" encoding="UTF-8" standalone="no"?>
<svg xmlns:xlink="http://www.w3.org/1999/xlink" height="34.7px" width="29.8px" xmlns="http://www.w3.org/2000/svg">
  <g transform="matrix(1.0, 0.0, 0.0, 1.0, 0.1, 13.5)">
    <path d="M-0.1 10.85 L0.0 -3.75 21.5 10.25 29.7 -13.5 24.1 21.2 -0.1 10.85" fill="#ffffff" fill-rule="evenodd" stroke="none"/>
  </g>
</svg>
