<?xml version="1.0" encoding="UTF-8" standalone="no"?>
<svg xmlns:xlink="http://www.w3.org/1999/xlink" height="33.75px" width="32.9px" xmlns="http://www.w3.org/2000/svg">
  <g transform="matrix(1.0, 0.0, 0.0, 1.0, 0.5, 2.05)">
    <path d="M6.55 -0.3 L15.3 -0.75 16.45 2.05 11.95 2.45 9.05 2.7 8.75 2.7 6.9 0.15 6.55 -0.3 M24.3 -1.15 L31.9 -1.55 29.55 0.85 29.5 0.85 23.65 1.4 23.8 0.75 24.3 -1.15" fill="#8091aa" fill-rule="evenodd" stroke="none"/>
    <path d="M15.3 -0.75 L24.3 -1.15 23.8 0.75 23.65 1.4 16.45 2.05 15.3 -0.75" fill="#74849c" fill-rule="evenodd" stroke="none"/>
    <path d="M3.35 -0.15 L6.55 -0.3 6.9 0.15 8.75 2.7 5.65 3.0 3.35 -0.15" fill="#8da0bd" fill-rule="evenodd" stroke="none"/>
    <path d="M31.9 -1.55 L31.75 5.15 30.85 5.45 29.25 6.15 29.35 4.05 29.45 2.6 29.5 1.6 29.55 0.85 31.9 -1.55 M31.45 16.15 L31.25 23.05 28.3 21.5 28.7 15.0 31.45 16.15" fill="#4b5773" fill-rule="evenodd" stroke="none"/>
    <path d="M31.75 5.15 L31.45 16.15 28.7 15.0 28.9 11.7 29.1 8.45 29.25 6.15 30.85 5.45 31.75 5.15 M31.25 23.05 L31.0 31.2 27.8 28.0 27.9 28.0 28.3 21.5 31.25 23.05 M29.5 0.85 L29.55 0.85 29.5 0.85" fill="#5b6a8a" fill-rule="evenodd" stroke="none"/>
    <path d="M11.95 2.45 L16.45 2.05 23.65 1.4 29.5 0.85 29.55 0.85 29.5 1.6 27.6 2.1 23.5 2.85 23.35 2.85 Q22.4 2.95 19.35 3.9 L18.15 4.3 17.5 4.55 14.55 5.7 11.2 7.05 10.75 7.2 Q8.85 7.8 8.1 8.35 7.8 8.55 7.8 9.6 7.75 10.55 7.05 10.75 L6.7 10.8 5.55 10.95 Q4.65 11.25 4.95 12.45 L4.75 15.55 4.4 20.65 3.9 26.7 4.35 27.4 5.0 27.9 5.15 28.0 2.55 28.0 2.5 28.0 2.7 21.25 2.8 17.7 3.05 15.4 Q3.45 11.75 4.1 9.7 4.65 7.8 7.15 5.7 8.2 4.85 9.55 3.95 L11.05 2.95 11.95 2.45" fill="#65769c" fill-rule="evenodd" stroke="none"/>
    <path d="M29.35 4.05 L29.25 6.15 29.1 8.45 Q25.45 10.15 24.85 11.7 L23.05 13.9 21.15 16.2 20.1 18.2 Q18.45 21.0 15.55 24.1 15.25 24.4 15.05 24.9 L14.8 25.45 Q14.7 25.85 13.45 26.1 12.45 26.25 9.9 27.15 L7.65 27.95 7.5 28.0 7.2 27.95 7.75 27.75 Q8.95 27.2 11.05 26.2 10.85 26.2 10.85 25.8 12.75 21.5 13.4 20.95 13.75 20.6 17.45 17.75 L19.8 15.9 20.85 14.95 Q20.85 14.45 19.35 12.35 L19.3 12.3 Q17.7 10.15 17.7 9.6 17.7 9.2 18.8 8.5 L19.1 8.3 20.45 7.45 22.7 6.25 23.7 5.7 Q25.0 4.9 25.3 4.8 L29.35 4.05" fill="#525f78" fill-rule="evenodd" stroke="none"/>
    <path d="M29.45 2.6 L29.35 4.05 25.3 4.8 Q25.0 4.9 23.7 5.7 L22.7 6.25 20.45 7.45 19.1 8.3 18.8 8.5 Q17.7 9.2 17.7 9.6 17.7 10.15 19.3 12.3 L19.35 12.35 Q20.85 14.45 20.85 14.95 L19.8 15.9 17.45 17.75 Q13.75 20.6 13.4 20.95 12.75 21.5 10.85 25.8 10.85 26.2 11.05 26.2 8.95 27.2 7.75 27.75 L7.2 27.95 7.1 28.0 5.15 28.0 5.0 27.9 5.45 27.3 4.5 23.25 6.55 19.8 13.1 9.6 13.9 8.35 18.35 6.7 18.55 6.6 22.9 4.95 29.45 2.6" fill="#586580" fill-rule="evenodd" stroke="none"/>
    <path d="M29.5 1.6 L29.45 2.6 22.9 4.95 18.55 6.6 18.35 6.7 13.9 8.35 13.1 9.6 6.55 19.8 4.5 23.25 5.45 27.3 5.0 27.9 4.35 27.4 3.9 26.7 4.4 20.65 4.75 15.55 4.95 12.45 Q4.65 11.25 5.55 10.95 L6.7 10.8 7.05 10.75 Q7.75 10.55 7.8 9.6 7.8 8.55 8.1 8.35 8.85 7.8 10.75 7.2 L11.2 7.05 14.55 5.7 17.5 4.55 18.15 4.3 19.35 3.9 Q22.4 2.95 23.35 2.85 L23.5 2.85 27.6 2.1 29.5 1.6 M28.9 11.7 L28.7 15.0 28.3 21.5 27.9 28.0 27.8 28.0 20.7 28.0 14.2 28.0 10.45 28.0 17.5 27.45 26.55 26.7 28.55 12.8 28.9 11.7" fill="#5e6e91" fill-rule="evenodd" stroke="none"/>
    <path d="M29.1 8.45 L28.9 11.7 28.55 12.8 27.9 14.6 26.85 17.25 Q26.15 18.9 25.8 20.1 25.35 21.3 25.25 22.0 L24.65 23.15 21.65 25.15 Q21.1 25.45 20.5 25.8 L20.2 26.0 17.5 27.45 10.45 28.0 7.5 28.0 7.65 27.95 9.9 27.15 Q12.45 26.25 13.45 26.1 14.7 25.85 14.8 25.45 L15.05 24.9 Q15.25 24.4 15.55 24.1 18.45 21.0 20.1 18.2 L21.15 16.2 23.05 13.9 24.85 11.7 Q25.45 10.15 29.1 8.45 M7.2 27.95 L7.5 28.0 7.1 28.0 7.2 27.95" fill="#4a5a71" fill-rule="evenodd" stroke="none"/>
    <path d="M17.5 27.45 L20.2 26.0 20.5 25.8 Q21.1 25.45 21.65 25.15 L24.65 23.15 25.25 22.0 Q25.35 21.3 25.8 20.1 26.15 18.9 26.85 17.25 L27.9 14.6 28.55 12.8 26.55 26.7 17.5 27.45" fill="#425066" fill-rule="evenodd" stroke="none"/>
    <path d="M9.05 2.7 L11.95 2.45 11.05 2.95 9.55 3.95 Q8.2 4.85 7.15 5.7 4.65 7.8 4.1 9.7 3.45 11.75 3.05 15.4 L2.8 17.7 2.95 11.05 3.45 9.4 4.1 6.35 Q4.2 5.55 6.4 4.2 7.0 3.8 7.8 3.35 L8.85 2.8 9.05 2.7" fill="#7287b0" fill-rule="evenodd" stroke="none"/>
    <path d="M8.75 2.7 L9.05 2.7 8.85 2.8 7.8 3.35 Q7.0 3.8 6.4 4.2 4.2 5.55 4.1 6.35 L3.45 9.4 2.95 11.05 3.0 9.2 3.15 3.25 3.15 3.2 5.65 3.0 8.75 2.7" fill="#a0bdf7" fill-rule="evenodd" stroke="none"/>
    <path d="M0.0 0.0 L3.35 -0.15 5.65 3.0 3.15 3.2 3.15 3.25 0.0 0.0" fill="#95a7c7" fill-rule="evenodd" stroke="none"/>
    <path d="M0.0 7.7 L0.0 0.0 3.15 3.25 3.0 9.2 0.0 7.7" fill="#46586b" fill-rule="evenodd" stroke="none"/>
    <path d="M0.0 22.2 L0.0 7.7 3.0 9.2 2.95 11.05 2.8 17.7 2.7 21.25 0.0 22.2 M2.5 28.0 L2.55 28.0 2.55 28.05 2.5 28.0" fill="#394857" fill-rule="evenodd" stroke="none"/>
    <path d="M21.3 30.85 L13.55 30.55 13.8 29.55 14.2 28.0 20.7 28.0 21.15 30.2 21.3 30.85 M0.6 30.0 L0.0 30.0 0.0 22.2 2.7 21.25 2.5 28.0 2.55 28.05 0.6 30.0" fill="#27313b" fill-rule="evenodd" stroke="none"/>
    <path d="M13.55 30.55 L6.65 30.25 7.6 28.05 7.5 28.0 10.45 28.0 14.2 28.0 13.8 29.55 13.55 30.55" fill="#1f272e" fill-rule="evenodd" stroke="none"/>
    <path d="M6.65 30.25 L0.6 30.0 2.55 28.05 2.55 28.0 5.15 28.0 7.1 28.0 7.5 28.0 7.6 28.05 6.65 30.25" fill="#313d4a" fill-rule="evenodd" stroke="none"/>
    <path d="M31.0 31.2 L21.3 30.85 21.15 30.2 20.7 28.0 27.8 28.0 31.0 31.2" fill="#000000" fill-rule="evenodd" stroke="none"/>
    <path d="M0.0 30.0 L31.0 31.2 31.9 -1.55 0.0 0.0 0.0 30.0 Z" fill="none" stroke="#10141a" stroke-linecap="butt" stroke-linejoin="miter" stroke-miterlimit="3.0" stroke-opacity="0.69411767" stroke-width="1.0"/>
  </g>
</svg>
