<?xml version="1.0" encoding="UTF-8" standalone="no"?>
<svg xmlns:xlink="http://www.w3.org/1999/xlink" height="8.9px" width="8.9px" xmlns="http://www.w3.org/2000/svg">
  <g transform="matrix(1.0, 0.0, 0.0, 1.0, 3.8, 3.9)">
    <path d="M3.8 -2.6 Q5.1 -1.3 5.1 0.55 5.1 2.4 3.8 3.7 2.5 5.0 0.65 5.0 -1.2 5.0 -2.5 3.7 -3.8 2.4 -3.8 0.55 -3.8 -1.3 -2.5 -2.6 -1.2 -3.9 0.65 -3.9 2.5 -3.9 3.8 -2.6" fill="#ffffff" fill-opacity="0.4" fill-rule="evenodd" stroke="none"/>
  </g>
</svg>
