<?xml version="1.0" encoding="UTF-8" standalone="no"?>
<svg xmlns:xlink="http://www.w3.org/1999/xlink" height="193.65px" width="217.8px" xmlns="http://www.w3.org/2000/svg">
  <g transform="matrix(1.0, 0.0, 0.0, 1.0, 245.95, 291.05)">
    <path d="M-174.05 -203.05 Q-165.15 -199.3 -155.95 -196.15 -148.8 -193.75 -141.5 -191.6 L-136.6 -190.2 -133.95 -189.45 Q-127.1 -187.9 -120.05 -187.0 L-118.4 -186.8 -117.35 -186.7 -108.45 -186.2 -108.15 -186.2 Q-100.95 -186.1 -93.45 -186.6 L-93.5 -186.3 Q-93.05 -185.35 -92.25 -185.25 L-90.75 -185.35 -89.9 -185.2 -94.3 -178.1 -94.9 -177.15 -99.65 -179.0 -98.4 -181.95 -100.5 -179.3 -109.3 -181.95 -122.1 -184.7 -125.65 -185.45 -126.8 -185.7 Q-126.9 -185.85 -127.05 -185.85 L-127.2 -185.9 -127.25 -185.65 Q-128.75 -185.25 -130.1 -184.35 L-138.9 -184.8 -144.95 -185.05 -146.8 -185.2 -145.6 -185.9 -144.15 -186.8 -142.6 -187.55 -144.55 -187.65 -147.05 -187.7 -160.0 -189.05 Q-165.3 -190.0 -169.55 -191.25 L-169.55 -191.4 -170.05 -196.25 -170.1 -194.55 -170.2 -191.5 -174.35 -193.05 -174.7 -195.05 -174.95 -197.4 Q-174.75 -197.35 -174.7 -197.6 L-173.55 -197.45 -172.65 -197.45 -172.5 -198.3 -172.75 -199.1 -174.05 -203.05 M-171.7 -176.6 Q-167.4 -180.05 -159.05 -178.7 L-151.35 -176.95 -145.5 -176.0 -145.55 -175.95 -145.3 -174.1 -144.7 -171.25 -144.85 -171.25 Q-148.3 -171.95 -154.3 -173.6 L-164.4 -176.15 -169.4 -176.6 -171.7 -176.6 M-145.05 -179.5 L-145.1 -179.6 -145.15 -179.8 -145.15 -179.85 Q-145.6 -181.3 -145.5 -181.8 L-145.35 -182.8 -143.1 -182.75 -142.2 -182.65 -141.8 -182.65 -141.75 -182.5 -141.7 -182.2 -141.05 -180.75 -140.8 -180.1 -139.8 -177.6 -139.35 -176.55 -138.55 -174.4 -138.5 -174.25 Q-137.8 -171.55 -138.2 -169.15 L-142.45 -157.4 Q-146.75 -145.55 -146.95 -144.15 -147.2 -142.8 -146.25 -141.6 L-145.95 -141.25 -145.15 -140.55 Q-144.3 -140.0 -143.4 -139.8 L-141.0 -140.05 -138.9 -140.65 -138.65 -140.5 -139.85 -138.8 -140.0 -138.45 -141.3 -138.3 Q-143.65 -138.0 -145.0 -138.25 L-147.65 -139.0 Q-149.1 -139.6 -150.15 -140.5 L-151.05 -141.15 -151.05 -141.2 -151.25 -141.6 Q-151.7 -142.5 -151.6 -143.05 -151.4 -144.3 -150.6 -145.3 L-149.0 -146.95 Q-148.6 -145.7 -148.75 -145.05 L-148.65 -145.05 -148.7 -144.75 -148.55 -143.9 -147.3 -148.2 Q-146.0 -155.45 -145.0 -158.3 -143.6 -162.1 -141.45 -171.25 L-141.35 -171.75 -141.25 -172.25 -141.3 -172.75 -141.4 -172.85 Q-141.85 -174.55 -142.55 -175.95 -143.5 -178.05 -145.05 -179.5 M-152.55 -149.55 L-153.5 -151.15 -154.75 -150.5 Q-155.95 -149.75 -158.2 -148.55 L-156.45 -151.55 -151.9 -160.95 -155.45 -160.0 Q-158.5 -159.2 -159.3 -159.35 -158.9 -160.6 -156.15 -163.05 L-156.95 -160.95 -156.8 -160.9 -153.25 -163.85 Q-150.2 -166.4 -149.2 -166.5 L-149.55 -166.6 Q-149.85 -166.65 -149.8 -166.95 -149.7 -167.45 -151.1 -169.35 L-147.9 -170.2 -144.85 -171.25 -144.7 -171.2 -144.9 -170.25 -147.25 -165.6 -147.65 -164.75 -151.25 -156.85 Q-151.35 -156.15 -150.1 -152.45 L-149.4 -150.35 -150.5 -150.85 Q-151.4 -151.0 -152.55 -149.55 M-159.75 -134.05 L-158.35 -133.75 -156.4 -133.5 -155.2 -133.4 Q-152.95 -132.8 -150.05 -131.3 L-150.0 -131.25 -149.1 -130.85 -146.1 -129.6 Q-143.9 -128.85 -142.4 -128.85 -141.6 -128.85 -137.1 -130.35 L-136.5 -130.55 -134.55 -131.2 -133.95 -131.4 -128.55 -133.3 -127.5 -133.4 -127.45 -133.4 -126.55 -133.45 -123.15 -133.35 -123.05 -133.45 Q-120.45 -133.0 -120.05 -132.0 L-121.95 -132.0 -126.8 -131.8 -126.85 -131.75 -132.0 -129.95 -129.3 -129.65 -133.8 -128.7 -135.45 -128.3 -139.9 -127.05 -140.9 -126.8 Q-144.4 -126.95 -148.5 -129.1 L-150.0 -129.85 -150.25 -129.95 Q-153.65 -131.6 -155.55 -131.55 L-155.55 -131.7 -153.45 -132.0 -157.65 -133.15 -162.05 -133.95 -159.75 -134.05 M-169.7 -125.3 L-170.2 -124.05 -171.1 -121.25 Q-171.2 -120.65 -170.05 -118.4 L-169.55 -117.35 -167.85 -114.15 -167.7 -113.65 -167.65 -113.6 -167.6 -113.55 -167.55 -112.6 -167.6 -112.55 -170.55 -115.75 -172.6 -118.4 Q-174.1 -120.55 -173.9 -121.65 -171.0 -128.25 -170.4 -128.9 L-169.55 -125.5 -169.7 -125.3 M-103.8 -166.1 L-104.0 -165.85 -104.6 -164.9 -105.8 -165.6 Q-108.15 -167.0 -109.55 -167.25 L-121.55 -167.65 -130.45 -167.3 -131.85 -167.35 -130.45 -166.5 Q-128.9 -165.75 -126.4 -165.1 L-126.3 -164.95 -127.9 -163.9 Q-128.85 -163.25 -129.9 -163.4 L-129.95 -163.1 Q-128.2 -162.35 -125.7 -159.8 L-124.1 -158.35 -123.45 -157.9 Q-122.65 -155.85 -121.9 -152.7 -122.25 -153.55 -124.65 -154.7 L-127.15 -155.9 Q-127.95 -154.85 -130.1 -153.15 L-130.45 -152.85 -132.15 -151.0 -130.45 -147.95 -127.95 -143.45 -130.45 -145.8 -132.1 -147.35 -132.45 -147.45 -132.3 -147.3 -132.1 -146.7 -131.9 -146.0 -132.0 -145.9 -132.5 -145.6 Q-133.25 -147.8 -134.2 -147.95 L-135.6 -147.9 Q-132.4 -154.35 -132.2 -155.55 -132.05 -156.25 -132.4 -163.8 L-132.3 -166.2 -131.45 -169.5 -130.75 -169.4 -130.45 -169.4 -114.7 -169.4 -104.65 -168.3 -105.2 -167.6 -103.8 -166.1 M-127.1 -155.95 L-127.45 -156.05 -127.15 -155.9 -127.1 -155.95 M-126.85 -131.75 L-127.2 -132.05 -127.3 -131.9 -126.85 -131.75 M-128.6 -131.75 L-128.4 -131.95 -128.9 -131.95 -128.6 -131.75 M-137.55 -121.9 L-137.1 -121.6 Q-135.8 -120.95 -132.9 -120.5 -133.0 -119.55 -133.6 -118.4 -134.8 -116.15 -137.75 -113.1 -142.75 -107.65 -146.95 -108.4 -150.6 -109.05 -152.7 -110.7 -154.2 -112.0 -155.5 -114.2 -156.55 -116.15 -156.4 -116.75 -156.3 -117.45 -154.75 -118.4 L-152.75 -119.5 Q-149.85 -121.05 -149.25 -121.35 L-148.1 -121.05 Q-144.15 -120.35 -137.85 -121.85 L-137.7 -121.95 -137.55 -121.9 M-120.25 -116.4 L-120.25 -116.5 -119.4 -118.4 Q-119.0 -119.45 -118.75 -120.7 L-118.45 -120.65 -118.5 -118.4 -118.45 -115.3 Q-119.05 -112.05 -120.9 -110.1 -122.7 -108.3 -126.5 -106.75 L-122.4 -110.55 -119.5 -113.05 -119.85 -114.95 -120.25 -116.4" fill="#8f7146" fill-rule="evenodd" stroke="none"/>
    <path d="M-185.05 -186.05 Q-185.6 -186.55 -185.65 -187.5 L-185.55 -188.65 -186.05 -188.5 Q-186.3 -187.75 -187.1 -187.2 L-189.0 -185.95 -188.9 -186.5 -192.7 -183.5 -192.6 -184.0 -190.6 -187.25 -188.3 -190.75 -186.5 -193.35 -186.45 -193.45 -186.65 -193.5 -188.75 -190.8 -193.45 -185.15 -192.75 -189.25 Q-192.55 -190.35 -192.85 -191.15 L-193.0 -191.55 -192.95 -193.35 Q-192.6 -195.5 -191.15 -197.9 -189.85 -200.15 -188.9 -200.5 L-200.1 -196.6 -200.35 -196.55 Q-200.25 -196.55 -200.1 -196.7 -196.4 -198.9 -190.95 -204.85 L-190.95 -204.9 -191.15 -204.95 Q-192.55 -204.05 -193.35 -203.7 L-193.4 -204.0 -192.55 -204.5 -196.75 -204.1 -198.8 -203.8 -202.75 -203.25 -204.7 -203.6 Q-202.75 -204.05 -198.4 -206.3 -196.9 -206.95 -195.3 -207.9 L-190.85 -210.45 -187.6 -209.2 Q-180.95 -206.05 -174.05 -203.05 L-172.75 -199.1 -172.5 -198.3 -172.65 -197.45 -173.55 -197.45 -174.7 -197.6 Q-174.75 -197.35 -174.95 -197.4 L-174.7 -195.05 -174.35 -193.05 -173.8 -189.75 -174.3 -188.25 -175.0 -186.05 -176.4 -181.6 Q-176.9 -178.75 -176.7 -174.7 L-176.1 -168.9 Q-175.65 -165.15 -175.65 -161.9 -175.65 -158.65 -176.3 -155.95 L-178.25 -158.55 -178.3 -158.65 -178.45 -158.9 -178.55 -160.4 -178.7 -162.7 -178.8 -165.65 -178.9 -171.1 -178.95 -172.5 -178.9 -174.9 Q-178.85 -183.2 -177.65 -187.0 L-177.05 -188.65 -177.15 -188.75 -177.35 -189.0 Q-178.4 -190.3 -179.2 -190.45 -180.75 -190.75 -182.25 -189.65 L-183.75 -188.1 -185.05 -186.05 M-93.5 -186.3 L-93.4 -186.4 -93.0 -186.75 -82.0 -188.1 -79.6 -188.5 -74.05 -189.35 -73.75 -188.85 -70.35 -183.8 -66.15 -176.4 Q-68.7 -178.0 -69.6 -178.75 L-69.2 -178.0 Q-69.25 -177.65 -69.9 -177.75 -70.75 -177.9 -72.3 -179.1 -74.1 -180.55 -74.9 -182.3 L-75.1 -182.35 -75.25 -181.55 -73.4 -175.35 Q-72.05 -170.7 -72.05 -169.5 -72.6 -169.3 -73.35 -169.8 L-73.75 -170.15 -74.2 -169.85 -75.65 -172.55 -77.4 -176.8 -77.75 -174.55 Q-77.95 -172.55 -77.75 -172.0 L-77.8 -171.9 -79.6 -175.35 -81.4 -178.7 -81.75 -179.55 -82.0 -179.6 -82.25 -178.3 -83.05 -171.15 -83.25 -169.65 -83.4 -168.1 Q-83.35 -166.65 -82.8 -165.35 L-85.75 -169.9 -85.9 -169.9 -85.9 -169.85 -86.0 -168.5 Q-86.15 -167.7 -87.25 -167.2 -87.35 -169.35 -87.9 -171.15 L-88.9 -173.15 Q-89.8 -174.65 -91.45 -174.9 -92.3 -175.05 -93.9 -174.0 L-94.0 -173.95 -93.8 -171.15 -93.75 -170.4 -93.75 -170.35 -93.7 -168.95 -94.85 -165.25 -95.15 -164.65 -97.35 -158.6 -97.85 -157.2 -99.1 -153.7 -99.75 -152.0 -100.65 -149.45 Q-102.15 -148.4 -103.45 -148.15 L-104.95 -147.75 Q-103.45 -150.1 -103.3 -150.95 L-103.25 -151.0 -103.45 -151.05 Q-104.1 -150.35 -104.65 -150.6 L-104.45 -151.65 -104.2 -152.2 -101.2 -159.05 -99.95 -161.8 Q-98.05 -166.5 -97.5 -169.75 L-97.25 -171.15 -97.25 -171.55 -98.8 -172.6 -97.5 -174.0 -96.9 -174.55 -96.6 -174.7 -94.9 -177.15 -94.3 -178.1 -89.9 -185.2 -90.75 -185.35 -92.25 -185.25 Q-93.05 -185.35 -93.5 -186.3" fill="#382d1d" fill-rule="evenodd" stroke="none"/>
    <path d="M-170.2 -191.5 L-170.1 -194.55 -170.05 -196.25 -169.55 -191.4 -169.55 -191.25 -169.2 -187.35 -169.2 -185.45 -169.95 -183.75 -170.7 -182.1 Q-170.85 -181.3 -170.45 -180.6 L-169.95 -179.55 -172.7 -177.75 -173.1 -177.4 Q-174.3 -179.75 -174.2 -180.3 L-172.25 -185.8 -171.4 -187.75 Q-170.45 -190.15 -170.25 -191.2 L-170.2 -191.5 M-100.5 -179.3 L-98.4 -181.95 -99.65 -179.0 -99.8 -178.75 -101.05 -175.3 -101.3 -174.35 Q-101.45 -173.55 -100.95 -171.5 L-100.85 -171.15 Q-100.45 -169.5 -100.55 -169.15 L-100.95 -167.55 -101.2 -167.15 -102.8 -164.95 -103.8 -166.1 -105.2 -167.6 -104.65 -168.3 -103.25 -170.7 -103.25 -171.15 -103.55 -172.5 Q-103.95 -173.85 -103.75 -174.8 L-103.15 -175.65 -100.5 -179.3 M-145.5 -176.0 L-146.1 -178.45 -146.4 -179.35 -146.45 -179.45 -146.4 -179.65 -146.35 -180.15 -146.6 -180.05 -147.2 -181.15 Q-146.2 -180.6 -145.35 -179.85 L-145.25 -179.75 -145.15 -179.6 -145.05 -179.5 Q-143.5 -178.05 -142.55 -175.95 -141.85 -174.55 -141.4 -172.85 L-141.3 -172.75 -141.25 -172.25 -141.35 -171.75 -141.45 -171.25 Q-143.6 -162.1 -145.0 -158.3 -146.0 -155.45 -147.3 -148.2 L-148.55 -143.9 -148.7 -144.75 -148.65 -145.05 -148.35 -146.95 -148.35 -147.3 -148.25 -148.45 -148.2 -149.0 -148.15 -149.25 -148.2 -149.35 -148.15 -149.3 -145.7 -157.95 Q-143.5 -165.2 -142.7 -169.65 L-142.7 -170.45 -143.15 -172.55 -143.3 -173.2 -143.75 -175.15 -144.1 -176.45 -144.2 -176.6 -144.3 -177.0 -144.3 -176.0 -144.4 -174.75 -144.55 -173.35 -144.55 -173.05 -144.45 -172.6 -144.7 -171.25 -145.3 -174.1 -145.55 -175.95 -145.5 -176.0 M-172.15 -155.35 Q-172.2 -154.1 -173.65 -147.35 L-174.1 -141.6 -174.2 -137.55 -173.95 -135.95 -173.7 -134.1 -173.35 -130.65 -173.4 -130.45 -173.45 -130.0 -174.0 -130.75 Q-174.75 -131.85 -175.4 -134.1 L-175.8 -142.1 -175.05 -146.35 -175.2 -147.05 -175.05 -147.85 Q-174.35 -149.05 -173.35 -152.15 L-172.15 -155.35 M-138.55 -138.65 L-137.7 -139.25 Q-136.3 -140.15 -136.15 -141.05 L-136.05 -141.6 Q-136.0 -143.0 -136.65 -145.25 L-137.75 -144.8 -137.15 -146.4 -137.1 -146.65 -136.85 -146.7 -136.65 -146.75 -136.1 -146.8 -135.45 -146.75 Q-134.8 -146.65 -134.0 -143.55 L-133.5 -141.6 Q-133.25 -140.3 -133.35 -139.8 -133.4 -139.55 -133.8 -139.2 L-134.75 -139.15 -138.0 -138.7 -138.55 -138.65 M-137.75 -151.2 Q-138.3 -154.75 -138.1 -155.85 -137.95 -156.8 -137.95 -158.65 L-137.85 -161.7 Q-136.85 -167.2 -135.25 -169.75 -133.75 -171.95 -128.7 -176.4 L-128.6 -176.35 -130.6 -172.9 -130.65 -172.95 -130.75 -172.7 Q-131.4 -171.6 -131.9 -171.35 L-132.05 -171.15 -132.3 -170.75 -132.7 -170.2 -132.9 -170.15 -133.05 -169.8 -133.55 -169.35 Q-135.55 -166.5 -135.65 -164.45 -135.8 -161.45 -137.5 -154.6 L-137.75 -151.2 M-148.25 -149.55 L-148.2 -149.35 -148.2 -149.0 -148.55 -147.35 -148.55 -147.2 -148.6 -147.0 Q-148.8 -148.05 -149.5 -148.2 -150.35 -148.35 -152.05 -146.7 -153.55 -145.25 -153.65 -144.6 -153.8 -143.8 -152.7 -142.3 L-152.75 -142.2 -153.4 -142.65 -155.0 -143.4 -155.05 -143.9 -154.0 -145.05 -152.45 -146.95 -149.9 -149.95 -148.55 -149.8 -148.25 -149.55 M-132.7 -126.5 Q-133.35 -126.0 -133.6 -126.0 -135.3 -126.0 -135.3 -127.2 -135.3 -128.0 -133.65 -128.4 -132.05 -128.75 -132.05 -127.35 -132.05 -127.0 -132.7 -126.5 M-129.3 -127.65 L-129.4 -127.0 -130.1 -126.8 -130.7 -127.3 -130.85 -127.7 Q-130.85 -128.7 -129.5 -128.25 -129.3 -128.3 -129.3 -127.65 M-158.6 -132.35 Q-156.75 -132.7 -156.75 -130.8 -156.75 -129.05 -158.75 -129.05 -159.95 -129.05 -160.35 -129.6 L-160.5 -130.35 Q-160.5 -132.0 -158.6 -132.35 M-157.55 -132.7 L-157.45 -132.8 -157.35 -132.7 -157.55 -132.7 M-154.75 -128.35 Q-155.1 -127.75 -155.75 -127.75 -156.8 -127.75 -156.6 -128.7 -156.6 -129.8 -155.55 -130.15 -154.5 -130.45 -154.5 -129.25 L-154.75 -128.35 M-112.8 -125.25 L-111.95 -128.0 -109.8 -135.95 -109.2 -138.05 -109.1 -135.95 -109.15 -134.5 Q-109.2 -131.35 -109.35 -130.3 L-109.4 -130.1 Q-109.45 -129.3 -109.95 -127.8 L-110.85 -125.95 -111.15 -125.25 -111.25 -125.05 -112.35 -123.7 -113.25 -122.65 -115.2 -120.35 -115.6 -119.7 -115.65 -119.75 -115.3 -120.35 Q-113.85 -122.5 -112.8 -125.25" fill="#a68451" fill-rule="evenodd" stroke="none"/>
    <path d="M-104.0 -141.6 L-105.55 -135.95 -106.1 -133.3 -107.7 -125.25 Q-108.55 -121.2 -109.15 -119.25 L-109.4 -118.4 -109.55 -118.1 Q-117.85 -108.75 -124.7 -104.05 L-125.15 -103.75 Q-130.85 -99.9 -138.2 -97.4 L-140.55 -97.45 -146.85 -97.75 Q-152.65 -98.75 -157.05 -100.75 L-160.25 -102.35 -161.8 -103.6 -162.0 -103.75 -166.7 -108.05 Q-169.6 -110.95 -171.8 -114.25 L-174.5 -118.4 Q-176.75 -122.15 -178.85 -126.9 L-180.95 -132.0 -181.4 -133.05 Q-181.4 -134.7 -180.4 -141.15 L-180.35 -141.6 -179.3 -148.25 Q-178.75 -151.6 -178.5 -154.25 L-178.4 -158.55 -178.25 -158.55 -176.3 -155.95 Q-175.65 -158.65 -175.65 -161.9 -175.65 -165.15 -176.1 -168.9 L-176.7 -174.7 Q-176.9 -178.75 -176.4 -181.6 L-175.0 -186.05 -174.3 -188.25 -173.8 -189.75 -174.35 -193.05 -170.2 -191.5 -170.25 -191.2 Q-170.45 -190.15 -171.4 -187.75 L-172.25 -185.8 -174.2 -180.3 Q-174.3 -179.75 -173.1 -177.4 L-172.7 -177.75 -169.95 -179.55 -170.45 -180.6 Q-170.85 -181.3 -170.7 -182.1 L-169.95 -183.75 -169.2 -185.45 -169.2 -187.35 -169.55 -191.25 Q-165.3 -190.0 -160.0 -189.05 L-147.05 -187.7 -144.55 -187.65 -142.6 -187.55 -144.15 -186.8 -145.6 -185.9 -146.8 -185.2 -155.55 -186.25 -163.0 -187.8 -164.3 -188.15 Q-161.3 -186.5 -158.5 -185.45 -155.35 -184.25 -152.5 -183.75 L-145.35 -182.8 -145.5 -181.8 Q-145.6 -181.3 -145.15 -179.85 L-145.15 -179.8 -145.1 -179.6 -145.05 -179.5 -145.15 -179.6 -145.25 -179.75 -145.35 -179.85 Q-146.2 -180.6 -147.2 -181.15 L-146.6 -180.05 -146.35 -180.15 -146.4 -179.65 -146.45 -179.45 -146.4 -179.35 -146.1 -178.45 -145.5 -176.0 -151.35 -176.95 -159.05 -178.7 Q-167.4 -180.05 -171.7 -176.6 L-172.6 -176.55 -173.2 -176.55 -173.2 -176.45 -173.85 -176.15 Q-173.25 -175.25 -172.55 -173.15 -171.85 -171.2 -171.9 -170.85 -171.95 -170.55 -170.15 -168.6 L-170.1 -168.6 -170.2 -169.15 -170.35 -170.25 Q-166.2 -167.8 -157.95 -166.35 L-155.7 -166.05 -153.55 -166.2 -153.3 -166.2 -153.35 -166.05 -153.45 -166.05 -154.55 -165.5 -155.25 -165.25 -155.5 -165.0 -156.15 -163.2 -156.15 -163.05 Q-158.9 -160.6 -159.3 -159.35 -158.5 -159.2 -155.45 -160.0 L-151.9 -160.95 -156.45 -151.55 -158.2 -148.55 -158.5 -148.35 Q-162.15 -146.25 -163.45 -144.65 L-162.55 -145.0 -161.25 -145.15 -157.0 -146.1 -158.1 -144.45 -158.9 -142.4 -158.95 -141.6 Q-158.9 -140.05 -157.3 -139.35 L-153.2 -138.05 -152.95 -138.0 -151.25 -137.1 -150.2 -136.15 -150.05 -135.95 Q-149.2 -134.8 -149.05 -133.65 L-153.1 -134.3 -157.4 -135.1 -159.45 -135.7 -162.35 -134.95 -164.65 -134.4 -165.3 -134.25 -165.2 -134.45 -164.8 -135.4 -168.05 -134.8 Q-170.4 -134.1 -171.05 -132.75 L-170.7 -132.4 Q-170.55 -132.25 -170.25 -132.2 -169.7 -132.1 -168.15 -132.7 L-165.6 -133.55 -163.5 -133.85 -162.95 -133.95 -162.55 -134.0 -160.1 -134.2 -159.75 -134.05 -162.05 -133.95 -157.65 -133.15 -153.45 -132.0 -155.55 -131.7 -155.55 -131.55 Q-153.65 -131.6 -150.25 -129.95 L-150.0 -129.85 -148.5 -129.1 Q-144.4 -126.95 -140.9 -126.8 L-139.9 -127.05 -135.45 -128.3 -133.8 -128.7 -129.3 -129.65 -132.0 -129.95 -126.85 -131.75 -126.8 -131.8 -121.95 -132.0 -120.05 -132.0 Q-120.45 -133.0 -123.05 -133.45 L-123.15 -133.35 -123.4 -133.55 Q-125.65 -135.2 -126.65 -135.75 L-130.45 -135.15 -132.9 -134.85 -133.0 -134.85 -135.1 -134.55 -135.9 -134.45 -139.75 -133.9 Q-138.65 -134.9 -135.2 -134.8 L-133.0 -134.85 Q-131.3 -135.1 -130.5 -135.95 L-130.45 -136.0 Q-129.9 -136.6 -129.75 -137.45 -129.6 -138.45 -129.75 -140.25 L-125.65 -139.9 -124.65 -139.95 -123.8 -139.55 -124.35 -140.0 -126.0 -141.6 -127.95 -143.45 -130.45 -147.95 -132.15 -151.0 -130.45 -152.85 -130.1 -153.15 Q-127.95 -154.85 -127.15 -155.9 L-124.65 -154.7 Q-122.25 -153.55 -121.9 -152.7 -122.65 -155.85 -123.45 -157.9 -122.3 -156.95 -121.15 -156.45 L-121.1 -156.75 -122.6 -159.5 -119.75 -158.65 Q-116.4 -157.75 -114.75 -157.75 -112.8 -157.75 -110.35 -158.7 -109.35 -159.1 -108.6 -159.55 L-111.3 -155.6 Q-107.05 -157.7 -103.85 -164.4 L-104.6 -164.9 -104.0 -165.85 -103.8 -166.1 -102.8 -164.95 -101.2 -167.15 -100.95 -167.55 -100.55 -169.15 Q-100.45 -169.5 -100.85 -171.15 L-100.95 -171.5 Q-101.45 -173.55 -101.3 -174.35 L-101.05 -175.3 -99.8 -178.75 -99.65 -179.0 -94.9 -177.15 -96.6 -174.7 -96.9 -174.55 -97.5 -174.0 -98.8 -172.6 -97.25 -171.55 -97.25 -171.15 -97.5 -169.75 Q-98.05 -166.5 -99.95 -161.8 L-101.2 -159.05 -104.2 -152.2 -104.45 -151.65 -104.65 -150.6 Q-104.1 -150.35 -103.45 -151.05 L-103.3 -150.95 Q-103.45 -150.1 -104.95 -147.75 L-103.45 -148.15 Q-102.15 -148.4 -100.65 -149.45 -101.9 -146.3 -102.65 -145.05 L-104.0 -141.6 M-130.1 -184.35 Q-128.75 -185.25 -127.25 -185.65 L-127.2 -185.9 -127.05 -185.85 Q-126.9 -185.85 -126.8 -185.7 L-125.65 -185.45 -122.1 -184.7 -109.3 -181.95 -100.5 -179.3 -103.15 -175.65 -103.75 -174.8 Q-103.95 -173.85 -103.55 -172.5 L-103.25 -171.15 -103.25 -170.7 -104.65 -168.3 -114.7 -169.4 -130.45 -169.4 -130.75 -169.4 -131.45 -169.5 -130.75 -172.7 -130.65 -172.95 -130.6 -172.9 -128.6 -176.35 -128.7 -176.4 Q-133.75 -171.95 -135.25 -169.75 -136.85 -167.2 -137.85 -161.7 L-137.95 -158.65 Q-137.95 -156.8 -138.1 -155.85 -138.3 -154.75 -137.75 -151.2 L-137.75 -150.75 -137.8 -150.25 -138.15 -146.15 -138.2 -145.55 -138.25 -144.15 -138.3 -142.95 -137.95 -143.85 -137.8 -144.6 -137.75 -144.8 -136.65 -145.25 Q-136.0 -143.0 -136.05 -141.6 L-136.15 -141.05 Q-136.3 -140.15 -137.7 -139.25 L-138.55 -138.65 -140.0 -138.45 -139.85 -138.8 -138.65 -140.5 -138.9 -140.65 -141.0 -140.05 -143.4 -139.8 Q-144.3 -140.0 -145.15 -140.55 L-145.95 -141.25 -146.25 -141.6 Q-147.2 -142.8 -146.95 -144.15 -146.75 -145.55 -142.45 -157.4 L-138.2 -169.15 Q-137.8 -171.55 -138.5 -174.25 L-138.55 -174.4 -139.35 -176.55 -139.8 -177.6 -140.8 -180.1 -141.05 -180.75 -141.7 -182.2 -141.75 -182.5 -141.8 -182.65 -135.35 -182.45 -131.4 -182.4 -126.75 -182.4 -115.5 -181.95 -122.35 -183.5 -124.2 -183.75 -129.6 -184.3 -130.1 -184.35 M-144.85 -171.25 L-144.7 -171.25 -144.7 -171.2 -144.85 -171.25 M-171.05 -170.55 L-170.85 -170.55 -170.85 -170.35 -171.05 -170.55 M-172.15 -155.35 L-173.35 -152.15 Q-174.35 -149.05 -175.05 -147.85 L-175.2 -147.05 -175.05 -146.35 -175.8 -142.1 -175.4 -134.1 Q-174.75 -131.85 -174.0 -130.75 L-173.45 -130.0 -173.4 -130.45 -173.35 -130.65 -173.7 -134.1 -173.95 -135.95 -174.2 -137.55 -174.1 -141.6 -173.65 -147.35 Q-172.2 -154.1 -172.15 -155.35 M-163.75 -144.6 L-163.55 -144.6 -163.45 -144.65 -163.75 -144.6 M-148.2 -149.35 L-148.15 -149.25 -148.2 -149.0 -148.25 -148.45 -148.35 -147.3 -148.35 -146.95 -148.65 -145.05 -148.75 -145.05 Q-148.6 -145.7 -149.0 -146.95 L-150.6 -145.3 Q-151.4 -144.3 -151.6 -143.05 -151.7 -142.5 -151.25 -141.6 L-151.05 -141.2 -151.65 -141.6 -152.55 -142.15 -152.75 -142.2 -152.7 -142.3 Q-153.8 -143.8 -153.65 -144.6 -153.55 -145.25 -152.05 -146.7 -150.35 -148.35 -149.5 -148.2 -148.8 -148.05 -148.6 -147.0 L-148.55 -147.2 -148.55 -147.35 -148.2 -149.0 -148.2 -149.35 M-169.55 -125.5 L-170.4 -128.9 Q-171.0 -128.25 -173.9 -121.65 -174.1 -120.55 -172.6 -118.4 L-170.55 -115.75 -167.6 -112.55 -167.55 -112.6 -167.6 -113.55 -166.7 -111.8 -166.05 -110.4 -166.25 -111.45 -167.75 -117.85 -167.9 -118.4 Q-169.1 -123.3 -169.3 -125.05 L-169.25 -125.15 -169.3 -125.55 -169.3 -126.05 -169.55 -125.5 M-123.8 -139.55 L-123.65 -139.4 -123.45 -139.4 -123.8 -139.55 M-126.4 -165.1 L-126.2 -165.1 -126.25 -165.05 -126.3 -164.95 -126.4 -165.1 M-127.1 -155.95 L-127.15 -155.9 -127.45 -156.05 -127.1 -155.95 M-131.3 -138.65 L-131.1 -138.7 -131.1 -138.55 -131.3 -138.65 M-124.95 -136.85 L-120.15 -136.5 -118.15 -135.95 Q-116.6 -135.35 -115.25 -134.25 L-115.65 -135.95 -116.35 -137.0 Q-117.15 -137.7 -118.85 -137.7 L-124.5 -137.45 -124.95 -136.85 M-137.15 -137.45 L-136.95 -137.45 -137.1 -137.4 -137.15 -137.45 M-132.7 -126.5 Q-132.05 -127.0 -132.05 -127.35 -132.05 -128.75 -133.65 -128.4 -135.3 -128.0 -135.3 -127.2 -135.3 -126.0 -133.6 -126.0 -133.35 -126.0 -132.7 -126.5 M-137.55 -121.9 L-132.55 -123.4 -128.8 -125.0 -128.95 -125.25 -129.8 -125.9 Q-137.2 -123.0 -140.1 -122.85 L-140.4 -122.85 -148.05 -123.9 -150.1 -124.3 Q-154.15 -125.1 -156.45 -125.8 L-152.5 -123.15 Q-150.65 -121.9 -149.25 -121.35 -149.85 -121.05 -152.75 -119.5 L-154.75 -118.4 Q-156.3 -117.45 -156.4 -116.75 -156.55 -116.15 -155.5 -114.2 -154.2 -112.0 -152.7 -110.7 -150.6 -109.05 -146.95 -108.4 -142.75 -107.65 -137.75 -113.1 -134.8 -116.15 -133.6 -118.4 -133.0 -119.55 -132.9 -120.5 -135.8 -120.95 -137.1 -121.6 L-137.55 -121.9 M-129.3 -127.65 Q-129.3 -128.3 -129.5 -128.25 -130.85 -128.7 -130.85 -127.7 L-130.7 -127.3 -130.1 -126.8 -129.4 -127.0 -129.3 -127.65 M-155.95 -143.8 L-155.9 -143.8 -156.1 -143.1 -156.1 -143.6 -155.95 -143.8 M-158.6 -132.35 Q-160.5 -132.0 -160.5 -130.35 L-160.35 -129.6 Q-159.95 -129.05 -158.75 -129.05 -156.75 -129.05 -156.75 -130.8 -156.75 -132.7 -158.6 -132.35 M-157.55 -132.7 L-157.35 -132.7 -157.45 -132.8 -157.55 -132.7 M-154.75 -128.35 L-154.5 -129.25 Q-154.5 -130.45 -155.55 -130.15 -156.6 -129.8 -156.6 -128.7 -156.8 -127.75 -155.75 -127.75 -155.1 -127.75 -154.75 -128.35 M-120.25 -116.4 L-121.2 -114.95 -122.1 -113.5 -122.35 -113.25 -123.05 -112.05 -126.55 -106.75 -126.5 -106.75 Q-122.7 -108.3 -120.9 -110.1 -119.05 -112.05 -118.45 -115.3 L-118.5 -118.4 -118.45 -120.65 -118.75 -120.7 Q-119.0 -119.45 -119.4 -118.4 L-120.25 -116.5 -120.25 -116.4 M-112.8 -125.25 Q-113.85 -122.5 -115.3 -120.35 L-115.65 -119.75 -115.6 -119.7 -115.2 -120.35 -113.25 -122.65 -112.35 -123.7 -111.25 -125.05 -111.15 -125.25 -110.85 -125.95 -109.95 -127.8 Q-109.45 -129.3 -109.4 -130.1 L-109.35 -130.3 Q-109.2 -131.35 -109.15 -134.5 L-109.1 -135.95 -109.2 -138.05 -109.8 -135.95 -111.95 -128.0 -112.8 -125.25 M-119.8 -134.55 L-119.9 -134.65 -119.95 -134.4 -119.8 -134.55" fill="#977849" fill-rule="evenodd" stroke="none"/>
    <path d="M-87.25 -167.2 Q-87.25 -165.25 -87.65 -163.0 -88.5 -158.25 -93.8 -152.75 L-94.6 -151.8 -99.15 -147.0 -98.95 -144.6 -98.85 -142.15 -99.05 -141.6 Q-99.55 -140.9 -100.85 -140.5 -102.5 -139.95 -104.0 -141.6 L-102.65 -145.05 Q-101.9 -146.3 -100.65 -149.45 L-99.75 -152.0 -99.1 -153.7 -98.1 -154.3 Q-95.5 -155.75 -94.35 -157.15 -92.15 -159.95 -91.5 -162.15 L-90.6 -166.85 Q-90.45 -167.75 -90.75 -169.2 L-90.9 -169.65 -90.9 -169.7 Q-91.3 -171.05 -91.9 -171.15 L-92.15 -171.15 -93.75 -170.4 -93.8 -171.15 -94.0 -173.95 -93.9 -174.0 Q-92.3 -175.05 -91.45 -174.9 -89.8 -174.65 -88.9 -173.15 L-87.9 -171.15 Q-87.35 -169.35 -87.25 -167.2 M-178.5 -154.25 Q-181.1 -154.15 -182.15 -154.9 -183.65 -156.05 -183.45 -157.15 L-182.5 -159.4 -181.55 -161.6 -182.3 -163.6 -184.6 -168.85 Q-187.7 -175.8 -186.85 -180.55 -186.3 -183.7 -185.05 -186.05 L-183.75 -188.1 -182.25 -189.65 Q-180.75 -190.75 -179.2 -190.45 -178.4 -190.3 -177.35 -189.0 L-177.45 -188.8 Q-177.9 -187.55 -177.05 -188.65 L-177.65 -187.0 Q-179.7 -187.4 -181.5 -185.15 -183.5 -182.9 -183.95 -180.4 L-184.1 -179.1 -184.15 -177.7 Q-184.15 -174.4 -182.8 -171.35 -181.55 -168.85 -178.8 -165.65 L-178.7 -162.7 -178.55 -160.4 -178.45 -158.9 -178.45 -158.7 -178.4 -158.55 -178.5 -154.25 M-146.8 -185.2 L-144.95 -185.05 -138.9 -184.8 -130.1 -184.35 -129.6 -184.3 -124.2 -183.75 -122.35 -183.5 -115.5 -181.95 -126.75 -182.4 -131.4 -182.4 -135.35 -182.45 -141.8 -182.65 -142.2 -182.65 -143.1 -182.75 -145.35 -182.8 -152.5 -183.75 Q-155.35 -184.25 -158.5 -185.45 -161.3 -186.5 -164.3 -188.15 L-163.0 -187.8 -155.55 -186.25 -146.8 -185.2 M-156.15 -163.05 L-156.15 -163.2 -155.5 -165.0 -155.25 -165.25 -154.55 -165.5 -153.45 -166.05 -153.35 -166.05 -153.3 -166.2 -153.55 -166.2 -155.7 -166.05 -157.95 -166.35 Q-166.2 -167.8 -170.35 -170.25 L-170.2 -169.15 -170.1 -168.6 -170.15 -168.6 Q-171.95 -170.55 -171.9 -170.85 -171.85 -171.2 -172.55 -173.15 -173.25 -175.25 -173.85 -176.15 L-173.2 -176.45 -173.2 -176.55 -172.6 -176.55 -171.7 -176.6 -169.4 -176.6 -164.4 -176.15 -154.3 -173.6 Q-148.3 -171.95 -144.85 -171.25 L-147.9 -170.2 -151.1 -169.35 Q-149.7 -167.45 -149.8 -166.95 -149.85 -166.65 -149.55 -166.6 L-149.2 -166.5 Q-150.2 -166.4 -153.25 -163.85 L-156.8 -160.9 -156.95 -160.95 -156.15 -163.05 M-171.1 -173.85 L-170.95 -173.35 -166.2 -169.95 Q-163.0 -168.25 -158.9 -167.7 L-153.1 -167.3 -153.0 -167.75 -153.6 -168.95 -154.1 -170.7 -151.9 -171.0 -152.0 -171.35 -155.35 -172.85 -155.7 -172.95 -157.0 -173.4 Q-161.35 -174.8 -166.95 -175.7 L-170.5 -176.15 -170.6 -176.15 -171.9 -176.25 Q-171.55 -175.75 -171.1 -173.9 L-171.1 -173.85 M-171.05 -170.55 L-170.85 -170.35 -170.85 -170.55 -171.05 -170.55 M-162.55 -145.0 L-160.75 -145.6 -158.55 -146.35 -154.65 -147.65 -153.85 -147.8 -154.15 -147.45 -154.5 -146.8 -155.95 -143.8 -156.1 -143.6 -156.1 -143.1 Q-156.15 -142.2 -155.5 -141.6 -155.0 -141.1 -154.1 -140.85 L-154.0 -140.75 -153.15 -140.45 -151.35 -140.0 -150.3 -139.75 -150.15 -139.65 -148.7 -138.35 -147.95 -137.6 -147.75 -137.4 Q-146.45 -136.25 -144.85 -135.95 L-144.7 -135.95 -144.55 -135.9 -142.4 -135.95 -141.3 -136.25 -141.2 -136.4 -138.15 -137.6 -137.15 -137.45 -137.1 -137.4 -136.95 -137.45 -134.5 -137.3 -134.25 -137.35 -134.2 -137.3 Q-132.05 -137.2 -131.5 -138.8 L-131.4 -139.2 -131.65 -141.6 -132.0 -143.55 -132.0 -143.9 -131.95 -143.9 -130.45 -143.05 -127.75 -141.6 -126.45 -140.9 -124.65 -139.95 -125.65 -139.9 -129.75 -140.25 Q-129.6 -138.45 -129.75 -137.45 -129.9 -136.6 -130.45 -136.0 L-130.5 -135.95 Q-131.3 -135.1 -133.0 -134.85 L-135.2 -134.8 Q-138.65 -134.9 -139.75 -133.9 L-143.2 -133.2 -146.7 -133.4 -149.05 -133.65 Q-149.2 -134.8 -150.05 -135.95 L-150.2 -136.15 -151.25 -137.1 -152.95 -138.0 -153.2 -138.05 -157.3 -139.35 Q-158.9 -140.05 -158.95 -141.6 L-158.9 -142.4 -158.1 -144.45 -157.0 -146.1 -161.25 -145.15 -162.55 -145.0 M-165.6 -133.55 L-168.15 -132.7 Q-169.7 -132.1 -170.25 -132.2 -170.55 -132.25 -170.7 -132.4 L-171.05 -132.75 Q-170.4 -134.1 -168.05 -134.8 L-164.8 -135.4 -165.2 -134.45 -165.3 -134.25 -167.65 -133.75 -167.6 -133.75 -167.5 -133.5 -167.35 -133.5 -165.6 -133.55 M-127.5 -133.4 L-127.5 -133.45 -127.45 -133.4 -127.5 -133.4 M-167.6 -113.55 L-167.65 -113.6 -167.7 -113.65 -167.85 -114.15 -169.55 -117.35 -170.05 -118.4 Q-171.2 -120.65 -171.1 -121.25 L-170.2 -124.05 -169.7 -125.3 -169.5 -125.2 -169.5 -125.1 -169.3 -125.05 Q-169.1 -123.3 -167.9 -118.4 L-167.75 -117.85 -166.25 -111.45 -166.7 -111.8 -167.6 -113.55 M-104.6 -164.9 L-103.85 -164.4 Q-107.05 -157.7 -111.3 -155.6 L-108.6 -159.55 Q-109.35 -159.1 -110.35 -158.7 -112.8 -157.75 -114.75 -157.75 -116.4 -157.75 -119.75 -158.65 L-122.6 -159.5 -121.1 -156.75 -121.15 -156.45 Q-122.3 -156.95 -123.45 -157.9 L-124.1 -158.35 -125.7 -159.8 Q-128.2 -162.35 -129.95 -163.1 L-129.9 -163.4 Q-128.85 -163.25 -127.9 -163.9 L-126.3 -164.95 -126.25 -165.05 -126.2 -165.1 -126.4 -165.1 Q-128.9 -165.75 -130.45 -166.5 L-131.85 -167.35 -130.45 -167.3 -121.55 -167.65 -109.55 -167.25 Q-108.15 -167.0 -105.8 -165.6 L-104.6 -164.9 M-110.1 -161.9 L-110.9 -161.55 -112.95 -161.1 -110.1 -161.9 M-107.05 -163.1 L-106.9 -163.3 -105.9 -164.75 -105.7 -164.9 -105.4 -165.3 -106.0 -165.5 -106.6 -165.6 -110.15 -166.2 -114.1 -166.7 -114.9 -166.8 -120.5 -167.1 -121.8 -167.05 -122.2 -167.1 -125.9 -166.75 -126.0 -166.4 -124.1 -165.5 -124.1 -165.45 -124.55 -164.85 -125.35 -163.7 -125.9 -163.1 -126.1 -162.95 -126.15 -162.9 Q-126.65 -162.5 -127.0 -162.35 -126.5 -161.7 -126.5 -161.15 -124.95 -161.85 -121.6 -160.1 L-121.3 -159.95 Q-119.85 -159.2 -119.0 -159.0 L-116.45 -158.95 Q-113.25 -158.95 -110.9 -160.15 L-109.95 -160.7 Q-108.8 -161.45 -107.85 -162.6 L-107.25 -162.8 -107.05 -163.1 M-132.3 -166.2 L-132.4 -163.8 Q-132.05 -156.25 -132.2 -155.55 -132.4 -154.35 -135.6 -147.9 L-136.8 -147.55 -135.6 -151.35 -134.85 -155.0 -134.65 -156.2 -132.3 -166.2 M-144.9 -170.25 L-147.25 -158.45 -147.55 -156.7 -148.0 -153.55 -148.25 -149.55 -148.55 -149.8 -149.25 -150.3 -149.4 -150.35 -150.1 -152.45 Q-151.35 -156.15 -151.25 -156.85 L-147.65 -164.75 -147.25 -165.6 -144.9 -170.25 M-131.3 -138.65 L-131.1 -138.55 -131.1 -138.7 -131.3 -138.65 M-128.6 -131.75 L-128.9 -131.95 -128.4 -131.95 -128.6 -131.75 M-140.1 -122.85 Q-137.2 -123.0 -129.8 -125.9 L-128.95 -125.25 -128.8 -125.0 -132.55 -123.4 -137.55 -121.9 -137.7 -121.95 -137.85 -121.85 Q-144.15 -120.35 -148.1 -121.05 L-149.25 -121.35 Q-150.65 -121.9 -152.5 -123.15 L-156.45 -125.8 Q-154.15 -125.1 -150.1 -124.3 L-146.3 -121.75 Q-144.3 -121.4 -140.1 -122.85 M-126.5 -106.75 L-126.55 -106.75 -123.05 -112.05 -122.35 -113.25 -122.1 -113.5 -121.2 -114.95 -120.25 -116.4 -119.85 -114.95 -119.5 -113.05 -122.4 -110.55 -126.5 -106.75" fill="#856941" fill-rule="evenodd" stroke="none"/>
    <path d="M-177.65 -187.0 Q-178.85 -183.2 -178.9 -174.9 L-178.95 -172.5 -178.9 -171.1 -179.35 -171.4 -179.65 -171.65 Q-180.3 -172.2 -180.25 -172.6 L-180.6 -175.05 Q-181.05 -177.55 -180.85 -178.5 -180.65 -179.8 -179.95 -180.8 L-178.9 -182.1 Q-180.35 -182.3 -181.9 -181.35 -183.4 -180.5 -184.1 -179.1 L-183.95 -180.4 Q-183.5 -182.9 -181.5 -185.15 -179.7 -187.4 -177.65 -187.0 M-97.85 -157.2 L-97.35 -158.6 -95.15 -164.65 Q-94.8 -164.5 -94.35 -163.8 -93.65 -162.85 -93.75 -162.3 -94.1 -160.3 -96.3 -158.4 L-97.85 -157.2 M-94.85 -165.25 L-93.7 -168.95 -93.75 -170.35 -93.75 -170.4 -92.15 -171.15 -91.9 -171.15 Q-91.3 -171.05 -90.9 -169.7 L-90.9 -169.65 -92.8 -167.9 Q-94.3 -166.4 -94.85 -165.25" fill="#59452b" fill-rule="evenodd" stroke="none"/>
    <path d="M-178.9 -171.1 L-178.8 -165.65 Q-181.55 -168.85 -182.8 -171.35 -184.15 -174.4 -184.15 -177.7 L-184.1 -179.1 Q-183.4 -180.5 -181.9 -181.35 -180.35 -182.3 -178.9 -182.1 L-179.95 -180.8 Q-180.65 -179.8 -180.85 -178.5 -181.05 -177.55 -180.6 -175.05 L-180.25 -172.6 Q-180.3 -172.2 -179.65 -171.65 L-179.35 -171.4 -178.9 -171.1 M-99.1 -153.7 L-97.85 -157.2 -96.3 -158.4 Q-94.1 -160.3 -93.75 -162.3 -93.65 -162.85 -94.35 -163.8 -94.8 -164.5 -95.15 -164.65 L-94.85 -165.25 Q-94.3 -166.4 -92.8 -167.9 L-90.9 -169.65 -90.75 -169.2 Q-90.45 -167.75 -90.6 -166.85 L-91.5 -162.15 Q-92.15 -159.95 -94.35 -157.15 -95.5 -155.75 -98.1 -154.3 L-99.1 -153.7" fill="#705736" fill-rule="evenodd" stroke="none"/>
    <path d="M-163.7 -174.15 L-166.6 -175.1 -170.3 -175.75 -168.7 -173.7 -166.35 -171.55 Q-164.35 -169.95 -158.95 -169.25 -156.6 -168.85 -155.55 -169.65 -155.0 -170.15 -154.9 -170.85 L-154.8 -171.5 -156.9 -172.2 -163.7 -174.15 M-171.1 -173.85 L-171.1 -173.9 Q-171.55 -175.75 -171.9 -176.25 L-170.6 -176.15 -170.5 -176.15 -166.95 -175.7 Q-161.35 -174.8 -157.0 -173.4 L-155.7 -172.95 -155.35 -172.85 -152.0 -171.35 -151.9 -171.0 -154.1 -170.7 -153.6 -168.95 -153.0 -167.75 -153.1 -167.3 -158.9 -167.7 Q-163.0 -168.25 -166.2 -169.95 L-170.95 -173.35 -171.1 -173.85 M-162.55 -145.0 L-163.45 -144.65 Q-162.15 -146.25 -158.5 -148.35 L-158.2 -148.55 Q-155.95 -149.75 -154.75 -150.5 L-153.5 -151.15 -152.55 -149.55 -153.85 -147.8 -154.65 -147.65 -158.55 -146.35 -160.75 -145.6 -162.55 -145.0 M-169.7 -125.3 L-169.55 -125.5 -169.3 -126.05 -169.3 -125.55 -169.25 -125.15 -169.3 -125.05 -169.5 -125.1 -169.5 -125.2 -169.7 -125.3 M-166.7 -111.8 L-166.25 -111.45 -166.05 -110.4 -166.7 -111.8 M-127.95 -143.45 L-126.0 -141.6 -124.35 -140.0 -123.8 -139.55 -124.65 -139.95 -126.45 -140.9 -127.75 -141.6 -130.45 -143.05 -131.95 -143.9 -132.0 -143.9 -132.5 -145.6 -132.0 -145.9 -131.9 -146.0 -132.1 -146.7 -132.3 -147.3 -132.1 -147.35 -130.45 -145.8 -127.95 -143.45 M-110.1 -161.9 Q-108.25 -162.85 -107.35 -164.85 L-107.45 -164.9 -107.4 -164.95 -109.75 -165.3 -111.55 -165.55 -114.2 -165.85 -114.4 -165.9 -114.65 -165.9 -114.85 -165.9 -115.6 -165.95 -118.65 -166.1 -118.85 -166.1 -120.6 -166.15 -120.8 -166.2 -122.2 -166.15 -122.7 -166.1 -122.8 -166.1 -123.05 -166.05 -123.25 -165.35 -123.3 -164.9 -123.25 -164.55 -123.35 -163.75 Q-123.35 -160.9 -116.35 -160.9 L-113.1 -161.05 -112.95 -161.1 -110.9 -161.55 -110.1 -161.9 M-107.05 -163.1 L-107.25 -162.8 -107.85 -162.6 Q-108.8 -161.45 -109.95 -160.7 L-110.9 -160.15 Q-113.25 -158.95 -116.45 -158.95 L-119.0 -159.0 Q-119.85 -159.2 -121.3 -159.95 L-121.6 -160.1 Q-124.95 -161.85 -126.5 -161.15 -126.5 -161.7 -127.0 -162.35 -126.65 -162.5 -126.15 -162.9 L-126.1 -162.95 -125.9 -163.1 -125.35 -163.7 -124.55 -164.85 -124.1 -165.45 -124.1 -165.5 -126.0 -166.4 -125.9 -166.75 -122.2 -167.1 -121.8 -167.05 -120.5 -167.1 -114.9 -166.8 -114.1 -166.7 -110.15 -166.2 -106.6 -165.6 -106.0 -165.5 -105.4 -165.3 -105.7 -164.9 -105.9 -164.75 -106.9 -163.3 -107.05 -163.1 M-140.0 -138.45 L-138.55 -138.65 -138.0 -138.7 -134.75 -139.15 -133.8 -139.2 -131.5 -138.8 Q-132.05 -137.2 -134.2 -137.3 L-134.25 -137.35 -132.9 -138.25 -132.85 -138.7 -135.65 -138.05 -137.15 -137.45 -138.15 -137.6 -141.2 -136.4 -141.3 -136.25 -142.4 -135.95 -144.55 -135.9 -144.7 -135.95 -144.85 -135.95 Q-146.45 -136.25 -147.75 -137.4 L-147.95 -137.6 -148.7 -138.35 -150.15 -139.65 -150.3 -139.75 -151.35 -140.0 Q-152.4 -140.9 -153.2 -141.45 L-153.35 -141.6 -155.0 -142.6 -155.05 -142.15 -154.65 -141.6 -154.05 -140.85 -154.1 -140.85 Q-155.0 -141.1 -155.5 -141.6 -156.15 -142.2 -156.1 -143.1 L-155.9 -143.8 -155.0 -143.4 -153.4 -142.65 -152.75 -142.2 -152.55 -142.15 -151.65 -141.6 -151.05 -141.2 -151.05 -141.15 -150.15 -140.5 Q-149.1 -139.6 -147.65 -139.0 L-145.0 -138.25 Q-143.65 -138.0 -141.3 -138.3 L-140.0 -138.45 M-124.95 -136.85 L-124.5 -137.45 -118.85 -137.7 Q-117.15 -137.7 -116.35 -137.0 L-115.65 -135.95 -115.25 -134.25 Q-116.6 -135.35 -118.15 -135.95 L-120.15 -136.5 -124.95 -136.85 M-150.1 -124.3 L-148.05 -123.9 -140.4 -122.85 -140.1 -122.85 Q-144.3 -121.4 -146.3 -121.75 L-150.1 -124.3" fill="#755d39" fill-rule="evenodd" stroke="none"/>
    <path d="M-168.7 -173.7 L-170.3 -175.75 -166.6 -175.1 -163.7 -174.15 -163.4 -172.95 -164.1 -173.15 -165.0 -173.2 -165.0 -173.0 -165.05 -172.85 -166.35 -173.3 -166.9 -173.4 -168.7 -173.7 M-156.9 -172.2 L-154.8 -171.5 -154.9 -170.85 Q-155.0 -170.15 -155.55 -169.65 L-157.25 -170.35 -159.05 -170.9 Q-157.85 -171.15 -156.9 -172.2 M-114.4 -165.9 L-114.2 -165.85 -111.55 -165.55 -109.75 -165.3 -107.4 -164.95 -107.45 -164.9 -107.35 -164.85 Q-108.25 -162.85 -110.1 -161.9 L-112.95 -161.1 -113.1 -161.05 -116.35 -160.9 Q-123.35 -160.9 -123.35 -163.75 L-123.25 -164.55 Q-122.9 -163.1 -120.0 -162.6 -114.6 -161.65 -112.2 -162.55 L-109.5 -163.75 -111.45 -164.25 -112.6 -164.45 -112.6 -164.5 -112.65 -164.75 -113.95 -164.85 -113.95 -165.1 -114.0 -165.7 -114.2 -165.85 -114.4 -165.85 -114.4 -165.9 M-123.3 -164.9 L-123.25 -165.35 -123.05 -166.05 -122.8 -166.1 -122.7 -166.1 -122.2 -166.15 -120.8 -166.2 -120.6 -166.15 -118.85 -166.1 -119.4 -165.55 -119.65 -165.0 -119.75 -165.05 -119.75 -164.9 -119.65 -164.9 -119.7 -164.5 -119.65 -164.25 -120.0 -164.55 -120.15 -164.9 -120.4 -164.9 -122.05 -164.85 -123.15 -164.9 -123.3 -164.9" fill="#a38c75" fill-rule="evenodd" stroke="none"/>
    <path d="M-163.7 -174.15 L-156.9 -172.2 Q-157.85 -171.15 -159.05 -170.9 -159.9 -170.75 -160.85 -170.9 -161.85 -171.1 -162.55 -171.75 L-162.4 -171.7 Q-161.85 -171.6 -161.8 -171.95 -161.75 -172.2 -162.3 -172.5 L-163.4 -172.95 -163.7 -174.15 M-118.85 -166.1 L-118.65 -166.1 -115.6 -165.95 -114.85 -165.9 -114.65 -165.9 -114.4 -165.9 -114.4 -165.85 -114.2 -165.85 -114.0 -165.7 -113.95 -165.1 -113.95 -164.85 -114.8 -164.95 -115.3 -164.95 Q-116.0 -164.95 -116.05 -164.65 L-116.0 -164.3 -114.9 -164.15 -114.2 -164.15 -114.3 -164.05 Q-114.55 -163.65 -115.1 -163.35 -116.1 -162.75 -117.35 -162.75 -117.95 -162.75 -118.7 -163.2 L-118.75 -163.25 Q-119.5 -163.75 -119.65 -164.25 L-119.7 -164.5 -119.65 -164.9 -119.55 -164.95 -119.65 -165.0 -119.4 -165.55 -118.85 -166.1" fill="#332211" fill-rule="evenodd" stroke="none"/>
    <path d="M-165.05 -172.85 L-165.0 -173.0 -165.0 -173.2 -164.1 -173.15 -163.4 -172.95 -162.3 -172.5 Q-161.75 -172.2 -161.8 -171.95 -161.85 -171.6 -162.4 -171.7 L-162.55 -171.75 Q-163.55 -171.9 -164.35 -172.35 L-165.05 -172.85 M-113.95 -164.85 L-112.65 -164.75 -112.6 -164.5 -112.6 -164.45 Q-112.75 -164.25 -113.25 -164.2 L-113.9 -164.2 -114.2 -164.15 -114.9 -164.15 -116.0 -164.3 -116.05 -164.65 Q-116.0 -164.95 -115.3 -164.95 L-114.8 -164.95 -113.95 -164.85" fill="#ffdcb8" fill-rule="evenodd" stroke="none"/>
    <path d="M-166.9 -173.4 L-166.35 -173.3 -165.05 -172.85 -164.35 -172.35 Q-163.55 -171.9 -162.55 -171.75 -161.85 -171.1 -160.85 -170.9 -159.9 -170.75 -159.05 -170.9 L-157.25 -170.35 Q-158.2 -170.0 -158.9 -170.0 L-161.55 -170.4 Q-163.75 -170.75 -164.6 -171.45 L-166.9 -173.4 M-122.05 -164.85 L-120.4 -164.9 -120.15 -164.9 -120.0 -164.55 -119.65 -164.25 Q-119.5 -163.75 -118.75 -163.25 L-118.7 -163.2 -119.25 -163.3 Q-119.9 -163.4 -121.0 -164.0 L-122.05 -164.85 M-114.3 -164.05 L-114.2 -164.15 -113.9 -164.2 -114.3 -164.05" fill="#e0c1a1" fill-rule="evenodd" stroke="none"/>
    <path d="M-155.55 -169.65 Q-156.6 -168.85 -158.95 -169.25 -164.35 -169.95 -166.35 -171.55 L-168.7 -173.7 -166.9 -173.4 -164.6 -171.45 Q-163.75 -170.75 -161.55 -170.4 L-158.9 -170.0 Q-158.2 -170.0 -157.25 -170.35 L-155.55 -169.65 M-123.25 -164.55 L-123.3 -164.9 -123.15 -164.9 -122.05 -164.85 -121.0 -164.0 Q-119.9 -163.4 -119.25 -163.3 L-118.7 -163.2 Q-117.95 -162.75 -117.35 -162.75 -116.1 -162.75 -115.1 -163.35 -114.55 -163.65 -114.3 -164.05 L-113.9 -164.2 -113.25 -164.2 Q-112.75 -164.25 -112.6 -164.45 L-111.45 -164.25 -109.5 -163.75 -112.2 -162.55 Q-114.6 -161.65 -120.0 -162.6 -122.9 -163.1 -123.25 -164.55" fill="#c4a98d" fill-rule="evenodd" stroke="none"/>
    <path d="M-165.3 -134.25 L-164.65 -134.4 -162.35 -134.95 -159.45 -135.7 -157.4 -135.1 -153.1 -134.3 -149.05 -133.65 -146.7 -133.4 -143.2 -133.2 -139.75 -133.9 -135.9 -134.45 -135.1 -134.55 -133.0 -134.85 -132.9 -134.85 -130.45 -135.15 -126.65 -135.75 Q-125.65 -135.2 -123.4 -133.55 L-123.15 -133.35 -126.55 -133.45 -127.45 -133.4 -127.5 -133.45 -127.5 -133.4 -128.55 -133.3 -129.65 -133.2 -130.45 -133.1 -131.1 -133.05 -134.1 -132.55 -137.0 -132.1 -137.5 -132.05 -139.45 -131.7 -140.6 -131.5 -141.55 -131.15 -145.85 -131.4 -146.7 -131.6 -148.0 -131.95 -149.15 -132.25 -149.6 -132.35 -152.8 -133.15 -155.2 -133.4 -156.4 -133.5 -158.35 -133.75 -159.75 -134.05 -160.1 -134.2 -162.55 -134.0 -162.95 -133.95 -163.5 -133.85 -165.6 -133.55 -167.35 -133.5 -167.5 -133.5 -167.6 -133.75 -167.65 -133.75 -165.3 -134.25" fill="#695333" fill-rule="evenodd" stroke="none"/>
    <path d="M-153.85 -147.8 L-152.55 -149.55 Q-151.4 -151.0 -150.5 -150.85 L-149.4 -150.35 -149.25 -150.3 -148.55 -149.8 -149.9 -149.95 -152.45 -146.95 -154.0 -145.05 -155.05 -143.9 -155.0 -143.4 -155.9 -143.8 -155.95 -143.8 -154.5 -146.8 -154.15 -147.45 -153.85 -147.8 M-144.7 -171.2 L-144.7 -171.25 -144.45 -172.6 -144.55 -173.05 -144.55 -173.35 -144.4 -174.75 -144.3 -176.0 -144.3 -177.0 -144.2 -176.6 -144.1 -176.45 -143.75 -175.15 -143.3 -173.2 -143.15 -172.55 -142.7 -170.45 -142.7 -169.65 Q-143.5 -165.2 -145.7 -157.95 L-148.15 -149.3 -148.2 -149.35 -148.25 -149.55 -148.0 -153.55 -147.55 -156.7 -147.25 -158.45 -144.9 -170.25 -144.7 -171.2 M-137.75 -144.8 L-137.8 -144.6 -137.95 -143.85 -138.3 -142.95 -138.25 -144.15 -138.2 -145.55 -138.15 -146.15 -137.8 -150.25 -137.75 -150.75 -137.75 -151.2 -137.5 -154.6 Q-135.8 -161.45 -135.65 -164.45 -135.55 -166.5 -133.55 -169.35 L-133.05 -169.8 -132.9 -170.15 -132.7 -170.2 -132.3 -170.75 -132.05 -171.15 -131.9 -171.35 Q-131.4 -171.6 -130.75 -172.7 L-131.45 -169.5 -132.3 -166.2 -134.65 -156.2 -134.85 -155.0 -135.6 -151.35 -136.8 -147.55 -135.6 -147.9 -134.2 -147.95 Q-133.25 -147.8 -132.5 -145.6 L-132.0 -143.9 -132.0 -143.55 -131.65 -141.6 -131.4 -139.2 -131.5 -138.8 -133.8 -139.2 Q-133.4 -139.55 -133.35 -139.8 -133.25 -140.3 -133.5 -141.6 L-134.0 -143.55 Q-134.8 -146.65 -135.45 -146.75 L-136.1 -146.8 -136.65 -146.75 -136.85 -146.7 -137.1 -146.65 -137.15 -146.4 -137.75 -144.8" fill="#b59058" fill-rule="evenodd" stroke="none"/>
    <path d="M-119.65 -164.9 L-119.75 -164.9 -119.75 -165.05 -119.65 -165.0 -119.55 -164.95 -119.65 -164.9" fill="#c2a78b" fill-rule="evenodd" stroke="none"/>
    <path d="M-137.15 -137.45 L-135.65 -138.05 -132.85 -138.7 -132.9 -138.25 -134.25 -137.35 -134.5 -137.3 -136.95 -137.45 -137.15 -137.45 M-154.05 -140.85 L-154.65 -141.6 -155.05 -142.15 -155.0 -142.6 -153.35 -141.6 -153.2 -141.45 Q-152.4 -140.9 -151.35 -140.0 L-153.15 -140.45 -154.0 -140.75 -154.05 -140.85" fill="#493a25" fill-rule="evenodd" stroke="none"/>
    <path d="M-146.1 -129.6 L-146.3 -130.35 -137.05 -131.2 -137.1 -130.35 Q-141.6 -128.85 -142.4 -128.85 -143.9 -128.85 -146.1 -129.6" fill="#bfbf8c" fill-rule="evenodd" stroke="none"/>
    <path d="M-148.0 -131.95 L-146.7 -131.6 -145.85 -131.4 -141.55 -131.15 -140.6 -131.5 -139.45 -131.7 -137.5 -132.05 -136.5 -130.55 -137.1 -130.35 -137.05 -131.2 -146.3 -130.35 -146.1 -129.6 -149.1 -130.85 -148.0 -131.95" fill="#abab7c" fill-rule="evenodd" stroke="none"/>
    <path d="M-149.6 -132.35 L-149.15 -132.25 -148.0 -131.95 -149.1 -130.85 -150.0 -131.25 -149.6 -132.35 M-137.5 -132.05 L-137.0 -132.1 -134.1 -132.55 -133.95 -131.4 -134.55 -131.2 -136.5 -130.55 -137.5 -132.05" fill="#919169" fill-rule="evenodd" stroke="none"/>
    <path d="M-155.2 -133.4 L-152.8 -133.15 -149.6 -132.35 -150.0 -131.25 -150.05 -131.3 Q-152.95 -132.8 -155.2 -133.4 M-134.1 -132.55 L-131.1 -133.05 -130.45 -133.1 -129.65 -133.2 -128.55 -133.3 -133.95 -131.4 -134.1 -132.55" fill="#787857" fill-rule="evenodd" stroke="none"/>
    <path d="M-121.15 -180.7 L-107.6 -177.0 Q-106.6 -175.25 -105.15 -171.95 -102.5 -166.05 -102.55 -164.6 L-102.85 -164.55 -104.05 -166.45 Q-104.85 -167.55 -106.2 -168.6 -108.6 -170.6 -111.85 -172.2 -114.45 -173.45 -125.6 -176.45 L-125.7 -176.6 -125.75 -176.7 -124.45 -180.15 -123.2 -183.35 -122.55 -182.3 -121.75 -180.85 -121.15 -180.7" fill="#382d1d" fill-rule="evenodd" stroke="none"/>
    <path d="M-171.6 -176.3 Q-174.8 -176.0 -176.65 -174.9 L-176.85 -175.15 Q-176.1 -176.35 -170.5 -179.65 L-165.6 -182.35 -152.35 -177.55 -151.85 -177.35 Q-151.25 -177.55 -150.3 -178.1 L-149.6 -178.4 -149.25 -178.55 -149.35 -177.85 -150.05 -175.25 -150.95 -171.7 -151.05 -171.65 -151.15 -171.5 Q-162.05 -175.45 -164.85 -175.95 L-171.6 -176.3" fill="#382d1d" fill-rule="evenodd" stroke="none"/>
    <path d="M-93.25 -224.4 L-89.6 -239.75 Q-85.7 -255.15 -85.1 -258.55 -82.9 -271.1 -84.45 -277.85 -86.55 -286.9 -95.35 -288.45 L-102.55 -287.9 -102.65 -288.2 Q-90.2 -291.45 -87.7 -290.95 -80.3 -289.4 -78.25 -279.4 -76.75 -272.05 -78.3 -263.2 -79.1 -258.7 -82.85 -242.7 L-86.0 -229.7 -86.95 -225.5 -88.2 -220.25 -93.15 -224.25 -93.25 -224.4 M-134.9 -290.8 L-133.35 -290.75 Q-145.7 -287.8 -150.6 -284.5 -155.35 -281.3 -156.45 -275.1 -157.6 -268.5 -158.0 -253.3 -158.2 -244.05 -158.75 -237.7 L-163.9 -235.9 Q-165.3 -235.35 -166.5 -234.65 L-166.7 -234.65 -166.4 -239.55 -165.25 -257.3 -164.0 -271.5 Q-162.5 -279.95 -150.75 -286.2 -145.95 -288.75 -141.55 -289.85 -138.1 -290.8 -134.9 -290.8 M-140.0 -210.45 L-149.15 -211.1 -145.1 -211.55 -140.75 -211.75 -141.0 -211.8 Q-141.4 -212.15 -143.15 -212.45 L-158.95 -214.75 -158.95 -214.95 -157.4 -215.15 -156.3 -215.45 -154.8 -215.4 -147.65 -214.75 -141.55 -214.05 -129.05 -211.95 -123.65 -210.7 -122.45 -210.4 -120.2 -208.55 -121.45 -208.7 -125.2 -209.15 -134.8 -210.2 -140.0 -210.45" fill="#694d45" fill-rule="evenodd" stroke="none"/>
    <path d="M-104.25 -231.6 Q-102.45 -237.3 -99.05 -245.35 -93.2 -259.3 -92.8 -261.7 -92.2 -265.2 -92.9 -274.45 -93.75 -284.85 -95.9 -285.25 L-110.05 -284.85 -112.05 -284.75 -118.3 -285.2 -118.15 -285.6 Q-119.75 -285.9 -122.8 -287.2 L-123.15 -287.4 Q-123.65 -287.6 -124.15 -287.9 L-125.25 -288.4 Q-134.75 -288.3 -139.2 -287.15 -147.15 -284.95 -148.25 -278.75 L-149.65 -267.25 Q-150.05 -265.2 -149.95 -256.4 -149.95 -247.55 -150.45 -244.7 L-150.4 -240.55 -150.3 -239.35 -157.6 -238.0 -158.75 -237.7 Q-158.2 -244.05 -158.0 -253.3 -157.6 -268.5 -156.45 -275.1 -155.35 -281.3 -150.6 -284.5 -145.7 -287.8 -133.35 -290.75 L-134.9 -290.8 -131.9 -291.05 Q-127.5 -291.05 -122.5 -289.15 L-114.3 -285.7 -109.2 -286.6 -105.4 -287.45 -103.0 -287.85 -102.55 -287.9 -95.35 -288.45 Q-86.55 -286.9 -84.45 -277.85 -82.9 -271.1 -85.1 -258.55 -85.7 -255.15 -89.6 -239.75 L-93.25 -224.4 -97.5 -227.35 -99.8 -228.85 -102.15 -230.35 -104.25 -231.6" fill="#5c433c" fill-rule="evenodd" stroke="none"/>
    <path d="M-150.3 -239.35 L-150.4 -240.55 -150.45 -244.7 Q-149.95 -247.55 -149.95 -256.4 -150.05 -265.2 -149.65 -267.25 L-148.25 -278.75 Q-147.15 -284.95 -139.2 -287.15 -134.75 -288.3 -125.25 -288.4 L-124.15 -287.9 Q-123.65 -287.6 -123.15 -287.4 L-122.8 -287.2 Q-119.75 -285.9 -118.15 -285.6 L-118.3 -285.2 -112.05 -284.75 -110.05 -284.85 -95.9 -285.25 Q-93.75 -284.85 -92.9 -274.45 -92.2 -265.2 -92.8 -261.7 -93.2 -259.3 -99.05 -245.35 -102.45 -237.3 -104.25 -231.6 L-110.55 -235.05 -108.2 -245.75 -105.1 -262.05 Q-104.7 -264.35 -107.0 -266.45 -109.4 -268.05 -109.35 -268.35 L-109.25 -268.95 -110.1 -268.95 Q-115.7 -269.9 -127.5 -266.6 -140.95 -262.85 -142.0 -257.05 L-142.25 -252.0 Q-142.45 -247.95 -142.85 -245.4 -143.25 -243.35 -143.0 -239.95 L-143.0 -239.8 -144.2 -239.8 -150.3 -239.35 M-102.55 -287.9 L-103.0 -287.85 -105.4 -287.45 -103.1 -288.05 -102.65 -288.2 -102.55 -287.9 M-166.7 -234.55 L-166.7 -234.65 -166.5 -234.65 -166.7 -234.55" fill="#523c36" fill-rule="evenodd" stroke="none"/>
    <path d="M-143.0 -239.8 L-143.0 -239.95 Q-143.25 -243.35 -142.85 -245.4 -142.45 -247.95 -142.25 -252.0 L-142.0 -257.05 Q-140.95 -262.85 -127.5 -266.6 -115.7 -269.9 -110.1 -268.95 L-109.25 -268.95 -109.35 -268.35 Q-109.4 -268.05 -107.0 -266.45 -104.7 -264.35 -105.1 -262.05 L-108.2 -245.75 -110.55 -235.05 Q-113.3 -236.35 -114.95 -236.7 -131.05 -240.0 -143.0 -239.8" fill="#45322d" fill-rule="evenodd" stroke="none"/>
    <path d="M-104.25 -231.6 L-102.15 -230.35 -100.15 -226.35 Q-98.15 -222.0 -98.4 -220.6 L-102.15 -212.25 -105.05 -205.5 -112.4 -207.6 -116.3 -208.7 Q-114.65 -212.75 -111.85 -216.95 -108.65 -221.8 -108.35 -223.4 -108.1 -224.7 -108.95 -225.45 L-112.35 -227.85 -113.1 -228.35 Q-116.9 -230.95 -121.7 -233.4 -125.65 -235.4 -126.7 -235.55 -127.9 -235.8 -133.95 -233.6 -140.15 -231.4 -141.25 -230.05 L-146.0 -225.5 Q-150.4 -220.9 -151.8 -217.75 L-149.05 -215.65 -147.65 -214.75 -154.8 -215.4 -156.3 -215.45 -158.3 -215.65 -158.8 -215.6 -159.65 -215.65 -159.75 -217.6 -159.9 -218.95 -159.85 -219.05 Q-159.55 -220.8 -159.85 -222.8 L-159.9 -223.3 Q-160.15 -225.1 -159.9 -226.5 L-159.85 -226.6 -159.85 -228.75 -159.85 -230.05 -160.05 -233.0 Q-160.0 -233.45 -159.1 -234.1 -157.0 -235.4 -150.25 -237.55 L-143.0 -239.8 Q-131.05 -240.0 -114.95 -236.7 -113.3 -236.35 -110.55 -235.05 L-104.25 -231.6" fill="#380a08" fill-rule="evenodd" stroke="none"/>
    <path d="M-147.65 -214.75 L-149.05 -215.65 -151.8 -217.75 Q-150.4 -220.9 -146.0 -225.5 L-141.25 -230.05 Q-140.15 -231.4 -133.95 -233.6 -127.9 -235.8 -126.7 -235.55 -125.65 -235.4 -121.7 -233.4 -116.9 -230.95 -113.1 -228.35 L-112.35 -227.85 -108.95 -225.45 Q-108.1 -224.7 -108.35 -223.4 -108.65 -221.8 -111.85 -216.95 -114.65 -212.75 -116.3 -208.7 L-122.45 -210.4 -123.65 -210.7 -122.05 -212.25 Q-117.5 -216.45 -117.05 -217.5 L-116.85 -218.6 -118.0 -219.0 -125.8 -220.6 -128.1 -220.95 -135.9 -220.4 -142.3 -219.15 -145.0 -218.4 Q-145.0 -217.45 -142.95 -215.45 L-141.55 -214.05 -147.65 -214.75" fill="#381211" fill-rule="evenodd" stroke="none"/>
    <path d="M-102.15 -230.35 L-99.8 -228.85 -97.5 -227.35 -93.25 -224.4 -93.15 -224.25 -91.25 -221.4 Q-90.65 -220.3 -90.75 -219.7 -90.95 -218.45 -93.2 -214.3 -95.15 -209.95 -97.2 -203.15 L-99.6 -203.85 -100.0 -203.95 -100.25 -204.05 -101.2 -204.3 -105.05 -205.5 -102.15 -212.25 -98.4 -220.6 Q-98.15 -222.0 -100.15 -226.35 L-102.15 -230.35 M-158.75 -237.7 L-157.6 -238.0 -150.3 -239.35 -144.2 -239.8 -143.0 -239.8 -150.25 -237.55 Q-157.0 -235.4 -159.1 -234.1 -160.0 -233.45 -160.05 -233.0 L-159.85 -230.05 -159.85 -228.75 -159.85 -226.6 -159.9 -226.5 Q-160.15 -225.1 -159.9 -223.3 L-159.85 -222.8 Q-159.55 -220.8 -159.85 -219.05 L-159.9 -218.95 -159.75 -217.6 -159.65 -215.65 -159.75 -215.7 -164.35 -215.95 -164.2 -223.4 -164.0 -235.0 -163.9 -235.9 -158.75 -237.7" fill="#4a0c0a" fill-rule="evenodd" stroke="none"/>
    <path d="M-123.65 -210.7 L-129.05 -211.95 -141.55 -214.05 -142.95 -215.45 Q-145.0 -217.45 -145.0 -218.4 L-142.3 -219.15 -135.9 -220.4 -128.1 -220.95 -125.8 -220.6 -118.0 -219.0 -116.85 -218.6 -117.05 -217.5 Q-117.5 -216.45 -122.05 -212.25 L-123.65 -210.7" fill="#381a19" fill-rule="evenodd" stroke="none"/>
    <path d="M-116.3 -208.7 L-112.4 -207.6 -105.05 -205.5 -101.2 -204.3 -100.3 -203.75 -97.8 -201.1 -95.65 -199.15 -93.55 -197.2 -90.8 -194.4 Q-91.75 -193.8 -93.3 -193.15 L-94.75 -192.55 -99.65 -191.5 -110.45 -190.1 -120.95 -188.45 -127.45 -189.6 Q-123.55 -190.45 -118.05 -192.4 -108.4 -195.8 -108.1 -197.5 -107.9 -198.65 -111.5 -201.55 L-116.15 -205.0 -117.4 -206.15 -119.55 -207.95 -120.2 -208.55 -122.45 -210.4 -116.3 -208.7 M-156.3 -215.45 L-157.4 -215.15 -158.95 -214.95 -158.95 -214.75 -143.15 -212.45 Q-141.4 -212.15 -141.0 -211.8 L-140.75 -211.75 -145.1 -211.55 -149.15 -211.1 -140.0 -210.45 -149.0 -206.1 Q-155.05 -203.15 -156.35 -201.55 -153.65 -197.75 -150.95 -195.7 L-156.05 -197.35 -165.45 -200.7 -168.65 -203.25 -172.45 -207.2 -174.5 -209.65 Q-174.4 -210.4 -169.55 -212.05 L-168.35 -212.45 -164.35 -213.8 -159.7 -215.3 -159.6 -215.35 -158.8 -215.6 -158.3 -215.65 -156.3 -215.45" fill="#7a5950" fill-rule="evenodd" stroke="none"/>
    <path d="M-140.0 -210.45 L-134.8 -210.2 -125.2 -209.15 -121.45 -208.7 -120.2 -208.55 -119.55 -207.95 -117.4 -206.15 -116.15 -205.0 -111.5 -201.55 Q-107.9 -198.65 -108.1 -197.5 -108.4 -195.8 -118.05 -192.4 -123.55 -190.45 -127.45 -189.6 L-137.75 -191.9 -150.95 -195.7 Q-153.65 -197.75 -156.35 -201.55 -155.05 -203.15 -149.0 -206.1 L-140.0 -210.45" fill="#73544b" fill-rule="evenodd" stroke="none"/>
    <path d="M-86.45 -218.6 L-84.95 -216.85 -87.5 -209.6 -90.6 -201.2 -92.2 -201.65 -90.4 -207.4 -86.45 -218.6 M-169.35 -216.45 L-169.35 -216.5 -169.45 -217.15 -169.8 -223.4 Q-170.1 -229.6 -169.7 -232.85 L-167.35 -234.25 -166.7 -234.55 -166.5 -234.65 -166.8 -234.35 -168.3 -232.25 -168.45 -221.35 -168.45 -216.25 -169.35 -216.45" fill="#73110e" fill-rule="evenodd" stroke="none"/>
    <path d="M-88.2 -220.25 L-88.15 -220.25 -86.45 -218.6 -90.4 -207.4 -92.2 -201.65 -92.55 -201.75 -97.2 -203.15 Q-95.15 -209.95 -93.2 -214.3 -90.95 -218.45 -90.75 -219.7 -90.65 -220.3 -91.25 -221.4 L-93.15 -224.25 -88.2 -220.25 M-168.45 -216.25 L-168.45 -221.35 -168.3 -232.25 -166.8 -234.35 -166.5 -234.65 Q-165.3 -235.35 -163.9 -235.9 L-164.0 -235.0 -164.2 -223.4 -164.35 -215.95 -167.1 -216.0 -168.45 -216.25 M-167.6 -216.7 L-167.75 -217.25 -167.7 -216.7 -167.6 -216.7" fill="#5c0f0c" fill-rule="evenodd" stroke="none"/>
    <path d="M-42.0 -190.2 L-41.65 -190.05 -42.0 -190.1 -42.0 -190.2 M-158.8 -215.6 L-159.6 -215.35 -159.7 -215.3 -164.35 -213.8 -168.35 -212.45 -169.55 -212.05 Q-174.4 -210.4 -174.5 -209.65 L-172.45 -207.2 -168.65 -203.25 -165.45 -200.7 -175.9 -204.6 -185.25 -208.7 -186.1 -210.55 -187.45 -212.9 -181.45 -213.2 -175.0 -213.8 -168.4 -214.5 -164.3 -215.05 -162.45 -215.35 -159.75 -215.7 -159.65 -215.65 -158.8 -215.6 M-120.95 -188.45 L-110.45 -190.1 -99.65 -191.5 -94.75 -192.55 -93.3 -193.15 Q-91.75 -193.8 -90.8 -194.4 L-93.55 -197.2 -95.65 -199.15 -97.8 -201.1 -100.3 -203.75 -101.2 -204.3 -100.25 -204.05 -100.3 -203.75 Q-98.95 -202.9 -97.45 -202.2 L-92.75 -200.05 Q-82.15 -195.65 -65.2 -192.25 -65.55 -191.5 -66.75 -191.0 L-68.85 -190.25 -72.05 -190.0 -82.6 -188.9 -96.0 -187.6 Q-106.6 -186.75 -117.0 -187.85 L-120.95 -188.45" fill="#856c65" fill-rule="evenodd" stroke="none"/>
    <path d="M-90.6 -201.2 Q-76.15 -197.0 -68.85 -195.5 L-65.8 -195.05 Q-61.4 -194.95 -57.3 -193.65 -55.0 -192.7 -52.35 -192.7 L-47.75 -191.8 -44.45 -191.0 -42.05 -190.2 -42.0 -190.2 -42.0 -190.1 -43.75 -190.5 -47.95 -190.7 -50.85 -190.7 Q-59.9 -190.95 -68.85 -190.25 L-66.75 -191.0 Q-65.55 -191.5 -65.2 -192.25 -82.15 -195.65 -92.75 -200.05 L-97.45 -202.2 Q-98.95 -202.9 -100.3 -203.75 L-100.25 -204.05 -100.0 -203.95 -99.6 -203.85 -97.2 -203.15 -92.55 -201.75 -92.2 -201.65 -90.6 -201.2 M-211.55 -218.65 L-204.65 -218.5 -194.8 -217.75 -190.85 -217.45 -169.7 -216.5 -169.35 -216.45 -168.45 -216.25 -167.1 -216.0 -164.35 -215.95 -159.75 -215.7 -162.45 -215.35 -164.3 -215.05 -168.4 -214.5 -175.0 -213.8 -181.45 -213.2 -187.45 -212.9 -186.1 -210.55 -185.25 -208.7 -192.8 -212.3 -195.55 -213.6 Q-200.15 -215.65 -204.95 -217.05 L-211.55 -218.65" fill="#947870" fill-rule="evenodd" stroke="none"/>
    <path d="M-41.65 -190.05 Q-38.9 -188.9 -36.45 -187.5 -35.25 -186.85 -34.15 -186.05 L-33.7 -185.55 -33.55 -185.25 -33.7 -184.7 Q-32.0 -182.5 -30.75 -180.15 L-29.15 -177.5 Q-28.65 -176.7 -28.6 -175.85 L-28.4 -174.35 -28.15 -172.95 -28.45 -172.65 -28.8 -172.55 Q-29.9 -175.65 -31.95 -178.25 L-33.65 -180.15 Q-34.5 -181.05 -35.5 -182.9 -36.55 -184.8 -39.65 -186.45 -42.75 -188.15 -44.45 -188.4 L-47.5 -189.1 -48.2 -189.25 -55.25 -189.85 -62.1 -189.45 -66.9 -189.05 -74.75 -188.05 -75.25 -188.0 -81.65 -186.85 Q-109.3 -182.4 -133.6 -188.3 -148.4 -192.2 -162.4 -197.35 -175.15 -202.1 -187.25 -208.05 -191.75 -209.85 -196.0 -211.25 -200.95 -212.9 -205.5 -213.75 -221.1 -216.9 -231.6 -211.9 L-232.3 -211.6 Q-247.7 -204.05 -243.8 -194.5 L-243.9 -194.45 -245.6 -196.75 -245.9 -197.3 Q-246.65 -206.1 -238.3 -211.8 L-237.75 -212.15 -221.75 -218.15 -219.25 -218.45 -217.6 -218.55 -213.05 -218.7 -211.7 -218.7 -211.55 -218.65 -204.95 -217.05 Q-200.15 -215.65 -195.55 -213.6 L-192.8 -212.3 -185.25 -208.7 -175.9 -204.6 -165.45 -200.7 -156.05 -197.35 -150.95 -195.7 -137.75 -191.9 -127.45 -189.6 -120.95 -188.45 -117.0 -187.85 Q-106.6 -186.75 -96.0 -187.6 L-82.6 -188.9 -72.05 -190.0 -68.85 -190.25 Q-59.9 -190.95 -50.85 -190.7 L-47.95 -190.7 -43.75 -190.5 -42.0 -190.1 -41.65 -190.05" fill="#5e443d" fill-rule="evenodd" stroke="none"/>
  </g>
</svg>
