<?xml version="1.0" encoding="UTF-8" standalone="no"?>
<svg xmlns:xlink="http://www.w3.org/1999/xlink" height="22.65px" width="170.45px" xmlns="http://www.w3.org/2000/svg">
  <g transform="matrix(1.0, 0.0, 0.0, 1.0, 11.2, 11.8)">
    <path d="M5.6 -8.55 L6.0 -8.15 5.65 -7.95 6.9 -7.95 8.7 -8.05 12.15 -7.9 15.8 -7.2 15.35 -7.0 21.2 -6.95 21.3 -6.95 25.8 -5.95 Q29.0 -5.25 31.7 -3.85 35.35 -1.9 38.55 -1.1 L45.8 -0.3 49.35 -0.4 50.45 -0.6 46.75 -0.6 Q43.65 -0.7 35.95 -4.15 31.65 -6.1 28.4 -6.9 L32.85 -6.8 33.9 -6.8 38.5 -6.7 38.55 -6.7 43.55 -4.75 Q48.75 -2.95 52.05 -2.95 L56.7 -3.45 60.35 -4.45 60.45 -4.45 62.15 -4.0 61.95 -3.8 61.7 -3.55 65.1 -4.05 71.5 -4.45 76.4 -4.35 Q78.25 -4.15 79.1 -3.1 77.05 -2.45 74.05 -2.3 72.35 -2.2 69.7 -2.25 L77.2 -1.8 84.2 -0.65 Q83.0 1.0 78.5 1.0 L71.4 0.65 56.6 1.1 59.05 1.35 62.15 1.55 62.2 1.7 62.35 1.8 61.55 2.4 58.3 2.95 Q56.8 3.35 54.95 4.15 L51.1 5.5 46.25 5.55 46.15 5.55 Q38.95 2.6 35.65 1.7 30.45 0.25 24.85 0.25 16.6 0.25 11.6 2.45 L11.6 2.7 16.2 1.8 20.7 1.35 Q26.15 1.35 30.2 2.35 L34.55 3.75 33.55 3.9 34.65 3.9 34.6 3.8 38.1 5.05 37.7 5.2 36.5 5.7 33.9 5.75 33.85 5.75 33.6 5.75 25.2 5.85 21.3 5.9 18.6 5.95 18.65 6.05 5.9 6.95 6.45 7.15 6.3 7.45 6.0 7.7 5.95 7.7 5.95 7.75 1.8 8.4 1.6 8.4 1.4 8.4 1.2 8.4 0.05 8.3 -0.75 8.2 Q-4.45 7.65 -7.3 5.8 -11.2 3.2 -11.2 -0.5 -11.2 -4.2 -7.3 -6.8 -4.45 -8.65 -0.75 -9.2 L0.05 -9.3 1.2 -9.4 1.4 -9.4 1.6 -9.4 1.8 -9.4 3.65 -9.25 4.1 -9.15 4.15 -9.1 5.6 -8.55 M45.65 -6.65 L50.3 -6.6 48.55 -6.5 45.65 -6.65 M1.5 -7.25 L1.35 -7.25 1.5 -7.2 1.5 -7.25 M14.45 -3.45 L14.2 -3.45 14.2 -3.3 14.35 -3.3 14.45 -3.45 M142.8 -0.75 L142.1 -0.85 142.8 -0.85 142.8 -0.75 M74.8 5.3 L74.75 5.3 74.8 5.2 74.8 5.3" fill="#ffffff" fill-rule="evenodd" stroke="none"/>
    <path d="M5.6 -8.55 L4.15 -9.1 4.1 -9.15 3.65 -9.25 4.1 -9.15 4.15 -9.15 5.95 -8.7 6.0 -8.7 15.25 -10.65 Q21.0 -11.8 24.8 -11.8 L31.4 -11.2 37.4 -9.6 42.7 -7.25 42.65 -7.1 42.7 -7.1 43.65 -6.9 45.65 -6.65 48.55 -6.5 50.3 -6.6 Q53.5 -6.8 56.55 -7.9 L57.2 -8.15 57.8 -8.15 Q62.65 -10.25 69.05 -10.25 L81.15 -9.4 85.35 -8.6 88.05 -7.85 88.65 -7.65 88.8 -7.6 Q93.65 -6.0 96.85 -5.4 L99.05 -5.1 100.05 -4.85 107.1 -3.6 118.15 -3.1 122.4 -3.1 124.9 -3.2 Q127.75 -3.4 130.15 -4.35 L124.25 -1.75 118.7 0.7 116.15 1.75 115.35 1.8 113.6 1.8 115.45 1.95 Q110.8 3.45 106.5 3.15 L106.5 3.35 111.2 3.85 114.95 3.8 115.4 3.8 115.05 4.0 110.25 5.95 109.9 6.0 108.7 6.15 108.7 6.35 108.6 6.5 104.25 7.35 98.95 6.35 92.45 5.35 92.4 5.35 90.3 5.75 90.0 5.85 89.9 5.85 87.1 6.6 86.45 6.85 86.2 6.85 86.1 6.85 85.05 7.15 83.3 7.7 Q78.95 9.1 76.3 9.1 73.65 9.1 70.3 7.75 69.2 7.3 68.15 7.0 L63.05 7.05 60.15 7.05 Q58.55 8.0 55.75 9.05 51.1 10.85 48.7 10.85 43.75 10.85 40.75 9.1 39.25 8.25 36.7 7.6 L35.55 7.35 26.75 7.5 25.2 7.5 6.0 7.7 5.95 7.7 6.0 7.7 6.3 7.45 25.2 7.2 26.75 7.2 33.15 7.15 34.4 7.1 40.3 7.05 40.7 7.05 43.15 8.1 47.35 8.85 Q50.85 8.85 55.0 6.85 L55.8 6.5 58.2 5.4 Q60.85 4.2 61.65 4.2 63.3 4.2 66.65 5.35 L67.4 5.65 70.2 6.7 73.85 6.65 73.9 6.7 81.65 6.65 Q82.2 6.15 82.2 5.55 82.2 4.9 80.85 4.55 L78.85 4.0 88.25 3.6 97.45 3.1 100.4 3.1 Q103.3 2.95 104.0 2.25 101.15 1.35 97.25 1.15 L90.0 1.1 99.2 0.45 107.6 0.2 110.5 0.3 113.85 0.0 Q112.95 -0.6 108.6 -1.35 L104.35 -1.95 105.1 -2.1 Q106.0 -2.35 106.25 -2.9 L97.55 -3.7 90.8 -3.95 94.15 -2.8 Q96.6 -2.05 98.25 -2.25 L98.25 -2.0 95.35 -2.0 Q90.6 -2.85 82.35 -6.0 79.5 -7.1 76.15 -7.65 L73.85 -7.65 73.75 -7.7 68.4 -7.75 66.85 -7.8 62.5 -7.4 57.75 -6.5 57.15 -6.25 Q53.75 -4.95 49.9 -4.95 L47.0 -5.0 42.85 -6.05 42.0 -6.3 39.2 -7.45 37.25 -8.15 35.9 -8.15 29.95 -8.2 27.6 -9.05 Q23.15 -10.45 18.7 -10.45 L12.25 -9.35 8.3 -8.4 6.0 -8.45 5.95 -8.5 5.6 -8.55 M1.5 -7.25 L1.5 -7.2 1.35 -7.25 1.5 -7.25" fill="#f7de09" fill-rule="evenodd" stroke="none"/>
    <path d="M6.3 7.45 L6.45 7.15 5.9 6.95 18.65 6.05 18.6 5.95 21.3 5.9 25.2 5.85 33.6 5.75 33.85 5.75 33.9 5.75 36.5 5.7 37.7 5.2 38.1 5.05 34.6 3.8 34.65 3.9 33.55 3.9 34.55 3.75 30.2 2.35 Q26.15 1.35 20.7 1.35 L16.2 1.8 11.6 2.7 11.6 2.45 Q16.6 0.25 24.85 0.25 30.45 0.25 35.65 1.7 38.95 2.6 46.15 5.55 L46.25 5.55 51.1 5.5 54.95 4.15 Q56.8 3.35 58.3 2.95 L61.55 2.4 62.35 1.8 62.2 1.7 62.15 1.55 59.05 1.35 56.6 1.1 71.4 0.65 78.5 1.0 Q83.0 1.0 84.2 -0.65 L77.2 -1.8 69.7 -2.25 Q72.35 -2.2 74.05 -2.3 77.05 -2.45 79.1 -3.1 78.25 -4.15 76.4 -4.35 L71.5 -4.45 65.1 -4.05 61.7 -3.55 61.95 -3.8 62.15 -4.0 60.45 -4.45 60.35 -4.45 56.7 -3.45 52.05 -2.95 Q48.75 -2.95 43.55 -4.75 L38.55 -6.7 38.5 -6.7 33.9 -6.8 32.85 -6.8 28.4 -6.9 Q31.65 -6.1 35.95 -4.15 43.65 -0.7 46.75 -0.6 L50.45 -0.6 49.35 -0.4 45.8 -0.3 38.55 -1.1 Q35.35 -1.9 31.7 -3.85 29.0 -5.25 25.8 -5.95 L21.3 -6.95 21.2 -6.95 15.35 -7.0 15.8 -7.2 12.15 -7.9 8.7 -8.05 6.9 -7.95 5.65 -7.95 6.0 -8.15 5.6 -8.55 5.95 -8.5 6.0 -8.45 8.3 -8.4 12.25 -9.35 18.7 -10.45 Q23.15 -10.45 27.6 -9.05 L29.95 -8.2 35.9 -8.15 37.25 -8.15 39.2 -7.45 42.0 -6.3 42.85 -6.05 47.0 -5.0 49.9 -4.95 Q53.75 -4.95 57.15 -6.25 L57.75 -6.5 62.5 -7.4 66.85 -7.8 68.4 -7.75 73.75 -7.7 73.85 -7.65 76.15 -7.65 Q79.5 -7.1 82.35 -6.0 90.6 -2.85 95.35 -2.0 L98.25 -2.0 98.25 -2.25 Q96.6 -2.05 94.15 -2.8 L90.8 -3.95 97.55 -3.7 106.25 -2.9 Q106.0 -2.35 105.1 -2.1 L104.35 -1.95 108.6 -1.35 Q112.95 -0.6 113.85 0.0 L110.5 0.3 107.6 0.2 99.2 0.45 90.0 1.1 97.25 1.15 Q101.15 1.35 104.0 2.25 103.3 2.95 100.4 3.1 L97.45 3.1 88.25 3.6 78.85 4.0 80.85 4.55 Q82.2 4.9 82.2 5.55 82.2 6.15 81.65 6.65 L73.9 6.7 73.85 6.65 70.2 6.7 67.4 5.65 66.65 5.35 Q63.3 4.2 61.65 4.2 60.85 4.2 58.2 5.4 L55.8 6.5 55.0 6.85 Q50.85 8.85 47.35 8.85 L43.15 8.1 40.7 7.05 40.3 7.05 34.4 7.1 33.15 7.15 26.75 7.2 25.2 7.2 6.3 7.45 M14.45 -3.45 L14.35 -3.3 14.2 -3.3 14.2 -3.45 14.45 -3.45 M100.0 -5.1 L100.05 -5.1 100.05 -5.0 100.0 -5.1 M135.55 -5.95 L135.55 -6.0 135.6 -6.0 135.55 -5.95 M74.8 5.3 L74.8 5.2 74.75 5.3 74.8 5.3" fill="#fefd81" fill-rule="evenodd" stroke="none"/>
    <path d="M119.15 -7.15 L119.15 -7.1 119.1 -7.2 119.15 -7.15 M150.4 -3.15 L150.6 -3.1 150.5 -3.0 150.4 -3.15 M159.1 0.35 L159.25 0.45 159.15 0.5 159.1 0.35" fill="#f76f09" fill-rule="evenodd" stroke="none"/>
    <path d="M85.35 -8.6 L100.8 -6.35 117.5 -5.1 Q120.9 -5.1 129.25 -7.05 L137.7 -9.25 137.75 -9.2 Q130.15 -1.5 118.5 3.15 L121.5 3.15 123.05 3.1 Q105.85 8.95 103.8 8.95 101.9 8.15 99.65 7.4 95.25 5.8 90.3 5.8 L90.3 5.75 92.4 5.35 92.45 5.35 98.95 6.35 104.25 7.35 108.6 6.5 108.7 6.35 108.7 6.15 109.9 6.0 110.25 5.95 115.05 4.0 115.4 3.8 114.95 3.8 111.2 3.85 106.5 3.35 106.5 3.15 Q110.8 3.45 115.45 1.95 L115.35 1.8 116.15 1.75 118.7 0.7 124.25 -1.75 130.15 -4.35 Q127.75 -3.4 124.9 -3.2 L122.4 -3.1 118.15 -3.1 107.1 -3.6 100.05 -4.85 99.05 -5.1 96.85 -5.4 Q93.65 -6.0 88.8 -7.6 L88.65 -7.65 88.05 -7.85 85.35 -8.6 M100.0 -5.1 L100.05 -5.0 100.05 -5.1 100.0 -5.1" fill="#f7a809" fill-rule="evenodd" stroke="none"/>
  </g>
</svg>
