<?xml version="1.0" encoding="UTF-8" standalone="no"?>
<svg xmlns:xlink="http://www.w3.org/1999/xlink" height="19.3px" width="24.05px" xmlns="http://www.w3.org/2000/svg">
  <g transform="matrix(1.0, 0.0, 0.0, 1.0, 4.25, 19.6)">
    <path d="M19.8 -13.2 Q10.7 -8.85 1.7 -14.85 L0.05 -15.95 Q2.5 -9.5 -1.9 -4.0 -2.45 -3.3 -2.6 -2.2 L-2.7 -0.3 -3.8 -0.45 Q-5.35 -5.35 -1.3 -9.05 -0.5 -9.75 -0.65 -11.05 -1.1 -15.15 -2.15 -19.1 L-1.35 -19.2 Q-0.4 -20.3 1.25 -18.55 8.35 -11.35 18.55 -13.95 L19.8 -13.2" fill="#000000" fill-opacity="0.17254902" fill-rule="evenodd" stroke="none"/>
  </g>
</svg>
