<?xml version="1.0" encoding="UTF-8" standalone="no"?>
<svg xmlns:xlink="http://www.w3.org/1999/xlink" height="18.15px" width="35.25px" xmlns="http://www.w3.org/2000/svg">
  <g transform="matrix(1.0, 0.0, 0.0, 1.0, 18.25, 4.75)">
    <path d="M8.5 1.05 L8.4 1.1 8.45 1.05 8.5 1.05" fill="#d2b6b6" fill-rule="evenodd" stroke="none"/>
    <path d="M8.4 1.1 L8.25 1.25 8.1 1.1 8.4 1.1 8.1 1.1 8.45 1.05 8.4 1.1 M8.5 6.5 L9.75 6.3 9.6 6.3 8.5 6.5" fill="#c29c9c" fill-rule="evenodd" stroke="none"/>
    <path d="M5.0 3.7 L12.4 2.15 12.8 2.55 8.7 3.75 5.85 4.25 5.0 4.3 4.55 4.3 2.7 4.0 5.0 3.7" fill="#a38875" fill-rule="evenodd" stroke="none"/>
    <path d="M5.65 12.2 L4.3 12.3 2.95 12.1 2.95 11.9 2.85 10.0 2.85 9.4 2.7 6.7 2.65 4.85 2.6 4.0 2.7 4.0 2.6 4.0 2.65 4.85 Q1.95 6.25 1.8 7.1 L1.6 9.2 1.5 9.7 0.8 10.4 -0.55 10.8 -1.9 11.3 -2.7 12.05 -4.2 11.95 -4.25 11.05 -4.25 10.75 -4.55 6.6 -4.55 6.25 -4.8 1.6 -4.8 1.4 -4.8 1.15 -7.15 0.85 -9.6 0.5 Q-12.4 0.05 -13.95 -0.55 L-15.15 0.25 -14.8 2.85 -14.65 4.0 -14.4 4.35 -13.85 10.2 -14.9 9.85 -15.05 9.05 -15.15 8.3 -15.4 6.5 Q-15.35 5.2 -15.75 2.9 L-15.9 2.15 -16.4 -2.5 -16.4 -3.2 Q-14.3 -2.35 -11.6 -1.95 L-2.2 -1.2 4.7 -1.5 4.8 -0.05 2.4 0.25 3.35 1.2 3.4 1.25 3.85 2.0 4.95 1.8 5.0 1.8 8.1 1.1 8.25 1.25 6.75 1.85 4.95 2.25 5.0 3.7 2.7 4.0 4.55 4.3 5.0 4.3 5.85 4.25 5.05 4.7 Q4.8 4.8 4.8 5.35 L4.95 6.9 5.25 6.9 8.5 6.5 Q6.85 7.2 5.1 7.85 L5.2 8.85 5.2 9.5 Q5.1 10.45 5.4 11.45 L5.65 12.2 M-5.4 13.4 L-8.7 12.7 -8.65 12.15 -8.55 11.1 -8.25 8.15 -5.55 6.75 -5.55 8.6 -5.5 10.8 -5.45 11.85 -5.4 12.4 -5.4 13.4 M2.4 0.25 L-3.0 0.4 -2.85 2.2 -0.25 2.3 3.85 2.0 -0.25 2.3 -2.85 2.2 -3.0 0.4 2.4 0.25 M4.95 6.9 L2.7 6.7 4.95 6.9 M-7.5 1.75 L-7.0 1.85 -6.0 1.95 -5.4 5.45 -5.6 5.55 -10.0 8.3 Q-9.4 7.4 -8.9 5.95 L-8.25 3.9 -7.5 1.75" fill="#6b544d" fill-rule="evenodd" stroke="none"/>
    <path d="M2.95 11.9 L-2.7 12.05 -1.9 11.3 -0.55 10.8 0.8 10.4 1.5 9.7 1.6 9.2 1.8 7.1 Q1.95 6.25 2.65 4.85 L2.7 6.7 2.85 9.4 2.85 10.0 2.95 11.9 M-4.2 11.95 L-4.2 12.4 -5.4 13.4 -5.4 12.4 -5.45 11.85 -5.5 10.8 -5.55 8.6 -5.55 6.75 -5.6 5.9 -5.6 5.55 -5.4 5.45 -6.0 1.95 -4.8 1.6 -4.55 6.25 -4.55 6.6 -4.25 10.75 -4.25 11.05 -4.2 11.95 M-10.1 5.7 Q-9.8 5.75 -9.8 6.1 L-10.0 6.75 -10.5 7.0 Q-11.1 7.0 -11.1 6.4 -11.1 5.6 -10.5 5.7 L-10.1 5.7" fill="#57443e" fill-rule="evenodd" stroke="none"/>
    <path d="M15.35 8.35 L13.1 9.35 13.15 9.8 9.15 11.3 5.65 12.2 5.4 11.45 Q5.1 10.45 5.2 9.5 L5.2 8.85 5.1 7.85 Q6.85 7.2 8.5 6.5 L5.25 6.9 4.95 6.9 4.8 5.35 Q4.8 4.8 5.05 4.7 L5.85 4.25 8.7 3.75 12.8 2.55 12.4 2.15 5.0 3.7 4.95 2.25 6.75 1.85 8.25 1.25 8.4 1.1 8.5 1.05 10.4 0.6 10.4 0.55 10.2 -0.45 10.05 -1.25 4.8 -0.05 10.05 -1.25 10.2 -0.45 10.4 0.55 10.4 0.6 8.5 1.05 8.45 1.05 8.1 1.1 5.0 1.8 4.95 1.8 3.85 2.0 3.4 1.25 3.35 1.2 2.4 0.25 4.8 -0.05 4.7 -1.5 9.05 -2.35 11.8 -3.05 11.95 -2.25 Q12.3 -0.6 12.7 -0.4 14.0 0.4 14.2 1.8 L14.2 1.9 14.9 6.15 14.95 6.4 15.35 8.35 M-8.7 12.7 L-9.25 12.55 -12.5 11.6 -12.75 8.95 -12.8 8.3 Q-12.75 7.5 -13.4 6.85 L-13.65 6.6 -13.6 5.25 -13.6 5.2 -13.4 3.1 -13.4 2.9 -13.6 2.4 -8.25 1.65 -7.5 1.75 -8.25 3.9 -8.9 5.95 Q-9.4 7.4 -10.0 8.3 L-5.6 5.55 -5.6 5.9 -5.55 6.75 -8.25 8.15 -8.55 11.1 -8.65 12.15 -8.7 12.7 M-14.9 9.85 L-15.6 9.65 -16.15 8.05 -16.75 5.55 -16.8 3.55 -16.8 3.0 -17.05 -3.5 -16.4 -3.2 -16.4 -2.5 -15.9 2.15 -15.75 2.9 Q-15.35 5.2 -15.4 6.5 L-15.15 8.3 -15.05 9.05 -14.9 9.85 M13.1 9.35 L12.85 7.8 12.75 7.2 12.6 5.3 12.9 5.15 12.8 2.55 12.9 5.15 12.6 5.3 12.75 7.2 12.85 7.8 13.1 9.35 M9.75 6.3 L8.5 6.5 9.6 6.3 9.75 6.3 Q10.85 6.1 12.6 5.3 10.85 6.1 9.75 6.3 M-10.1 5.7 L-10.5 5.7 Q-11.1 5.6 -11.1 6.4 -11.1 7.0 -10.5 7.0 L-10.0 6.75 -9.8 6.1 Q-9.8 5.75 -10.1 5.7 M-10.55 8.65 L-13.6 5.25 -10.55 8.65" fill="#82655d" fill-rule="evenodd" stroke="none"/>
    <path d="M11.8 -3.05 Q15.05 -4.0 15.5 -4.75 L16.5 1.6 17.0 7.5 15.35 8.35 14.95 6.4 14.9 6.15 14.2 1.9 14.2 1.8 Q14.0 0.4 12.7 -0.4 12.3 -0.6 11.95 -2.25 L11.8 -3.05 M-12.5 11.6 L-13.7 11.2 -13.85 10.2 -14.4 4.35 -14.65 4.0 -14.8 2.85 -15.15 0.25 -13.95 -0.55 Q-12.4 0.05 -9.6 0.5 L-7.15 0.85 -4.8 1.15 -4.8 1.4 -4.8 1.6 -6.0 1.95 -7.0 1.85 -7.5 1.75 -8.25 1.65 -13.6 2.4 -13.4 2.9 -13.4 3.1 -13.6 5.2 -13.6 5.25 -14.4 4.35 -13.6 5.25 -13.65 6.6 -13.4 6.85 Q-12.75 7.5 -12.8 8.3 L-12.75 8.95 -12.5 11.6 M-16.75 5.55 L-17.15 3.35 -17.2 3.0 -18.25 -4.15 -17.05 -3.5 -16.8 3.0 -16.8 3.55 -16.75 5.55 M-8.25 1.65 L-10.8 1.3 -15.15 0.25 -10.8 1.3 -8.25 1.65" fill="#96756c" fill-rule="evenodd" stroke="none"/>
    <path d="M11.8 -3.05 Q15.05 -4.0 15.5 -4.75 L16.5 1.6 17.0 7.5 15.35 8.35 13.1 9.35 13.15 9.8 9.15 11.3 5.65 12.2 4.3 12.3 2.95 12.1 2.95 11.9 -2.7 12.05 -4.2 11.95 -4.2 12.4 -5.4 13.4 -8.7 12.7 -9.25 12.55 -12.5 11.6 -13.7 11.2 -13.85 10.2 -14.9 9.85 -15.6 9.65 -16.15 8.05 -16.75 5.55 -17.15 3.35 -17.2 3.0 -18.25 -4.15 -17.05 -3.5 -16.4 -3.2 Q-14.3 -2.35 -11.6 -1.95 L-2.2 -1.2 4.7 -1.5 9.05 -2.35 11.8 -3.05 M4.8 -0.05 L10.05 -1.25 10.2 -0.45 10.4 0.55 10.4 0.6 8.5 1.05 8.4 1.1 M5.0 3.7 L12.4 2.15 12.8 2.55 12.9 5.15 12.6 5.3 12.75 7.2 12.85 7.8 13.1 9.35 M8.1 1.1 L8.4 1.1 M8.45 1.05 L8.1 1.1 5.0 1.8 4.95 1.8 3.85 2.0 -0.25 2.3 -2.85 2.2 -3.0 0.4 2.4 0.25 4.8 -0.05 M12.8 2.55 L8.7 3.75 5.85 4.25 M4.95 6.9 L5.25 6.9 8.5 6.5 9.6 6.3 9.75 6.3 Q10.85 6.1 12.6 5.3 M5.0 3.7 L2.7 4.0 4.55 4.3 5.0 4.3 5.85 4.25 M2.7 4.0 L2.6 4.0 2.65 4.85 2.7 6.7 4.95 6.9 M2.95 11.9 L2.85 10.0 2.85 9.4 2.7 6.7 M-13.85 10.2 L-14.4 4.35 -14.65 4.0 -14.8 2.85 -15.15 0.25 -13.95 -0.55 Q-12.4 0.05 -9.6 0.5 L-7.15 0.85 -4.8 1.15 -4.8 1.4 -4.8 1.6 -4.55 6.25 -4.55 6.6 -4.25 10.75 -4.25 11.05 -4.2 11.95 M-6.0 1.95 L-7.0 1.85 -7.5 1.75 -8.25 1.65 M-10.0 8.3 L-5.6 5.55 -5.4 5.45 -6.0 1.95 -4.8 1.6 M-10.1 5.7 L-10.5 5.7 Q-11.1 5.6 -11.1 6.4 -11.1 7.0 -10.5 7.0 L-10.0 6.75 -9.8 6.1 Q-9.8 5.75 -10.1 5.7 M-5.6 5.55 L-5.6 5.9 -5.55 6.75 -5.55 8.6 -5.5 10.8 -5.45 11.85 -5.4 12.4 -5.4 13.4 M-13.6 5.25 L-10.55 8.65 M-13.6 5.25 L-14.4 4.35 M-15.15 0.25 L-10.8 1.3 -8.25 1.65" fill="none" stroke="#42362e" stroke-linecap="round" stroke-linejoin="round" stroke-opacity="0.6509804" stroke-width="0.05"/>
  </g>
</svg>
