<?xml version="1.0" encoding="UTF-8" standalone="no"?>
<svg xmlns:xlink="http://www.w3.org/1999/xlink" height="19.9px" width="13.05px" xmlns="http://www.w3.org/2000/svg">
  <g transform="matrix(1.0, 0.0, 0.0, 1.0, 0.0, 0.2)">
    <path d="M6.15 2.25 L9.0 0.0 8.75 0.3 Q9.55 -0.2 10.5 -0.2 11.65 -0.2 12.4 1.2 13.05 2.45 13.05 4.0 L13.0 4.35 Q13.0 5.95 11.85 7.4 10.75 8.75 9.65 8.75 L9.3 8.85 8.4 8.8 8.05 8.75 8.05 8.9 7.3 9.2 5.75 10.0 5.2 10.35 3.75 10.9 2.95 11.0 Q1.85 11.0 1.05 10.3 L0.6 9.8 0.8 8.8 1.15 7.7 Q1.4 6.65 3.15 5.0 L6.15 2.25" fill="#647862" fill-rule="evenodd" stroke="none"/>
    <path d="M0.1 12.45 L0.15 11.4 0.15 8.65 0.15 8.2 0.3 8.0 0.75 7.25 1.0 6.9 2.1 5.7 3.7 4.25 6.15 2.25 3.15 5.0 Q1.4 6.65 1.15 7.7 L0.8 8.8 0.6 9.8 0.35 10.95 Q0.15 11.75 0.1 12.45" fill="#c3ebc0" fill-rule="evenodd" stroke="none"/>
    <path d="M5.2 10.35 Q4.55 11.05 4.2 12.15 3.85 13.25 3.65 15.5 L3.8 16.75 3.75 17.25 3.1 18.45 2.4 19.1 Q1.9 19.5 1.25 19.7 L1.25 17.35 Q1.2 16.2 0.6 15.3 L0.0 14.0 0.1 12.45 Q0.15 11.75 0.35 10.95 L0.6 9.8 1.05 10.3 Q1.85 11.0 2.95 11.0 L3.75 10.9 5.2 10.35" fill="#4c5c4b" fill-rule="evenodd" stroke="none"/>
  </g>
</svg>
