<?xml version="1.0" encoding="UTF-8" standalone="no"?>
<svg xmlns:xlink="http://www.w3.org/1999/xlink" height="30.8px" width="29.75px" xmlns="http://www.w3.org/2000/svg">
  <g transform="matrix(1.0, 0.0, 0.0, 1.0, 2.5, 3.35)">
    <path d="M19.9 25.1 L19.8 25.15 19.5 23.8 19.5 23.75 19.5 23.55 Q19.5 23.35 19.65 23.25 L19.65 23.95 19.75 24.05 19.9 23.05 Q19.85 22.5 20.05 22.2 L20.25 22.45 20.3 22.9 20.25 23.05 Q20.2 22.7 20.0 22.85 L19.9 23.9 19.9 25.1 M1.75 23.55 L1.55 23.4 1.6 23.15 1.75 23.3 1.75 23.55 M-2.35 14.4 L-2.45 14.35 -2.4 14.2 -1.65 13.65 -1.0 13.2 -0.95 13.15 -0.9 13.3 -1.75 13.9 -2.35 14.4 M-2.45 10.55 L-2.45 10.25 Q-2.3 10.05 -1.8 10.0 L-0.35 10.1 -0.35 10.2 -1.45 10.35 Q-2.05 10.4 -2.35 10.6 L-2.45 10.55 M-2.25 8.4 L-2.2 8.25 -1.65 8.0 -0.9 7.65 -1.85 7.65 -1.9 7.5 -1.45 7.15 -0.75 7.2 -1.2 7.25 Q-0.55 7.45 -0.55 7.6 L-0.75 7.75 -1.7 8.2 -1.75 8.25 -1.7 8.25 -1.5 8.3 -1.2 8.2 Q-0.9 8.3 -0.9 8.5 -0.9 8.75 -1.55 8.95 L-1.1 8.5 -1.2 8.4 -1.55 8.5 -2.25 8.4 M9.1 -1.45 L9.05 -1.55 10.6 -2.95 10.85 -2.8 Q11.15 -2.8 11.5 -3.15 L11.7 -3.1 9.2 -1.5 9.1 -1.45 M10.7 -1.95 Q10.8 -1.95 10.95 -2.1 L11.25 -2.25 11.3 -2.2 Q11.05 -2.2 10.95 -2.05 L10.65 -1.8 10.5 -1.8 10.95 -2.35 10.7 -2.0 10.7 -1.95 M18.4 0.7 L18.55 0.5 18.6 0.55 18.45 0.8 18.2 0.9 Q17.9 0.9 17.9 0.4 L17.85 -0.25 17.9 -0.3 18.1 0.4 18.2 0.45 Q18.2 -0.25 18.45 -0.35 L18.35 0.65 18.35 0.7 18.4 0.7 M19.2 -0.15 L19.1 0.35 19.1 0.4 19.3 0.2 19.15 0.75 19.05 0.85 18.95 0.9 18.85 0.75 19.1 -0.25 18.95 -0.25 19.05 -0.4 19.15 -0.45 19.2 -0.15 M20.2 -0.45 L20.2 -0.15 20.1 0.05 20.2 0.0 20.0 0.45 20.0 0.25 20.2 -0.45 M19.55 -0.2 L19.8 -0.45 19.8 -0.4 19.7 0.1 19.25 0.65 19.45 0.0 19.55 -0.2 M20.3 0.3 L20.5 -0.15 20.6 -0.35 20.65 -0.4 21.05 -0.65 20.65 0.45 20.3 0.5 20.4 0.4 20.55 0.1 20.55 0.05 20.3 0.3 M21.65 -0.15 L21.2 0.3 21.35 -0.05 21.6 -0.15 21.65 -0.15 M22.15 0.6 L22.0 0.75 22.0 0.7 22.1 0.55 22.15 0.6 M21.95 1.45 L21.85 1.6 21.8 1.55 21.85 1.45 21.95 1.45 M21.75 0.6 L21.55 0.9 21.45 1.05 21.4 1.1 21.35 1.05 21.45 0.8 21.4 0.55 21.7 0.3 21.5 0.6 21.5 0.65 21.75 0.6 M22.3 1.65 L22.5 1.45 22.8 1.8 22.65 1.9 22.3 1.65 M20.9 3.2 L20.75 3.1 20.65 2.95 20.9 3.2 21.25 3.55 21.85 4.35 21.55 4.45 21.55 4.55 Q21.05 3.9 20.9 3.4 L20.8 3.15 20.9 3.2 M20.9 5.3 L20.7 5.25 20.8 5.6 20.75 5.8 19.75 4.55 20.0 4.55 20.3 4.75 20.9 5.3 M21.05 5.3 L20.6 4.85 20.65 4.85 19.85 3.95 19.85 3.7 19.95 3.65 20.55 4.05 21.25 5.2 21.05 5.3 M21.5 5.9 L21.75 6.2 21.9 6.5 22.05 6.8 22.35 7.3 22.45 7.55 22.3 7.7 21.65 6.85 21.25 6.4 21.25 6.35 21.4 6.2 21.25 5.95 21.5 5.9 M21.55 5.9 L21.65 5.95 21.8 6.2 21.75 6.15 21.55 5.9 M22.05 5.05 L21.85 4.85 21.9 4.8 22.05 5.05 M24.2 4.55 L24.45 4.3 25.0 4.35 24.55 4.65 24.2 4.55 M23.6 4.05 L24.05 4.2 23.95 4.4 23.9 4.35 23.5 4.1 23.6 4.05 M23.45 15.4 L22.75 16.45 22.75 16.4 22.6 16.35 23.4 15.25 23.45 15.4 M18.6 19.2 L18.05 19.8 17.9 19.8 17.85 19.65 19.1 18.45 Q19.5 17.55 20.1 17.3 L20.0 17.1 20.25 16.6 20.8 16.1 20.85 16.2 20.2 17.3 20.1 17.35 19.25 18.45 18.55 19.2 18.5 19.25 18.5 19.3 18.15 19.65 18.1 19.65 18.15 19.65 18.6 19.2 M20.75 17.1 L20.8 17.1 19.95 18.4 20.7 17.45 20.75 17.55 20.75 17.6 20.9 17.4 21.45 17.0 21.45 17.05 20.8 18.0 20.65 18.0 20.65 17.9 20.65 17.95 19.95 18.7 18.85 19.65 18.75 19.5 Q18.75 19.3 19.7 18.65 L19.65 18.55 19.7 18.25 19.85 17.95 20.25 17.55 20.4 17.45 20.75 17.1 M20.35 17.4 L20.4 17.2 Q20.5 17.0 20.7 17.05 L20.35 17.4 M21.15 18.1 L21.15 18.15 20.15 19.55 20.05 19.55 19.95 19.55 21.15 18.1 M23.4 16.95 L22.6 18.3 22.9 18.35 21.05 20.2 19.05 21.95 18.95 21.9 20.4 20.55 Q20.1 20.6 19.45 21.05 L18.75 21.55 Q18.5 21.7 18.2 21.95 L18.1 21.95 18.7 21.45 18.7 21.35 18.8 21.4 20.5 19.9 20.5 20.15 23.35 16.9 23.4 16.95 M20.45 20.75 L21.05 20.15 21.0 20.15 Q20.7 20.25 20.45 20.7 L20.45 20.75 M21.4 21.4 L21.5 21.8 21.4 21.9 21.2 21.6 21.4 21.4 M20.35 23.05 L20.35 23.1 20.3 23.25 20.25 23.7 20.25 23.2 20.35 23.1 20.35 23.05 M20.7 22.8 L20.6 22.85 20.6 22.7 20.7 22.8 M21.0 22.75 L21.05 23.7 20.8 22.65 20.95 22.55 21.0 22.75 M21.2 23.7 L21.15 23.7 21.15 23.55 21.2 23.15 21.2 23.7 M20.55 23.85 L20.55 23.4 20.6 23.2 20.65 23.25 20.5 24.65 20.5 24.8 20.35 24.4 20.45 23.85 20.5 24.2 20.55 23.85 M19.65 0.65 L19.6 0.7 19.65 0.65 M19.65 4.85 L19.65 4.6 21.5 7.0 19.4 4.95 Q18.9 4.85 19.65 4.85 M13.45 8.25 L10.15 11.25 10.15 11.2 10.6 10.7 11.95 9.4 13.25 8.35 13.45 8.25 M13.45 9.25 L13.0 9.6 13.0 9.55 14.0 8.6 13.75 8.85 13.45 9.25 M14.05 8.3 L10.6 11.6 10.7 11.45 10.7 11.35 10.3 11.6 12.15 9.85 14.0 8.2 14.05 8.3 M11.15 7.1 L11.0 8.05 11.3 8.1 Q10.9 8.4 10.8 8.85 L10.55 9.6 10.8 9.8 10.8 9.95 10.5 9.95 10.35 9.6 Q10.35 9.15 10.6 8.9 L9.85 9.55 10.05 9.95 10.05 10.0 9.95 10.1 9.6 9.8 9.45 10.0 9.45 9.9 9.65 9.35 9.65 9.4 10.35 8.65 9.9 8.65 9.95 8.45 Q10.55 8.4 10.65 7.8 10.8 7.0 11.1 6.8 L11.15 7.1 M11.0 6.95 L10.75 7.45 10.75 8.1 11.0 7.5 11.0 6.95 M10.95 11.55 L11.2 11.4 10.95 11.6 10.95 11.55 M12.65 11.6 L12.45 11.75 12.3 11.75 12.65 11.4 12.65 11.6 M11.45 12.15 L11.4 12.0 11.75 11.65 13.5 10.15 11.75 11.95 11.45 12.15 M13.75 12.35 L14.5 11.8 13.6 12.5 13.75 12.35 M14.95 10.9 L15.0 11.0 14.95 11.15 14.45 11.5 14.95 10.9 M13.1 12.0 L13.85 11.25 15.1 10.2 13.4 11.95 12.5 12.9 12.4 12.9 12.35 12.75 13.1 12.0 M9.95 1.45 L9.85 1.8 9.3 2.35 Q8.85 2.45 7.95 3.3 L8.5 2.65 8.45 2.55 8.3 2.5 Q9.8 1.05 10.2 1.1 L9.95 1.4 9.95 1.45 M9.0 1.35 L8.25 2.35 7.75 3.0 6.55 4.3 6.6 3.7 8.95 1.25 9.0 1.35 M8.55 0.8 L6.75 2.75 6.75 2.45 8.4 0.8 8.55 0.8 M6.55 1.8 L5.5 2.75 5.35 2.75 6.6 1.7 6.55 1.8 M6.75 1.55 L7.0 1.3 8.75 0.0 6.8 1.6 6.75 1.55 M6.9 5.4 L6.85 5.55 6.3 6.05 6.3 6.0 6.35 5.95 6.9 5.4 M6.3 5.9 L6.35 5.65 6.4 5.6 6.85 5.15 6.9 5.3 6.85 5.35 6.3 5.9 M6.1 5.85 L6.1 6.15 5.95 6.3 5.75 6.2 6.1 5.85 M5.35 5.6 L5.3 5.35 6.35 4.0 6.25 4.6 5.5 5.4 5.35 5.6 M5.1 4.6 L4.95 4.5 6.45 2.75 6.45 3.1 5.1 4.6 M1.85 7.6 L1.25 8.5 1.3 8.55 1.25 8.55 0.75 9.25 0.6 9.0 0.7 8.7 0.7 8.65 0.5 8.75 0.35 8.65 1.1 7.9 1.8 7.45 1.85 7.6 M2.1 7.85 L1.0 9.5 0.8 9.8 0.7 9.6 0.8 9.45 0.85 9.4 0.95 9.3 0.95 9.25 2.05 7.85 2.1 7.85 M2.1 8.7 L2.3 8.5 2.4 8.45 2.45 8.55 1.9 9.3 1.8 9.45 1.55 9.55 1.05 9.85 1.95 8.6 1.9 8.55 1.55 8.9 2.2 7.95 2.2 8.0 1.95 8.45 2.45 8.15 2.05 8.65 2.05 8.7 2.1 8.7 M1.9 8.85 L1.45 9.4 1.45 9.45 2.0 8.85 1.9 8.85 M1.9 10.85 L1.9 10.95 1.4 11.75 1.25 11.7 1.05 11.95 0.9 11.9 2.0 10.5 2.05 10.45 2.5 9.8 2.5 9.85 1.95 10.8 1.9 10.75 1.85 10.75 1.9 10.85 M1.1 9.65 L1.05 9.6 1.3 9.35 1.1 9.65 M1.0 10.0 L1.6 9.65 1.1 10.4 0.8 10.25 0.75 10.2 0.9 10.05 1.0 10.0 M0.15 10.35 L0.15 10.85 0.05 11.1 0.0 10.55 0.15 10.35 M1.15 10.45 L1.2 10.45 1.0 10.8 Q0.9 10.45 1.15 10.45 M0.2 11.0 L0.2 11.1 0.25 10.9 0.3 10.85 Q0.35 10.75 0.5 10.75 L0.9 10.9 0.5 11.45 0.2 11.1 0.25 11.75 0.15 11.9 0.1 11.95 0.05 11.2 0.2 11.0 M1.1 12.0 L1.3 11.9 0.65 12.95 0.55 12.8 0.5 12.6 0.6 12.25 Q0.75 12.15 1.05 12.0 L1.1 12.0 M2.25 10.9 L2.3 10.85 2.6 10.3 3.25 9.85 2.75 10.7 2.7 10.65 2.25 10.9 M2.05 12.2 L2.2 12.25 Q3.15 10.75 3.65 10.3 L3.8 10.45 3.1 11.35 2.8 11.7 2.4 12.2 2.25 12.4 2.05 12.25 2.05 12.2 M8.65 8.7 L8.5 8.95 8.05 8.4 8.35 8.1 8.35 8.05 Q8.5 8.1 8.65 8.25 L8.85 8.35 8.7 8.65 8.35 8.4 8.65 8.7 M8.3 8.05 L8.05 8.35 8.0 8.2 Q8.0 8.05 8.25 8.05 L8.3 8.05 M9.05 8.8 L9.3 9.1 9.4 9.15 9.4 9.1 9.15 8.8 9.1 8.75 9.2 8.6 9.5 9.0 9.55 9.05 9.35 9.6 8.8 9.15 9.05 8.8 M9.2 8.55 L9.3 8.45 9.75 8.45 9.7 8.6 9.2 8.55 M9.0 10.6 L8.75 10.35 9.35 9.7 9.05 10.55 9.0 10.6 M10.1 11.55 L10.05 11.6 10.1 11.55 M1.65 12.5 L1.15 13.1 1.3 12.85 1.6 12.4 1.65 12.5 M1.05 15.25 L0.65 15.65 0.65 15.55 0.75 15.3 0.75 14.9 0.65 15.0 0.8 14.6 Q1.1 14.65 1.05 15.05 L1.05 15.25 M0.25 14.8 L0.55 14.65 0.3 15.3 -0.25 15.7 -0.4 15.65 0.25 14.8 M0.75 15.8 L1.05 15.55 1.0 15.9 0.75 15.8 M1.95 21.95 L1.8 21.55 1.9 21.5 2.05 22.05 2.0 22.0 1.95 21.95 M2.05 22.1 L2.05 22.65 2.1 22.65 2.15 22.55 2.15 22.2 2.45 22.5 2.45 22.65 2.5 22.55 2.8 22.8 2.7 23.0 2.7 23.05 2.8 22.85 2.85 22.9 2.8 23.05 2.8 23.15 2.6 23.05 2.6 22.85 2.5 23.0 2.15 22.8 2.15 22.65 2.1 22.8 2.0 22.75 2.0 22.45 1.95 22.05 2.05 22.1 M1.9 22.0 L1.85 22.65 1.55 22.5 1.65 22.35 1.7 22.35 1.9 22.0 M1.55 21.4 L1.6 21.7 1.6 21.75 1.5 22.35 1.5 22.45 1.35 22.35 1.35 22.15 1.5 21.4 1.55 21.4 M2.35 21.85 L2.4 21.8 2.45 22.3 2.2 22.15 2.15 22.1 2.15 21.95 2.15 21.75 2.3 21.75 2.35 21.85 M1.6 21.75 L1.55 21.7 1.6 21.75 M1.6 22.75 L1.55 22.85 1.5 22.85 1.4 22.75 1.4 22.6 1.65 22.75 1.6 22.75 M1.8 23.1 L1.6 22.95 1.65 22.75 1.8 22.85 1.8 22.9 1.8 23.1 M2.25 23.75 L2.4 23.85 2.4 23.95 2.3 23.95 2.25 23.75 M2.2 23.05 L2.45 23.2 2.45 23.6 2.2 23.4 2.2 23.05 M2.0 22.95 L2.05 22.95 2.05 23.15 2.0 23.15 2.0 22.95 M3.95 23.2 L3.9 23.6 3.8 23.5 3.85 23.2 3.95 23.2 M3.05 22.15 L3.25 22.95 2.9 22.65 2.9 22.6 3.0 22.2 3.05 22.15 M2.8 22.0 L2.8 22.6 2.6 22.4 2.6 22.1 2.65 22.0 2.8 22.0 M3.1 23.1 L3.25 23.25 3.25 23.4 2.95 23.25 3.0 23.0 3.05 23.05 3.05 23.25 3.1 23.1 M3.0 24.0 L2.9 23.95 2.95 23.45 3.25 23.65 3.2 24.2 3.05 24.05 3.05 24.0 3.05 23.85 3.0 24.0 M2.6 23.4 L2.6 23.3 2.75 23.35 2.7 23.4 2.6 23.4 M3.15 24.65 L2.95 24.5 2.95 24.4 3.0 24.35 3.2 24.5 3.15 24.65 M3.75 24.6 L3.6 24.5 3.7 23.9 3.85 24.0 3.75 24.6 M4.7 24.05 L4.75 24.1 4.75 25.6 4.5 25.35 4.5 25.05 4.65 24.05 4.7 24.05 M8.4 20.65 L9.15 19.9 9.3 20.05 9.1 20.5 8.95 20.45 9.05 20.55 8.75 20.95 9.1 20.6 9.15 20.6 9.7 21.05 9.3 21.4 9.0 21.15 9.05 21.1 9.05 21.05 8.95 21.1 8.75 20.95 8.4 20.65 M9.15 20.55 L10.3 19.85 10.35 19.95 10.15 20.3 10.1 20.4 10.2 20.35 10.65 20.0 10.7 20.25 10.65 20.2 9.8 20.95 9.15 20.55 M9.25 21.45 L8.95 21.75 8.8 21.7 8.75 21.6 8.95 21.2 9.25 21.45 M8.9 21.15 Q8.7 21.25 8.65 21.45 L8.3 21.55 8.15 21.5 8.1 21.4 8.2 21.15 8.4 20.85 8.2 21.0 8.1 20.95 8.35 20.7 8.7 20.95 8.9 21.15 M10.0 21.25 L10.2 21.45 10.1 21.55 9.85 21.85 9.65 21.65 10.0 21.25 M7.1 22.35 L7.9 22.95 7.75 23.05 7.2 22.8 6.35 22.05 7.1 22.35 M7.2 22.9 L7.55 23.15 7.55 23.35 Q6.45 22.7 5.8 22.4 L5.9 22.25 6.7 22.6 7.2 22.9 M9.6 21.7 L9.85 21.9 9.7 22.05 9.55 22.05 9.55 21.75 9.6 21.7 M10.15 22.15 L10.5 21.65 10.75 21.9 10.85 21.95 10.5 22.4 10.45 22.45 10.3 22.5 10.1 22.4 10.1 22.3 10.15 22.15 10.5 22.4 10.15 22.15 M19.9 16.7 L19.95 16.8 Q19.95 17.15 18.2 18.6 L18.05 18.65 18.0 18.5 Q18.0 18.25 18.95 17.55 L19.3 17.0 Q19.55 16.65 19.9 16.7 M19.95 18.4 L19.85 18.5 19.95 18.4 M13.5 13.7 Q14.8 12.05 15.7 11.65 L13.55 13.75 13.5 13.7 M12.8 19.65 L11.8 20.9 11.7 20.45 12.15 19.9 Q12.55 19.4 12.95 19.35 12.8 19.45 12.8 19.65 M13.35 19.55 L13.65 19.3 11.95 21.45 11.85 21.05 13.35 19.5 13.35 19.55 M12.0 19.7 L11.55 20.15 11.5 20.05 11.55 20.0 12.0 19.7 M11.5 19.95 L11.45 19.85 11.45 19.8 11.6 19.8 11.5 19.95 M11.2 20.2 L11.05 20.4 11.0 20.25 11.15 20.1 11.25 20.2 11.2 20.2 M11.25 20.25 L11.35 20.4 11.15 20.6 11.1 20.45 11.25 20.25 M10.85 20.7 L10.9 20.9 10.7 21.1 10.6 21.0 10.85 20.7 M10.65 21.2 L10.45 21.5 10.35 21.4 10.55 21.05 10.65 21.2 M10.25 21.35 L10.05 21.2 10.4 20.85 10.75 20.45 10.85 20.65 10.8 20.7 10.55 20.95 10.4 20.85 10.5 21.0 10.25 21.35 M10.25 21.65 L10.15 21.6 10.25 21.5 10.4 21.6 10.35 21.6 10.25 21.65 M10.7 21.4 L10.8 21.35 11.05 21.7 10.95 21.8 10.9 21.8 10.85 21.8 10.55 21.6 10.7 21.4 M11.4 21.35 L11.25 20.9 11.45 20.7 11.5 20.7 11.65 21.1 11.4 21.35 M11.0 21.15 L11.1 21.45 11.05 21.45 10.85 21.25 11.0 21.15 M11.7 21.25 L11.75 21.7 11.7 21.8 11.6 21.75 11.45 21.5 11.7 21.25 M10.85 22.4 L10.7 22.55 10.85 22.4 M19.85 19.4 L19.9 19.35 19.85 19.45 19.85 19.4 M19.3 21.2 Q19.1 21.25 18.95 21.4 L19.15 21.3 19.3 21.2 M19.6 22.4 L19.55 22.4 19.6 22.35 19.6 22.4 M18.55 24.75 L18.5 24.8 18.45 24.5 18.55 22.9 18.6 22.9 18.7 23.15 18.8 24.25 18.8 24.3 18.85 24.3 18.9 24.25 18.9 24.45 18.9 24.55 18.8 24.6 18.6 25.55 18.55 25.35 18.65 24.8 18.65 24.7 18.55 24.7 18.55 24.75 M18.7 24.4 L18.65 23.2 18.55 24.55 18.7 24.4 M19.15 24.45 L19.15 24.15 19.25 24.35 19.25 24.45 19.15 24.45 M19.45 23.8 L19.5 24.1 19.4 25.05 19.45 23.8 M3.7 25.0 L3.6 24.9 3.55 24.8 3.7 24.9 3.7 25.0 M-2.35 9.35 L-2.15 9.2 -2.2 9.3 -2.05 9.35 -2.35 9.35 M-2.05 13.35 L-2.25 13.55 -2.35 13.25 -2.2 13.1 -2.05 13.35 M-0.65 13.1 L-0.7 13.15 -0.7 13.1 -0.65 13.1 M-1.75 15.0 L-1.95 14.95 -1.7 14.7 -0.9 13.95 -0.8 13.9 -1.5 14.65 -1.75 15.0 M-0.6 14.75 L-0.2 14.5 -0.15 14.5 -0.55 15.15 -1.05 15.4 -1.2 15.35 -1.25 15.25 -0.9 14.7 -0.4 14.2 Q-0.45 14.55 -0.65 14.7 L-0.7 14.8 -0.6 14.75" fill="#542c22" fill-opacity="0.48235294" fill-rule="evenodd" stroke="none"/>
    <path d="M3.65 25.0 L3.55 24.95 3.6 24.9 3.7 25.0 3.65 25.0 M3.15 24.65 L2.9 24.5 2.95 24.5 3.15 24.65 M-2.45 14.4 L-2.35 14.4 -2.45 14.4 M18.55 19.2 L18.6 19.2 18.5 19.25 18.55 19.2 M19.5 23.75 L19.5 23.8 19.45 23.8 19.5 23.75 M2.05 22.05 L2.05 22.1 1.95 22.05 2.0 22.0 2.05 22.05 M9.3 21.4 L9.25 21.45 8.95 21.2 9.0 21.15 9.3 21.4 M8.35 20.7 L8.4 20.65 8.75 20.95 8.7 20.95 8.35 20.7 M10.7 21.1 L10.65 21.2 10.55 21.05 10.6 21.0 10.7 21.1" fill="url(#gradient0)" fill-rule="evenodd" stroke="none"/>
    <path d="M-1.9 7.5 L-2.0 7.5 Q-1.5 5.6 -0.4 3.85 L3.1 3.0 3.6 -0.4 Q6.1 -2.2 9.35 -2.95 L11.5 -3.25 15.55 -3.15 17.45 -0.25 21.05 -1.0 21.2 -0.9 21.3 -0.85 21.45 -0.75 Q23.9 1.25 25.85 4.25 L26.25 5.1 26.35 5.45 26.85 6.95 26.9 7.25 27.0 7.6 27.05 7.9 27.2 8.75 27.2 8.8 27.2 10.35 27.25 10.75 27.2 11.75 25.9 13.2 26.6 14.35 26.6 17.35 24.85 20.6 24.75 20.7 Q23.0 23.25 20.6 24.9 L20.0 25.25 19.9 25.1 19.9 23.9 20.0 22.85 Q20.2 22.7 20.25 23.05 L20.3 22.9 20.25 22.45 20.05 22.2 Q19.85 22.5 19.9 23.05 L19.75 24.05 19.65 23.95 19.65 23.25 Q19.5 23.35 19.5 23.55 L19.5 23.75 19.45 23.8 19.5 23.8 19.8 25.15 19.9 25.3 18.9 25.85 18.35 26.1 14.95 24.8 12.45 27.45 8.1 26.95 7.7 26.85 Q6.2 26.4 4.75 25.65 L4.25 25.35 3.65 25.0 3.7 25.0 3.7 24.9 3.55 24.8 3.6 24.9 3.55 24.95 3.15 24.65 3.2 24.5 3.0 24.35 2.95 24.4 2.95 24.5 2.9 24.5 2.25 24.0 1.75 23.55 1.75 23.3 1.6 23.15 1.55 23.4 1.25 23.1 1.25 20.1 1.3 19.55 -1.6 18.35 -1.7 18.3 -2.15 16.85 -2.45 14.4 -2.35 14.4 -1.75 13.9 -0.9 13.3 -0.95 13.15 -1.0 13.2 -1.65 13.65 -2.4 14.2 -2.45 14.2 -2.45 13.25 -2.4 12.4 -2.4 12.35 -2.45 11.65 -2.45 10.55 -2.35 10.6 Q-2.05 10.4 -1.45 10.35 L-0.35 10.2 -0.35 10.1 -1.8 10.0 Q-2.3 10.05 -2.45 10.25 L-2.4 9.35 -2.25 8.4 -1.55 8.5 -1.2 8.4 -1.1 8.5 -1.55 8.95 Q-0.9 8.75 -0.9 8.5 -0.9 8.3 -1.2 8.2 L-1.5 8.3 -1.7 8.25 -1.7 8.2 -0.75 7.75 -0.55 7.6 Q-0.55 7.45 -1.2 7.25 L-0.75 7.2 -1.45 7.15 -1.9 7.5 M18.35 0.65 L18.45 -0.35 Q18.2 -0.25 18.2 0.45 L18.1 0.4 17.9 -0.3 17.85 -0.25 17.9 0.4 Q17.9 0.9 18.2 0.9 L18.45 0.8 18.6 0.55 18.55 0.5 18.4 0.7 18.35 0.65 M10.7 -1.95 L10.7 -2.0 10.95 -2.35 10.5 -1.8 10.65 -1.8 10.95 -2.05 Q11.05 -2.2 11.3 -2.2 L11.25 -2.25 10.95 -2.1 Q10.8 -1.95 10.7 -1.95 M9.1 -1.45 L9.2 -1.5 11.7 -3.1 11.5 -3.15 Q11.15 -2.8 10.85 -2.8 L10.6 -2.95 9.05 -1.55 9.1 -1.45 M20.2 -0.45 L20.0 0.25 20.0 0.45 20.2 0.0 20.1 0.05 20.2 -0.15 20.2 -0.45 M19.2 -0.15 L19.15 -0.45 19.05 -0.4 18.95 -0.25 19.1 -0.25 18.85 0.75 18.95 0.9 19.05 0.85 19.15 0.75 19.3 0.2 19.1 0.4 19.1 0.35 19.2 -0.15 M19.55 -0.2 L19.45 0.0 19.25 0.65 19.7 0.1 19.8 -0.4 19.8 -0.45 19.55 -0.2 M20.4 0.4 L20.3 0.5 20.65 0.45 21.05 -0.65 20.65 -0.4 20.6 -0.35 20.5 -0.15 20.3 0.3 20.4 0.4 M21.65 -0.15 L21.6 -0.15 21.35 -0.05 21.2 0.3 21.65 -0.15 M22.15 0.6 L22.1 0.55 22.0 0.7 22.0 0.75 22.15 0.6 M21.95 1.45 L21.85 1.45 21.8 1.55 21.85 1.6 21.95 1.45 M21.75 0.6 L21.5 0.65 21.5 0.6 21.7 0.3 21.4 0.55 21.45 0.8 21.35 1.05 21.4 1.1 21.45 1.05 21.55 0.9 21.75 0.6 M22.3 1.65 L22.65 1.9 22.8 1.8 22.5 1.45 22.3 1.65 M21.85 4.35 L21.25 3.55 20.9 3.2 20.8 3.15 20.9 3.4 Q21.05 3.9 21.55 4.55 L21.55 4.45 21.85 4.35 M20.9 3.2 L20.65 2.95 20.75 3.1 20.9 3.2 M22.05 5.05 L21.9 4.8 21.85 4.85 22.05 5.05 M21.55 5.9 L21.75 6.15 21.8 6.2 21.65 5.95 21.55 5.9 M21.5 5.9 L21.25 5.95 21.4 6.2 21.25 6.35 21.25 6.4 21.65 6.85 22.3 7.7 22.45 7.55 22.35 7.3 22.05 6.8 21.9 6.5 21.75 6.2 21.5 5.9 M21.05 5.3 L21.25 5.2 20.55 4.05 19.95 3.65 19.85 3.7 19.85 3.95 20.65 4.85 20.6 4.85 21.05 5.3 M20.9 5.3 L20.3 4.75 20.0 4.55 19.75 4.55 20.75 5.8 20.8 5.6 20.7 5.25 20.9 5.3 M24.2 4.55 L24.55 4.65 25.0 4.35 24.45 4.3 24.2 4.55 M18.55 19.2 L19.25 18.45 20.1 17.35 20.2 17.3 20.85 16.2 20.8 16.1 20.25 16.6 20.0 17.1 20.1 17.3 Q19.5 17.55 19.1 18.45 L17.85 19.65 17.9 19.8 18.05 19.8 18.6 19.2 18.55 19.2 M23.45 15.4 L23.4 15.25 22.6 16.35 22.75 16.4 22.75 16.45 23.45 15.4 M23.6 4.05 L23.5 4.1 23.9 4.35 23.95 4.4 24.05 4.2 23.6 4.05 M20.65 18.0 L20.8 18.0 21.45 17.05 21.45 17.0 20.9 17.4 20.75 17.6 20.75 17.55 20.7 17.45 19.95 18.4 20.8 17.1 20.75 17.1 20.7 17.05 Q20.5 17.0 20.4 17.2 L20.35 17.4 20.4 17.45 20.25 17.55 19.85 17.95 19.7 18.25 19.65 18.55 19.7 18.65 Q18.75 19.3 18.75 19.5 L18.85 19.65 19.95 18.7 20.65 17.95 20.65 18.0 M21.15 18.1 L19.95 19.55 20.05 19.55 20.15 19.55 21.15 18.15 21.15 18.1 M23.4 16.95 L23.35 16.9 20.5 20.15 20.5 19.9 18.8 21.4 18.7 21.35 18.7 21.45 18.1 21.95 18.2 21.95 Q18.5 21.7 18.75 21.55 L19.45 21.05 Q20.1 20.6 20.4 20.55 L18.95 21.9 19.05 21.95 21.05 20.2 22.9 18.35 22.6 18.3 23.4 16.95 M21.4 21.4 L21.2 21.6 21.4 21.9 21.5 21.8 21.4 21.4 M21.0 22.75 L20.95 22.55 20.8 22.65 21.05 23.7 21.0 22.75 M20.7 22.8 L20.6 22.7 20.6 22.85 20.7 22.8 M20.35 23.05 L20.35 23.1 20.25 23.2 20.25 23.7 20.3 23.25 20.35 23.1 20.35 23.05 M21.2 23.7 L21.2 23.15 21.15 23.55 21.15 23.7 21.2 23.7 M20.55 23.85 L20.45 23.85 20.35 24.4 20.5 24.8 20.5 24.65 20.65 23.25 20.6 23.2 20.55 23.4 20.55 23.85 M19.65 0.65 L19.6 0.7 19.65 0.65 M11.15 7.1 L11.1 6.8 Q10.8 7.0 10.65 7.8 10.55 8.4 9.95 8.45 L9.9 8.65 10.35 8.65 9.65 9.4 9.65 9.35 9.45 9.9 9.45 10.0 9.6 9.8 9.95 10.1 10.05 10.0 10.05 9.95 9.85 9.55 10.6 8.9 Q10.35 9.15 10.35 9.6 L10.5 9.95 10.8 9.95 10.8 9.8 10.55 9.6 10.8 8.85 Q10.9 8.4 11.3 8.1 L11.0 8.05 11.15 7.1 M14.05 8.3 L14.0 8.2 12.15 9.85 10.3 11.6 10.7 11.35 10.7 11.45 10.6 11.6 14.05 8.3 M13.45 9.25 L13.75 8.85 14.0 8.6 13.0 9.55 13.0 9.6 13.45 9.25 M13.45 8.25 L13.25 8.35 11.95 9.4 10.6 10.7 10.15 11.2 10.15 11.25 13.45 8.25 M19.65 4.85 Q18.9 4.85 19.4 4.95 L21.5 7.0 19.65 4.6 19.65 4.85 M10.95 11.55 L10.95 11.6 11.2 11.4 10.95 11.55 M11.45 12.15 L11.75 11.95 13.5 10.15 11.75 11.65 11.4 12.0 11.45 12.15 M12.65 11.6 L12.65 11.4 12.3 11.75 12.45 11.75 12.65 11.6 M13.1 12.0 L12.35 12.75 12.4 12.9 12.5 12.9 13.4 11.95 15.1 10.2 13.85 11.25 13.1 12.0 M14.95 10.9 L14.45 11.5 14.95 11.15 15.0 11.0 14.95 10.9 M13.75 12.35 L13.6 12.5 14.5 11.8 13.75 12.35 M8.55 0.8 L8.4 0.8 6.75 2.45 6.75 2.75 8.55 0.8 M9.0 1.35 L8.95 1.25 6.6 3.7 6.55 4.3 7.75 3.0 8.25 2.35 9.0 1.35 M9.95 1.45 L9.95 1.4 10.2 1.1 Q9.8 1.05 8.3 2.5 L8.45 2.55 8.5 2.65 7.95 3.3 Q8.85 2.45 9.3 2.35 L9.85 1.8 9.95 1.45 M6.55 1.8 L6.6 1.7 5.35 2.75 5.5 2.75 6.55 1.8 M6.35 5.95 L6.3 6.0 6.3 6.05 6.85 5.55 6.9 5.4 6.85 5.35 6.9 5.3 6.85 5.15 6.4 5.6 6.35 5.65 6.3 5.9 6.35 5.95 M6.75 1.55 L6.8 1.6 8.75 0.0 7.0 1.3 6.75 1.55 M5.35 5.6 L5.5 5.4 6.25 4.6 6.35 4.0 5.3 5.35 5.35 5.6 M6.1 5.85 L5.75 6.2 5.95 6.3 6.1 6.15 6.1 5.85 M2.05 8.65 L2.45 8.15 1.95 8.45 2.2 8.0 2.2 7.95 1.55 8.9 1.9 8.55 1.95 8.6 1.05 9.85 1.55 9.55 1.8 9.45 1.9 9.3 2.45 8.55 2.4 8.45 2.3 8.5 2.1 8.7 2.05 8.65 M2.1 7.85 L2.05 7.85 0.95 9.25 0.95 9.3 0.85 9.4 0.8 9.45 0.7 9.6 0.8 9.8 1.0 9.5 2.1 7.85 M1.85 7.6 L1.8 7.45 1.1 7.9 0.35 8.65 0.5 8.75 0.7 8.65 0.7 8.7 0.6 9.0 0.75 9.25 1.25 8.55 1.3 8.55 1.25 8.5 1.85 7.6 M5.1 4.6 L6.45 3.1 6.45 2.75 4.95 4.5 5.1 4.6 M1.95 10.8 L2.5 9.85 2.5 9.8 2.05 10.45 2.0 10.5 0.9 11.9 1.05 11.95 1.25 11.7 1.4 11.75 1.9 10.95 1.9 10.85 1.95 10.8 M1.1 9.65 L1.3 9.35 1.05 9.6 1.1 9.65 M0.15 10.35 L0.0 10.55 0.05 11.1 0.15 10.85 0.15 10.35 M1.0 10.0 L0.9 10.05 0.75 10.2 0.8 10.25 1.1 10.4 1.6 9.65 1.0 10.0 M1.15 10.45 Q0.9 10.45 1.0 10.8 L1.2 10.45 1.15 10.45 M1.1 12.0 L1.05 12.0 Q0.75 12.15 0.6 12.25 L0.5 12.6 0.55 12.8 0.65 12.95 1.3 11.9 1.1 12.0 M0.2 11.0 L0.05 11.2 0.1 11.95 0.15 11.9 0.25 11.75 0.2 11.1 0.5 11.45 0.9 10.9 0.5 10.75 Q0.35 10.75 0.3 10.85 L0.25 10.9 0.2 11.1 0.2 11.0 M2.25 10.9 L2.7 10.65 2.75 10.7 3.25 9.85 2.6 10.3 2.3 10.85 2.25 10.9 M2.05 12.2 L2.05 12.25 2.25 12.4 2.4 12.2 2.8 11.7 3.1 11.35 3.8 10.45 3.65 10.3 Q3.15 10.75 2.2 12.25 L2.05 12.2 M8.7 8.65 L8.85 8.35 8.65 8.25 Q8.5 8.1 8.35 8.05 L8.35 8.1 8.05 8.4 8.5 8.95 8.65 8.7 8.7 8.65 M8.3 8.05 L8.25 8.05 Q8.0 8.05 8.0 8.2 L8.05 8.35 8.3 8.05 M9.05 8.8 L8.8 9.15 9.35 9.6 9.55 9.05 9.5 9.0 9.2 8.6 9.1 8.75 9.05 8.8 M9.2 8.55 L9.7 8.6 9.75 8.45 9.3 8.45 9.2 8.55 M9.0 10.6 L9.05 10.55 9.35 9.7 8.75 10.35 9.0 10.6 M10.1 11.55 L10.05 11.6 10.1 11.55 M1.05 15.25 L1.05 15.05 Q1.1 14.65 0.8 14.6 L0.65 15.0 0.75 14.9 0.75 15.3 0.65 15.55 0.65 15.65 1.05 15.25 M1.65 12.5 L1.6 12.4 1.3 12.85 1.15 13.1 1.65 12.5 M0.25 14.8 L-0.4 15.65 -0.25 15.7 0.3 15.3 0.55 14.65 0.25 14.8 M2.05 22.05 L1.9 21.5 1.8 21.55 1.95 21.95 1.9 22.0 1.95 22.05 2.0 22.45 2.0 22.75 2.1 22.8 2.15 22.65 2.15 22.8 2.5 23.0 2.6 22.85 2.6 23.05 2.8 23.15 2.8 23.05 2.85 22.9 2.8 22.85 2.8 22.8 2.5 22.55 2.45 22.5 2.15 22.2 2.15 22.55 2.1 22.65 2.05 22.65 2.05 22.1 2.05 22.05 M0.75 15.8 L1.0 15.9 1.05 15.55 0.75 15.8 M1.9 22.0 L1.7 22.35 1.65 22.35 1.55 22.5 1.85 22.65 1.9 22.0 M2.35 21.85 L2.3 21.75 2.15 21.75 2.15 21.95 2.15 22.1 2.2 22.15 2.45 22.3 2.4 21.8 2.35 21.85 M1.55 21.4 L1.5 21.4 1.35 22.15 1.35 22.35 1.5 22.45 1.5 22.35 1.6 21.75 1.6 21.7 1.55 21.4 M1.6 22.75 L1.65 22.75 1.4 22.6 1.4 22.75 1.5 22.85 1.55 22.85 1.6 22.75 M1.8 23.1 L1.8 22.9 1.8 22.85 1.65 22.75 1.6 22.95 1.8 23.1 M2.0 22.95 L2.0 23.15 2.05 23.15 2.05 22.95 2.0 22.95 M2.2 23.05 L2.2 23.4 2.45 23.6 2.45 23.2 2.2 23.05 M2.25 23.75 L2.3 23.95 2.4 23.95 2.4 23.85 2.25 23.75 M2.8 22.0 L2.65 22.0 2.6 22.1 2.6 22.4 2.8 22.6 2.8 22.0 M3.05 22.15 L3.0 22.2 2.9 22.6 2.9 22.65 3.25 22.95 3.05 22.15 M3.95 23.2 L3.85 23.2 3.8 23.5 3.9 23.6 3.95 23.2 M3.1 23.1 L3.05 23.05 3.0 23.0 2.95 23.25 3.25 23.4 3.25 23.25 3.1 23.1 M3.05 24.05 L3.2 24.2 3.25 23.65 2.95 23.45 2.9 23.95 3.0 24.0 3.05 24.05 M2.6 23.4 L2.7 23.4 2.75 23.35 2.6 23.3 2.6 23.4 M3.75 24.6 L3.85 24.0 3.7 23.9 3.6 24.5 3.75 24.6 M9.1 20.5 L9.3 20.05 9.15 19.9 8.4 20.65 8.35 20.7 8.1 20.95 8.2 21.0 8.4 20.85 8.2 21.15 8.1 21.4 8.15 21.5 8.3 21.55 8.65 21.45 Q8.7 21.25 8.9 21.15 L8.95 21.2 8.75 21.6 8.8 21.7 8.95 21.75 9.25 21.45 9.3 21.4 9.7 21.05 9.15 20.6 9.15 20.55 9.1 20.5 M4.7 24.05 L4.65 24.05 4.5 25.05 4.5 25.35 4.75 25.6 4.75 24.1 4.7 24.05 M10.15 20.3 L10.35 19.95 10.3 19.85 9.15 20.55 9.8 20.95 10.65 20.2 10.7 20.25 10.65 20.0 10.2 20.35 10.15 20.3 M10.0 21.25 L9.65 21.65 9.85 21.85 10.1 21.55 10.2 21.45 10.0 21.25 M7.2 22.9 L6.7 22.6 5.9 22.25 5.8 22.4 Q6.45 22.7 7.55 23.35 L7.55 23.15 7.2 22.9 M7.1 22.35 L6.35 22.05 7.2 22.8 7.75 23.05 7.9 22.95 7.1 22.35 M9.6 21.7 L9.55 21.75 9.55 22.05 9.7 22.05 9.85 21.9 9.6 21.7 M10.15 22.15 L10.1 22.3 10.1 22.4 10.3 22.5 10.45 22.45 10.5 22.4 10.85 21.95 10.75 21.9 10.5 21.65 10.15 22.15 M19.9 16.7 Q19.55 16.65 19.3 17.0 L18.95 17.55 Q18.0 18.25 18.0 18.5 L18.05 18.65 18.2 18.6 Q19.95 17.15 19.95 16.8 L19.9 16.7 M12.0 19.7 L11.55 20.0 11.5 20.05 11.55 20.15 12.0 19.7 M13.35 19.55 L13.35 19.5 11.85 21.05 11.95 21.45 13.65 19.3 13.35 19.55 M12.8 19.65 Q12.8 19.45 12.95 19.35 12.55 19.4 12.15 19.9 L11.7 20.45 11.8 20.9 12.8 19.65 M13.5 13.7 L13.55 13.75 15.7 11.65 Q14.8 12.05 13.5 13.7 M11.5 19.95 L11.6 19.8 11.45 19.8 11.45 19.85 11.5 19.95 M11.2 20.2 L11.25 20.2 11.15 20.1 11.0 20.25 11.05 20.4 11.2 20.2 M11.25 20.25 L11.1 20.45 11.15 20.6 11.35 20.4 11.25 20.25 M10.85 20.7 L10.8 20.7 10.85 20.65 10.75 20.45 10.4 20.85 10.05 21.2 10.25 21.35 10.35 21.4 10.45 21.5 10.65 21.2 10.7 21.1 10.9 20.9 10.85 20.7 M10.7 21.4 L10.55 21.6 10.85 21.8 10.9 21.8 10.95 21.8 11.05 21.7 10.8 21.35 10.7 21.4 M10.25 21.65 L10.35 21.6 10.4 21.6 10.25 21.5 10.15 21.6 10.25 21.65 M11.0 21.15 L10.85 21.25 11.05 21.45 11.1 21.45 11.0 21.15 M11.4 21.35 L11.65 21.1 11.5 20.7 11.45 20.7 11.25 20.9 11.4 21.35 M11.7 21.25 L11.45 21.5 11.6 21.75 11.7 21.8 11.75 21.7 11.7 21.25 M10.85 22.4 L10.7 22.55 10.85 22.4 M19.85 19.4 L19.85 19.45 19.9 19.35 19.85 19.4 M18.8 24.25 L18.7 23.15 18.6 22.9 18.55 22.9 18.45 24.5 18.5 24.8 18.55 24.75 18.65 24.8 18.55 25.35 18.6 25.55 18.8 24.6 18.9 24.55 18.9 24.45 18.9 24.25 18.85 24.3 18.8 24.25 M19.6 22.4 L19.6 22.35 19.55 22.4 19.6 22.4 M19.15 24.45 L19.25 24.45 19.25 24.35 19.15 24.15 19.15 24.45 M19.45 23.8 L19.4 25.05 19.5 24.1 19.45 23.8 M-2.35 9.35 L-2.05 9.35 -2.2 9.3 -2.15 9.2 -2.35 9.35 M-0.65 13.1 L-0.7 13.1 -0.7 13.15 -0.65 13.1 M-2.05 13.35 L-2.2 13.1 -2.35 13.25 -2.25 13.55 -2.05 13.35 M-1.75 15.0 L-1.5 14.65 -0.8 13.9 -0.9 13.95 -1.7 14.7 -1.95 14.95 -1.75 15.0 M-0.65 14.7 Q-0.45 14.55 -0.4 14.2 L-0.9 14.7 -1.25 15.25 -1.2 15.35 -1.05 15.4 -0.55 15.15 -0.15 14.5 -0.2 14.5 -0.6 14.75 -0.65 14.7" fill="url(#gradient1)" fill-rule="evenodd" stroke="none"/>
  </g>
  <defs>
    <linearGradient gradientTransform="matrix(-7.0E-4, -0.0182, 0.0182, -7.0E-4, 12.35, 11.1)" gradientUnits="userSpaceOnUse" id="gradient0" spreadMethod="pad" x1="-819.2" x2="819.2">
      <stop offset="0.0" stop-color="#542c22" stop-opacity="0.29803923"/>
      <stop offset="1.0" stop-color="#e3997a" stop-opacity="0.15294118"/>
    </linearGradient>
    <linearGradient gradientTransform="matrix(-0.0029, -0.0147, 0.0182, -0.0036, 12.25, 11.75)" gradientUnits="userSpaceOnUse" id="gradient1" spreadMethod="pad" x1="-819.2" x2="819.2">
      <stop offset="0.0" stop-color="#542c22" stop-opacity="0.6117647"/>
      <stop offset="1.0" stop-color="#e3997a" stop-opacity="0.15294118"/>
    </linearGradient>
  </defs>
</svg>
