<?xml version="1.0" encoding="UTF-8" standalone="no"?>
<svg xmlns:xlink="http://www.w3.org/1999/xlink" height="4.25px" width="16.55px" xmlns="http://www.w3.org/2000/svg">
  <g transform="matrix(1.0, 0.0, 0.0, 1.0, -1.4, -51.35)">
    <path d="M15.0 53.25 L16.9 52.6 Q17.9 52.6 17.95 53.35 17.95 54.15 15.65 54.85 13.25 55.6 10.3 55.6 4.55 55.6 1.4 52.05 1.4 51.35 2.2 51.35 3.1 51.3 4.3 52.5 L6.15 53.45 10.35 53.9 15.0 53.25" fill="#000000" fill-opacity="0.17254902" fill-rule="evenodd" stroke="none"/>
  </g>
</svg>
