<?xml version="1.0" encoding="UTF-8" standalone="no"?>
<svg xmlns:xlink="http://www.w3.org/1999/xlink" height="59.35px" width="65.0px" xmlns="http://www.w3.org/2000/svg">
  <g transform="matrix(1.0, 0.0, 0.0, 1.0, 27.15, 28.15)">
    <path d="M13.55 -26.2 L14.05 -26.3 Q21.0 -23.95 17.55 -17.7 17.0 -16.65 15.7 -16.2 25.5 -15.6 27.5 -6.4 28.35 -2.65 27.1 0.9 34.7 -2.95 37.75 4.8 38.05 5.55 37.5 6.0 29.95 11.5 25.3 4.2 L22.5 7.25 Q28.5 5.95 29.15 11.85 29.4 13.95 28.45 15.75 27.25 18.05 24.75 18.75 29.0 23.2 23.25 26.45 21.6 27.35 19.9 26.95 15.65 25.6 17.3 21.7 18.0 20.1 19.25 18.95 L16.8 17.5 Q15.3 20.55 11.75 20.9 16.2 26.65 9.65 30.75 L8.2 31.2 Q0.25 31.0 2.2 23.6 2.75 21.5 4.65 20.35 1.35 18.25 0.7 14.4 L0.7 13.15 -1.8 13.95 Q3.5 18.7 -0.55 24.15 L-1.35 24.75 Q-8.1 27.25 -11.7 21.35 -13.45 27.65 -18.8 25.7 -23.3 24.05 -22.05 19.95 -21.2 17.15 -18.65 17.25 L-15.95 16.1 Q-25.75 16.25 -27.1 7.15 -27.35 5.25 -26.4 3.85 -23.65 -0.25 -18.4 0.15 -16.65 0.25 -15.0 0.9 L-14.85 0.05 Q-20.9 0.1 -23.65 -4.9 -24.1 -5.65 -24.0 -6.65 -23.35 -11.85 -18.85 -13.65 -24.4 -15.35 -20.6 -19.65 L-19.75 -20.25 Q-14.1 -19.7 -15.65 -15.25 -15.95 -14.45 -16.55 -13.75 L-11.55 -12.45 Q-16.5 -20.6 -8.35 -26.5 -4.7 -29.1 -0.25 -27.65 5.2 -25.8 7.5 -20.5 7.1 -22.95 9.25 -23.7 L10.75 -24.1 12.0 -25.3 13.55 -26.2 M8.6 -14.9 L12.05 -15.85 Q9.85 -15.95 8.4 -17.55 L8.6 -14.9 M21.9 7.65 Q19.4 9.35 16.5 9.35 L17.1 10.3 Q18.6 9.1 20.95 8.9 21.3 8.15 21.9 7.65 M8.85 6.85 L7.45 5.85 6.8 7.35 8.85 6.85 M-5.9 -9.0 L-8.9 -10.45 -7.35 -8.5 -5.9 -9.0 M-12.65 18.2 L-12.75 17.6 Q-13.2 14.05 -9.9 12.9 L-10.65 12.4 Q-12.7 15.4 -15.5 16.0 -13.6 17.05 -12.65 18.2" fill="#ffffff" fill-opacity="0.49803922" fill-rule="evenodd" stroke="none"/>
    <path d="M15.4 -22.1 L15.5 -21.6 Q15.7 -19.9 14.5 -18.9 L13.65 -18.35 10.45 -19.85 10.55 -20.6 14.2 -22.9 15.4 -22.1 M10.45 -19.85 L10.3 -19.3 10.2 -19.75 9.85 -20.15 10.45 -19.85 M13.15 -13.05 L14.1 -13.65 15.55 -13.2 Q17.25 -12.9 18.75 -12.15 27.05 -7.95 24.15 1.45 21.2 5.6 16.65 6.35 14.1 6.5 13.95 8.95 13.75 12.7 17.1 13.35 21.65 13.05 24.1 9.75 L26.4 11.15 Q26.55 12.9 25.4 14.25 L21.95 17.65 20.75 16.4 Q18.6 14.3 15.95 15.05 10.7 16.45 8.95 20.4 8.8 20.75 9.0 21.05 12.05 25.45 8.1 28.2 L5.1 27.35 Q4.25 24.25 6.65 22.4 7.6 21.65 7.4 20.55 6.65 15.75 3.1 12.2 L1.9 11.35 Q-2.15 9.5 -4.4 13.15 -4.7 13.55 -4.45 13.85 -2.0 17.4 -1.95 21.65 L-3.05 21.9 Q-7.4 22.95 -9.75 19.05 L-9.35 16.1 Q-6.6 14.7 -7.85 11.75 -8.35 10.6 -9.6 10.25 -13.35 10.3 -16.4 13.1 -21.85 13.25 -23.45 8.15 -24.85 3.55 -19.4 3.6 L-14.0 3.4 Q-12.2 3.0 -12.35 1.4 -12.8 -2.95 -17.8 -4.05 -19.8 -4.4 -20.0 -4.65 -22.8 -8.45 -17.1 -11.2 L-11.7 -9.4 Q-9.5 -4.2 -4.9 -6.1 -3.5 -6.6 -3.4 -8.15 -3.2 -12.85 -8.7 -13.45 -10.95 -16.75 -9.5 -20.35 -8.6 -22.6 -6.7 -23.4 1.5 -27.15 5.5 -18.25 5.3 -16.45 5.5 -14.75 5.7 -13.25 6.95 -12.65 10.0 -11.05 13.15 -13.05 M13.65 -18.35 L14.4 -17.7 12.95 -17.15 13.05 -17.5 13.05 -17.55 13.65 -18.35 M24.85 2.75 L24.85 2.85 24.55 2.45 24.85 2.75 M-16.9 19.35 Q-15.95 19.35 -15.25 19.9 -14.6 20.4 -14.6 21.15 -14.6 21.9 -15.25 22.45 -15.95 22.95 -16.9 22.95 -17.85 22.95 -18.5 22.45 -19.2 21.9 -19.2 21.15 -19.2 20.4 -18.5 19.9 -17.85 19.35 -16.9 19.35 M-18.35 -16.65 L-18.7 -15.85 -19.85 -16.45 -18.95 -16.75 -18.85 -16.25 -18.5 -16.85 -18.95 -16.75 -19.15 -17.55 -17.25 -16.2 -18.1 -15.95 -18.35 -16.65 M8.05 8.5 Q7.6 8.15 7.6 8.25 L7.75 10.2 8.25 9.75 9.05 9.8 8.4 9.35 8.05 8.5 M5.2 4.6 L6.8 5.8 7.0 5.1 6.65 4.5 6.0 4.25 5.2 4.6 M22.05 20.1 L23.1 21.65 22.2 23.2 20.9 22.75 22.05 20.1 M28.55 3.55 L29.8 3.0 Q32.8 1.85 34.4 4.5 32.4 5.75 30.35 4.75 L28.55 3.55" fill="#ffffff" fill-rule="evenodd" stroke="none"/>
  </g>
</svg>
