<?xml version="1.0" encoding="UTF-8" standalone="no"?>
<svg xmlns:xlink="http://www.w3.org/1999/xlink" height="9.05px" width="10.5px" xmlns="http://www.w3.org/2000/svg">
  <g transform="matrix(1.0, 0.0, 0.0, 1.0, 2.4, 17.9)">
    <path d="M1.2 -13.35 Q0.65 -12.7 -0.35 -12.7 -1.35 -12.7 -1.85 -13.35 -2.4 -14.0 -2.4 -15.3 -2.4 -16.6 -1.85 -17.25 -1.35 -17.9 -0.35 -17.9 0.7 -17.9 1.2 -17.25 1.75 -16.6 1.75 -15.3 1.75 -14.0 1.2 -13.35 M0.5 -16.65 Q0.25 -17.1 -0.35 -17.1 -0.95 -17.1 -1.15 -16.65 L-1.35 -15.3 -1.15 -13.95 Q-0.95 -13.5 -0.35 -13.5 0.25 -13.5 0.5 -13.95 L0.7 -15.3 0.5 -16.65 M7.6 -13.35 Q8.1 -12.7 8.1 -11.4 8.1 -10.1 7.6 -9.45 7.05 -8.85 6.05 -8.85 5.05 -8.85 4.5 -9.45 4.0 -10.1 4.0 -11.4 4.0 -12.75 4.5 -13.35 5.05 -14.0 6.05 -14.0 7.05 -14.0 7.6 -13.35 M6.05 -13.2 Q5.45 -13.2 5.25 -12.75 L5.05 -11.4 5.25 -10.05 Q5.45 -9.6 6.05 -9.6 6.65 -9.6 6.85 -10.05 L7.05 -11.4 6.85 -12.75 Q6.65 -13.2 6.05 -13.2 M5.65 -17.7 L1.05 -9.0 0.1 -9.0 4.65 -17.7 5.65 -17.7" fill="#f2f2f2" fill-rule="evenodd" stroke="none"/>
  </g>
</svg>
