<?xml version="1.0" encoding="UTF-8" standalone="no"?>
<svg xmlns:xlink="http://www.w3.org/1999/xlink" height="173.8px" width="167.9px" xmlns="http://www.w3.org/2000/svg">
  <g transform="matrix(1.0, 0.0, 0.0, 1.0, 101.0, 143.5)">
    <path d="M-2.5 -136.25 L0.65 -136.25 0.85 -136.15 1.05 -136.0 1.1 -135.65 0.85 -135.25 Q0.75 -135.15 0.65 -135.15 L-1.75 -135.15 Q-0.95 -133.75 -0.95 -131.9 0.25 -131.4 0.6 -130.35 L0.35 -129.85 Q-0.35 -129.25 -1.35 -129.1 -2.6 -129.05 -3.7 -129.75 L-7.5 -129.1 Q-7.95 -127.85 -9.35 -127.6 -11.6 -127.1 -11.9 -128.9 -14.85 -129.2 -17.5 -130.25 L-18.35 -129.75 Q-19.5 -129.1 -21.05 -129.4 L-21.2 -129.5 Q-21.85 -130.2 -21.35 -131.1 -20.75 -132.2 -19.45 -132.6 L-19.25 -133.45 -18.25 -135.15 -19.15 -135.15 -19.35 -135.1 Q-20.05 -135.1 -20.1 -135.55 L-20.1 -135.65 -19.95 -136.1 -19.7 -136.25 -19.05 -136.25 -18.4 -136.3 -17.25 -136.3 -2.5 -136.25 M-11.75 -135.15 L-11.8 -135.15 -13.7 -135.15 -15.4 -135.15 -16.3 -135.15 Q-17.4 -133.6 -15.55 -131.75 -14.9 -131.1 -13.75 -130.7 -5.05 -128.1 -3.0 -134.1 L-3.9 -135.15 -8.15 -135.15 -11.75 -135.15" fill="#331a00" fill-rule="evenodd" stroke="none"/>
    <path d="M0.35 -129.85 L0.6 -130.35 Q0.25 -131.4 -0.95 -131.9 -0.95 -133.75 -1.75 -135.15 L0.65 -135.15 Q0.75 -135.15 0.85 -135.25 L1.1 -135.65 1.05 -136.0 0.85 -136.15 0.65 -136.25 -2.5 -136.25 Q-4.1 -138.05 -7.4 -139.0 L-7.45 -139.35 -7.6 -140.6 -7.7 -141.35 -7.65 -142.25 17.45 -126.1 17.4 -126.1 7.05 -126.1 4.55 -127.45 0.35 -129.85" fill="#cf9e00" fill-rule="evenodd" stroke="none"/>
    <path d="M-33.35 -118.3 Q-29.35 -120.1 -25.3 -122.3 L-24.35 -122.8 Q-22.35 -124.0 -20.75 -124.4 L-18.8 -124.95 Q-17.2 -125.2 -7.95 -125.05 L-1.0 -125.15 8.3 -125.3 8.75 -125.3 16.95 -125.55 15.15 -123.15 11.35 -123.2 9.75 -123.2 8.75 -123.2 -2.6 -123.05 -9.55 -122.9 -11.55 -122.8 -13.0 -122.3 Q-15.1 -121.85 -23.85 -118.9 L-30.7 -116.8 -31.85 -116.4 -33.35 -118.3" fill="#7a4000" fill-rule="evenodd" stroke="none"/>
    <path d="M7.05 -126.1 L17.4 -126.1 16.95 -125.55 8.75 -125.3 8.3 -125.3 -1.0 -125.15 -7.95 -125.05 Q-17.2 -125.2 -18.8 -124.95 L-20.75 -124.4 Q-22.35 -124.0 -24.35 -122.8 L-25.3 -122.3 Q-29.35 -120.1 -33.35 -118.3 L-35.05 -120.6 Q-32.85 -121.55 -29.8 -123.05 L-22.95 -126.1 -7.25 -126.1 7.05 -126.1" fill="#6e3900" fill-rule="evenodd" stroke="none"/>
    <path d="M-21.05 -129.4 Q-19.5 -129.1 -18.35 -129.75 L-17.5 -130.25 Q-14.85 -129.2 -11.9 -128.9 -11.6 -127.1 -9.35 -127.6 -7.95 -127.85 -7.5 -129.1 L-3.7 -129.75 Q-2.6 -129.05 -1.35 -129.1 -0.35 -129.25 0.35 -129.85 L4.55 -127.45 7.05 -126.1 -7.25 -126.1 -16.75 -127.5 -21.7 -128.65 -21.05 -129.4" fill="#e3ad00" fill-rule="evenodd" stroke="none"/>
    <path d="M-31.85 -116.4 L-30.7 -116.8 -23.85 -118.9 Q-15.1 -121.85 -13.0 -122.3 L-11.55 -122.8 -9.55 -122.9 -2.6 -123.05 8.75 -123.2 9.75 -123.2 11.35 -123.2 15.15 -123.15 12.9 -120.3 12.1 -120.15 8.75 -119.85 Q-2.3 -118.65 -10.4 -116.8 L-10.6 -116.8 Q-19.35 -114.85 -24.15 -113.3 L-25.95 -112.75 -29.0 -112.75 -31.85 -116.4 M9.35 -115.55 L7.1 -112.75 -1.25 -112.75 5.6 -114.65 9.35 -115.55" fill="#8a4b00" fill-rule="evenodd" stroke="none"/>
    <path d="M12.9 -120.3 L11.1 -117.95 8.75 -117.35 6.4 -116.8 -9.15 -112.75 -25.95 -112.75 -24.15 -113.3 Q-19.35 -114.85 -10.6 -116.8 L-10.4 -116.8 Q-2.3 -118.65 8.75 -119.85 L12.1 -120.15 12.9 -120.3" fill="#a35900" fill-rule="evenodd" stroke="none"/>
    <path d="M-9.15 -112.75 L6.4 -116.8 8.75 -117.35 11.1 -117.95 9.35 -115.55 5.6 -114.65 -1.25 -112.75 -9.15 -112.75" fill="#945100" fill-rule="evenodd" stroke="none"/>
    <path d="M-19.05 -136.25 L-19.7 -136.25 -19.95 -136.1 -20.1 -135.65 -20.1 -135.55 Q-23.0 -133.65 -26.6 -131.3 L-31.8 -127.7 -27.5 -126.2 -27.3 -126.1 -27.75 -126.1 -39.35 -126.1 -9.55 -143.5 -9.15 -143.25 -9.9 -142.5 Q-11.0 -141.7 -12.65 -140.6 L-14.4 -139.35 -19.05 -136.25" fill="#fff300" fill-rule="evenodd" stroke="none"/>
    <path d="M-2.5 -136.25 L-17.25 -136.3 Q-15.75 -137.7 -13.35 -138.55 L-12.55 -139.35 -11.55 -140.6 -9.9 -142.5 -9.15 -143.25 -7.65 -142.25 -7.7 -141.35 -7.6 -140.6 -7.45 -139.35 -7.4 -139.0 Q-4.1 -138.05 -2.5 -136.25" fill="#f2be00" fill-rule="evenodd" stroke="none"/>
    <path d="M-17.25 -136.3 L-18.4 -136.3 -19.05 -136.25 -14.4 -139.35 -12.65 -140.6 Q-11.0 -141.7 -9.9 -142.5 L-11.55 -140.6 -12.55 -139.35 -13.35 -138.55 Q-15.75 -137.7 -17.25 -136.3 M-20.1 -135.55 Q-20.05 -135.1 -19.35 -135.1 L-19.15 -135.15 -18.25 -135.15 -19.25 -133.45 -19.45 -132.6 Q-20.75 -132.2 -21.35 -131.1 -21.85 -130.2 -21.2 -129.5 L-21.05 -129.4 -21.7 -128.65 -16.75 -127.5 -7.25 -126.1 -22.95 -126.1 -27.3 -126.1 -27.5 -126.2 -31.8 -127.7 -26.6 -131.3 Q-23.0 -133.65 -20.1 -135.55" fill="#ffcc00" fill-rule="evenodd" stroke="none"/>
    <path d="M-9.85 -132.85 Q-12.05 -132.85 -12.05 -134.35 L-11.75 -135.15 -8.15 -135.15 -7.95 -134.45 Q-7.95 -133.85 -8.4 -133.4 -8.95 -132.85 -9.8 -132.85 L-9.85 -132.85 M-10.7 -134.05 L-10.6 -133.85 -9.95 -133.75 Q-9.3 -133.75 -9.3 -134.0 L-9.15 -134.05 -9.15 -134.35 Q-9.15 -135.05 -10.0 -135.05 -10.8 -135.1 -10.8 -134.45 L-10.7 -134.05" fill="#592860" fill-rule="evenodd" stroke="none"/>
    <path d="M-10.7 -134.05 L-10.8 -134.45 Q-10.8 -135.1 -10.0 -135.05 -9.15 -135.05 -9.15 -134.35 L-9.15 -134.05 -9.3 -134.0 Q-9.3 -133.75 -9.95 -133.75 L-10.6 -133.85 -10.7 -134.05" fill="#76357d" fill-rule="evenodd" stroke="none"/>
    <path d="M-11.75 -135.15 L-12.05 -134.35 Q-12.05 -132.85 -9.85 -132.85 -11.25 -132.25 -12.75 -132.25 -13.9 -132.25 -14.9 -132.85 -15.85 -133.45 -15.85 -134.15 -15.85 -134.65 -15.4 -135.15 L-13.7 -135.15 Q-13.5 -134.8 -12.7 -134.8 -12.05 -134.8 -11.8 -135.15 L-11.75 -135.15 M-13.95 -134.0 Q-13.95 -133.2 -13.0 -133.2 -12.05 -133.2 -12.05 -134.0 -12.05 -134.65 -13.0 -134.65 -13.95 -134.65 -13.95 -134.0" fill="#ccdaff" fill-rule="evenodd" stroke="none"/>
    <path d="M-11.8 -135.15 Q-12.05 -134.8 -12.7 -134.8 -13.5 -134.8 -13.7 -135.15 L-11.8 -135.15 M-13.95 -134.0 Q-13.95 -134.65 -13.0 -134.65 -12.05 -134.65 -12.05 -134.0 -12.05 -133.2 -13.0 -133.2 -13.95 -133.2 -13.95 -134.0 M-5.0 -132.3 Q-5.5 -131.95 -5.95 -131.95 -6.85 -131.95 -7.15 -132.45 L-7.3 -133.0 Q-7.3 -133.75 -5.85 -133.8 -4.45 -134.0 -4.45 -133.05 -4.45 -132.65 -5.0 -132.3" fill="#fafcff" fill-rule="evenodd" stroke="none"/>
    <path d="M-15.4 -135.15 Q-15.85 -134.65 -15.85 -134.15 -15.85 -133.45 -14.9 -132.85 -13.9 -132.25 -12.75 -132.25 -11.25 -132.25 -9.85 -132.85 L-9.8 -132.85 Q-8.95 -132.85 -8.4 -133.4 -7.95 -133.85 -7.95 -134.45 L-8.15 -135.15 -3.9 -135.15 -3.0 -134.1 Q-5.05 -128.1 -13.75 -130.7 -14.9 -131.1 -15.55 -131.75 -17.4 -133.6 -16.3 -135.15 L-15.4 -135.15 M-5.0 -132.3 Q-4.45 -132.65 -4.45 -133.05 -4.45 -134.0 -5.85 -133.8 -7.3 -133.75 -7.3 -133.0 L-7.15 -132.45 Q-6.85 -131.95 -5.95 -131.95 -5.5 -131.95 -5.0 -132.3" fill="#b1bfde" fill-rule="evenodd" stroke="none"/>
    <path d="M-27.75 -126.1 L-27.3 -126.1 -22.95 -126.1 -29.8 -123.05 Q-32.85 -121.55 -35.05 -120.6 L-37.25 -123.35 -31.1 -125.2 -27.75 -126.1" fill="#5e3100" fill-rule="evenodd" stroke="none"/>
    <path d="M-27.75 -126.1 L-31.1 -125.2 -37.25 -123.35 -39.35 -126.1 -27.75 -126.1" fill="#542a00" fill-rule="evenodd" stroke="none"/>
    <path d="M-35.0 -20.95 L-42.95 -15.65 -42.95 -15.95 -38.7 -23.0 -36.65 -26.2 -36.05 -24.05 -35.0 -20.95 M-56.35 4.1 L-59.05 3.3 -58.8 3.15 -58.75 2.95 Q-55.2 2.7 -47.1 -1.05 -37.95 -5.25 -35.85 -8.75 L-36.6 -5.1 -37.2 -2.05 -38.7 5.95 -38.9 7.1 -39.5 7.15 -40.4 10.2 -41.35 10.1 -42.1 10.05 -46.6 9.8 -52.65 10.25 -53.1 10.15 -61.65 10.8 Q-66.05 11.5 -68.45 12.65 -65.1 10.65 -58.4 7.7 -57.1 7.1 -55.85 6.65 -52.6 5.65 -49.85 4.4 L-46.75 2.85 -44.35 1.4 -53.5 3.6 -54.3 3.75 -56.35 4.1" fill="#26201a" fill-rule="evenodd" stroke="none"/>
    <path d="M-36.65 -26.2 L-38.7 -23.0 -42.95 -15.95 -42.95 -15.65 -35.0 -20.95 -33.9 -17.55 -34.6 -14.35 -35.85 -8.75 Q-37.95 -5.25 -47.1 -1.05 -55.2 2.7 -58.75 2.95 L-58.8 3.15 -59.05 3.3 -56.35 4.1 -65.2 5.1 Q-58.45 1.95 -52.65 -1.95 -46.9 -5.85 -39.3 -12.45 L-39.6 -12.75 -54.15 -9.0 -54.1 -9.6 Q-50.0 -14.1 -46.4 -18.65 -40.65 -26.1 -38.1 -31.7 L-36.65 -26.2 M-90.4 16.2 Q-78.35 11.35 -68.45 9.3 L-65.35 8.75 Q-60.15 7.9 -55.85 6.65 -57.1 7.1 -58.4 7.7 -65.1 10.65 -68.45 12.65 -66.05 11.5 -61.65 10.8 L-53.1 10.15 -52.65 10.25 Q-59.4 11.25 -68.2 14.8 L-68.45 14.9 -77.3 18.55 Q-81.25 19.95 -83.75 20.1 L-84.6 20.1 -84.7 20.1 -88.15 19.45 -91.0 18.75 -90.7 17.6 -90.6 17.15 -90.6 17.1 -90.5 16.45 -90.45 16.2 -90.4 16.2" fill="#332b23" fill-rule="evenodd" stroke="none"/>
    <path d="M-46.4 -24.6 Q-52.9 -14.7 -60.1 -5.35 L-60.5 -5.2 -60.2 -5.2 -60.1 -5.35 -48.0 -9.45 Q-51.2 -5.9 -54.6 -3.85 -56.35 -2.85 -62.65 0.05 L-68.75 2.95 Q-72.55 4.9 -76.6 7.2 L-68.45 6.95 -62.95 6.65 -62.65 6.65 -68.45 8.25 -75.35 10.45 Q-83.65 13.15 -90.15 15.85 L-88.6 14.5 -75.8 2.95 -58.85 -12.45 Q-51.3 -19.5 -46.4 -24.6" fill="#54473a" fill-rule="evenodd" stroke="none"/>
    <path d="M-38.1 -31.7 Q-40.65 -26.1 -46.4 -18.65 -50.0 -14.1 -54.1 -9.6 L-54.15 -9.0 -39.6 -12.75 -39.3 -12.45 Q-46.9 -5.85 -52.65 -1.95 -58.45 1.95 -65.2 5.1 L-56.35 4.1 -54.3 3.75 -53.5 3.6 -44.35 1.4 -46.75 2.85 -49.85 4.4 Q-52.6 5.65 -55.85 6.65 -60.15 7.9 -65.35 8.75 L-68.45 9.3 Q-78.35 11.35 -90.4 16.2 L-90.45 16.1 -90.15 15.85 Q-83.65 13.15 -75.35 10.45 L-68.45 8.25 -62.65 6.65 -62.95 6.65 -68.45 6.95 -76.6 7.2 Q-72.55 4.9 -68.75 2.95 L-62.65 0.05 Q-56.35 -2.85 -54.6 -3.85 -51.2 -5.9 -48.0 -9.45 L-60.1 -5.35 -60.2 -5.2 -60.5 -5.2 -60.1 -5.35 Q-52.9 -14.7 -46.4 -24.6 -40.65 -30.7 -38.65 -34.05 L-38.1 -31.7 M-65.2 5.1 L-65.55 5.15 -65.25 5.15 -65.2 5.1" fill="#42372d" fill-rule="evenodd" stroke="none"/>
    <path d="M-97.5 29.75 L-98.9 28.45 -99.5 27.7 -100.1 26.7 Q-100.85 25.25 -100.95 23.85 L-101.0 23.3 -100.95 22.6 -100.85 22.2 -100.05 21.5 -96.85 19.05 -92.4 15.95 -92.25 16.0 -92.15 16.1 -90.6 17.1 -90.6 17.15 -90.7 17.6 -90.9 17.65 -91.65 17.8 -92.35 17.6 -92.65 17.2 -92.95 17.2 -92.65 17.95 Q-92.4 18.4 -92.4 18.75 L-92.8 19.55 -95.1 19.35 -99.45 22.65 -100.0 23.1 Q-100.0 24.6 -99.4 26.25 L-98.5 28.1 -97.5 29.75" fill="#dbd0af" fill-rule="evenodd" stroke="none"/>
    <path d="M-90.45 16.1 L-90.4 16.2 -90.45 16.2 -90.45 16.1 M-83.75 20.1 Q-84.9 22.35 -84.9 24.2 -84.9 25.85 -84.05 27.0 L-85.65 25.85 -87.05 24.95 Q-87.05 25.25 -87.35 25.25 L-88.2 29.45 -88.25 29.45 Q-89.1 27.7 -89.3 25.55 L-89.4 24.05 -90.35 24.9 -91.15 26.15 -91.15 24.95 -90.95 24.05 -90.6 22.9 -90.65 22.8 -92.5 24.05 Q-93.7 24.75 -94.95 24.65 L-95.05 24.65 -95.1 24.35 Q-94.15 23.95 -93.35 22.9 L-92.2 21.25 -92.1 21.1 -92.4 21.1 -92.7 21.2 Q-93.1 21.3 -93.7 21.7 -94.55 22.35 -95.1 22.3 L-93.45 20.35 -92.8 19.55 -92.4 18.75 Q-92.4 18.4 -92.65 17.95 L-92.95 17.2 -92.65 17.2 -92.35 17.6 -91.65 17.8 -90.9 17.65 -90.7 17.6 -91.0 18.75 -88.15 19.45 -84.7 20.1 -84.6 20.1 -83.75 20.1" fill="#1a1612" fill-rule="evenodd" stroke="none"/>
    <path d="M-99.4 26.25 Q-100.0 24.6 -100.0 23.1 L-99.45 22.65 -95.1 19.35 -92.8 19.55 -93.45 20.35 -95.1 22.3 Q-94.55 22.35 -93.7 21.7 -93.1 21.3 -92.7 21.2 L-98.9 25.85 -99.4 26.25" fill="#b3a98f" fill-rule="evenodd" stroke="none"/>
    <path d="M-89.3 25.55 L-92.85 28.75 -94.4 30.25 -95.2 30.3 -97.35 29.8 -96.85 29.3 -90.95 24.05 -91.15 24.95 -91.15 26.15 -90.35 24.9 -89.4 24.05 -89.3 25.55 M-92.7 21.2 L-92.4 21.1 -92.2 21.25 -93.35 22.9 Q-94.15 23.95 -95.1 24.35 L-95.1 24.65 -95.05 24.65 -94.95 24.65 -96.25 25.9 -98.5 28.1 -99.4 26.25 -98.9 25.85 -92.7 21.2" fill="#a69c84" fill-rule="evenodd" stroke="none"/>
    <path d="M-97.35 29.8 L-97.5 29.75 -98.5 28.1 -96.25 25.9 -94.95 24.65 Q-93.7 24.75 -92.5 24.05 L-90.65 22.8 -90.6 22.9 -90.95 24.05 -96.85 29.3 -97.35 29.8" fill="#99907a" fill-rule="evenodd" stroke="none"/>
    <path d="M15.0 -29.1 L15.35 -30.75 Q18.8 -27.3 26.2 -20.4 L28.6 -17.0 Q32.8 -11.1 35.9 -8.5 L34.3 -8.5 30.65 -9.75 24.15 -9.75 Q28.5 -6.65 34.25 -3.45 L42.0 0.55 55.65 6.65 60.05 10.75 60.1 11.4 60.15 13.4 60.25 14.45 60.3 15.05 60.2 15.05 59.7 15.35 52.0 9.35 Q46.8 5.05 41.9 2.9 L39.35 1.9 Q29.7 -1.35 25.05 -3.3 L24.7 -3.45 Q16.6 -6.7 11.85 -10.0 21.9 -11.75 27.55 -11.25 L27.6 -11.85 Q25.85 -14.35 23.85 -18.45 21.3 -22.55 15.0 -29.1 M33.55 4.25 L33.65 4.5 24.95 6.0 19.8 3.9 Q16.7 2.6 15.15 1.65 L13.65 0.65 14.25 0.45 15.1 0.6 21.1 1.45 32.65 3.75 33.55 4.25" fill="#42372d" fill-rule="evenodd" stroke="none"/>
    <path d="M42.6 12.4 Q36.05 10.55 28.9 10.35 25.05 10.25 17.35 11.9 L15.45 12.3 Q12.2 13.0 9.75 14.0 L9.4 7.75 9.3 5.9 11.9 6.05 15.3 6.25 23.45 6.65 Q21.4 6.25 15.2 2.95 L15.15 2.9 Q11.2 0.8 8.9 -0.15 L8.9 -0.45 15.1 0.35 18.3 0.65 31.85 1.8 18.35 -3.45 Q15.4 -4.55 10.5 -7.4 L8.35 -8.65 8.1 -12.45 10.85 -18.2 16.95 -12.4 Q16.1 -14.05 12.25 -18.95 L17.6 -16.35 Q20.85 -14.55 22.45 -14.45 L22.4 -15.0 Q20.35 -16.45 15.15 -22.8 L13.65 -24.6 15.0 -29.1 Q21.3 -22.55 23.85 -18.45 25.85 -14.35 27.6 -11.85 L27.55 -11.25 Q21.9 -11.75 11.85 -10.0 16.6 -6.7 24.7 -3.45 L25.05 -3.3 Q29.7 -1.35 39.35 1.9 L41.9 2.9 Q46.8 5.05 52.0 9.35 L59.7 15.35 Q57.5 16.6 57.0 16.6 L56.45 16.6 56.3 16.6 56.15 16.6 55.35 16.5 52.0 15.7 51.7 15.6 46.3 13.55 42.6 12.4 M33.65 4.5 L33.7 4.5 33.55 4.25 32.65 3.75 21.1 1.45 15.1 0.6 14.25 0.45 13.65 0.65 15.15 1.65 Q16.7 2.6 19.8 3.9 L24.95 6.0 33.65 4.5" fill="#332b23" fill-rule="evenodd" stroke="none"/>
    <path d="M52.25 17.4 Q50.95 17.9 50.15 18.6 49.0 17.15 44.8 13.95 L42.6 12.4 46.3 13.55 51.7 15.6 52.0 15.7 55.35 16.5 53.0 17.15 52.25 17.4 M9.3 5.9 L8.9 -0.15 Q11.2 0.8 15.15 2.9 L15.2 2.95 Q21.4 6.25 23.45 6.65 L15.3 6.25 11.9 6.05 9.3 5.9 M8.9 -0.45 L8.75 -1.25 8.65 -3.45 8.35 -8.65 10.5 -7.4 Q15.4 -4.55 18.35 -3.45 L31.85 1.8 18.3 0.65 15.1 0.35 8.9 -0.45 M10.85 -18.2 L13.65 -24.6 15.15 -22.8 Q20.35 -16.45 22.4 -15.0 L22.45 -14.45 Q20.85 -14.55 17.6 -16.35 L12.25 -18.95 Q16.1 -14.05 16.95 -12.4 L10.85 -18.2" fill="#26201a" fill-rule="evenodd" stroke="none"/>
    <path d="M26.2 -20.4 L34.85 -12.45 44.7 -3.45 55.65 6.65 42.0 0.55 34.25 -3.45 Q28.5 -6.65 24.15 -9.75 L30.65 -9.75 34.3 -8.5 35.9 -8.5 Q32.8 -11.1 28.6 -17.0 L26.2 -20.4" fill="#54473a" fill-rule="evenodd" stroke="none"/>
    <path d="M60.15 13.4 L61.2 13.85 62.85 14.4 64.75 15.0 Q64.45 15.0 64.4 15.15 L64.35 15.25 63.45 15.45 63.3 15.45 61.65 16.05 Q60.9 16.45 60.7 16.95 60.2 17.65 60.55 18.55 59.65 18.05 59.1 17.2 58.7 18.75 57.6 19.85 L56.75 20.5 54.3 21.6 53.25 21.9 54.0 20.75 54.35 20.25 55.05 19.0 53.65 19.75 53.2 19.95 51.55 20.55 51.0 20.55 51.9 18.85 52.25 17.4 53.0 17.15 55.35 16.5 56.15 16.6 56.3 16.6 56.45 16.6 57.0 16.6 Q57.5 16.6 59.7 15.35 L60.2 15.05 60.3 15.05 60.25 14.45 60.15 13.4 M55.05 19.0 L55.1 18.9 55.1 18.6 55.05 19.0" fill="#1a1612" fill-rule="evenodd" stroke="none"/>
    <path d="M63.3 15.45 L63.5 15.6 66.9 20.85 65.45 22.5 61.65 16.05 63.3 15.45" fill="#dbd0af" fill-rule="evenodd" stroke="none"/>
    <path d="M64.1 23.55 L63.75 23.75 Q62.05 24.8 60.4 25.25 L58.4 21.35 57.6 19.85 Q58.7 18.75 59.1 17.2 59.65 18.05 60.55 18.55 60.2 17.65 60.7 16.95 L64.1 23.55" fill="#99907a" fill-rule="evenodd" stroke="none"/>
    <path d="M65.45 22.5 L64.1 23.55 60.7 16.95 Q60.9 16.45 61.65 16.05 L65.45 22.5" fill="#b3a98f" fill-rule="evenodd" stroke="none"/>
    <path d="M60.4 25.25 L58.0 25.5 55.7 25.1 55.4 24.55 54.7 22.55 54.3 21.6 56.75 20.5 57.6 19.85 58.4 21.35 60.4 25.25" fill="#a69c84" fill-rule="evenodd" stroke="none"/>
    <path d="M33.65 4.5 L33.55 4.25 33.7 4.5 33.65 4.5" fill="#4d4236" fill-rule="evenodd" stroke="none"/>
  </g>
</svg>
