<?xml version="1.0" encoding="UTF-8" standalone="no"?>
<svg xmlns:xlink="http://www.w3.org/1999/xlink" height="3.15px" width="5.2px" xmlns="http://www.w3.org/2000/svg">
  <g transform="matrix(1.0, 0.0, 0.0, 1.0, 0.65, 0.35)">
    <path d="M0.05 1.2 L-0.4 0.9 -0.55 0.65 -0.65 0.45 Q-0.65 -0.05 0.05 0.05 L0.25 0.15 0.4 0.1 0.7 0.2 1.05 0.35 1.15 0.35 1.6 0.45 Q2.45 0.45 2.85 -0.05 L3.8 -0.35 Q4.45 -0.35 4.45 0.05 L4.05 0.5 4.0 0.55 3.85 0.6 3.4 0.75 2.9 0.9 2.6 0.95 2.4 1.05 1.4 1.2 0.8 1.3 0.55 1.2 0.35 1.3 0.05 1.2" fill="#c29b9b" fill-opacity="0.68235296" fill-rule="evenodd" stroke="none"/>
    <path d="M4.0 0.55 L4.2 0.7 4.55 1.2 Q4.55 1.8 3.45 2.35 L1.6 2.8 0.55 2.5 -0.3 1.7 0.05 1.2 0.35 1.3 0.55 1.2 0.8 1.3 1.4 1.2 2.4 1.05 2.6 0.95 2.9 0.9 3.4 0.75 3.85 0.6 4.0 0.55" fill="url(#gradient0)" fill-rule="evenodd" stroke="none"/>
    <path d="M0.9 1.1 L0.2 1.1 Q-0.4 0.95 -0.55 0.4 -0.25 0.45 0.2 0.75 L0.9 1.1 M4.55 0.0 Q4.4 0.55 3.8 0.7 L3.1 0.7 3.8 0.35 4.55 0.0" fill="#c29a9a" fill-rule="evenodd" stroke="none"/>
    <path d="M0.9 1.1 L0.2 0.75 Q-0.25 0.45 -0.55 0.4 -0.4 0.95 0.2 1.1 L0.9 1.1 M4.55 0.0 Q4.4 0.55 3.8 0.7 L3.1 0.7 3.8 0.35 4.55 0.0" fill="none" stroke="#8f5555" stroke-linecap="round" stroke-linejoin="round" stroke-opacity="0.29803923" stroke-width="0.05"/>
  </g>
  <defs>
    <linearGradient gradientTransform="matrix(-2.0E-4, -0.0016, 0.0029, -4.0E-4, 1.85, 1.3)" gradientUnits="userSpaceOnUse" id="gradient0" spreadMethod="pad" x1="-819.2" x2="819.2">
      <stop offset="0.0" stop-color="#a36a6a" stop-opacity="0.0"/>
      <stop offset="1.0" stop-color="#a36a6a" stop-opacity="0.6313726"/>
    </linearGradient>
  </defs>
</svg>
