<?xml version="1.0" encoding="UTF-8" standalone="no"?>
<svg xmlns:xlink="http://www.w3.org/1999/xlink" height="28.3px" width="25.25px" xmlns="http://www.w3.org/2000/svg">
  <g transform="matrix(1.0, 0.0, 0.0, 1.0, -0.2, -0.65)">
    <path d="M21.0 0.85 L24.5 0.75 25.0 0.85 24.95 0.85 25.3 1.2 25.35 1.2 25.45 1.7 25.45 2.1 25.45 2.25 25.45 2.7 25.45 2.9 25.45 3.3 25.45 3.5 25.45 3.9 25.45 4.1 25.45 4.5 25.45 4.7 25.35 8.25 25.15 8.8 Q23.9 10.2 23.3 11.9 L24.05 12.65 24.3 13.25 24.3 13.55 24.3 13.8 24.3 13.85 24.3 14.15 24.3 14.45 24.3 14.75 24.3 15.05 24.3 15.35 24.3 15.65 24.3 15.75 24.3 15.95 24.3 16.25 24.05 16.9 23.3 17.65 Q23.95 19.45 25.2 21.0 L25.4 21.55 25.45 24.9 25.45 25.05 25.45 25.5 25.45 25.65 25.45 26.1 25.45 26.25 25.45 26.7 25.45 26.85 25.45 27.3 25.45 27.45 25.45 27.9 25.2 28.5 25.2 28.45 Q25.0 28.75 24.6 28.75 L21.1 28.9 20.45 28.7 Q18.6 27.05 16.3 26.35 L15.8 26.0 15.65 25.4 15.65 25.25 13.5 27.45 12.85 27.7 12.25 27.45 10.0 25.25 10.05 25.4 9.9 26.0 9.4 26.4 Q7.15 27.05 5.2 28.7 L4.65 28.9 1.1 28.95 0.65 28.85 0.3 28.5 0.2 28.05 0.25 27.65 0.2 27.45 0.25 27.0 0.2 26.85 0.25 26.4 0.2 26.25 0.25 25.8 0.2 25.65 0.25 25.2 0.2 25.05 0.3 21.6 0.55 21.05 Q1.85 19.5 2.5 17.75 L1.65 16.9 1.4 16.25 1.45 16.0 1.4 15.75 1.4 15.65 1.45 15.35 1.4 15.05 1.45 14.75 1.4 14.45 1.45 14.15 1.4 13.85 1.4 13.7 1.45 13.55 1.4 13.25 Q1.4 12.9 1.65 12.65 L2.45 11.85 Q1.85 10.2 0.6 8.85 L0.4 8.25 0.3 4.55 0.35 4.5 0.3 3.95 0.3 3.85 0.3 3.35 0.3 3.25 0.3 2.75 0.35 2.65 0.3 2.15 0.35 1.95 0.3 1.55 Q0.3 1.3 0.45 1.1 0.55 0.85 0.8 0.75 L1.25 0.65 4.8 0.85 Q5.1 0.9 5.3 1.1 7.15 2.6 9.45 3.15 L9.95 3.5 10.1 4.1 10.05 4.3 12.25 2.15 Q12.5 1.85 12.85 1.85 L13.5 2.15 15.75 4.4 15.65 4.2 15.85 3.6 16.35 3.25 Q18.6 2.65 20.45 1.1 20.7 0.9 21.0 0.85" fill="#1c1c26" fill-rule="evenodd" stroke="none"/>
    <path d="M24.5 0.75 L25.0 0.85 24.95 0.85 25.3 1.2 25.35 1.2 25.45 1.7 25.35 5.25 25.15 5.8 Q23.6 7.65 22.9 9.85 L22.55 10.35 21.95 10.5 21.85 10.5 24.05 12.65 24.3 13.25 24.05 13.9 21.85 16.1 22.0 16.05 22.6 16.25 22.6 16.2 23.0 16.7 Q23.65 19.0 25.2 21.0 L25.4 21.55 25.45 24.9 25.2 25.5 Q25.0 25.75 24.6 25.8 L21.1 25.95 20.45 25.7 Q18.6 24.05 16.3 23.35 L15.8 23.0 15.65 22.4 15.65 22.25 13.5 24.45 12.85 24.7 12.25 24.45 10.0 22.3 10.05 22.45 9.9 23.05 9.4 23.4 Q7.15 24.05 5.2 25.7 L4.65 25.95 1.1 25.95 0.65 25.85 0.3 25.5 0.2 25.05 0.3 21.6 0.55 21.05 Q2.15 19.1 2.8 16.75 2.9 16.45 3.15 16.25 L3.75 16.1 3.9 16.15 1.65 13.9 1.4 13.25 Q1.4 12.9 1.65 12.65 L3.85 10.5 3.75 10.5 3.15 10.35 2.8 9.9 2.8 9.85 Q2.15 7.6 0.6 5.85 L0.4 5.25 0.3 1.55 Q0.3 1.3 0.45 1.1 0.55 0.85 0.8 0.75 L1.25 0.65 4.8 0.85 Q5.1 0.9 5.3 1.1 7.15 2.6 9.45 3.15 L9.95 3.5 10.1 4.1 10.05 4.3 12.25 2.15 Q12.5 1.85 12.85 1.85 L13.5 2.15 15.75 4.4 15.65 4.2 15.85 3.6 16.35 3.25 Q18.6 2.65 20.45 1.1 20.7 0.9 21.0 0.85 L24.5 0.75" fill="#39394d" fill-rule="evenodd" stroke="none"/>
    <path d="M5.05 8.25 L3.65 9.65 Q3.0 7.2 1.25 5.3 L1.2 1.55 4.75 1.8 Q6.8 3.4 9.2 4.05 L7.75 5.5 Q7.35 5.9 7.25 6.45 7.2 7.0 7.45 7.45 L7.45 7.55 7.35 7.8 7.1 7.9 6.9 7.9 5.95 7.8 Q5.4 7.9 5.05 8.25 M4.45 2.65 L2.05 2.45 2.1 4.95 Q3.35 6.4 4.0 8.1 L4.5 7.65 5.8 6.95 6.4 6.9 6.45 6.3 Q6.55 5.5 7.15 4.9 L7.65 4.45 Q5.95 3.75 4.45 2.65 M6.25 9.45 L7.1 9.6 Q7.9 9.6 8.5 8.95 9.1 8.35 9.1 7.55 L8.9 6.7 12.85 2.8 16.75 6.7 16.55 7.55 Q16.55 8.35 17.2 8.95 17.75 9.6 18.6 9.6 L19.5 9.45 23.4 13.3 19.5 17.25 18.6 17.05 Q17.75 17.05 17.2 17.6 16.55 18.3 16.55 19.15 L16.75 19.95 12.85 23.85 8.9 19.95 9.1 19.15 Q9.1 18.3 8.5 17.6 7.9 17.05 7.1 17.05 L6.25 17.25 2.3 13.3 6.25 9.45 M12.85 6.85 L13.85 7.85 Q13.95 9.6 15.25 10.9 16.55 12.15 18.35 12.4 L19.3 13.3 18.35 14.3 Q16.55 14.4 15.25 15.75 13.95 17.05 13.85 18.85 L12.85 19.8 11.9 18.85 Q11.75 17.05 10.4 15.75 9.15 14.4 7.4 14.3 L6.4 13.3 7.4 12.4 Q9.15 12.15 10.4 10.9 11.75 9.6 11.9 7.85 L12.85 6.85 M12.9 8.3 L12.9 8.25 12.85 8.25 12.85 8.3 Q12.55 10.2 11.05 11.6 L11.1 11.6 Q9.7 12.95 7.85 13.3 L7.75 13.3 7.8 13.3 7.75 13.35 7.85 13.4 Q9.7 13.6 11.1 15.05 L11.1 15.1 Q12.55 16.5 12.85 18.4 L12.85 18.45 12.9 18.6 12.9 18.45 12.9 18.4 Q13.1 16.45 14.55 15.05 16.0 13.6 17.9 13.4 L18.0 13.35 17.95 13.3 18.0 13.3 17.9 13.3 Q16.0 12.95 14.55 11.6 13.15 10.15 12.9 8.3 M10.5 7.4 L10.5 7.55 Q10.5 8.95 9.5 10.0 8.45 11.0 7.1 11.0 L6.95 11.0 4.65 13.3 6.95 15.65 7.1 15.65 Q8.45 15.65 9.5 16.7 10.5 17.6 10.5 19.15 L10.5 19.3 12.85 21.6 15.15 19.3 15.15 19.15 Q15.15 17.6 16.15 16.7 17.2 15.65 18.6 15.65 L18.8 15.65 21.1 13.3 18.8 11.0 18.6 11.0 Q17.2 11.0 16.15 10.0 15.15 8.95 15.15 7.55 L15.15 7.4 12.85 5.05 10.5 7.4 M18.55 4.95 Q19.1 5.5 19.25 6.25 L19.25 6.95 19.95 6.95 Q20.7 7.1 21.25 7.65 L21.7 8.1 Q22.4 6.4 23.65 4.9 L23.65 2.55 21.35 2.65 Q19.85 3.85 18.15 4.5 L18.55 4.9 18.55 4.95 M18.3 19.25 L18.25 19.15 18.4 18.8 18.6 18.75 18.9 18.8 19.85 18.9 20.7 18.45 22.1 17.0 Q22.85 19.45 24.5 21.6 L24.55 24.9 21.05 25.05 Q19.05 23.25 16.55 22.5 L17.95 21.15 18.4 20.25 18.3 19.25 M18.6 7.9 L18.45 7.85 18.35 7.75 18.25 7.55 18.3 7.35 18.4 6.4 17.95 5.55 16.55 4.15 Q19.0 3.5 21.05 1.8 L24.55 1.65 24.45 5.25 Q22.75 7.25 22.05 9.6 L20.65 8.25 Q20.3 7.9 19.8 7.8 L18.8 7.9 18.6 7.9 M20.0 19.7 L19.25 19.75 19.25 20.4 Q19.1 21.15 18.55 21.75 L18.1 22.2 Q19.85 22.9 21.35 24.2 L23.7 24.1 23.65 21.9 Q22.5 20.3 21.75 18.55 L21.25 19.0 Q20.75 19.55 20.0 19.7 M7.35 18.8 L7.45 19.15 7.4 19.25 Q7.2 19.7 7.25 20.25 L7.75 21.15 9.15 22.55 Q6.7 23.3 4.65 25.05 L1.1 25.1 1.2 21.65 Q2.95 19.55 3.65 17.05 L5.05 18.45 Q5.4 18.8 5.95 18.9 L6.95 18.75 7.1 18.75 7.35 18.8 M5.8 19.7 L4.5 19.0 4.45 19.0 4.0 18.6 Q3.3 20.4 2.05 21.95 L1.95 24.25 4.35 24.2 Q5.85 22.95 7.6 22.2 L7.15 21.75 Q6.55 21.15 6.45 20.4 L6.4 19.75 5.8 19.7" fill="#cf381a" fill-rule="evenodd" stroke="none"/>
    <path d="M4.45 2.65 Q5.95 3.75 7.65 4.45 L7.15 4.9 Q6.55 5.5 6.45 6.3 L6.4 6.9 5.8 6.95 4.5 7.65 4.0 8.1 Q3.35 6.4 2.1 4.95 L2.05 2.45 4.45 2.65 M12.9 8.3 Q13.15 10.15 14.55 11.6 16.0 12.95 17.9 13.3 L18.0 13.3 17.95 13.3 18.0 13.35 17.9 13.4 Q16.0 13.6 14.55 15.05 13.1 16.45 12.9 18.4 L12.9 18.45 12.9 18.6 12.85 18.45 12.85 18.4 Q12.55 16.5 11.1 15.1 L11.1 15.05 Q9.7 13.6 7.85 13.4 L7.75 13.35 7.8 13.3 7.75 13.3 7.85 13.3 Q9.7 12.95 11.1 11.6 L11.05 11.6 Q12.55 10.2 12.85 8.3 L12.85 8.25 12.9 8.25 12.9 8.3 M18.55 4.95 L18.55 4.9 18.15 4.5 Q19.85 3.85 21.35 2.65 L23.65 2.55 23.65 4.9 Q22.4 6.4 21.7 8.1 L21.25 7.65 Q20.7 7.1 19.95 6.95 L19.25 6.95 19.25 6.25 Q19.1 5.5 18.55 4.95 M20.0 19.7 Q20.75 19.55 21.25 19.0 L21.75 18.55 Q22.5 20.3 23.65 21.9 L23.7 24.1 21.35 24.2 Q19.85 22.9 18.1 22.2 L18.55 21.75 Q19.1 21.15 19.25 20.4 L19.25 19.75 20.0 19.7 M5.8 19.7 L6.4 19.75 6.45 20.4 Q6.55 21.15 7.15 21.75 L7.6 22.2 Q5.85 22.95 4.35 24.2 L1.95 24.25 2.05 21.95 Q3.3 20.4 4.0 18.6 L4.45 19.0 4.5 19.0 5.8 19.7" fill="#f76d18" fill-rule="evenodd" stroke="none"/>
    <path d="M12.85 6.85 L11.9 7.85 Q11.75 9.6 10.4 10.9 9.15 12.15 7.4 12.4 L6.4 13.3 7.4 14.3 Q9.15 14.4 10.4 15.75 11.75 17.05 11.9 18.85 L12.85 19.8 13.85 18.85 Q13.95 17.05 15.25 15.75 16.55 14.4 18.35 14.3 L19.3 13.3 18.35 12.4 Q16.55 12.15 15.25 10.9 13.95 9.6 13.85 7.85 L12.85 6.85 M10.5 7.4 L12.85 5.05 15.15 7.4 15.15 7.55 Q15.15 8.95 16.15 10.0 17.2 11.0 18.6 11.0 L18.8 11.0 21.1 13.3 18.8 15.65 18.6 15.65 Q17.2 15.65 16.15 16.7 15.15 17.6 15.15 19.15 L15.15 19.3 12.85 21.6 10.5 19.3 10.5 19.15 Q10.5 17.6 9.5 16.7 8.45 15.65 7.1 15.65 L6.95 15.65 4.65 13.3 6.95 11.0 7.1 11.0 Q8.45 11.0 9.5 10.0 10.5 8.95 10.5 7.55 L10.5 7.4" fill="#fee7b4" fill-rule="evenodd" stroke="none"/>
  </g>
</svg>
