<?xml version="1.0" encoding="UTF-8" standalone="no"?>
<svg xmlns:xlink="http://www.w3.org/1999/xlink" height="98.45px" width="90.6px" xmlns="http://www.w3.org/2000/svg">
  <g transform="matrix(1.0, 0.0, 0.0, 1.0, 149.1, 207.6)">
    <path d="M-63.9 -150.75 L-63.85 -150.85 -63.65 -150.6 -63.9 -150.75" fill="#974646" fill-rule="evenodd" stroke="none"/>
    <path d="M-135.45 -154.3 L-135.4 -154.45 -135.4 -154.3 -135.45 -154.3 M-113.85 -121.85 L-113.35 -121.35 -113.35 -121.3 -113.45 -121.4 -113.55 -121.4 -113.7 -121.4 -113.95 -121.45 -113.85 -121.85 M-77.5 -135.3 L-77.1 -135.25 -77.85 -133.6 -77.5 -135.3" fill="#a12020" fill-opacity="0.32941177" fill-rule="evenodd" stroke="none"/>
    <path d="M-113.4 -150.9 L-113.4 -150.7 -113.7 -150.7 -113.4 -150.9" fill="#a13d3d" fill-opacity="0.88235295" fill-rule="evenodd" stroke="none"/>
    <path d="M-125.4 -130.45 Q-125.05 -127.5 -124.4 -126.6 L-124.75 -126.3 -124.75 -126.35 -125.4 -127.6 -125.45 -130.45 -125.4 -130.45 M-99.3 -121.15 L-98.95 -121.15 -99.25 -121.1 -99.3 -121.15 M-95.45 -121.7 L-95.8 -121.65 -95.65 -121.9 -95.45 -121.7" fill="#c2826a" fill-rule="evenodd" stroke="none"/>
    <path d="M-102.0 -121.9 Q-99.95 -122.7 -98.7 -123.65 -97.05 -124.85 -95.25 -128.1 -93.6 -131.25 -92.45 -132.0 -92.45 -130.2 -92.9 -126.6 L-91.85 -126.45 Q-89.65 -126.45 -84.1 -136.15 -78.75 -145.85 -78.3 -145.85 -77.1 -145.85 -77.1 -144.6 -77.1 -143.9 -78.3 -140.9 -78.3 -140.45 -77.55 -139.7 L-75.8 -141.2 Q-74.55 -140.0 -74.9 -139.25 L-74.55 -139.0 Q-73.4 -140.15 -72.65 -143.6 L-71.3 -148.8 Q-70.4 -148.5 -70.25 -146.75 L-70.1 -145.35 Q-67.7 -152.8 -67.7 -157.4 -67.7 -158.9 -68.35 -161.6 L-69.1 -164.9 -68.35 -165.0 Q-66.55 -165.0 -66.55 -158.6 -66.55 -154.3 -67.6 -149.4 -68.2 -146.55 -68.75 -144.75 L-68.05 -144.05 Q-67.6 -143.45 -67.6 -143.0 L-67.65 -142.15 -68.5 -140.35 -69.4 -138.35 -69.5 -138.35 -69.5 -141.2 Q-71.45 -141.05 -72.35 -137.5 L-72.85 -135.15 -72.95 -135.0 Q-73.3 -134.0 -74.9 -132.2 L-75.55 -131.35 -75.3 -134.35 Q-75.3 -136.0 -76.35 -136.45 L-77.1 -135.25 -77.5 -135.3 -77.55 -136.15 Q-79.05 -136.0 -80.85 -133.8 L-82.9 -131.25 -83.05 -131.25 Q-83.05 -132.15 -84.1 -132.15 -85.45 -132.15 -86.95 -127.5 -87.85 -124.85 -87.95 -123.35 L-88.3 -123.2 -88.4 -123.2 -89.55 -122.75 -89.8 -123.1 Q-89.9 -124.1 -90.8 -124.1 L-92.1 -123.65 -93.3 -122.65 Q-94.75 -124.7 -95.25 -124.85 -95.75 -125.0 -96.9 -123.6 L-98.95 -121.15 -99.3 -121.15 -100.25 -121.3 -102.0 -121.15 -102.0 -121.9 M-144.75 -153.5 L-144.95 -154.75 -145.55 -159.2 -144.95 -160.55 -144.4 -160.55 -144.2 -156.1 Q-143.6 -155.5 -143.15 -156.1 L-142.9 -152.1 Q-142.75 -149.85 -142.15 -148.2 -141.7 -148.05 -140.95 -148.5 -140.5 -147.9 -139.9 -145.65 L-138.7 -142.25 -138.1 -144.2 -139.0 -148.05 Q-140.2 -153.7 -140.2 -158.15 -140.2 -165.0 -137.95 -172.15 -135.6 -179.6 -131.85 -183.15 L-131.6 -182.75 Q-138.55 -174.1 -138.55 -158.9 -138.55 -152.1 -137.55 -146.75 L-135.45 -154.3 -135.4 -154.3 Q-135.4 -142.25 -134.25 -142.25 -133.35 -142.25 -133.35 -143.0 -133.05 -143.0 -133.05 -143.3 L-132.9 -140.15 Q-131.75 -139.4 -131.45 -135.85 -131.1 -132.55 -128.9 -132.15 L-128.75 -135.7 Q-128.3 -139.0 -127.25 -139.0 -126.05 -139.0 -125.6 -132.55 L-125.4 -130.45 -125.45 -130.45 Q-125.65 -132.2 -127.2 -132.2 L-128.1 -131.95 -128.25 -131.7 Q-128.25 -129.8 -127.85 -128.5 L-128.05 -128.45 Q-129.9 -129.95 -131.55 -132.7 -133.25 -135.55 -133.95 -136.2 L-134.7 -135.8 -135.1 -135.65 -135.85 -138.1 Q-136.25 -139.5 -137.35 -140.35 L-138.05 -139.8 -138.1 -138.15 -139.0 -139.4 Q-142.9 -145.2 -144.4 -151.8 L-144.7 -153.1 -144.7 -153.3 -144.75 -153.5 M-124.4 -126.6 L-123.85 -126.2 Q-123.5 -126.2 -122.35 -127.35 -121.9 -127.35 -121.45 -126.6 -120.85 -125.6 -120.25 -125.15 L-119.95 -125.45 -120.7 -128.25 -121.6 -132.4 -121.3 -134.2 -121.0 -134.35 Q-120.55 -133.6 -119.35 -130.05 -118.3 -126.75 -117.25 -125.45 L-116.85 -125.45 -116.55 -127.35 Q-116.25 -127.35 -116.25 -127.65 -114.9 -126.2 -114.0 -122.6 L-114.3 -122.45 -113.85 -121.85 -113.95 -121.45 -115.95 -122.0 -116.5 -122.2 -117.0 -122.35 -118.95 -123.0 -119.8 -123.35 -120.85 -123.8 -121.85 -124.25 -123.1 -124.9 -123.75 -125.4 -124.75 -126.3 -124.4 -126.6" fill="#ba6b8f" fill-rule="evenodd" stroke="none"/>
    <path d="M-116.4 -205.95 Q-110.45 -207.6 -103.9 -207.6 -97.2 -207.6 -91.25 -205.95 L-87.95 -204.9 Q-79.05 -201.65 -71.6 -194.35 -58.5 -181.1 -58.5 -162.2 -58.5 -143.45 -71.6 -130.2 -74.5 -127.35 -77.65 -125.05 L-77.65 -124.4 Q-77.65 -123.8 -79.75 -121.85 L-82.7 -119.35 -84.3 -118.95 -85.3 -118.65 -85.4 -113.9 -85.55 -113.65 Q-85.7 -113.4 -86.35 -113.4 -87.85 -113.4 -87.9 -115.5 L-87.85 -117.15 -88.75 -116.4 -88.8 -115.0 -88.85 -109.5 -89.7 -109.15 Q-90.75 -110.3 -90.7 -113.0 L-90.7 -115.35 -91.45 -115.3 Q-92.4 -115.3 -93.95 -116.15 L-95.85 -117.3 -96.6 -117.5 -100.45 -117.05 -101.0 -116.9 -105.05 -116.1 -106.35 -115.35 Q-107.7 -114.65 -108.3 -114.65 -111.75 -114.65 -113.2 -116.0 -114.6 -117.45 -115.95 -117.45 -116.5 -117.45 -117.15 -116.9 -117.8 -116.4 -118.35 -116.4 L-118.4 -116.4 Q-118.75 -115.7 -119.6 -115.7 -121.3 -115.7 -122.15 -117.7 L-122.8 -120.0 -123.6 -120.75 -125.05 -121.7 -126.2 -122.75 -126.6 -122.95 -128.25 -123.2 -130.4 -123.6 Q-131.55 -124.5 -132.15 -125.7 L-132.8 -127.45 -135.75 -130.2 -137.7 -132.15 Q-140.8 -135.7 -143.0 -139.4 -146.45 -145.2 -147.95 -151.8 -149.1 -156.65 -149.1 -162.2 -149.1 -178.55 -139.15 -190.6 L-135.75 -194.35 Q-128.6 -201.65 -119.5 -204.9 L-116.4 -205.95 M-67.65 -142.15 L-66.8 -143.8 -65.4 -147.65 Q-64.6 -149.8 -63.9 -150.75 L-63.65 -150.6 -63.65 -150.05 Q-61.95 -155.75 -61.95 -162.2 -61.95 -179.75 -74.3 -191.95 -86.5 -204.15 -103.9 -204.15 -121.3 -204.15 -133.35 -191.95 L-134.7 -190.6 Q-145.7 -178.85 -145.7 -162.2 -145.7 -157.6 -144.75 -153.5 L-144.7 -153.3 -144.7 -153.1 -144.4 -151.8 Q-142.9 -145.2 -139.0 -139.4 L-138.1 -138.15 -138.05 -139.8 -137.35 -140.35 Q-136.25 -139.5 -135.85 -138.1 L-135.1 -135.65 -134.7 -135.8 -133.95 -136.2 Q-133.25 -135.55 -131.55 -132.7 -129.9 -129.95 -128.05 -128.45 L-127.85 -128.5 Q-128.25 -129.8 -128.25 -131.7 L-128.1 -131.95 -127.2 -132.2 Q-125.65 -132.2 -125.45 -130.45 L-125.4 -127.6 -124.75 -126.35 -124.75 -126.3 -123.75 -125.4 -123.1 -124.9 -121.85 -124.25 -120.85 -123.8 -119.8 -123.35 -118.95 -123.0 -117.0 -122.35 -116.5 -122.2 -115.95 -122.0 -113.95 -121.45 -113.7 -121.4 -113.55 -121.4 -113.45 -121.4 -113.35 -121.3 -113.35 -121.35 -111.15 -120.9 Q-110.0 -121.85 -109.75 -123.65 -109.6 -125.25 -109.6 -128.7 L-108.95 -128.7 Q-108.8 -128.5 -108.35 -124.0 -108.05 -120.9 -106.15 -120.9 -103.9 -120.9 -103.5 -121.9 -103.5 -123.1 -103.15 -123.6 L-102.6 -123.65 Q-102.2 -123.05 -102.0 -121.9 L-102.0 -121.15 -100.25 -121.3 -99.3 -121.15 -99.25 -121.1 -98.95 -121.15 -96.9 -123.6 Q-95.75 -125.0 -95.25 -124.85 -94.75 -124.7 -93.3 -122.65 L-92.1 -123.65 -90.8 -124.1 Q-89.9 -124.1 -89.8 -123.1 L-89.55 -122.75 -88.3 -123.2 -87.95 -123.35 Q-81.35 -126.05 -75.75 -131.15 L-75.55 -131.35 -74.9 -132.2 Q-73.3 -134.0 -72.95 -135.0 L-72.85 -135.15 Q-72.3 -136.55 -71.35 -137.35 -70.6 -137.95 -69.5 -138.35 L-69.4 -138.35 -68.5 -140.35 -67.65 -142.15 M-95.45 -121.7 L-95.65 -121.9 -95.8 -121.65 -95.45 -121.7" fill="#874e66" fill-rule="evenodd" stroke="none"/>
    <path d="M-67.65 -142.15 L-67.6 -143.0 Q-67.6 -143.45 -68.05 -144.05 L-68.75 -144.75 Q-68.2 -146.55 -67.6 -149.4 -66.55 -154.3 -66.55 -158.6 -66.55 -165.0 -68.35 -165.0 L-69.1 -164.9 -68.35 -161.6 Q-67.7 -158.9 -67.7 -157.4 -67.7 -152.8 -70.1 -145.35 L-70.25 -146.75 Q-70.4 -148.5 -71.3 -148.8 L-72.65 -143.6 Q-73.4 -140.15 -74.55 -139.0 L-74.9 -139.25 Q-74.55 -140.0 -75.8 -141.2 L-77.55 -139.7 Q-78.3 -140.45 -78.3 -140.9 -77.1 -143.9 -77.1 -144.6 -77.1 -145.85 -78.3 -145.85 -78.75 -145.85 -84.1 -136.15 -89.65 -126.45 -91.85 -126.45 L-92.9 -126.6 Q-92.45 -130.2 -92.45 -132.0 -93.6 -131.25 -95.25 -128.1 -97.05 -124.85 -98.7 -123.65 -99.95 -122.7 -102.0 -121.9 -102.2 -123.05 -102.6 -123.65 L-103.15 -123.6 Q-103.5 -123.1 -103.5 -121.9 -103.9 -120.9 -106.15 -120.9 -108.05 -120.9 -108.35 -124.0 -108.8 -128.5 -108.95 -128.7 L-109.6 -128.7 Q-109.6 -125.25 -109.75 -123.65 -110.0 -121.85 -111.15 -120.9 L-113.35 -121.35 -113.85 -121.85 -114.3 -122.45 -114.0 -122.6 Q-114.9 -126.2 -116.25 -127.65 -116.25 -127.35 -116.55 -127.35 L-116.85 -125.45 -117.25 -125.45 Q-118.3 -126.75 -119.35 -130.05 -120.55 -133.6 -121.0 -134.35 L-121.3 -134.2 -121.6 -132.4 -120.7 -128.25 -119.95 -125.45 -120.25 -125.15 Q-120.85 -125.6 -121.45 -126.6 -121.9 -127.35 -122.35 -127.35 -123.5 -126.2 -123.85 -126.2 L-124.4 -126.6 Q-125.05 -127.5 -125.4 -130.45 L-125.6 -132.55 Q-126.05 -139.0 -127.25 -139.0 -128.3 -139.0 -128.75 -135.7 L-128.9 -132.15 Q-131.1 -132.55 -131.45 -135.85 -131.75 -139.4 -132.9 -140.15 L-133.05 -143.3 Q-133.05 -143.0 -133.35 -143.0 -133.35 -142.25 -134.25 -142.25 -135.4 -142.25 -135.4 -154.3 L-135.4 -154.45 -135.45 -154.3 -137.55 -146.75 Q-138.55 -152.1 -138.55 -158.9 -138.55 -174.1 -131.6 -182.75 L-131.85 -183.15 Q-135.6 -179.6 -137.95 -172.15 -140.2 -165.0 -140.2 -158.15 -140.2 -153.7 -139.0 -148.05 L-138.1 -144.2 -138.7 -142.25 -139.9 -145.65 Q-140.5 -147.9 -140.95 -148.5 -141.7 -148.05 -142.15 -148.2 -142.75 -149.85 -142.9 -152.1 L-143.15 -156.1 Q-143.6 -155.5 -144.2 -156.1 L-144.4 -160.55 -144.95 -160.55 -145.55 -159.2 -144.95 -154.75 -144.75 -153.5 Q-145.7 -157.6 -145.7 -162.2 -145.7 -178.85 -134.7 -190.6 L-133.35 -191.95 Q-121.3 -204.15 -103.9 -204.15 -86.5 -204.15 -74.3 -191.95 -61.95 -179.75 -61.95 -162.2 -61.95 -155.75 -63.65 -150.05 L-63.65 -150.6 -63.85 -150.85 -63.9 -150.75 Q-64.6 -149.8 -65.4 -147.65 L-66.8 -143.8 -67.65 -142.15 M-87.95 -123.35 Q-87.85 -124.85 -86.95 -127.5 -85.45 -132.15 -84.1 -132.15 -83.05 -132.15 -83.05 -131.25 L-82.9 -131.25 -80.85 -133.8 Q-79.05 -136.0 -77.55 -136.15 L-77.5 -135.3 -77.85 -133.6 -77.1 -135.25 -76.35 -136.45 Q-75.3 -136.0 -75.3 -134.35 L-75.55 -131.35 -75.75 -131.15 Q-81.35 -126.05 -87.95 -123.35 M-72.85 -135.15 L-72.35 -137.5 Q-71.45 -141.05 -69.5 -141.2 L-69.5 -138.35 Q-70.6 -137.95 -71.35 -137.35 -72.3 -136.55 -72.85 -135.15 M-113.4 -150.9 L-113.7 -150.7 -113.4 -150.7 -113.4 -150.9" fill="url(#gradient0)" fill-rule="evenodd" stroke="none"/>
    <path d="M-89.55 -122.75 L-88.4 -123.2 -88.3 -123.2 -89.55 -122.75" fill="url(#gradient1)" fill-rule="evenodd" stroke="none"/>
    <path d="M-94.85 -188.9 Q-87.55 -180.1 -87.55 -167.0 -87.4 -154.4 -94.7 -145.0 -102.0 -136.05 -112.1 -135.9 -122.2 -135.9 -129.35 -144.85 -136.65 -154.05 -136.65 -166.7 -136.65 -179.8 -129.55 -188.9 -122.7 -197.8 -112.3 -197.95 -102.35 -197.8 -94.85 -188.9 M-112.75 -190.65 Q-121.4 -190.55 -127.55 -183.05 -133.85 -175.5 -133.7 -164.65 -133.35 -154.05 -127.2 -146.8 -120.75 -139.5 -111.8 -139.3 -102.65 -139.65 -96.5 -147.2 -90.2 -154.65 -90.55 -165.4 -90.55 -176.1 -97.2 -183.55 -103.65 -190.55 -112.75 -190.65" fill="url(#gradient2)" fill-rule="evenodd" stroke="none"/>
    <path d="M-119.4 -178.0 Q-122.2 -172.65 -122.05 -164.9 -121.9 -157.2 -118.9 -151.85 -116.25 -146.5 -112.3 -146.5 -108.45 -146.5 -105.8 -152.1 -103.15 -157.5 -103.15 -165.2 -103.3 -172.8 -106.3 -178.2 -109.1 -183.4 -112.95 -183.55 -116.9 -183.7 -119.4 -178.0 M-112.75 -190.65 Q-103.65 -190.55 -97.2 -183.55 -90.55 -176.1 -90.55 -165.4 -90.2 -154.65 -96.5 -147.2 -102.65 -139.65 -111.8 -139.3 -120.75 -139.5 -127.2 -146.8 -133.35 -154.05 -133.7 -164.65 -133.85 -175.5 -127.55 -183.05 -121.4 -190.55 -112.75 -190.65" fill="url(#gradient3)" fill-rule="evenodd" stroke="none"/>
    <path d="M-119.4 -178.0 Q-116.9 -183.7 -112.95 -183.55 -109.1 -183.4 -106.3 -178.2 -103.3 -172.8 -103.15 -165.2 -103.15 -157.5 -105.8 -152.1 -108.45 -146.5 -112.3 -146.5 -116.25 -146.5 -118.9 -151.85 -121.9 -157.2 -122.05 -164.9 -122.2 -172.65 -119.4 -178.0" fill="#3c0c00" fill-rule="evenodd" stroke="none"/>
    <path d="M-102.95 -150.25 Q-106.75 -143.3 -112.25 -143.45 -117.95 -143.35 -121.7 -149.95 L-121.65 -149.9 Q-125.6 -156.05 -125.85 -164.85 -126.05 -173.7 -122.35 -179.8 L-122.3 -179.9 Q-118.8 -186.85 -113.0 -186.55 -107.55 -186.45 -103.6 -180.05 -99.7 -173.95 -99.45 -165.25 -99.45 -156.4 -102.95 -150.25" fill="#3d0b00" fill-opacity="0.3764706" fill-rule="evenodd" stroke="none"/>
    <path d="M-118.7 -179.05 Q-114.85 -178.75 -114.85 -174.9 -114.85 -171.3 -118.7 -171.3 -120.65 -171.3 -121.85 -173.1 -122.75 -174.75 -122.75 -175.5 -122.75 -179.5 -118.7 -179.05 M-105.35 -159.1 Q-106.35 -163.15 -101.3 -161.05 -96.25 -158.65 -95.95 -157.35 L-95.8 -156.45 Q-96.1 -155.55 -97.75 -155.1 -101.75 -154.2 -105.35 -159.1 M-103.55 -148.85 Q-105.05 -148.4 -106.35 -149.75 -107.55 -151.1 -107.85 -152.1 -108.75 -156.0 -106.05 -154.8 -103.4 -153.9 -102.65 -150.35 -102.35 -149.45 -102.5 -149.15 L-103.55 -148.85" fill="#ffffff" fill-opacity="0.76862746" fill-rule="evenodd" stroke="none"/>
    <path d="M-118.7 -179.05 Q-122.75 -179.5 -122.75 -175.5 -122.75 -174.75 -121.85 -173.1 -120.65 -171.3 -118.7 -171.3 -114.85 -171.3 -114.85 -174.9 -114.85 -178.75 -118.7 -179.05 M-112.15 -171.3 Q-115.15 -170.15 -118.4 -169.4 -121.7 -168.2 -124.25 -170.3 -128.25 -172.95 -128.55 -178.45 -128.55 -183.95 -122.75 -184.1 -111.3 -182.5 -112.15 -171.3" fill="#ffffff" fill-opacity="0.4117647" fill-rule="evenodd" stroke="none"/>
  </g>
  <defs>
    <radialGradient cx="0" cy="0" fx="448.0" fy="0" gradientTransform="matrix(-0.0256, -0.0441, -0.0473, 0.0274, -105.25, -165.45)" gradientUnits="userSpaceOnUse" id="gradient0" r="819.2" spreadMethod="pad">
      <stop offset="0.24313725490196078" stop-color="#ffffff"/>
      <stop offset="0.7607843137254902" stop-color="#dec1d7"/>
      <stop offset="1.0" stop-color="#cc709c"/>
    </radialGradient>
    <radialGradient cx="0" cy="0" fx="448.0" fy="0" gradientTransform="matrix(-0.0256, -0.0441, -0.0473, 0.0274, -105.25, -165.45)" gradientUnits="userSpaceOnUse" id="gradient1" r="819.2" spreadMethod="pad">
      <stop offset="0.24313725490196078" stop-color="#ffffff"/>
      <stop offset="0.7607843137254902" stop-color="#ddccc1"/>
      <stop offset="1.0" stop-color="#cc8a70"/>
    </radialGradient>
    <linearGradient gradientTransform="matrix(-0.0033, 0.0341, -0.0301, -0.0024, -112.1, -165.95)" gradientUnits="userSpaceOnUse" id="gradient2" spreadMethod="pad" x1="-819.2" x2="819.2">
      <stop offset="0.0" stop-color="#874e66" stop-opacity="0.42352942"/>
      <stop offset="1.0" stop-color="#ffffff"/>
    </linearGradient>
    <radialGradient cx="0" cy="0" gradientTransform="matrix(-0.0315, -1.0E-4, -4.0E-4, 0.0396, -106.2, -161.9)" gradientUnits="userSpaceOnUse" id="gradient3" r="819.2" spreadMethod="pad">
      <stop offset="0.0" stop-color="#730187"/>
      <stop offset="0.6313725490196078" stop-color="#aa00ff"/>
      <stop offset="1.0" stop-color="#ff00e1"/>
    </radialGradient>
  </defs>
</svg>
