<?xml version="1.0" encoding="UTF-8" standalone="no"?>
<svg xmlns:xlink="http://www.w3.org/1999/xlink" height="20.8px" width="33.3px" xmlns="http://www.w3.org/2000/svg">
  <g transform="matrix(1.0, 0.0, 0.0, 1.0, 12.95, 39.35)">
    <path d="M-12.3 -35.15 L-12.3 -18.55 19.75 -22.75 19.75 -39.35 -12.3 -35.15" fill="#00ff00" fill-rule="evenodd" stroke="none">
      <animate attributeName="fill" dur="2s" repeatCount="indefinite" values="#00ff00;#00ff01"/>
      <animate attributeName="fill-opacity" dur="2s" repeatCount="indefinite" values="1.0;1.0"/>
      <animate attributeName="d" dur="2s" repeatCount="indefinite" values="M-12.3 -35.15 L-12.3 -18.55 19.75 -22.75 19.75 -39.35 -12.3 -35.15;M-12.95 -34.75 L-12.95 -18.8 20.35 -21.95 20.35 -37.9 -12.95 -34.75"/>
    </path>
    <path d="M-12.3 -35.15 L19.75 -39.35 19.75 -22.75 -12.3 -18.55 -12.3 -35.15" fill="none" stroke="#000000" stroke-linecap="round" stroke-linejoin="round" stroke-opacity="0.0" stroke-width="1.0">
      <animate attributeName="stroke" dur="2s" repeatCount="indefinite" values="#000000;#000001"/>
      <animate attributeName="stroke-width" dur="2s" repeatCount="indefinite" values="0.0;0.0"/>
      <animate attributeName="fill-opacity" dur="2s" repeatCount="indefinite" values="0.0;0.0"/>
      <animate attributeName="d" dur="2s" repeatCount="indefinite" values="M-12.3 -35.15 L19.75 -39.35 19.75 -22.75 -12.3 -18.55 -12.3 -35.15;M-12.95 -34.75 L20.35 -37.9 20.35 -21.95 -12.95 -18.8 -12.95 -34.75"/>
    </path>
  </g>
</svg>
