<?xml version="1.0" encoding="UTF-8" standalone="no"?>
<svg xmlns:xlink="http://www.w3.org/1999/xlink" height="1.65px" width="1.4px" xmlns="http://www.w3.org/2000/svg">
  <g transform="matrix(1.0, 0.0, 0.0, 1.0, 12.05, 6.15)">
    <path d="M-12.05 -6.15 L-10.65 -6.15 -10.65 -4.5 -12.05 -4.5 -12.05 -6.15" fill="#ffffff" fill-rule="evenodd" stroke="none"/>
  </g>
</svg>
