<?xml version="1.0" encoding="UTF-8" standalone="no"?>
<svg xmlns:xlink="http://www.w3.org/1999/xlink" height="30.8px" width="21.45px" xmlns="http://www.w3.org/2000/svg">
  <g transform="matrix(1.0, 0.0, 0.0, 1.0, 10.45, 15.3)">
    <path d="M0.4 -14.8 L0.55 -14.8 Q5.75 -14.75 9.65 -11.25 L9.65 -10.3 6.9 -10.3 6.9 -8.95 9.65 -8.95 9.65 -7.9 10.5 -7.9 10.5 -5.5 6.7 -5.5 6.7 5.65 10.5 5.65 10.5 8.1 9.65 8.1 9.65 9.25 6.9 9.25 6.9 10.45 9.65 10.45 9.65 11.45 Q5.75 14.95 0.55 15.0 L0.4 15.0 0.3 15.0 0.25 15.0 0.1 15.0 Q-5.1 14.95 -8.9 11.45 L-8.9 10.45 -6.2 10.45 -6.2 9.25 -8.9 9.25 -8.9 8.1 -9.95 8.1 -9.95 5.65 -6.2 5.65 -6.2 -5.5 -9.95 -5.5 -9.95 -7.9 -8.9 -7.9 -8.9 -8.95 -6.2 -8.95 -6.2 -10.3 -8.9 -10.3 -8.9 -11.25 Q-5.1 -14.75 0.1 -14.8 L0.25 -14.8 0.3 -14.8 0.4 -14.8 Z" fill="none" stroke="#495154" stroke-linecap="butt" stroke-linejoin="miter" stroke-miterlimit="3.0" stroke-width="1.0"/>
  </g>
</svg>
