<?xml version="1.0" encoding="UTF-8" standalone="no"?>
<svg xmlns:xlink="http://www.w3.org/1999/xlink" height="30.35px" width="52.3px" xmlns="http://www.w3.org/2000/svg">
  <g transform="matrix(1.0, 0.0, 0.0, 1.0, 24.9, 39.15)">
    <path d="M4.9 -38.35 Q6.85 -38.05 9.9 -36.15 13.6 -33.8 15.05 -33.2 17.25 -32.3 22.2 -27.85 27.4 -23.2 27.4 -21.55 27.4 -20.0 24.75 -18.0 L24.35 -16.8 24.45 -15.95 24.95 -14.9 Q25.1 -14.5 25.8 -14.1 L26.35 -13.4 26.05 -12.85 Q25.75 -12.45 25.8 -12.2 L26.05 -11.25 Q25.95 -10.35 25.2 -10.35 24.3 -10.35 24.1 -11.35 23.8 -12.6 22.6 -13.15 21.9 -13.45 21.5 -14.45 21.25 -15.2 21.25 -16.0 L21.25 -16.1 Q18.95 -15.45 16.6 -16.1 16.2 -14.7 13.75 -12.8 10.4 -10.15 6.1 -10.15 1.3 -10.15 -0.9 -11.75 -1.85 -12.45 -2.35 -13.7 -3.05 -15.95 -2.8 -17.65 L-2.75 -17.8 -3.85 -17.45 -5.95 -17.15 Q-8.35 -17.15 -9.15 -18.7 -9.45 -19.3 -9.45 -20.45 L-9.05 -22.1 -8.45 -23.8 -8.55 -24.05 -9.55 -23.85 -10.3 -23.65 -11.2 -22.7 Q-11.5 -22.35 -12.35 -22.05 -13.45 -21.7 -14.4 -22.05 -13.6 -18.3 -18.55 -17.25 -17.9 -14.8 -19.5 -11.75 -21.05 -8.8 -22.8 -8.8 -24.15 -8.8 -24.5 -9.75 -24.7 -10.25 -24.7 -11.95 L-24.9 -14.95 Q-24.9 -16.35 -24.45 -17.35 -23.95 -18.45 -23.85 -20.85 -23.7 -23.85 -22.0 -26.55 -20.0 -29.6 -16.35 -32.55 -12.1 -35.95 -7.2 -37.8 L-5.45 -38.25 -2.55 -38.75 -0.85 -39.15 3.0 -38.8 4.9 -38.35" fill="#000000" fill-opacity="0.16470589" fill-rule="evenodd" stroke="none"/>
  </g>
</svg>
