<?xml version="1.0" encoding="UTF-8" standalone="no"?>
<svg xmlns:xlink="http://www.w3.org/1999/xlink" height="9.4px" width="41.3px" xmlns="http://www.w3.org/2000/svg">
  <g transform="matrix(1.0, 0.0, 0.0, 1.0, 22.15, 57.3)">
    <path d="M2.2 -50.35 Q2.8 -50.45 3.8 -50.9 2.75 -50.75 2.35 -50.4 L2.2 -50.35 M3.8 -52.2 L8.6 -54.65 Q11.2 -55.95 14.7 -56.85 19.15 -57.95 19.15 -56.35 19.15 -55.8 18.7 -55.65 L15.95 -55.25 9.15 -51.6 Q8.15 -50.85 5.55 -49.7 1.55 -47.9 -1.4 -47.9 -9.05 -47.9 -13.7 -51.75 L-16.65 -54.45 Q-18.15 -55.65 -19.65 -55.65 L-20.7 -55.35 -21.5 -55.1 -21.95 -55.2 -22.1 -55.3 -22.15 -55.7 -21.1 -56.55 -19.1 -56.95 Q-17.15 -56.95 -15.25 -55.45 L-12.65 -53.2 Q-10.95 -51.6 -9.45 -50.85 -6.85 -49.55 -1.3 -49.55 0.65 -49.55 1.65 -50.35 L3.8 -52.2 M5.2 -51.6 L5.1 -51.5 6.85 -52.25 6.65 -52.25 5.2 -51.6" fill="#000000" fill-opacity="0.17254902" fill-rule="evenodd" stroke="none"/>
  </g>
</svg>
