<?xml version="1.0" encoding="UTF-8" standalone="no"?>
<svg xmlns:xlink="http://www.w3.org/1999/xlink" height="30.5px" width="24.75px" xmlns="http://www.w3.org/2000/svg">
  <g transform="matrix(1.0, 0.0, 0.0, 1.0, -0.45, 0.45)">
    <path d="M8.85 2.0 L8.9 2.0 9.25 1.6 Q11.2 -0.3 12.6 -0.4 L13.15 -0.4 Q14.5 -0.3 16.5 1.6 L16.6 1.65 16.6 1.7 16.85 1.95 16.95 2.1 18.35 3.65 18.4 3.7 18.4 3.65 19.1 3.55 20.8 3.9 20.95 3.9 Q23.45 4.6 24.55 5.85 L24.55 5.9 24.8 6.35 Q25.25 7.1 25.15 8.4 L25.15 9.0 25.15 9.65 25.15 10.3 25.15 10.9 Q25.25 12.1 24.8 13.8 L24.75 13.9 24.55 14.75 24.7 15.35 24.7 15.45 24.85 15.95 25.2 18.7 25.2 19.0 25.2 19.35 25.2 19.95 25.2 20.6 25.2 21.0 25.2 21.25 Q25.25 22.45 24.9 23.25 L24.65 23.75 24.6 23.8 24.45 23.9 24.4 24.05 24.35 24.1 Q23.4 25.0 20.95 25.75 L20.6 25.8 18.15 26.3 18.05 26.3 17.7 26.4 17.7 26.55 17.4 27.05 16.75 27.7 16.8 27.7 16.45 28.0 16.4 28.1 Q14.45 30.0 13.05 30.05 L12.5 30.05 Q11.15 29.95 9.2 28.05 L9.15 28.0 8.95 27.85 8.9 27.85 8.7 27.6 8.25 27.05 8.0 26.6 7.95 26.4 7.9 26.4 7.0 26.25 6.95 26.25 6.15 26.1 6.25 26.1 6.15 26.05 5.2 25.9 5.1 25.85 5.05 25.85 4.9 25.8 4.75 25.75 Q2.25 25.0 1.2 23.85 L0.9 23.4 0.85 23.35 0.85 23.3 Q0.45 22.55 0.5 21.35 L0.5 21.1 0.5 20.65 0.5 20.6 0.5 20.35 0.5 20.05 0.5 20.0 0.5 19.35 0.5 19.1 0.5 18.6 Q0.45 17.5 0.85 15.85 L1.0 15.6 1.2 14.95 0.85 13.8 0.85 13.7 0.85 13.75 Q0.45 12.1 0.5 10.95 L0.5 10.3 0.5 9.7 0.5 9.05 0.5 8.4 Q0.45 7.2 0.85 6.4 L0.85 6.35 1.1 5.85 1.2 5.75 1.3 5.65 1.35 5.6 Q2.3 4.6 4.85 3.9 L6.65 3.55 7.2 3.6 7.35 3.7 7.8 3.2 8.85 2.05 8.85 2.0" fill="#1c1c26" fill-rule="evenodd" stroke="none"/>
    <path d="M9.25 1.6 Q11.2 -0.3 12.6 -0.4 L13.15 -0.4 Q14.5 -0.3 16.5 1.6 L16.6 1.65 16.6 1.7 16.85 1.95 16.95 2.1 18.35 3.65 18.4 3.7 18.4 3.65 19.1 3.55 20.8 3.9 20.95 3.9 Q23.45 4.6 24.55 5.85 L24.55 5.9 24.8 6.35 Q25.55 7.7 24.8 10.65 L24.75 10.75 24.3 12.25 24.0 12.7 24.0 12.75 23.85 12.85 23.85 12.95 24.25 13.85 24.25 13.9 24.3 14.0 24.3 13.95 24.7 15.35 24.7 15.45 24.85 15.95 Q25.5 18.65 24.9 20.1 L24.65 20.6 24.6 20.65 24.45 20.75 24.4 20.9 24.35 20.9 Q23.4 21.85 20.95 22.6 L20.6 22.65 18.15 23.15 18.05 23.15 17.7 23.2 17.7 23.4 17.4 23.9 16.75 24.55 16.8 24.55 16.45 24.85 16.4 24.9 16.4 24.95 Q14.45 26.8 13.05 26.9 L12.5 26.9 Q11.15 26.8 9.2 24.9 L9.15 24.85 8.95 24.7 8.9 24.7 8.7 24.4 8.25 23.9 8.0 23.45 7.95 23.2 7.9 23.2 7.0 23.1 6.95 23.1 6.15 22.95 6.25 22.95 6.15 22.9 5.2 22.7 5.1 22.7 5.05 22.7 4.9 22.6 4.75 22.6 Q2.25 21.85 1.2 20.7 L0.9 20.25 0.85 20.15 0.9 20.25 0.85 20.2 0.85 20.15 Q0.1 18.8 0.85 15.85 L1.0 15.6 1.7 13.4 1.7 13.35 1.9 12.95 1.85 12.95 1.7 12.85 1.4 12.4 0.85 10.65 0.85 10.55 Q0.15 7.8 0.85 6.4 L0.85 6.35 1.1 5.85 1.2 5.75 1.3 5.65 1.35 5.6 Q2.3 4.6 4.85 3.9 L6.65 3.55 7.2 3.6 7.35 3.7 7.8 3.2 8.85 2.05 8.85 2.0 8.9 2.0 9.25 1.6" fill="#39394d" fill-rule="evenodd" stroke="none"/>
    <path d="M1.9 6.25 Q2.8 5.4 5.0 4.8 L6.7 4.4 6.25 5.05 Q5.15 6.55 4.1 8.4 L4.15 8.4 2.25 12.05 1.7 10.4 1.7 10.35 Q1.1 7.9 1.65 6.65 L1.75 6.4 1.9 6.25 M16.1 2.6 L17.6 4.2 18.6 5.55 20.7 8.8 22.9 13.2 23.3 14.2 23.75 15.65 23.85 16.05 23.85 16.1 Q24.45 18.55 23.9 19.8 L23.75 20.05 23.6 20.2 Q22.75 21.05 20.5 21.65 L20.45 21.65 17.85 22.2 12.75 22.5 7.95 22.25 7.1 22.1 6.3 21.95 5.3 21.75 4.95 21.65 Q2.75 21.05 1.8 20.0 L1.65 19.75 Q1.05 18.65 1.7 16.05 L1.75 16.05 1.8 15.95 2.55 13.6 2.65 13.25 Q3.5 11.15 4.9 8.8 L6.95 5.55 8.4 3.8 9.5 2.6 9.85 2.25 Q11.55 0.6 12.7 0.55 L12.95 0.55 Q14.05 0.65 15.75 2.25 L16.1 2.6 M8.45 7.25 Q9.15 6.65 10.05 6.65 L10.5 6.65 10.5 6.6 Q10.5 5.65 11.2 5.0 11.85 4.35 12.8 4.35 13.7 4.35 14.35 5.0 15.05 5.65 15.05 6.6 L15.05 6.65 15.5 6.65 Q16.4 6.65 17.05 7.25 17.75 7.95 17.75 8.9 17.75 10.15 16.6 10.8 L16.3 11.0 15.9 11.3 14.25 12.25 Q13.75 11.65 13.05 11.55 L13.05 10.6 12.8 10.35 12.5 10.6 12.5 11.55 Q11.8 11.65 11.35 12.25 L9.7 11.3 9.3 11.05 8.95 10.8 Q7.85 10.15 7.85 8.9 7.85 7.95 8.45 7.25 M9.7 8.8 L9.65 8.85 Q9.35 9.2 9.35 9.7 9.35 10.4 9.9 10.75 L9.95 10.8 11.2 11.5 11.95 11.1 11.95 10.6 Q11.9 10.2 12.15 10.05 L12.45 9.85 12.8 9.8 13.1 9.85 13.4 10.05 13.6 10.6 13.6 11.1 Q14.0 11.25 14.35 11.55 L15.55 10.85 15.6 10.8 Q16.25 10.4 16.25 9.7 16.25 9.2 15.85 8.8 L15.8 8.8 Q15.5 8.45 15.0 8.45 L14.65 8.5 14.25 8.35 14.25 8.3 14.05 7.9 14.05 7.85 Q14.05 7.3 13.7 6.95 L13.6 6.9 Q13.3 6.6 12.8 6.6 12.25 6.6 11.95 6.95 L11.9 6.95 Q11.5 7.3 11.5 7.85 L11.5 7.9 11.35 8.3 11.35 8.35 10.95 8.5 10.9 8.5 10.55 8.45 Q10.05 8.45 9.7 8.8 M19.35 5.05 L18.85 4.4 20.6 4.8 Q22.8 5.4 23.75 6.45 L23.9 6.65 Q24.5 7.8 23.8 10.4 L23.35 12.0 21.45 8.4 19.35 5.05 M15.25 3.95 Q13.75 2.45 12.8 2.25 11.85 2.4 10.35 3.95 8.3 5.95 6.25 9.45 4.2 13.0 3.45 15.9 2.95 17.85 3.35 18.75 4.1 19.55 5.8 20.0 L12.75 20.8 Q16.85 20.8 19.65 20.0 21.45 19.55 22.15 18.9 L22.2 18.8 Q22.6 17.85 22.1 15.9 21.35 13.0 19.35 9.45 17.3 5.95 15.25 3.95 M20.6 17.9 Q20.15 18.7 19.25 18.95 18.35 19.2 17.55 18.7 L17.45 18.7 17.3 19.1 Q16.85 19.95 15.95 20.15 L14.2 19.95 13.4 19.1 Q13.1 18.55 13.1 18.0 L13.1 17.6 13.05 17.1 13.05 15.2 Q13.8 15.1 14.25 14.5 L15.05 15.0 15.4 14.9 15.3 14.5 14.45 14.05 Q14.75 13.4 14.45 12.7 L16.15 11.75 Q16.35 11.6 16.6 11.55 L16.9 11.4 Q18.0 10.7 19.2 11.4 L19.5 11.6 Q20.05 12.0 20.2 12.75 L20.3 13.45 20.0 14.4 19.7 14.75 19.8 14.85 Q20.6 15.3 20.85 16.2 21.1 17.1 20.6 17.9 M17.7 12.25 L16.5 12.2 16.45 12.25 15.15 12.95 15.15 13.75 15.6 14.05 Q16.15 14.3 16.0 14.9 L15.9 15.2 15.75 15.4 15.4 15.6 14.8 15.5 14.75 15.5 14.35 15.25 13.6 15.7 13.6 17.1 13.8 17.75 14.25 18.25 15.2 18.35 15.95 17.75 16.05 17.5 16.3 17.15 16.35 17.15 16.75 17.15 16.85 17.15 16.8 17.15 17.0 17.25 17.9 17.35 17.95 17.35 18.65 16.75 18.8 15.85 18.25 15.05 18.2 15.05 17.95 14.85 17.85 14.45 18.0 14.15 18.05 14.1 18.15 13.9 Q18.4 13.5 18.25 13.0 L18.25 12.95 17.7 12.25 M11.4 13.4 Q11.4 12.85 11.85 12.45 12.2 12.05 12.8 12.05 13.3 12.05 13.7 12.45 14.1 12.85 14.1 13.4 14.1 13.9 13.7 14.3 13.3 14.7 12.8 14.7 12.2 14.7 11.85 14.3 11.4 13.9 11.4 13.4 M12.5 17.1 L12.45 17.7 12.45 18.0 Q12.45 19.3 11.35 19.95 L9.6 20.15 Q8.7 19.95 8.25 19.1 L8.1 18.7 8.0 18.7 6.3 18.95 Q5.4 18.7 4.95 17.9 4.5 17.1 4.7 16.2 4.95 15.3 5.7 14.85 L5.85 14.8 5.55 14.4 Q5.1 13.65 5.35 12.75 5.55 11.85 6.4 11.4 6.9 11.05 7.55 11.05 8.15 11.05 8.6 11.4 L8.95 11.55 9.4 11.75 11.1 12.7 Q10.75 13.4 11.1 14.05 L10.25 14.5 Q10.05 14.7 10.15 14.9 10.25 15.1 10.5 15.0 L11.35 14.5 Q11.8 15.1 12.5 15.2 L12.5 17.1 M9.95 14.05 L10.4 13.75 10.4 12.95 9.1 12.25 9.1 12.2 8.5 12.05 7.9 12.2 7.85 12.25 Q7.4 12.5 7.3 12.95 L7.3 13.0 Q7.15 13.5 7.4 13.9 L7.6 14.2 7.7 14.5 7.6 14.85 7.3 15.05 Q6.9 15.35 6.75 15.85 L6.75 15.9 Q6.65 16.35 6.9 16.75 L7.65 17.35 8.55 17.25 8.75 17.15 8.8 17.15 9.1 17.1 9.1 17.15 9.4 17.3 9.55 17.55 9.6 17.7 9.6 17.75 Q9.9 18.2 10.35 18.35 L10.4 18.35 11.35 18.25 Q11.95 17.85 11.95 17.1 L11.95 15.65 11.2 15.25 10.85 15.45 10.8 15.5 10.2 15.6 Q10.0 15.6 9.85 15.4 L9.7 15.2 9.55 14.9 Q9.45 14.4 9.9 14.1 L9.95 14.05 M9.45 23.9 L9.45 23.85 8.85 23.2 12.75 23.4 16.7 23.2 16.05 23.85 15.7 24.2 Q14.0 25.85 12.85 25.9 L12.55 25.9 Q11.45 25.8 9.75 24.2 L9.45 23.9" fill="#84ab27" fill-rule="evenodd" stroke="none"/>
    <path d="M9.9 14.1 L9.95 14.05 9.9 14.1" fill="#ffffff" fill-rule="evenodd" stroke="none"/>
    <path d="M8.45 7.25 Q7.85 7.95 7.85 8.9 7.85 10.15 8.95 10.8 L9.3 11.05 9.7 11.3 11.35 12.25 Q11.8 11.65 12.5 11.55 L12.5 10.6 12.8 10.35 13.05 10.6 13.05 11.55 Q13.75 11.65 14.25 12.25 L15.9 11.3 16.3 11.0 16.6 10.8 Q17.75 10.15 17.75 8.9 17.75 7.95 17.05 7.25 16.4 6.65 15.5 6.65 L15.05 6.65 15.05 6.6 Q15.05 5.65 14.35 5.0 13.7 4.35 12.8 4.35 11.85 4.35 11.2 5.0 10.5 5.65 10.5 6.6 L10.5 6.65 10.05 6.65 Q9.15 6.65 8.45 7.25 M15.25 3.95 Q17.3 5.95 19.35 9.45 21.35 13.0 22.1 15.9 22.6 17.85 22.2 18.8 L22.15 18.9 Q21.45 19.55 19.65 20.0 16.85 20.8 12.75 20.8 L5.8 20.0 Q4.1 19.55 3.35 18.75 2.95 17.85 3.45 15.9 4.2 13.0 6.25 9.45 8.3 5.95 10.35 3.95 11.85 2.4 12.8 2.25 13.75 2.45 15.25 3.95 M20.6 17.9 Q21.1 17.1 20.85 16.2 20.6 15.3 19.8 14.85 L19.7 14.75 20.0 14.4 20.3 13.45 20.2 12.75 Q20.05 12.0 19.5 11.6 L19.2 11.4 Q18.0 10.7 16.9 11.4 L16.6 11.55 Q16.35 11.6 16.15 11.75 L14.45 12.7 Q14.75 13.4 14.45 14.05 L15.3 14.5 15.4 14.9 15.05 15.0 14.25 14.5 Q13.8 15.1 13.05 15.2 L13.05 17.1 13.1 17.6 13.1 18.0 Q13.1 18.55 13.4 19.1 L14.2 19.95 15.95 20.15 Q16.85 19.95 17.3 19.1 L17.45 18.7 17.55 18.7 Q18.35 19.2 19.25 18.95 20.15 18.7 20.6 17.9 M12.5 17.1 L12.5 15.2 Q11.8 15.1 11.35 14.5 L10.5 15.0 Q10.25 15.1 10.15 14.9 10.05 14.7 10.25 14.5 L11.1 14.05 Q10.75 13.4 11.1 12.7 L9.4 11.75 8.95 11.55 8.6 11.4 Q8.15 11.05 7.55 11.05 6.9 11.05 6.4 11.4 5.55 11.85 5.35 12.75 5.1 13.65 5.55 14.4 L5.85 14.8 5.7 14.85 Q4.95 15.3 4.7 16.2 4.5 17.1 4.95 17.9 5.4 18.7 6.3 18.95 L8.0 18.7 8.1 18.7 8.25 19.1 Q8.7 19.95 9.6 20.15 L11.35 19.95 Q12.45 19.3 12.45 18.0 L12.45 17.7 12.5 17.1 M11.4 13.4 Q11.4 13.9 11.85 14.3 12.2 14.7 12.8 14.7 13.3 14.7 13.7 14.3 14.1 13.9 14.1 13.4 14.1 12.85 13.7 12.45 13.3 12.05 12.8 12.05 12.2 12.05 11.85 12.45 11.4 12.85 11.4 13.4 M9.95 14.05 L9.9 14.1 9.95 14.05" fill="#3e4d20" fill-rule="evenodd" stroke="none"/>
    <path d="M9.7 8.8 Q10.05 8.45 10.55 8.45 L10.9 8.5 10.95 8.5 11.35 8.35 11.35 8.3 11.5 7.9 11.5 7.85 Q11.5 7.3 11.9 6.95 L11.95 6.95 Q12.25 6.6 12.8 6.6 13.3 6.6 13.6 6.9 L13.7 6.95 Q14.05 7.3 14.05 7.85 L14.05 7.9 14.25 8.3 14.25 8.35 14.65 8.5 15.0 8.45 Q15.5 8.45 15.8 8.8 L15.85 8.8 Q16.25 9.2 16.25 9.7 16.25 10.4 15.6 10.8 L15.55 10.85 14.35 11.55 Q14.0 11.25 13.6 11.1 L13.6 10.6 13.4 10.05 13.1 9.85 12.8 9.8 12.45 9.85 12.15 10.05 Q11.9 10.2 11.95 10.6 L11.95 11.1 11.2 11.5 9.95 10.8 9.9 10.75 Q9.35 10.4 9.35 9.7 9.35 9.2 9.65 8.85 L9.7 8.8 M17.7 12.25 L18.25 12.95 18.25 13.0 Q18.4 13.5 18.15 13.9 L18.05 14.1 18.0 14.15 17.85 14.45 17.95 14.85 18.2 15.05 18.25 15.05 18.8 15.85 18.65 16.75 17.95 17.35 17.9 17.35 17.0 17.25 16.8 17.15 16.85 17.15 16.75 17.15 16.35 17.15 16.3 17.15 16.05 17.5 15.95 17.75 15.2 18.35 14.25 18.25 13.8 17.75 13.6 17.1 13.6 15.7 14.35 15.25 14.75 15.5 14.8 15.5 15.4 15.6 15.75 15.4 15.9 15.2 16.0 14.9 Q16.15 14.3 15.6 14.05 L15.15 13.75 15.15 12.95 16.45 12.25 16.5 12.2 17.7 12.25 M9.9 14.1 Q9.45 14.4 9.55 14.9 L9.7 15.2 9.85 15.4 Q10.0 15.6 10.2 15.6 L10.8 15.5 10.85 15.45 11.2 15.25 11.95 15.65 11.95 17.1 Q11.95 17.85 11.35 18.25 L10.4 18.35 10.35 18.35 Q9.9 18.2 9.6 17.75 L9.6 17.7 9.55 17.55 9.4 17.3 9.1 17.15 9.1 17.1 8.8 17.15 8.75 17.15 8.55 17.25 7.65 17.35 6.9 16.75 Q6.65 16.35 6.75 15.9 L6.75 15.85 Q6.9 15.35 7.3 15.05 L7.6 14.85 7.7 14.5 7.6 14.2 7.4 13.9 Q7.15 13.5 7.3 13.0 L7.3 12.95 Q7.4 12.5 7.85 12.25 L7.9 12.2 8.5 12.05 9.1 12.2 9.1 12.25 10.4 12.95 10.4 13.75 9.95 14.05 9.9 14.1" fill="#e9ee87" fill-rule="evenodd" stroke="none"/>
  </g>
</svg>
