<?xml version="1.0" encoding="UTF-8" standalone="no"?>
<svg xmlns:xlink="http://www.w3.org/1999/xlink" height="67.7px" width="122.3px" xmlns="http://www.w3.org/2000/svg">
  <g transform="matrix(1.0, 0.0, 0.0, 1.0, 75.15, 46.1)">
    <path d="M21.55 -36.0 L21.3 -36.35 Q21.3 -38.35 32.3 -42.15 L39.9 -43.9 43.25 -44.5 44.55 -44.5 46.7 -44.45 46.7 -44.4 45.2 -44.15 45.2 -44.05 46.85 -44.1 46.5 -43.6 45.7 -43.5 41.8 -42.9 40.0 -42.75 Q37.7 -42.55 29.25 -39.6 L22.9 -37.25 22.1 -36.95 21.95 -36.75 21.55 -36.0 M45.5 -44.9 L47.0 -45.15 47.05 -45.2 47.1 -45.15 46.95 -45.05 45.5 -44.9 M-75.05 -0.05 L-71.7 0.05 -70.35 0.0 -69.35 -0.15 -68.6 -0.15 -70.35 0.45 -71.0 0.55 -73.35 1.0 -73.5 1.05 -73.4 0.95 -73.4 0.9 -73.5 0.8 -74.8 0.3 -75.15 0.15 -75.05 -0.05 M-74.65 3.4 L-68.75 1.95 -67.65 1.65 Q-63.7 0.5 -60.95 -1.1 L-60.8 -1.1 Q-61.05 -0.55 -62.2 0.15 L-62.9 0.65 -61.7 0.3 -58.35 -0.75 -56.3 -1.55 -56.2 -1.65 Q-55.7 -2.0 -56.15 -2.75 L-48.7 -5.3 -47.6 -5.65 -40.7 -9.9 -21.3 -20.25 Q-19.05 -21.3 -16.85 -22.4 -16.85 -22.7 -13.3 -23.75 -9.75 -24.75 -9.75 -25.45 L-9.9 -25.75 -9.95 -25.8 Q8.4 -33.95 14.1 -34.95 L15.45 -35.1 21.9 -34.1 25.65 -34.85 26.15 -34.95 Q28.95 -35.75 28.95 -36.05 28.95 -36.35 30.5 -36.7 L32.15 -37.1 34.3 -37.45 34.0 -36.9 29.45 -35.9 25.85 -34.7 Q23.05 -33.7 19.65 -32.15 L18.4 -32.9 16.6 -33.35 14.55 -33.15 14.15 -33.1 12.35 -32.5 11.95 -32.4 4.05 -29.7 Q-19.85 -20.95 -42.35 -6.75 L-42.6 -6.6 Q-43.0 -5.5 -44.0 -4.2 L-48.6 -2.05 Q-53.05 -0.15 -59.45 2.85 -65.85 5.8 -67.6 6.15 L-70.4 6.55 Q-71.65 6.35 -72.7 5.6 L-68.9 4.25 -73.35 5.05 -74.65 3.4 M-45.85 -4.55 L-42.6 -6.6 -45.85 -4.55 M-68.9 4.25 L-68.0 4.0 -67.95 3.85 -68.9 4.25" fill="#594b3e" fill-rule="evenodd" stroke="none"/>
    <path d="M26.5 -41.0 L26.55 -40.95 26.4 -40.95 26.5 -41.0" fill="#736050" fill-rule="evenodd" stroke="none"/>
    <path d="M25.65 -41.35 Q26.25 -41.25 26.5 -41.0 L26.4 -40.95 Q25.7 -40.9 22.95 -39.6 L20.1 -38.15 22.4 -38.6 Q20.15 -36.95 19.5 -36.9 L20.15 -36.3 20.45 -36.25 20.6 -36.05 19.85 -35.8 19.2 -35.7 16.6 -36.0 13.95 -35.55 13.85 -35.55 13.95 -35.6 14.45 -35.9 13.9 -35.8 8.75 -34.65 4.35 -33.4 13.7 -37.25 20.8 -39.8 25.65 -41.35 M-43.4 -9.6 Q-46.8 -6.9 -48.65 -5.9 L-54.15 -4.05 -56.65 -3.2 -60.35 -1.95 Q-64.9 -0.7 -68.25 -1.2 L-68.25 -1.35 -66.3 -2.15 -69.8 -2.35 -72.9 -2.8 Q-71.35 -4.2 -69.95 -4.2 -69.5 -4.2 -69.65 -3.85 L-68.4 -3.25 Q-67.4 -2.8 -66.4 -2.8 -62.35 -2.8 -56.75 -4.4 -50.9 -6.15 -43.4 -9.6" fill="#806b59" fill-rule="evenodd" stroke="none"/>
    <path d="M21.55 -36.0 L21.5 -35.95 Q21.5 -35.7 21.9 -35.6 L22.1 -35.6 22.9 -35.4 25.05 -35.6 25.3 -35.7 34.85 -38.5 34.3 -37.45 32.15 -37.1 30.5 -36.7 Q28.95 -36.35 28.95 -36.05 28.95 -35.75 26.15 -34.95 L25.65 -34.85 21.9 -34.1 15.45 -35.1 14.1 -34.95 Q8.4 -33.95 -9.95 -25.8 L-9.9 -25.75 -9.75 -25.45 Q-9.75 -24.75 -13.3 -23.75 -16.85 -22.7 -16.85 -22.4 -19.05 -21.3 -21.3 -20.25 L-40.7 -9.9 -47.6 -5.65 -48.7 -5.3 -56.15 -2.75 Q-55.7 -2.0 -56.2 -1.65 L-56.3 -1.55 -58.35 -0.75 -61.7 0.3 -62.9 0.65 -62.2 0.15 Q-61.05 -0.55 -60.8 -1.1 L-60.95 -1.1 Q-63.7 0.5 -67.65 1.65 L-68.75 1.95 -74.65 3.4 -74.65 3.35 -74.75 3.15 -73.8 2.75 -72.75 2.2 -73.2 2.0 -74.35 1.8 -75.15 1.85 -75.15 1.75 Q-73.85 1.3 -73.5 1.05 L-73.35 1.0 -71.0 0.55 -70.35 0.45 -68.6 -0.15 -69.35 -0.15 -70.35 0.0 -71.7 0.05 -75.05 -0.05 -74.75 -0.8 -74.7 -0.8 -73.15 -1.15 -71.95 -1.05 -72.65 -1.3 -73.45 -1.55 -74.0 -1.75 -73.4 -2.4 -73.05 -2.7 -72.9 -2.8 -69.8 -2.35 -66.3 -2.15 -68.25 -1.35 -68.25 -1.2 Q-64.9 -0.7 -60.35 -1.95 L-56.65 -3.2 -54.15 -4.05 -48.65 -5.9 Q-46.8 -6.9 -43.4 -9.6 L-43.35 -9.65 -13.95 -24.7 Q-4.2 -29.7 4.35 -33.4 L8.75 -34.65 13.9 -35.8 14.45 -35.9 13.95 -35.6 13.85 -35.55 13.95 -35.55 16.6 -36.0 19.2 -35.7 19.85 -35.8 20.6 -36.05 20.45 -36.25 20.15 -36.3 19.5 -36.9 Q20.15 -36.95 22.4 -38.6 L20.1 -38.15 22.95 -39.6 Q25.7 -40.9 26.4 -40.95 L26.55 -40.95 26.5 -41.0 Q26.25 -41.25 25.65 -41.35 33.4 -43.8 37.95 -44.8 L39.25 -45.05 45.85 -46.1 Q46.45 -46.1 47.05 -45.2 L47.0 -45.15 45.5 -44.9 42.45 -44.6 43.25 -44.5 39.9 -43.9 32.3 -42.15 Q21.3 -38.35 21.3 -36.35 L21.55 -36.0" fill="#665647" fill-rule="evenodd" stroke="none"/>
    <path d="M34.3 -37.45 L34.85 -38.5 25.3 -35.7 25.05 -35.6 22.9 -35.4 22.1 -35.6 21.9 -35.6 Q21.5 -35.7 21.5 -35.95 L21.55 -36.0 21.95 -36.75 22.1 -36.95 22.9 -37.25 29.25 -39.6 Q37.7 -42.55 40.0 -42.75 L41.8 -42.9 45.7 -43.5 46.5 -43.6 46.85 -44.1 45.2 -44.05 45.2 -44.15 46.7 -44.4 46.9 -44.5 46.7 -44.45 44.55 -44.5 43.25 -44.5 42.45 -44.6 45.5 -44.9 M47.05 -45.2 Q46.45 -46.1 45.85 -46.1 L39.25 -45.05 37.95 -44.8 Q33.4 -43.8 25.65 -41.35 L20.8 -39.8 13.7 -37.25 4.35 -33.4 Q-4.2 -29.7 -13.95 -24.7 L-43.35 -9.65 -43.4 -9.6 Q-50.9 -6.15 -56.75 -4.4 -62.35 -2.8 -66.4 -2.8 -67.4 -2.8 -68.4 -3.25 L-69.65 -3.85 Q-69.5 -4.2 -69.95 -4.2 -71.35 -4.2 -72.9 -2.8 M-73.05 -2.7 L-73.4 -2.4 -74.0 -1.75 -73.45 -1.55 -72.65 -1.3 -71.95 -1.05 -73.15 -1.15 -74.7 -0.8 -74.75 -0.8 -75.05 -0.05 -75.15 0.15 -74.8 0.3 -73.5 0.8 -73.4 0.9 -73.4 0.95 -73.5 1.05 Q-73.85 1.3 -75.15 1.75 L-75.15 1.85 -74.35 1.8 -73.2 2.0 -72.75 2.2 -73.8 2.75 -74.75 3.15 -74.65 3.35 M34.3 -37.45 L34.0 -36.9 29.45 -35.9 25.85 -34.7 Q23.05 -33.7 19.65 -32.15 L18.4 -32.9 16.6 -33.35 14.55 -33.15 14.15 -33.1 12.35 -32.5 11.95 -32.4 4.05 -29.7 Q-19.85 -20.95 -42.35 -6.75 L-42.6 -6.6 Q-43.0 -5.5 -44.0 -4.2 L-48.6 -2.05 Q-53.05 -0.15 -59.45 2.85 -65.85 5.8 -67.6 6.15 L-70.4 6.55 Q-71.65 6.35 -72.7 5.6 L-68.9 4.25 -73.35 5.05 -74.65 3.4 M47.1 -45.15 L47.15 -45.05 47.15 -45.0 47.0 -45.05 46.95 -45.05 45.5 -44.9 M47.05 -45.2 L47.1 -45.15 M-42.6 -6.6 L-45.85 -4.55 M-68.9 4.25 L-67.95 3.85 -68.0 4.0 -68.9 4.25" fill="none" stroke="#4d4236" stroke-linecap="round" stroke-linejoin="round" stroke-width="0.05"/>
    <path d="M35.05 -44.0 L34.6 -43.65 33.9 -43.2 33.45 -43.3 33.4 -43.25 Q33.3 -43.05 33.0 -43.05 L32.45 -43.2 32.4 -43.5 32.4 -43.55 35.05 -44.0 M34.65 -42.75 L34.5 -42.2 34.15 -42.15 33.75 -42.45 33.65 -42.8 Q33.65 -43.15 34.55 -43.1 L34.65 -42.75 M33.35 -42.65 L33.3 -42.35 33.0 -42.2 32.65 -42.3 32.55 -42.6 32.8 -42.9 33.3 -42.95 33.35 -42.65 M31.15 -43.3 L31.2 -42.95 31.05 -42.5 30.9 -42.05 30.75 -41.85 30.8 -41.85 31.05 -42.15 31.65 -42.2 31.7 -41.9 31.45 -41.7 31.35 -41.65 31.5 -41.5 31.7 -41.0 31.4 -40.4 31.05 -40.05 Q30.5 -40.05 30.2 -40.7 L30.15 -40.85 29.95 -40.75 29.4 -40.8 Q28.95 -40.8 28.8 -41.0 L28.8 -41.25 Q28.8 -41.7 29.3 -41.95 L29.55 -42.05 29.35 -42.2 28.95 -42.75 31.15 -43.3 M28.15 -42.55 L28.1 -42.5 27.6 -42.3 27.4 -42.3 Q27.95 -42.2 27.95 -41.85 L27.8 -41.45 27.6 -41.1 27.75 -40.85 27.9 -40.55 Q27.9 -39.85 26.75 -39.35 L23.45 -38.85 22.75 -39.05 22.5 -39.3 21.85 -39.15 21.35 -39.0 Q20.85 -39.0 20.6 -39.45 L20.45 -39.75 Q23.0 -41.0 26.45 -42.05 L27.2 -42.25 27.2 -42.3 27.25 -42.25 28.15 -42.55 M22.35 -37.55 Q22.35 -37.2 21.75 -36.95 L20.85 -36.8 Q20.25 -36.8 19.95 -37.25 L19.85 -37.5 19.45 -37.85 19.35 -38.1 Q19.35 -38.9 19.95 -38.65 L20.35 -38.4 21.8 -38.15 Q22.2 -38.15 22.35 -37.55 M-61.5 4.55 L-61.55 4.45 -61.4 4.25 -61.3 4.0 -61.55 3.4 Q-61.55 3.1 -61.25 3.05 -60.8 2.95 -60.5 2.5 -60.0 1.75 -59.1 1.75 -58.65 1.75 -58.4 2.05 L-58.2 2.5 -58.35 2.9 -59.5 3.45 -61.5 4.55 M-59.1 9.15 L-59.45 9.65 -59.85 9.6 -60.0 9.25 -59.9 8.9 -59.1 9.15 M-63.45 8.3 L-63.4 8.15 -63.2 7.85 -62.8 7.1 -62.65 6.35 Q-62.5 5.95 -62.0 5.9 L-61.9 5.9 -61.0 6.15 -59.45 5.7 Q-58.8 5.7 -58.8 6.3 -58.8 6.7 -59.15 7.05 L-59.2 7.1 Q-59.65 7.5 -60.35 7.6 L-60.4 7.6 -60.4 7.65 Q-62.2 8.4 -62.6 8.4 L-63.45 8.3 M-60.45 11.0 L-60.9 10.95 -60.95 10.65 Q-60.15 9.2 -59.4 10.25 L-59.85 10.75 -60.45 11.0 M-67.55 14.75 L-67.55 14.5 Q-67.55 13.75 -66.6 13.05 -65.95 12.55 -65.1 12.35 L-65.1 12.2 Q-65.1 11.1 -64.5 10.75 -64.45 10.0 -63.85 9.9 -63.15 9.8 -62.15 10.95 L-61.3 11.25 Q-60.65 11.5 -60.45 11.9 L-60.15 13.05 Q-60.15 13.75 -60.5 14.4 L-60.55 14.5 -60.55 14.45 -61.9 14.95 -64.05 15.85 Q-65.7 14.95 -65.9 14.25 L-67.55 14.75 M-62.75 1.25 L-62.7 1.55 Q-62.7 1.95 -62.85 2.1 L-63.15 2.15 Q-63.55 2.15 -63.6 1.9 L-63.6 1.65 Q-63.75 0.95 -62.85 1.2 L-62.75 1.25 M-63.8 2.6 L-64.35 2.75 Q-64.85 2.75 -65.0 1.7 L-64.55 1.05 Q-63.8 1.7 -63.8 2.6 M-66.9 6.15 L-66.7 5.95 -67.1 5.05 -66.95 4.1 Q-66.95 3.65 -66.25 3.45 -65.5 3.25 -65.05 3.85 L-64.75 4.3 -63.9 3.65 Q-62.5 2.85 -62.5 4.2 -62.5 4.5 -62.65 4.8 L-63.55 5.75 -63.7 5.9 -63.75 5.95 -63.75 5.9 -64.15 5.95 -66.7 6.15 -66.9 6.15 M-68.9 3.4 L-68.95 3.1 -68.8 2.9 -69.4 2.0 -69.1 1.4 Q-68.75 1.0 -68.3 1.0 L-67.75 1.1 -67.6 1.4 -67.15 0.95 Q-66.8 0.6 -66.25 0.6 L-66.0 0.65 -68.0 2.5 -68.9 3.4 M-70.85 8.4 L-70.95 8.15 Q-70.95 7.45 -70.5 7.05 -70.05 6.6 -69.4 6.85 L-69.55 6.05 Q-69.55 4.85 -68.75 5.0 -68.15 5.1 -68.0 5.9 L-67.95 6.4 -68.2 7.05 -67.8 7.6 -67.75 8.0 -67.75 8.1 -69.15 8.2 -70.85 8.4 M-70.1 4.05 L-70.2 4.15 -70.5 4.2 Q-71.35 4.2 -71.75 3.3 L-72.0 2.4 Q-72.0 2.0 -71.35 2.0 -70.55 2.0 -70.2 2.7 -70.05 3.05 -70.05 3.45 L-70.1 4.05 M-67.1 10.6 L-67.1 10.4 -67.6 10.2 -67.65 9.85 -67.4 9.35 -67.05 9.0 -66.3 8.6 -65.7 8.4 Q-64.9 8.4 -64.9 9.3 L-65.1 9.7 -66.35 10.15 -67.1 10.6 M-71.4 5.55 Q-72.3 5.55 -72.15 4.9 -72.15 4.25 -71.55 4.15 -70.95 4.05 -70.95 4.55 -70.95 5.55 -71.4 5.55 M-68.4 19.4 L-68.25 19.05 Q-68.35 18.25 -68.1 17.9 -67.4 17.1 -66.35 17.6 -65.4 18.1 -65.4 18.8 -65.4 19.2 -65.75 19.55 L-66.15 20.45 -66.15 20.65 -66.15 20.7 -66.2 20.65 Q-67.55 20.65 -68.4 19.4" fill="#d6cbc2" fill-rule="evenodd" stroke="none"/>
    <path d="M35.05 -44.0 L32.4 -43.55 Q32.4 -44.0 32.7 -44.0 L33.2 -43.8 33.85 -44.5 Q34.55 -45.05 35.15 -44.9 L35.25 -44.4 35.05 -44.0 M28.95 -42.75 Q28.95 -43.7 30.1 -43.8 31.0 -43.9 31.15 -43.3 L28.95 -42.75 M20.45 -39.75 L20.4 -39.95 Q20.4 -40.4 20.55 -40.55 20.7 -40.75 21.5 -41.15 L22.4 -41.75 22.65 -42.35 Q24.5 -44.55 25.4 -42.0 L26.85 -42.35 27.2 -42.3 Q26.85 -42.4 26.6 -42.6 26.3 -42.85 26.3 -43.1 26.3 -43.65 27.35 -43.65 28.35 -43.65 28.35 -43.05 L28.15 -42.55 27.25 -42.25 27.2 -42.3 27.2 -42.25 26.45 -42.05 Q23.0 -41.0 20.45 -39.75 M-58.35 2.9 L-58.55 3.3 -59.0 3.7 -59.3 4.05 -59.35 4.75 Q-59.6 5.4 -60.6 5.4 -61.4 5.4 -61.5 4.55 L-59.5 3.45 -58.35 2.9 M-60.4 7.65 Q-60.35 8.0 -60.8 8.95 L-60.95 9.6 Q-61.2 10.1 -61.85 10.1 -62.5 10.1 -63.05 9.4 L-63.5 8.5 -63.45 8.3 -62.6 8.4 Q-62.2 8.4 -60.4 7.65 M-67.55 14.75 L-65.9 14.25 Q-65.7 14.95 -64.05 15.85 L-61.9 14.95 -60.55 14.45 -60.55 14.5 Q-61.05 15.4 -62.1 15.6 L-62.2 16.15 -62.1 16.65 -62.3 17.7 -62.65 18.4 Q-63.15 19.05 -63.9 19.05 -65.3 19.05 -64.85 16.05 L-66.1 16.25 Q-67.55 16.25 -67.55 14.75 M-66.9 6.15 L-66.7 6.15 -64.15 5.95 -63.75 5.9 -63.75 5.95 Q-63.3 6.15 -63.3 6.55 -63.3 7.25 -63.85 7.3 L-65.3 7.25 -65.75 7.55 -66.05 7.75 -66.35 7.8 Q-67.05 7.8 -67.1 6.9 L-66.9 6.15 M-68.9 3.4 L-68.0 2.5 -66.0 0.65 Q-65.55 0.7 -65.55 1.05 -65.55 1.45 -66.1 2.25 -66.65 3.05 -67.25 3.25 -67.35 3.85 -68.6 3.85 -68.85 3.85 -68.9 3.4 M-67.75 8.1 L-67.9 8.55 -68.6 8.95 -68.85 9.45 Q-69.2 9.95 -69.75 9.95 -70.45 9.95 -70.5 9.55 L-70.45 9.1 Q-70.4 8.65 -70.65 8.55 L-70.85 8.4 -69.15 8.2 -67.75 8.1 M-65.1 9.7 L-65.9 10.25 Q-65.75 10.7 -65.85 11.3 -66.0 12.0 -66.45 12.0 -67.35 12.0 -67.1 10.6 L-66.35 10.15 -65.1 9.7 M-66.15 20.7 Q-66.45 21.6 -67.65 21.6 -68.85 21.6 -68.7 20.35 L-68.55 19.7 -68.4 19.4 Q-67.55 20.65 -66.2 20.65 L-66.15 20.7" fill="#fff2e8" fill-rule="evenodd" stroke="none"/>
    <path d="M33.9 -44.1 L33.9 -43.95 33.95 -43.85 33.95 -43.75 33.9 -43.75 33.4 -43.4 Q33.2 -43.4 33.05 -43.7 L32.95 -43.95 33.15 -44.2 33.55 -44.35 33.9 -44.1 M30.7 -41.65 L31.05 -41.65 31.1 -41.45 30.65 -41.05 30.45 -41.3 30.55 -41.5 30.6 -41.6 30.7 -41.65 M24.55 -42.2 L24.6 -41.9 24.45 -41.65 Q24.25 -41.45 24.05 -41.45 23.2 -41.45 24.4 -42.3 L24.55 -42.2 M23.7 -41.2 L24.1 -40.85 24.5 -41.15 25.15 -41.35 25.7 -41.45 Q26.1 -41.55 26.1 -41.25 26.1 -40.9 25.45 -40.7 L24.15 -40.45 24.1 -40.3 24.2 -40.2 Q24.2 -39.95 23.8 -39.95 23.25 -39.95 23.4 -40.35 L23.4 -40.4 22.7 -40.2 22.5 -40.05 21.9 -40.0 Q21.45 -40.0 21.45 -40.2 21.45 -40.55 22.5 -40.75 L22.9 -40.95 23.45 -41.05 Q23.55 -41.05 23.7 -41.2 M20.55 -37.55 L20.35 -37.55 20.25 -37.8 Q20.1 -37.8 20.1 -38.05 L20.8 -38.25 21.05 -37.85 Q21.05 -37.55 20.55 -37.55 M29.9 -41.6 L29.8 -41.8 29.8 -42.05 29.95 -42.65 Q30.5 -42.9 30.5 -42.0 30.5 -41.45 30.25 -41.45 30.0 -41.45 29.9 -41.6 M-60.4 4.05 Q-60.8 4.05 -60.7 3.7 -60.4 3.7 -60.25 3.85 L-60.4 4.05 M-60.2 3.35 Q-60.2 2.9 -59.65 2.9 L-59.45 3.05 -59.45 3.15 Q-59.45 3.6 -59.95 3.6 L-60.2 3.35 M-65.4 5.95 L-65.4 5.8 -65.3 5.4 -65.5 5.45 Q-65.75 5.45 -65.8 5.05 -65.8 4.7 -65.0 4.7 -64.65 4.7 -64.5 5.15 L-64.4 5.6 Q-64.4 6.2 -64.95 6.2 L-65.35 6.1 -65.35 6.2 Q-65.35 6.55 -65.8 6.55 L-66.15 6.35 -66.25 6.05 Q-66.25 5.75 -65.75 5.75 L-65.4 5.95 M-67.55 1.85 L-66.75 1.8 -66.8 2.05 -67.9 2.7 -68.1 2.65 -68.1 2.55 -68.25 2.6 -68.5 2.3 -68.4 2.05 -68.1 2.25 -68.1 2.45 -67.85 2.2 -67.55 1.85 M-70.8 3.65 L-71.15 3.3 -71.15 2.95 Q-70.8 2.95 -70.75 3.1 L-70.65 3.25 -70.6 3.4 -70.8 3.65 M-68.9 7.65 Q-68.7 7.6 -68.55 7.8 L-68.5 7.95 -68.75 8.4 -69.45 8.6 -69.8 8.3 -69.95 7.9 -69.75 7.45 Q-69.45 7.15 -69.3 7.2 L-69.0 7.45 -68.9 7.65 M-66.2 9.35 L-66.05 9.35 -66.0 9.45 -66.15 9.75 -66.45 9.95 -66.5 9.75 -66.2 9.35 M-61.3 6.8 Q-61.0 6.8 -61.0 7.05 -61.0 7.8 -61.65 7.8 L-62.05 7.5 -61.8 7.1 Q-61.6 6.8 -61.3 6.8 M-61.7 8.1 L-61.95 8.3 Q-62.25 8.3 -62.25 8.05 L-61.9 7.8 -61.7 8.1 M-63.65 11.9 L-62.95 11.7 Q-62.75 11.7 -62.55 12.0 L-62.35 12.4 -62.55 12.85 Q-62.8 13.15 -63.15 13.15 -63.4 13.15 -63.45 12.65 L-63.8 12.25 -63.65 11.9 M-71.3 4.65 L-71.6 4.8 -71.65 4.7 Q-71.65 4.5 -71.4 4.5 L-71.3 4.65 M-62.15 13.6 L-62.45 14.05 -62.95 14.4 Q-63.45 14.4 -63.45 14.05 L-63.45 13.95 -63.55 14.05 -64.2 14.4 Q-64.85 14.4 -64.8 13.85 L-64.8 13.6 -64.6 13.35 Q-64.3 13.05 -63.8 13.05 -63.3 13.05 -63.25 13.5 L-62.65 13.15 Q-62.15 13.15 -62.15 13.6 M-64.15 12.85 L-64.45 12.6 -64.2 12.3 -63.95 12.5 -64.15 12.85 M-66.6 19.2 L-66.55 19.4 -66.6 19.55 -66.85 19.7 -66.9 19.65 -67.1 19.8 Q-67.75 19.8 -67.8 19.15 L-67.7 18.7 -67.0 18.55 Q-66.55 18.55 -66.55 18.9 L-66.6 19.2" fill="#ba4a01" fill-rule="evenodd" stroke="none"/>
    <path d="M-36.3 -11.85 L-36.05 -10.95 -34.9 -9.55 Q-33.5 -8.2 -32.4 -8.2 -30.55 -8.2 -28.9 -10.0 -27.3 -11.7 -27.3 -13.35 -27.3 -15.2 -27.85 -15.75 L-27.3 -15.65 Q-26.25 -15.65 -24.8 -16.35 -23.2 -17.15 -23.2 -17.95 L-22.8 -19.3 -23.2 -20.25 -24.0 -20.8 -25.95 -20.35 -26.0 -20.35 -24.85 -21.35 Q-23.85 -22.35 -23.85 -22.85 -23.85 -24.0 -24.55 -24.0 L-25.7 -23.3 Q-24.75 -24.35 -24.75 -24.9 L-25.2 -26.05 -25.75 -26.6 Q-24.15 -26.55 -23.35 -25.25 -22.75 -24.3 -22.75 -23.25 L-22.95 -22.25 Q-22.95 -21.95 -23.5 -21.25 L-23.0 -21.3 -21.4 -19.95 Q-21.05 -19.4 -21.05 -18.2 -21.05 -16.8 -23.3 -15.65 -25.1 -14.7 -25.8 -14.75 L-25.9 -14.85 -26.05 -15.1 -25.95 -14.8 -25.8 -14.75 -25.7 -14.6 -25.3 -13.5 Q-25.3 -11.45 -27.05 -9.45 -28.9 -7.35 -31.1 -7.35 -33.15 -7.35 -34.6 -8.4 -36.3 -9.65 -36.3 -11.85" fill="#d6cbc2" fill-rule="evenodd" stroke="none"/>
    <path d="M-27.1 -18.6 Q-28.0 -17.35 -28.7 -17.35 -30.4 -17.35 -30.4 -19.3 L-30.1 -20.4 -29.0 -21.7 Q-28.05 -22.5 -27.05 -22.0 -26.15 -21.6 -26.15 -21.0 -26.15 -19.9 -27.1 -18.6 M-25.95 -16.95 Q-25.95 -16.7 -26.55 -16.35 -27.1 -16.05 -27.2 -16.05 -27.95 -16.05 -27.95 -16.65 -27.95 -17.2 -26.95 -17.5 -25.95 -17.85 -25.95 -16.95 M-29.6 -16.3 L-28.9 -16.4 Q-28.5 -16.4 -28.35 -16.0 L-28.25 -15.65 Q-28.25 -15.2 -28.55 -14.3 -28.95 -13.0 -29.6 -13.0 -30.2 -13.0 -30.4 -13.3 L-30.6 -13.85 -32.2 -12.75 Q-33.45 -12.75 -33.25 -13.7 -33.25 -14.2 -32.2 -15.3 L-31.65 -15.8 Q-32.2 -15.95 -32.3 -16.75 -32.3 -17.7 -31.0 -17.8 -29.75 -17.9 -29.75 -16.7 L-29.8 -16.3 -29.6 -16.3" fill="#ba4a01" fill-rule="evenodd" stroke="none"/>
    <path d="M-25.75 -26.6 L-25.2 -26.05 -24.75 -24.9 Q-24.75 -24.35 -25.7 -23.3 L-24.55 -24.0 Q-23.85 -24.0 -23.85 -22.85 -23.85 -22.35 -24.85 -21.35 L-26.0 -20.35 -25.95 -20.35 -24.0 -20.8 -23.2 -20.25 -22.8 -19.3 -23.2 -17.95 Q-23.2 -17.15 -24.8 -16.35 -26.25 -15.65 -27.3 -15.65 L-27.85 -15.75 Q-27.3 -15.2 -27.3 -13.35 -27.3 -11.7 -28.9 -10.0 -30.55 -8.2 -32.4 -8.2 -33.5 -8.2 -34.9 -9.55 L-36.05 -10.95 -36.3 -11.85 Q-36.3 -13.8 -35.25 -15.15 -34.4 -16.25 -33.25 -16.6 L-33.15 -16.65 -33.25 -16.6 Q-34.15 -16.95 -34.0 -18.05 -33.85 -19.15 -32.6 -19.5 L-31.25 -19.35 -31.1 -19.35 -31.4 -19.95 -31.65 -22.15 Q-31.65 -23.7 -29.2 -25.2 L-29.15 -25.25 Q-27.0 -26.6 -25.85 -26.6 L-25.75 -26.6 M-29.6 -16.3 L-29.8 -16.3 -29.75 -16.7 Q-29.75 -17.9 -31.0 -17.8 -32.3 -17.7 -32.3 -16.75 -32.2 -15.95 -31.65 -15.8 L-32.2 -15.3 Q-33.25 -14.2 -33.25 -13.7 -33.45 -12.75 -32.2 -12.75 L-30.6 -13.85 -30.4 -13.3 Q-30.2 -13.0 -29.6 -13.0 -28.95 -13.0 -28.55 -14.3 -28.25 -15.2 -28.25 -15.65 L-28.35 -16.0 Q-28.5 -16.4 -28.9 -16.4 L-29.6 -16.3 M-25.95 -16.95 Q-25.95 -17.85 -26.95 -17.5 -27.95 -17.2 -27.95 -16.65 -27.95 -16.05 -27.2 -16.05 -27.1 -16.05 -26.55 -16.35 -25.95 -16.7 -25.95 -16.95 M-27.1 -18.6 Q-26.15 -19.9 -26.15 -21.0 -26.15 -21.6 -27.05 -22.0 -28.05 -22.5 -29.0 -21.7 L-30.1 -20.4 -30.4 -19.3 Q-30.4 -17.35 -28.7 -17.35 -28.0 -17.35 -27.1 -18.6" fill="#f2e5dc" fill-rule="evenodd" stroke="none"/>
    <path d="M-25.75 -26.6 L-25.85 -26.6 Q-27.0 -26.6 -29.15 -25.25 L-29.2 -25.2 Q-31.65 -23.7 -31.65 -22.15 L-31.4 -19.95 -31.1 -19.35 -31.25 -19.35 -32.6 -19.5 Q-33.85 -19.15 -34.0 -18.05 -34.15 -16.95 -33.25 -16.6 L-33.15 -16.65 -33.25 -16.6 Q-34.4 -16.25 -35.25 -15.15 -36.3 -13.8 -36.3 -11.85 -36.3 -9.65 -34.6 -8.4 -33.15 -7.35 -31.1 -7.35 -28.9 -7.35 -27.05 -9.45 -25.3 -11.45 -25.3 -13.5 L-25.7 -14.6 -25.8 -14.75 -25.95 -14.8 -26.05 -15.1 -25.9 -14.85 -25.8 -14.75 Q-25.1 -14.7 -23.3 -15.65 -21.05 -16.8 -21.05 -18.2 -21.05 -19.4 -21.4 -19.95 L-23.0 -21.3 -23.5 -21.25 Q-22.95 -21.95 -22.95 -22.25 L-22.75 -23.25 Q-22.75 -24.3 -23.35 -25.25 -24.15 -26.55 -25.75 -26.6 Z" fill="none" stroke="#ac9586" stroke-linecap="round" stroke-linejoin="round" stroke-width="0.05"/>
  </g>
</svg>
