<?xml version="1.0" encoding="UTF-8" standalone="no"?>
<svg xmlns:xlink="http://www.w3.org/1999/xlink" height="30.3px" width="19.05px" xmlns="http://www.w3.org/2000/svg">
  <g transform="matrix(1.0, 0.0, 0.0, 1.0, 9.5, 15.15)">
    <path d="M3.75 -14.85 L3.8 -14.3 4.65 -12.55 4.85 -11.85 5.2 -11.55 Q7.4 -10.15 7.3 -7.6 7.3 -6.75 5.95 -5.3 5.8 -4.3 5.2 -3.3 L4.2 -2.05 Q3.25 -1.8 3.25 -1.35 3.25 -0.3 3.7 0.75 L4.2 1.6 3.85 1.4 3.55 1.15 3.25 -0.05 2.8 -1.15 1.9 -1.6 1.8 -1.9 1.6 -1.55 1.2 -0.55 Q2.2 -0.55 2.65 0.95 L2.75 1.5 2.65 0.95 Q2.2 -0.55 1.2 -0.55 L1.6 -1.55 1.8 -1.9 1.9 -1.6 2.8 -1.15 3.25 -0.05 3.55 1.15 3.85 1.4 3.8 1.4 Q3.45 1.4 3.2 1.0 L2.9 0.4 3.25 2.45 Q3.4 2.7 4.35 2.85 L4.55 2.9 5.0 3.0 5.25 3.65 5.45 4.1 5.55 4.3 5.2 4.25 4.75 4.3 Q4.3 4.3 4.4 3.7 4.55 3.1 3.95 3.1 L2.8 3.25 2.75 1.5 2.15 0.6 2.1 0.6 1.9 2.45 Q1.9 4.55 2.3 4.95 4.2 7.05 4.75 7.05 L5.2 6.8 6.4 6.55 6.45 6.55 Q7.5 6.55 9.35 7.25 L9.4 7.25 9.4 7.3 9.55 8.2 Q9.6 9.15 9.05 9.7 8.65 10.25 7.9 10.3 L7.4 10.35 6.25 10.2 5.25 10.0 5.55 10.6 5.8 10.9 6.0 11.9 Q5.95 13.3 4.6 13.3 3.7 13.3 2.7 12.35 L1.9 11.6 1.8 11.55 1.6 11.35 Q1.05 11.35 1.0 12.0 L1.35 12.95 1.65 14.15 1.3 14.75 0.9 15.15 0.2 14.75 -0.4 14.3 -2.0 12.9 -3.0 11.95 -3.55 11.45 -4.0 11.15 -5.6 8.9 Q-5.9 8.0 -5.85 6.6 -5.85 5.45 -5.05 3.5 -4.2 1.55 -4.2 0.75 -4.15 -0.4 -4.7 -1.05 -5.1 -1.65 -6.3 -2.2 -9.5 -3.9 -9.5 -4.75 -9.5 -5.35 -9.0 -5.8 -8.5 -6.35 -7.75 -6.35 L-4.55 -5.45 -2.6 -4.8 Q-1.95 -4.65 -3.85 -6.0 L-1.5 -6.35 Q-0.65 -6.8 -0.05 -7.55 L1.65 -9.55 2.3 -10.5 2.95 -11.5 3.1 -11.8 3.4 -13.0 3.4 -13.2 3.35 -15.15 3.75 -14.85 M2.95 -11.5 Q4.5 -9.75 4.45 -8.25 4.4 -6.75 3.4 -4.95 L2.05 -2.95 Q2.65 -4.65 2.7 -6.05 L2.35 -7.8 1.65 -9.55 2.35 -7.8 2.7 -6.05 Q2.65 -4.65 2.05 -2.95 L3.4 -4.95 Q4.4 -6.75 4.45 -8.25 4.5 -9.75 2.95 -11.5 M4.85 -11.85 Q5.45 -10.4 5.45 -9.45 L5.25 -8.1 5.65 -7.3 6.0 -5.8 5.95 -5.3 6.0 -5.8 5.65 -7.3 5.25 -8.1 5.45 -9.45 Q5.45 -10.4 4.85 -11.85 M1.8 -1.9 L1.9 -2.25 2.05 -2.95 1.9 -2.25 1.8 -1.9 M4.2 1.6 L4.65 1.8 4.7 1.8 4.8 1.85 4.65 1.85 4.2 1.6 M3.8 6.9 L2.95 6.15 2.65 5.75 Q1.65 3.9 0.65 3.35 L0.6 2.25 Q0.65 1.35 1.2 -0.55 0.65 1.35 0.6 2.25 L0.65 3.35 Q1.65 3.9 2.65 5.75 L2.95 6.15 3.8 6.9 3.7 7.0 3.15 6.75 4.95 8.5 5.1 8.6 Q5.8 9.2 6.7 9.2 L7.75 8.95 8.3 8.35 8.05 7.95 8.0 7.9 Q7.5 7.45 6.55 7.4 L6.4 7.4 6.35 7.4 5.65 7.5 5.45 7.5 Q4.6 7.45 3.9 6.95 L3.8 6.9 M7.9 10.3 L8.45 9.15 8.3 8.35 8.45 9.15 7.9 10.3 M2.05 7.65 L1.9 7.65 Q1.65 7.65 1.3 7.9 L0.9 8.3 0.85 8.45 0.95 9.05 1.6 9.95 1.9 10.25 2.2 10.55 Q3.25 11.5 3.75 11.5 4.45 11.5 4.8 10.5 L5.15 9.8 5.05 9.7 4.55 8.9 2.5 7.05 1.95 6.6 1.95 6.95 2.05 7.65 M1.8 11.55 L1.45 10.5 1.35 10.25 0.95 9.05 1.35 10.25 1.45 10.5 1.8 11.55 M-2.6 -4.8 L-1.75 -3.6 -1.5 -2.1 -1.95 0.4 -2.5 3.5 Q-2.55 5.25 -1.3 6.45 -0.1 7.7 -0.15 8.3 -0.15 8.8 -0.8 10.05 L0.25 12.75 0.25 14.2 0.2 14.75 0.25 14.2 0.25 12.75 -0.8 10.05 Q-0.15 8.8 -0.15 8.3 -0.1 7.7 -1.3 6.45 -2.55 5.25 -2.5 3.5 L-1.95 0.4 -1.5 -2.1 -1.75 -3.6 -2.6 -4.8 M1.95 6.6 Q0.85 5.45 0.65 3.35 0.85 5.45 1.95 6.6 M5.15 9.8 L5.25 10.0 5.15 9.8" fill="#b38484" fill-rule="evenodd" stroke="none"/>
    <path d="M4.2 -2.05 L4.0 -1.85 Q4.15 -1.2 4.65 -0.55 L4.0 -0.65 3.95 -0.45 Q3.95 0.0 5.25 1.05 L5.4 1.15 5.9 1.55 6.2 2.1 6.05 2.15 5.8 2.15 4.8 2.25 4.8 2.35 7.1 3.3 8.1 2.6 8.25 2.5 8.45 3.0 8.35 3.2 8.05 3.9 8.05 3.95 7.2 4.85 7.15 4.85 6.4 4.5 5.95 4.35 5.7 4.45 5.15 4.55 3.75 4.35 3.35 4.35 5.55 5.8 5.45 5.85 6.25 6.0 6.4 6.0 7.15 5.9 8.5 6.0 8.75 6.2 9.4 7.25 9.35 7.25 Q7.5 6.55 6.45 6.55 L6.4 6.55 5.2 6.8 4.75 7.05 Q4.2 7.05 2.3 4.95 1.9 4.55 1.9 2.45 L2.1 0.6 2.15 0.6 2.75 1.5 2.8 3.25 3.95 3.1 Q4.55 3.1 4.4 3.7 4.3 4.3 4.75 4.3 L5.2 4.25 5.55 4.3 5.45 4.1 5.25 3.65 5.0 3.0 4.55 2.9 4.35 2.85 Q3.4 2.7 3.25 2.45 L2.9 0.4 3.2 1.0 Q3.45 1.4 3.8 1.4 L3.85 1.4 4.2 1.6 3.7 0.75 Q3.25 -0.3 3.25 -1.35 3.25 -1.8 4.2 -2.05 M8.35 3.2 L8.1 2.6 8.35 3.2 M4.8 1.85 L4.7 1.8 4.65 1.8 4.2 1.6 4.65 1.85 4.8 1.85 5.8 2.15 4.8 1.85 M3.8 6.9 L3.9 6.95 Q4.6 7.45 5.45 7.5 L4.95 7.55 Q5.0 7.75 5.6 8.15 L5.65 8.2 6.45 8.55 8.0 7.9 8.05 7.95 8.3 8.35 7.75 8.95 6.7 9.2 Q5.8 9.2 5.1 8.6 L4.95 8.5 3.15 6.75 3.7 7.0 3.8 6.9 M3.7 9.3 L3.4 8.8 3.2 8.5 2.65 8.4 2.25 8.35 2.05 8.4 2.05 8.55 2.85 10.2 3.3 9.7 4.2 10.65 4.5 10.65 4.5 10.55 3.7 9.35 3.7 9.3 3.7 9.35 4.5 10.55 4.5 10.65 4.2 10.65 3.3 9.7 3.65 9.35 3.7 9.3 M2.05 7.65 L2.8 8.05 3.2 8.5 2.8 8.05 2.05 7.65 1.95 6.95 1.95 6.6 2.5 7.05 4.55 8.9 5.05 9.7 5.15 9.8 4.8 10.5 Q4.45 11.5 3.75 11.5 3.25 11.5 2.2 10.55 L1.9 10.25 1.6 9.95 0.95 9.05 0.85 8.45 0.9 8.3 1.3 7.9 Q1.65 7.65 1.9 7.65 L2.05 7.65" fill="#c29c9c" fill-rule="evenodd" stroke="none"/>
    <path d="M4.65 -0.55 L5.1 -0.05 5.85 0.6 6.2 0.85 8.25 2.5 8.1 2.6 7.75 2.35 6.05 2.15 7.75 2.35 8.1 2.6 7.1 3.3 4.8 2.35 4.8 2.25 5.8 2.15 6.05 2.15 6.2 2.1 5.9 1.55 5.4 1.15 5.25 1.05 Q3.95 0.0 3.95 -0.45 L4.0 -0.65 4.65 -0.55 M7.35 5.0 L7.95 5.45 8.5 6.0 7.15 5.9 6.4 6.0 6.25 6.0 5.45 5.85 5.55 5.8 3.35 4.35 3.75 4.35 5.15 4.55 5.7 4.45 5.95 4.35 6.4 4.5 7.15 4.85 7.35 5.0 M5.45 7.5 L5.65 7.5 6.35 7.4 6.4 7.4 6.55 7.4 Q7.5 7.45 8.0 7.9 L6.45 8.55 5.65 8.2 5.6 8.15 Q5.0 7.75 4.95 7.55 L5.45 7.5 M3.2 8.5 L3.4 8.8 3.7 9.3 3.65 9.35 3.3 9.7 2.85 10.2 2.05 8.55 2.05 8.4 2.25 8.35 2.65 8.4 3.2 8.5 M2.85 8.95 L3.2 9.6 3.3 9.7 3.2 9.6 2.85 8.95" fill="#d2b6b6" fill-rule="evenodd" stroke="none"/>
    <path d="M3.8 -14.3 L3.8 -14.4 3.75 -14.85 3.8 -14.3 4.65 -12.55 4.85 -11.85 5.2 -11.55 Q7.4 -10.15 7.3 -7.6 7.3 -6.75 5.95 -5.3 5.8 -4.3 5.2 -3.3 L4.2 -2.05 4.0 -1.85 Q4.15 -1.2 4.65 -0.55 M5.1 -0.05 L5.85 0.6 6.2 0.85 8.25 2.5 8.45 3.0 8.35 3.2 8.05 3.9 8.05 3.95 7.2 4.85 7.35 5.0 7.95 5.45 8.5 6.0 8.75 6.2 9.4 7.25 9.4 7.3 9.55 8.2 Q9.6 9.15 9.05 9.7 8.65 10.25 7.9 10.3 L7.4 10.35 6.25 10.2 5.25 10.0 5.55 10.6 5.8 10.9 6.0 11.9 Q5.95 13.3 4.6 13.3 3.7 13.3 2.7 12.35 L1.9 11.6 1.85 11.65 1.8 11.55 1.6 11.35 Q1.05 11.35 1.0 12.0 L1.35 12.95 1.65 14.15 1.3 14.75 0.9 15.15 0.2 14.75 -0.4 14.3 -2.0 12.9 -3.0 11.95 -3.55 11.45 -4.0 11.15 -5.6 8.9 Q-5.9 8.0 -5.85 6.6 -5.85 5.45 -5.05 3.5 -4.2 1.55 -4.2 0.75 -4.15 -0.4 -4.7 -1.05 -5.1 -1.65 -6.3 -2.2 -9.5 -3.9 -9.5 -4.75 -9.5 -5.35 -9.0 -5.8 -8.5 -6.35 -7.75 -6.35 L-4.55 -5.45 -2.6 -4.8 Q-1.95 -4.65 -3.85 -6.0 M3.1 -11.8 L3.4 -13.0 3.4 -13.2 3.35 -15.15 3.75 -14.85 M5.95 -5.3 L6.0 -5.8 5.65 -7.3 5.25 -8.1 5.45 -9.45 Q5.45 -10.4 4.85 -11.85 M1.65 -9.55 L2.35 -7.8 2.7 -6.05 Q2.65 -4.65 2.05 -2.95 L3.4 -4.95 Q4.4 -6.75 4.45 -8.25 4.5 -9.75 2.95 -11.5 M3.85 1.4 L3.55 1.15 3.25 -0.05 2.8 -1.15 1.9 -1.6 1.8 -1.9 1.6 -1.55 1.2 -0.55 Q2.2 -0.55 2.65 0.95 L2.75 1.5 2.8 3.25 3.95 3.1 Q4.55 3.1 4.4 3.7 4.3 4.3 4.75 4.3 L5.2 4.25 5.55 4.3 M3.85 1.4 L4.2 1.6 M2.05 -2.95 L1.9 -2.25 1.8 -1.9 M6.05 2.15 L7.75 2.35 8.1 2.6 8.35 3.2 M6.05 2.15 L5.8 2.15 M7.15 4.85 L7.35 5.0 M7.15 4.85 L6.4 4.5 M4.8 1.85 L4.7 1.8 4.65 1.8 4.2 1.6 M4.8 1.85 L5.8 2.15 M1.2 -0.55 Q0.65 1.35 0.6 2.25 L0.65 3.35 Q1.65 3.9 2.65 5.75 L2.95 6.15 3.8 6.9 3.9 6.95 Q4.6 7.45 5.45 7.5 L5.65 7.5 6.35 7.4 M6.4 7.4 L6.55 7.4 Q7.5 7.45 8.0 7.9 M8.05 7.95 L8.3 8.35 8.45 9.15 7.9 10.3 M3.2 8.5 L3.4 8.8 3.7 9.3 3.7 9.35 4.5 10.55 4.5 10.65 4.2 10.65 3.3 9.7 3.2 9.6 2.85 8.95 M3.2 8.5 L2.8 8.05 2.05 7.65 1.9 7.65 Q1.65 7.65 1.3 7.9 L0.9 8.3 M5.05 9.7 L4.55 8.9 2.5 7.05 1.95 6.6 M0.95 9.05 L1.35 10.25 1.45 10.5 1.8 11.55 1.9 11.6 M5.25 10.0 L5.15 9.8 M0.65 3.35 Q0.85 5.45 1.95 6.6 M0.2 14.75 L0.25 14.2 0.25 12.75 -0.8 10.05 Q-0.15 8.8 -0.15 8.3 -0.1 7.7 -1.3 6.45 -2.55 5.25 -2.5 3.5 L-1.95 0.4 -1.5 -2.1 -1.75 -3.6 -2.6 -4.8" fill="none" stroke="#a36a6a" stroke-linecap="round" stroke-linejoin="round" stroke-opacity="0.4" stroke-width="0.05"/>
  </g>
</svg>
