<?xml version="1.0" encoding="UTF-8" standalone="no"?>
<svg xmlns:xlink="http://www.w3.org/1999/xlink" height="202.05px" width="105.95px" xmlns="http://www.w3.org/2000/svg">
  <g transform="matrix(1.0, 0.0, 0.0, 1.0, 150.95, 285.75)">
    <path d="M-106.55 -260.0 L-104.2 -262.05 -99.9 -266.3 -92.65 -273.8 -92.9 -272.65 Q-93.05 -272.15 -93.75 -271.15 L-93.75 -270.75 Q-92.9 -271.6 -88.3 -277.85 -83.75 -283.9 -81.9 -285.75 L-81.9 -284.1 Q-82.6 -283.7 -82.95 -282.2 L-83.25 -280.75 -82.55 -281.65 -81.15 -283.0 -81.15 -281.4 -82.35 -278.65 Q-81.6 -279.25 -79.95 -281.85 -78.55 -284.1 -77.3 -284.85 L-79.0 -278.9 -79.95 -277.0 Q-81.45 -274.0 -81.9 -273.5 L-81.9 -274.9 -81.85 -275.7 Q-84.55 -271.85 -87.45 -266.05 L-87.45 -268.05 -87.85 -268.05 Q-89.45 -265.6 -90.35 -263.2 L-90.8 -262.05 -91.05 -261.2 -92.45 -261.2 -95.15 -261.05 -94.7 -262.05 Q-90.55 -271.5 -90.55 -271.95 L-90.9 -271.95 Q-91.7 -270.55 -94.3 -267.6 -96.8 -264.75 -97.65 -264.05 L-97.65 -265.65 -98.45 -265.65 Q-99.3 -264.75 -100.65 -262.25 L-100.7 -262.05 -101.6 -260.4 -103.3 -260.2 -106.55 -260.0 M-140.3 -209.15 L-141.0 -209.25 Q-143.15 -209.2 -145.1 -206.4 -146.35 -204.65 -146.65 -203.25 -146.2 -206.5 -144.05 -209.65 -141.55 -213.45 -138.6 -213.95 L-137.85 -214.0 -137.2 -213.95 Q-135.25 -213.65 -134.85 -211.4 L-134.5 -206.15 -133.85 -201.55 Q-133.75 -200.25 -133.2 -199.25 L-132.55 -200.45 Q-131.8 -201.8 -131.75 -202.1 L-131.45 -198.25 -131.45 -197.9 -131.4 -196.95 -131.75 -196.95 Q-132.05 -197.0 -132.15 -197.15 L-133.55 -198.25 Q-135.8 -200.4 -137.2 -204.4 L-138.55 -207.85 -138.9 -208.35 Q-139.65 -209.0 -140.3 -209.15 M-83.25 -280.75 Q-83.65 -280.05 -83.5 -279.45 L-83.5 -279.8 -83.25 -280.75 M-91.6 -206.7 L-88.85 -206.4 Q-83.75 -205.6 -80.95 -203.2 L-80.8 -203.0 -84.2 -204.4 Q-84.55 -204.75 -84.7 -204.6 L-87.25 -205.25 -89.15 -205.45 -90.95 -205.55 -91.65 -205.6 -93.8 -205.25 Q-97.7 -204.5 -104.2 -201.7 -110.3 -199.2 -114.55 -198.25 L-117.1 -197.8 -118.5 -197.7 -120.7 -198.1 -121.3 -198.25 -121.95 -198.35 Q-121.65 -198.75 -121.35 -198.5 L-120.75 -198.5 Q-118.95 -198.55 -115.7 -199.8 L-109.4 -202.6 Q-100.25 -206.9 -93.95 -206.8 L-93.6 -206.8 -91.6 -206.7 M-133.2 -199.2 L-133.4 -198.75 -133.15 -198.75 -133.2 -199.2" fill="#c7c0ae" fill-rule="evenodd" stroke="none"/>
    <path d="M-79.0 -278.9 L-79.3 -277.85 -81.15 -271.0 -81.15 -269.6 Q-80.95 -270.8 -79.95 -271.9 L-78.35 -273.5 -78.0 -273.45 -78.6 -271.2 -79.1 -268.8 -79.5 -266.25 -79.5 -262.35 Q-79.45 -264.15 -78.75 -266.4 L-78.35 -266.4 Q-78.55 -265.15 -77.7 -262.05 L-77.45 -261.35 -76.6 -258.75 -78.7 -259.45 -79.1 -259.6 -80.05 -259.85 -80.3 -262.05 -80.6 -263.55 Q-81.3 -266.6 -82.35 -268.4 -82.35 -268.05 -82.7 -268.05 -84.3 -264.2 -84.65 -263.65 L-84.85 -264.8 -85.1 -266.05 -85.45 -266.05 -86.7 -262.95 -87.0 -262.05 -87.35 -261.1 -91.05 -261.2 -90.8 -262.05 -90.35 -263.2 Q-89.45 -265.6 -87.85 -268.05 L-87.45 -268.05 -87.45 -266.05 Q-84.55 -271.85 -81.85 -275.7 L-81.9 -274.9 -81.9 -273.5 Q-81.45 -274.0 -79.95 -277.0 L-79.0 -278.9" fill="#b3ac9b" fill-rule="evenodd" stroke="none"/>
    <path d="M-128.9 -244.65 Q-126.3 -250.0 -122.15 -254.65 -118.95 -256.5 -114.85 -257.95 -110.45 -259.55 -106.55 -260.0 L-103.3 -260.2 -101.6 -260.4 -98.2 -260.75 -95.15 -261.05 -92.45 -261.2 -91.05 -261.2 -87.35 -261.1 -82.55 -260.4 -87.65 -260.4 -91.3 -260.4 -92.7 -260.4 -95.65 -259.9 Q-107.45 -257.8 -112.85 -255.55 -119.9 -252.65 -122.9 -247.45 -126.55 -246.25 -128.9 -244.65 M-139.1 -170.75 L-138.85 -170.9 -138.8 -170.75 -139.1 -170.75 M-140.05 -111.6 L-140.2 -111.5 -140.4 -111.7 -140.05 -111.6 M-132.75 -110.9 L-132.55 -111.05 -132.55 -111.0 -132.75 -110.9" fill="#721f63" fill-rule="evenodd" stroke="none"/>
    <path d="M-150.55 -101.75 L-149.8 -102.85 -149.6 -102.75 -149.55 -102.75 -148.55 -101.75 -145.7 -105.2 -144.35 -106.65 -140.2 -111.5 -140.05 -111.6 -139.65 -111.4 Q-139.35 -111.15 -139.2 -110.7 L-139.0 -109.85 Q-140.45 -109.15 -140.2 -108.0 L-141.45 -105.9 -142.5 -103.85 -144.4 -102.4 -145.1 -101.95 Q-147.95 -99.8 -148.95 -99.8 L-149.9 -100.05 Q-150.3 -100.45 -150.55 -101.7 L-150.55 -101.75 M-101.05 -250.3 L-112.6 -249.4 -116.2 -248.9 -122.9 -247.45 Q-119.9 -252.65 -112.85 -255.55 -107.45 -257.8 -95.65 -259.9 L-92.7 -260.4 -91.3 -260.4 -87.65 -260.4 -82.55 -260.4 -80.05 -259.85 -79.1 -259.6 -80.0 -259.6 -81.4 -259.6 Q-86.8 -258.85 -94.25 -255.0 -99.0 -252.6 -101.05 -250.3 M-132.75 -110.9 L-132.55 -111.0 -132.3 -110.85 Q-131.55 -109.85 -130.75 -107.8 L-130.7 -107.55 Q-131.2 -106.35 -132.45 -105.0 -134.95 -102.5 -136.65 -102.5 -135.75 -100.7 -136.05 -98.95 L-136.05 -98.9 -136.15 -98.7 -136.15 -98.65 Q-137.05 -96.75 -138.85 -96.75 -139.2 -96.75 -139.9 -97.3 -140.6 -98.0 -140.75 -98.7 L-140.8 -98.85 -140.9 -98.7 -141.75 -96.55 Q-142.25 -95.2 -143.4 -94.6 L-143.6 -94.9 -143.75 -94.9 -143.95 -96.1 Q-144.5 -95.6 -145.3 -95.5 -145.8 -95.5 -145.95 -95.8 L-146.3 -96.1 Q-146.6 -96.95 -145.85 -97.65 L-144.9 -97.85 -144.0 -98.7 -143.85 -98.9 -143.8 -98.95 -143.75 -98.95 -142.8 -100.35 Q-141.95 -101.45 -141.05 -103.5 -140.2 -104.95 -138.55 -104.5 -138.45 -105.55 -137.95 -106.55 L-137.6 -106.0 Q-136.8 -105.1 -135.75 -105.1 -134.05 -105.15 -133.15 -106.55 -132.5 -107.7 -132.75 -108.65 -133.1 -110.35 -134.4 -110.55 L-132.75 -110.9 M-136.65 -102.5 L-136.8 -102.8 -136.75 -102.5 -136.65 -102.5 M-140.9 -100.75 Q-140.75 -99.7 -139.6 -99.7 -138.2 -100.05 -138.3 -101.2 -138.55 -102.5 -139.9 -102.3 -141.15 -102.2 -140.9 -100.75 M-129.55 -105.3 L-129.55 -105.4 -129.55 -105.45 -129.5 -105.45 -129.55 -105.3 M-105.1 -111.5 L-104.9 -111.4 Q-104.7 -111.25 -104.35 -111.25 L-104.1 -109.75 -104.9 -106.3 -106.9 -103.2 -108.3 -100.8 -108.7 -100.4 -110.35 -98.95 -110.4 -98.9 -110.7 -98.7 -113.7 -96.75 Q-113.9 -97.9 -113.7 -98.5 L-113.95 -98.5 Q-113.9 -98.3 -114.8 -98.25 L-114.85 -98.7 -114.85 -98.9 -114.85 -98.95 Q-114.85 -101.25 -113.9 -103.05 -112.9 -105.3 -111.05 -105.8 L-109.9 -107.9 Q-109.4 -108.85 -108.5 -109.6 -107.2 -110.85 -105.1 -111.5" fill="#4d2222" fill-rule="evenodd" stroke="none"/>
    <path d="M-116.2 -248.9 L-112.6 -249.4 -101.05 -250.3 Q-97.55 -250.55 -94.95 -250.4 L-91.15 -250.1 -91.2 -250.05 Q-98.75 -249.65 -103.1 -239.95 L-105.15 -236.0 -106.65 -233.4 Q-108.85 -229.7 -110.4 -224.95 -110.9 -223.6 -112.1 -216.15 -112.9 -210.2 -114.6 -207.75 -116.15 -205.05 -116.85 -204.25 -118.05 -202.75 -119.65 -202.45 -123.7 -201.75 -125.7 -200.65 L-124.45 -207.9 -122.75 -219.15 -122.55 -219.0 -122.75 -219.55 Q-123.0 -220.3 -124.0 -220.2 -125.05 -220.25 -125.85 -218.95 -127.8 -216.4 -129.4 -207.5 -130.2 -203.6 -130.5 -198.25 L-130.55 -197.5 -130.9 -197.7 -131.45 -197.9 -131.45 -198.25 -131.75 -202.1 Q-131.8 -201.8 -132.55 -200.45 L-133.2 -199.25 Q-133.75 -200.25 -133.85 -201.55 L-134.5 -206.15 -134.85 -211.4 Q-135.25 -213.65 -137.2 -213.95 L-134.3 -222.3 -128.75 -235.85 -128.4 -237.0 Q-126.35 -241.95 -124.8 -243.3 -122.7 -245.5 -116.2 -248.9 M-106.65 -165.45 L-107.7 -166.3 -108.15 -166.75 -112.65 -171.85 -113.9 -173.55 Q-119.1 -180.5 -120.75 -183.6 L-117.45 -184.3 -114.1 -184.9 Q-112.65 -183.25 -109.25 -180.3 -103.9 -175.8 -101.2 -175.8 -98.7 -175.85 -96.55 -177.0 -95.2 -177.75 -92.15 -179.9 L-87.55 -174.65 -86.6 -173.55 -86.2 -173.1 -88.9 -170.5 Q-90.05 -169.7 -92.6 -168.25 L-95.25 -166.75 Q-96.3 -166.25 -97.1 -165.9 -99.6 -164.95 -101.6 -164.9 L-106.65 -165.45 M-139.7 -183.75 L-139.2 -184.95 -137.35 -181.6 Q-135.3 -178.25 -135.3 -177.6 -135.2 -177.4 -137.95 -175.15 L-139.9 -173.55 -140.2 -173.25 -140.4 -173.55 -142.15 -177.5 -139.7 -183.75" fill="#9e998a" fill-rule="evenodd" stroke="none"/>
    <path d="M-80.05 -259.85 L-82.55 -260.4 -87.35 -261.1 -87.0 -262.05 -86.7 -262.95 -85.45 -266.05 -85.1 -266.05 -84.85 -264.8 -84.65 -263.65 Q-84.3 -264.2 -82.7 -268.05 -82.35 -268.05 -82.35 -268.4 -81.3 -266.6 -80.6 -263.55 L-80.3 -262.05 -80.05 -259.85" fill="#999385" fill-rule="evenodd" stroke="none"/>
    <path d="M-101.6 -260.4 L-100.7 -262.05 -100.65 -262.25 Q-99.3 -264.75 -98.45 -265.65 L-97.65 -265.65 -97.65 -264.05 Q-96.8 -264.75 -94.3 -267.6 -91.7 -270.55 -90.9 -271.95 L-90.55 -271.95 Q-90.55 -271.5 -94.7 -262.05 L-95.15 -261.05 -98.2 -260.75 -101.6 -260.4" fill="#d4ccb8" fill-rule="evenodd" stroke="none"/>
    <path d="M-142.6 -174.4 L-144.15 -177.75 -144.3 -177.9 -144.15 -178.3 Q-143.9 -179.85 -142.1 -183.4 -140.9 -185.75 -139.25 -190.05 L-138.1 -187.7 -137.5 -186.75 Q-135.5 -183.6 -133.45 -183.5 -132.45 -183.55 -131.75 -184.0 L-131.65 -184.05 -131.55 -184.15 -131.55 -184.05 -131.55 -184.0 -133.05 -175.5 -134.45 -173.55 -134.9 -172.9 Q-136.35 -171.0 -138.8 -170.75 L-138.85 -170.9 -139.1 -170.75 Q-140.45 -170.85 -142.1 -173.55 L-142.6 -174.4 M-131.45 -197.9 L-130.9 -197.7 -130.55 -197.5 -130.7 -193.95 -130.75 -191.8 Q-131.45 -192.2 -131.7 -192.25 L-133.4 -192.4 Q-135.0 -192.45 -136.75 -191.75 L-137.5 -191.4 -138.0 -192.3 -139.05 -194.55 -140.2 -196.2 Q-141.3 -197.6 -141.15 -197.95 L-141.15 -198.25 Q-141.15 -201.05 -138.9 -208.35 L-138.55 -207.85 -137.2 -204.4 Q-135.8 -200.4 -133.55 -198.25 L-132.15 -197.15 Q-132.05 -197.0 -131.75 -196.95 L-131.4 -196.95 -131.45 -197.9 M-122.75 -219.55 L-122.55 -219.0 -122.75 -219.15 -122.75 -219.55 M-125.7 -200.65 Q-123.7 -201.75 -119.65 -202.45 -118.05 -202.75 -116.85 -204.25 -116.15 -205.05 -114.6 -207.75 -112.9 -210.2 -112.1 -216.15 -110.9 -223.6 -110.4 -224.95 -108.85 -229.7 -106.65 -233.4 L-105.15 -236.0 -103.1 -239.95 Q-98.75 -249.65 -91.2 -250.05 L-91.15 -250.1 -90.95 -250.05 -90.3 -250.0 -89.75 -249.9 Q-87.9 -249.25 -86.55 -245.3 -85.9 -242.75 -85.6 -239.8 -85.55 -238.3 -85.8 -235.9 -86.55 -230.5 -89.55 -221.65 -92.9 -212.35 -93.6 -206.8 L-93.95 -206.8 Q-100.25 -206.9 -109.4 -202.6 L-115.7 -199.8 Q-118.95 -198.55 -120.75 -198.5 L-121.35 -198.5 Q-121.65 -198.75 -121.95 -198.35 L-121.3 -198.25 -120.7 -198.1 -118.5 -197.7 -117.1 -197.8 -117.1 -197.55 -113.4 -197.6 -116.6 -195.75 -119.15 -194.3 -118.9 -194.1 -118.35 -193.95 -115.25 -194.6 -116.65 -193.6 -119.7 -191.25 -119.65 -191.15 -119.9 -191.05 Q-121.85 -190.8 -123.7 -192.3 -125.85 -194.05 -126.05 -196.1 L-126.15 -196.6 -126.0 -198.25 -125.85 -199.35 -125.7 -200.65 M-122.45 -198.6 L-122.55 -198.5 -122.15 -198.35 -122.3 -198.65 -122.45 -198.6 M-65.65 -136.9 L-65.75 -137.15 -65.6 -136.85 -65.65 -136.9 M-118.6 -187.8 Q-118.45 -186.75 -116.75 -186.75 L-114.5 -187.05 -112.45 -185.25 -109.15 -182.15 Q-103.75 -177.25 -101.55 -177.2 -100.5 -177.35 -99.2 -177.95 L-97.65 -178.9 Q-93.3 -181.3 -89.8 -184.8 L-87.25 -187.9 -84.55 -190.7 -84.3 -190.85 -84.2 -190.85 Q-82.55 -190.65 -81.3 -189.2 -80.0 -187.55 -79.75 -184.6 -79.5 -181.05 -81.55 -177.05 -82.45 -175.3 -83.75 -173.55 L-84.2 -173.0 -84.5 -172.65 -85.15 -171.85 -86.55 -170.3 Q-88.4 -168.25 -90.2 -166.75 -95.2 -162.6 -99.9 -162.55 L-101.7 -162.75 Q-104.0 -163.3 -106.65 -165.45 L-101.6 -164.9 Q-99.6 -164.95 -97.1 -165.9 -96.3 -166.25 -95.25 -166.75 L-92.6 -168.25 Q-90.05 -169.7 -88.9 -170.5 L-86.2 -173.1 -86.6 -173.55 -87.55 -174.65 -92.15 -179.9 Q-95.2 -177.75 -96.55 -177.0 -98.7 -175.85 -101.2 -175.8 -103.9 -175.8 -109.25 -180.3 -112.65 -183.25 -114.1 -184.9 L-117.45 -184.3 -120.75 -183.6 -121.65 -185.7 Q-121.75 -186.8 -120.55 -187.3 L-118.6 -187.8 M-139.7 -183.75 L-142.15 -177.5 -140.4 -173.55 -140.2 -173.25 -139.9 -173.55 -137.95 -175.15 Q-135.2 -177.4 -135.3 -177.6 -135.3 -178.25 -137.35 -181.6 L-139.2 -184.95 -139.7 -183.75 M-124.5 -95.15 L-124.55 -95.2 -124.55 -95.25 -124.5 -95.15" fill="#948f82" fill-rule="evenodd" stroke="none"/>
    <path d="M-76.6 -258.75 Q-74.7 -258.05 -72.95 -257.1 L-76.35 -258.0 -79.5 -258.5 -79.95 -258.5 Q-84.9 -258.35 -87.8 -255.05 -89.75 -252.8 -90.3 -250.0 L-90.95 -250.05 -91.15 -250.1 -94.95 -250.4 Q-97.55 -250.55 -101.05 -250.3 -99.0 -252.6 -94.25 -255.0 -86.8 -258.85 -81.4 -259.6 L-80.0 -259.6 -79.1 -259.6 -78.7 -259.45 -76.6 -258.75 M-61.45 -202.4 Q-58.5 -204.05 -56.85 -204.0 -51.3 -203.95 -48.45 -197.7 L-48.0 -196.75 -47.05 -193.7 -48.45 -193.15 -49.55 -192.85 Q-50.7 -192.95 -53.0 -196.15 -55.55 -199.45 -58.1 -199.5 L-60.65 -198.9 -64.25 -197.75 -62.4 -201.05 -61.45 -202.4 M-125.85 -218.95 Q-125.05 -220.25 -124.0 -220.2 -123.0 -220.3 -122.75 -219.55 L-122.75 -219.15 -124.45 -207.9 -125.7 -200.65 -125.85 -199.35 -126.0 -198.25 -126.15 -196.6 -126.05 -196.1 -128.85 -173.55 -129.0 -172.45 -129.3 -170.95 -129.35 -170.55 -130.8 -170.75 -132.15 -170.65 -131.75 -172.35 -131.5 -173.55 -130.75 -177.7 Q-130.1 -180.95 -130.1 -182.15 L-129.9 -188.9 -129.85 -191.8 -129.55 -197.35 -129.55 -198.25 -129.3 -200.55 -128.9 -203.85 -128.05 -208.0 Q-127.85 -208.45 -126.75 -214.55 -126.3 -217.6 -125.85 -218.95 M-64.4 -132.5 L-64.85 -133.05 -65.45 -133.95 Q-66.75 -136.1 -66.95 -139.5 -67.4 -144.3 -66.65 -148.3 L-66.3 -150.1 Q-64.65 -156.8 -59.85 -156.75 -58.9 -156.6 -57.85 -156.05 L-57.55 -155.85 -56.3 -147.95 -55.55 -143.6 -55.15 -140.4 -55.95 -137.65 -56.4 -136.55 -56.4 -136.6 -56.45 -136.85 -56.45 -137.15 -56.5 -137.3 -56.5 -137.4 -56.5 -137.6 Q-56.5 -138.6 -56.95 -139.6 -57.4 -140.6 -58.2 -141.35 L-58.7 -141.8 -59.75 -142.6 -60.05 -142.75 -60.25 -142.85 -60.7 -142.85 -62.85 -142.6 Q-64.05 -142.55 -64.5 -141.7 L-65.35 -140.5 -65.65 -139.8 -65.75 -138.95 -65.8 -138.35 -65.75 -137.45 -65.75 -136.75 -65.65 -136.3 Q-65.45 -134.55 -64.65 -133.05 L-64.4 -132.5 M-78.25 -139.45 Q-80.8 -139.6 -81.0 -141.3 -81.75 -146.05 -79.1 -146.15 -78.2 -146.25 -77.25 -145.4 -76.4 -144.55 -76.25 -143.25 -76.45 -139.35 -78.25 -139.45 M-80.0 -133.6 Q-80.2 -134.9 -79.1 -134.9 -77.9 -134.95 -77.75 -133.5 L-77.75 -133.05 Q-77.75 -132.25 -78.7 -132.25 -79.45 -132.35 -79.8 -132.9 L-79.9 -133.05 -80.0 -133.6 M-79.25 -125.8 L-80.05 -126.05 -80.3 -127.0 Q-80.45 -128.1 -79.8 -127.95 -79.15 -128.0 -78.5 -126.7 L-78.75 -126.15 -79.25 -125.8 M-79.1 -119.05 Q-79.8 -119.05 -80.2 -119.8 L-80.6 -120.8 Q-82.1 -120.25 -83.75 -121.35 L-84.4 -121.85 -85.2 -123.05 Q-85.35 -123.8 -84.85 -124.15 L-85.1 -125.0 Q-85.4 -126.7 -84.4 -127.2 L-83.45 -127.45 Q-81.5 -127.8 -81.05 -124.9 L-81.0 -123.85 Q-78.55 -123.0 -78.3 -121.0 L-78.3 -119.85 Q-78.45 -119.0 -79.1 -119.05 M-80.5 -114.95 Q-81.25 -115.0 -81.4 -115.35 -81.8 -115.9 -82.4 -115.85 -83.2 -115.4 -84.0 -115.85 L-84.4 -116.05 -85.8 -117.05 Q-86.25 -117.55 -86.25 -118.25 -86.65 -119.95 -84.4 -119.45 L-83.2 -119.15 Q-80.0 -117.9 -79.75 -116.35 -79.65 -115.85 -79.85 -115.35 -80.05 -114.9 -80.5 -114.95 M-84.5 -172.65 L-84.2 -172.65 -82.9 -172.6 Q-81.85 -172.4 -81.75 -171.35 -81.55 -167.35 -84.7 -162.25 L-85.85 -160.55 -86.45 -159.75 -86.9 -159.25 Q-90.5 -155.1 -94.85 -154.05 L-97.45 -153.8 Q-100.4 -153.8 -104.05 -156.45 L-107.35 -159.25 -108.05 -159.75 Q-108.3 -160.0 -108.5 -160.05 L-110.65 -162.25 -113.2 -165.25 -114.45 -166.75 Q-117.1 -170.1 -117.15 -171.0 L-116.6 -171.75 -115.95 -172.25 Q-114.65 -169.55 -111.4 -166.75 L-111.1 -166.5 Q-106.6 -162.65 -102.85 -162.6 L-101.7 -162.75 -99.9 -162.55 Q-95.2 -162.6 -90.2 -166.75 -88.4 -168.25 -86.55 -170.3 L-85.15 -171.85 -84.5 -172.65 M-83.75 -148.75 L-84.4 -148.65 -84.8 -148.6 -85.3 -148.7 -85.6 -148.95 -85.95 -150.35 Q-86.05 -150.75 -85.2 -153.1 L-84.5 -155.55 -84.45 -156.95 -84.4 -157.45 -84.2 -158.25 Q-83.65 -159.3 -82.8 -158.9 -81.85 -158.55 -81.85 -157.65 -81.6 -155.35 -81.85 -152.9 L-82.45 -150.35 Q-82.95 -149.15 -83.75 -148.75 M-108.25 -153.85 Q-108.65 -156.4 -106.1 -156.25 -103.5 -156.15 -103.2 -153.85 -103.15 -153.25 -103.6 -152.5 L-104.35 -151.7 Q-102.7 -151.65 -102.3 -149.55 -102.25 -148.85 -102.6 -148.2 -103.3 -147.25 -104.45 -147.25 -107.15 -147.25 -107.4 -148.7 -107.75 -151.1 -106.1 -151.6 -107.1 -151.75 -107.7 -152.65 L-108.25 -153.85 M-101.6 -151.6 Q-101.8 -152.95 -100.55 -152.75 -99.3 -152.75 -99.05 -151.65 -99.0 -151.15 -99.3 -150.8 L-100.15 -150.35 -100.85 -150.45 -101.3 -150.75 -101.6 -151.6 M-89.6 -154.15 Q-89.9 -156.25 -87.55 -156.8 -85.35 -157.55 -85.1 -155.75 -85.1 -155.35 -86.0 -154.05 -87.05 -152.75 -88.05 -152.75 -89.05 -152.75 -89.4 -153.45 L-89.6 -154.15 M-133.05 -175.5 L-133.15 -174.55 -133.4 -173.55 Q-133.9 -171.65 -134.2 -169.2 L-134.65 -166.75 -134.8 -165.15 -136.1 -166.75 -138.8 -170.75 Q-136.35 -171.0 -134.9 -172.9 L-134.45 -173.55 -133.05 -175.5 M-132.55 -111.0 L-132.55 -111.05 -132.3 -110.85 -132.55 -111.0 M-136.65 -102.5 L-136.75 -102.5 -136.8 -102.8 -136.65 -102.5 M-129.3 -106.15 L-129.05 -106.85 -128.9 -107.45 Q-127.75 -110.5 -125.7 -110.4 L-125.7 -110.3 Q-127.4 -109.8 -128.55 -107.45 L-128.35 -107.25 -128.9 -106.8 -129.3 -106.15 M-129.55 -105.45 L-129.5 -105.5 -129.5 -105.45 -129.55 -105.45 M-88.65 -113.95 L-87.55 -113.6 -87.9 -114.6 Q-88.35 -116.95 -86.35 -115.65 L-85.3 -115.0 -84.4 -114.25 Q-82.3 -112.4 -81.95 -110.35 L-82.05 -109.45 Q-82.15 -108.9 -82.85 -108.8 -83.45 -108.85 -84.4 -109.75 L-84.6 -109.95 -85.55 -110.95 -86.3 -111.7 -86.1 -110.6 Q-85.95 -109.85 -86.2 -109.15 -86.55 -108.25 -87.55 -108.25 -89.05 -108.3 -89.85 -109.9 L-90.3 -111.5 Q-90.85 -114.25 -88.65 -113.95" fill="#421e1e" fill-rule="evenodd" stroke="none"/>
    <path d="M-72.95 -257.1 Q-70.5 -255.75 -68.65 -253.8 -62.9 -247.85 -61.45 -235.8 L-61.15 -231.55 Q-60.85 -222.2 -61.65 -215.4 L-64.6 -200.35 -62.4 -201.85 -61.95 -202.2 -61.85 -202.2 -61.45 -202.4 -62.4 -201.05 -64.25 -197.75 -60.65 -198.9 -58.1 -199.5 Q-55.55 -199.45 -53.0 -196.15 -50.7 -192.95 -49.55 -192.85 L-48.45 -193.15 -47.05 -193.7 Q-46.45 -191.15 -46.1 -187.8 -45.15 -184.85 -45.0 -181.35 -44.85 -176.75 -46.4 -172.85 -47.4 -170.7 -50.0 -166.55 -52.6 -162.7 -53.5 -160.05 L-53.75 -159.25 Q-54.95 -155.35 -54.6 -150.55 L-54.55 -149.7 -54.35 -147.8 -53.45 -143.35 Q-52.4 -139.35 -52.35 -136.75 -52.25 -134.75 -52.5 -133.05 -52.85 -130.85 -53.8 -129.2 L-54.45 -128.3 Q-56.75 -125.35 -60.45 -125.25 -64.1 -125.35 -66.15 -130.7 L-66.95 -133.05 Q-67.85 -135.9 -68.3 -139.3 L-68.3 -140.65 -68.3 -145.7 -68.8 -148.35 -69.15 -149.45 -69.2 -149.6 -70.1 -153.65 Q-70.3 -156.05 -69.7 -159.25 L-69.55 -160.2 -69.15 -162.25 Q-68.75 -164.8 -68.9 -166.35 -69.1 -169.2 -70.35 -172.95 L-70.5 -173.55 Q-71.6 -177.0 -71.75 -178.6 -71.95 -181.9 -70.35 -189.3 -69.3 -194.55 -68.35 -196.8 L-66.95 -198.0 -66.75 -198.25 -64.1 -213.15 Q-62.7 -222.25 -63.0 -229.6 -63.2 -233.15 -63.75 -235.8 -65.3 -242.2 -69.4 -242.2 -75.4 -242.2 -78.45 -235.85 -79.6 -233.9 -80.25 -231.2 -82.45 -223.65 -81.9 -215.4 L-81.25 -209.65 Q-80.75 -205.95 -80.45 -205.0 L-80.25 -202.85 -80.75 -203.05 -80.95 -203.2 Q-83.75 -205.6 -88.85 -206.4 L-91.6 -206.7 Q-91.3 -209.75 -90.1 -212.65 -88.8 -216.3 -86.55 -219.2 -85.9 -220.25 -84.3 -228.75 L-83.2 -235.9 Q-82.7 -240.5 -82.75 -243.2 -83.05 -247.05 -86.15 -248.75 -87.55 -249.5 -89.75 -249.9 L-90.3 -250.0 Q-89.75 -252.8 -87.8 -255.05 -84.9 -258.35 -79.95 -258.5 L-79.5 -258.5 -76.35 -258.0 -72.95 -257.1 M-73.2 -118.75 L-75.3 -116.1 -75.3 -117.3 -75.4 -119.5 -75.65 -120.8 -76.0 -122.3 Q-77.45 -118.35 -78.8 -111.3 -79.25 -109.25 -80.15 -106.55 -81.6 -104.5 -82.95 -103.6 L-84.3 -102.5 -84.4 -102.4 -85.7 -101.15 Q-87.4 -99.5 -88.45 -98.9 L-88.9 -98.7 -89.55 -98.4 -92.45 -97.35 -93.5 -97.05 Q-97.1 -94.05 -99.8 -92.25 L-103.65 -90.0 -107.2 -88.5 Q-108.8 -87.8 -112.05 -86.95 L-116.5 -85.7 -120.15 -85.35 -121.1 -85.25 -122.2 -84.9 -122.85 -84.75 -125.4 -84.15 -130.1 -83.7 Q-137.2 -83.75 -142.65 -86.7 L-142.7 -86.7 -143.5 -87.2 -144.65 -88.75 -145.35 -90.0 Q-146.2 -91.7 -146.4 -93.55 L-146.35 -93.55 Q-141.9 -90.2 -137.2 -90.15 L-134.8 -90.65 -133.55 -91.4 -133.45 -91.35 -133.35 -91.55 -132.8 -91.7 -132.85 -91.25 -132.55 -90.0 -131.8 -88.95 Q-131.1 -88.3 -130.05 -88.2 -129.15 -88.25 -127.65 -89.3 L-126.8 -90.0 -126.2 -90.65 -125.75 -90.0 Q-125.45 -89.65 -125.15 -89.65 -124.6 -89.65 -123.85 -90.0 -122.4 -90.8 -120.1 -93.4 L-119.9 -93.8 -118.25 -95.9 -118.1 -96.1 -117.95 -96.25 -118.2 -95.2 -118.2 -94.6 -118.2 -94.4 -118.65 -93.4 -119.1 -92.25 -119.6 -90.65 Q-119.35 -90.25 -118.9 -90.0 -117.8 -89.35 -115.55 -89.3 -113.8 -89.35 -112.35 -90.0 L-111.0 -90.85 Q-109.25 -92.4 -107.95 -92.35 -105.85 -92.35 -103.6 -96.05 L-102.3 -98.7 -102.25 -98.9 -101.75 -100.05 -101.55 -98.9 -101.5 -98.7 -101.45 -97.85 Q-101.2 -96.8 -99.9 -96.75 -98.7 -96.75 -95.75 -98.7 L-95.45 -98.9 Q-93.65 -100.1 -91.25 -102.05 L-91.0 -101.6 -90.8 -101.15 -89.75 -101.15 -88.6 -102.65 -87.8 -103.85 -87.8 -103.9 Q-88.15 -106.2 -89.8 -107.35 -90.65 -107.9 -91.3 -108.7 -90.75 -109.8 -90.85 -110.45 -91.15 -111.8 -91.75 -112.15 L-89.45 -116.4 -87.25 -119.6 -87.25 -119.7 Q-87.85 -123.5 -87.15 -126.6 -86.4 -130.0 -84.4 -130.35 L-83.7 -130.4 Q-82.7 -130.45 -81.75 -129.8 L-82.1 -130.5 -82.5 -132.05 -82.6 -133.05 Q-82.65 -134.65 -81.9 -135.7 L-81.15 -136.45 Q-79.85 -137.6 -77.5 -137.85 L-80.25 -137.8 Q-83.2 -138.15 -83.5 -140.15 -84.1 -144.2 -81.5 -147.35 L-78.05 -150.8 -78.95 -151.6 -79.05 -151.75 -81.95 -151.1 -82.45 -150.35 -81.85 -152.9 Q-81.6 -155.35 -81.85 -157.65 -81.85 -158.55 -82.8 -158.9 -83.65 -159.3 -84.2 -158.25 L-84.4 -157.45 -84.45 -156.95 -84.5 -155.55 -85.2 -153.1 Q-86.05 -150.75 -85.95 -150.35 L-85.6 -148.95 -85.3 -148.7 -84.8 -148.6 -84.4 -148.65 -83.75 -148.75 -84.4 -148.2 -86.2 -146.9 -87.4 -146.9 -87.55 -147.3 -87.85 -148.05 Q-88.1 -149.55 -86.75 -151.1 L-86.4 -151.55 -88.0 -151.85 Q-91.2 -150.0 -92.5 -149.95 L-93.35 -150.2 -94.1 -150.6 Q-94.9 -151.3 -94.65 -152.25 L-97.35 -150.75 Q-98.6 -149.7 -99.35 -149.5 L-99.55 -149.5 Q-99.85 -148.35 -100.6 -147.35 -102.4 -145.35 -105.55 -145.3 -106.6 -145.25 -107.5 -146.4 -108.55 -147.6 -108.3 -148.8 L-108.55 -148.8 Q-108.6 -148.25 -109.95 -146.35 -111.35 -144.35 -112.1 -144.35 -112.9 -144.3 -113.45 -144.6 -114.55 -145.0 -114.55 -145.7 L-114.4 -147.35 -116.35 -147.45 -116.4 -147.5 Q-114.9 -148.3 -114.1 -149.35 L-113.65 -150.15 -113.45 -150.75 Q-113.2 -152.1 -113.4 -153.4 -113.85 -156.05 -115.5 -158.15 L-116.5 -159.25 -117.25 -159.75 Q-118.45 -160.6 -119.8 -160.55 -120.5 -160.6 -121.8 -159.9 L-122.05 -159.75 -123.7 -159.25 -123.95 -159.15 -124.35 -159.1 -124.9 -159.25 -125.0 -159.25 -125.35 -159.35 -125.35 -159.75 -125.5 -162.25 Q-125.8 -165.4 -126.05 -166.5 L-126.15 -166.75 Q-126.95 -169.55 -128.8 -170.35 L-129.25 -170.5 -129.35 -170.55 -129.3 -170.95 -129.0 -172.45 -128.85 -173.55 -126.05 -196.1 Q-125.85 -194.05 -123.7 -192.3 -121.85 -190.8 -119.9 -191.05 L-119.65 -191.15 Q-119.45 -190.65 -118.7 -190.35 L-117.7 -190.05 Q-118.75 -188.95 -118.65 -188.0 L-118.6 -187.8 -120.55 -187.3 Q-121.75 -186.8 -121.65 -185.7 L-120.75 -183.6 Q-119.1 -180.5 -113.9 -173.55 L-112.65 -171.85 -108.15 -166.75 -107.7 -166.3 -106.65 -165.45 Q-104.0 -163.3 -101.7 -162.75 L-102.85 -162.6 Q-106.6 -162.65 -111.1 -166.5 L-111.4 -166.75 Q-114.65 -169.55 -115.95 -172.25 L-116.6 -171.75 -117.15 -171.0 Q-117.1 -170.1 -114.45 -166.75 L-113.2 -165.25 -110.65 -162.25 -108.5 -160.05 Q-108.3 -160.0 -108.05 -159.75 L-107.35 -159.25 -104.05 -156.45 Q-100.4 -153.8 -97.45 -153.8 L-94.85 -154.05 Q-90.5 -155.1 -86.9 -159.25 L-86.45 -159.75 -85.85 -160.55 -84.7 -162.25 Q-81.55 -167.35 -81.75 -171.35 -81.85 -172.4 -82.9 -172.6 L-84.2 -172.65 -84.5 -172.65 -84.2 -173.0 -83.75 -173.55 Q-82.45 -175.3 -81.55 -177.05 L-78.55 -179.0 -77.2 -178.9 Q-77.4 -176.4 -78.3 -173.55 -78.7 -172.2 -79.25 -170.8 L-82.15 -163.8 -82.0 -162.25 -80.1 -162.25 -77.45 -162.15 -76.85 -160.3 -76.65 -159.25 -76.55 -158.65 -77.1 -157.35 -77.85 -155.8 -77.85 -155.55 -77.85 -155.45 -77.8 -155.45 Q-77.2 -155.45 -76.45 -156.05 -75.75 -156.7 -75.05 -156.55 L-74.85 -154.45 -76.2 -147.75 Q-73.85 -147.75 -73.1 -143.55 -72.85 -141.4 -72.85 -138.1 L-72.55 -135.7 -72.35 -133.05 Q-72.1 -129.7 -72.2 -127.15 L-72.4 -123.95 -73.2 -118.75 M-91.65 -205.6 L-90.95 -205.55 -89.15 -205.45 -89.5 -204.0 -89.9 -201.35 Q-89.75 -199.85 -89.1 -198.25 -88.4 -196.65 -87.15 -194.95 L-84.6 -190.9 -84.8 -190.9 -85.35 -190.8 -85.6 -190.4 -87.25 -192.5 -90.0 -196.35 -90.85 -198.25 Q-91.45 -200.15 -91.65 -202.75 L-91.65 -205.6 M-66.55 -162.1 L-66.3 -161.9 -65.2 -161.85 Q-62.2 -161.75 -59.0 -167.3 L-55.75 -173.55 -55.15 -174.75 -55.25 -176.7 -57.85 -173.7 -57.95 -173.55 -60.55 -170.7 -62.15 -173.55 Q-64.0 -177.35 -64.15 -180.45 -64.25 -182.7 -63.55 -184.15 -62.35 -186.75 -61.85 -188.2 -60.45 -187.85 -60.05 -186.2 L-59.8 -182.8 Q-59.7 -181.2 -60.2 -178.55 L-59.1 -178.55 Q-57.15 -181.35 -56.35 -183.55 -55.4 -186.4 -55.75 -189.85 L-55.5 -190.15 -54.5 -187.65 Q-54.0 -186.2 -54.2 -184.5 L-52.6 -186.7 -52.2 -187.35 -52.1 -188.7 Q-52.35 -192.45 -53.8 -195.4 -55.75 -199.1 -58.55 -199.05 -63.55 -199.15 -65.95 -192.5 -68.1 -187.1 -67.75 -180.85 -67.65 -178.0 -65.75 -173.95 L-65.6 -173.55 -63.95 -170.2 Q-63.9 -169.45 -65.35 -167.2 L-66.95 -164.35 -66.8 -162.45 -66.8 -162.4 -66.75 -162.4 -66.55 -162.1 M-52.35 -173.55 Q-53.8 -169.15 -56.2 -166.95 -54.3 -167.1 -51.55 -173.05 L-51.35 -173.55 Q-49.0 -179.1 -49.1 -182.55 L-49.4 -184.0 -49.75 -185.65 -51.95 -174.85 -52.35 -173.55 M-77.0 -150.7 L-76.9 -150.7 -76.9 -150.95 -77.0 -150.7 M-56.4 -136.55 L-55.95 -137.65 -55.15 -140.4 -55.55 -143.6 -56.3 -147.95 -57.55 -155.85 -57.85 -156.05 Q-58.9 -156.6 -59.85 -156.75 -64.65 -156.8 -66.3 -150.1 L-66.65 -148.3 Q-67.4 -144.3 -66.95 -139.5 -66.75 -136.1 -65.45 -133.95 L-64.85 -133.05 -64.4 -132.5 -64.15 -132.2 -62.75 -130.75 Q-61.95 -130.1 -60.9 -130.05 L-60.85 -130.05 Q-60.1 -130.1 -59.4 -130.45 L-58.9 -130.6 -58.55 -130.8 Q-57.85 -131.15 -57.4 -131.85 L-56.9 -133.05 Q-56.25 -134.9 -56.25 -136.2 L-56.4 -136.55 M-79.25 -125.8 L-78.75 -126.15 -78.5 -126.7 Q-79.15 -128.0 -79.8 -127.95 -80.45 -128.1 -80.3 -127.0 L-80.05 -126.05 -79.25 -125.8 M-80.0 -133.6 L-79.9 -133.05 -79.8 -132.9 Q-79.45 -132.35 -78.7 -132.25 -77.75 -132.25 -77.75 -133.05 L-77.75 -133.5 Q-77.9 -134.95 -79.1 -134.9 -80.2 -134.9 -80.0 -133.6 M-78.25 -139.45 Q-76.45 -139.35 -76.25 -143.25 -76.4 -144.55 -77.25 -145.4 -78.2 -146.25 -79.1 -146.15 -81.75 -146.05 -81.0 -141.3 -80.8 -139.6 -78.25 -139.45 M-80.5 -114.95 Q-80.05 -114.9 -79.85 -115.35 -79.65 -115.85 -79.75 -116.35 -80.0 -117.9 -83.2 -119.15 L-84.4 -119.45 Q-86.65 -119.95 -86.25 -118.25 -86.25 -117.55 -85.8 -117.05 L-84.4 -116.05 -84.0 -115.85 Q-83.2 -115.4 -82.4 -115.85 -81.8 -115.9 -81.4 -115.35 -81.25 -115.0 -80.5 -114.95 M-79.1 -119.05 Q-78.45 -119.0 -78.3 -119.85 L-78.3 -121.0 Q-78.55 -123.0 -81.0 -123.85 L-81.05 -124.9 Q-81.5 -127.8 -83.45 -127.45 L-84.4 -127.2 Q-85.4 -126.7 -85.1 -125.0 L-84.85 -124.15 Q-85.35 -123.8 -85.2 -123.05 L-84.4 -121.85 -83.75 -121.35 Q-82.1 -120.25 -80.6 -120.8 L-80.2 -119.8 Q-79.8 -119.05 -79.1 -119.05 M-101.6 -151.6 L-101.3 -150.75 -100.85 -150.45 -100.15 -150.35 -99.3 -150.8 Q-99.0 -151.15 -99.05 -151.65 -99.3 -152.75 -100.55 -152.75 -101.8 -152.95 -101.6 -151.6 M-108.25 -153.85 L-107.7 -152.65 Q-107.1 -151.75 -106.1 -151.6 -107.75 -151.1 -107.4 -148.7 -107.15 -147.25 -104.45 -147.25 -103.3 -147.25 -102.6 -148.2 -102.25 -148.85 -102.3 -149.55 -102.7 -151.65 -104.35 -151.7 L-103.6 -152.5 Q-103.15 -153.25 -103.2 -153.85 -103.5 -156.15 -106.1 -156.25 -108.65 -156.4 -108.25 -153.85 M-89.6 -154.15 L-89.4 -153.45 Q-89.05 -152.75 -88.05 -152.75 -87.05 -152.75 -86.0 -154.05 -85.1 -155.35 -85.1 -155.75 -85.35 -157.55 -87.55 -156.8 -89.9 -156.25 -89.6 -154.15 M-101.4 -110.8 L-101.2 -110.7 -101.4 -110.7 -101.4 -110.8 M-88.65 -113.95 Q-90.85 -114.25 -90.3 -111.5 L-89.85 -109.9 Q-89.05 -108.3 -87.55 -108.25 -86.55 -108.25 -86.2 -109.15 -85.95 -109.85 -86.1 -110.6 L-86.3 -111.7 -85.55 -110.95 -84.6 -109.95 -84.4 -109.75 Q-83.45 -108.85 -82.85 -108.8 -82.15 -108.9 -82.05 -109.45 L-81.95 -110.35 Q-82.3 -112.4 -84.4 -114.25 L-85.3 -115.0 -86.35 -115.65 Q-88.35 -116.95 -87.9 -114.6 L-87.55 -113.6 -88.65 -113.95 M-131.9 -93.9 L-131.8 -93.8 -131.9 -93.8 -131.9 -93.9" fill="#341818" fill-rule="evenodd" stroke="none"/>
    <path d="M-89.75 -249.9 Q-87.55 -249.5 -86.15 -248.75 -83.05 -247.05 -82.75 -243.2 -82.7 -240.5 -83.2 -235.9 L-84.3 -228.75 Q-85.9 -220.25 -86.55 -219.2 -88.8 -216.3 -90.1 -212.65 -91.3 -209.75 -91.6 -206.7 L-93.6 -206.8 Q-92.9 -212.35 -89.55 -221.65 -86.55 -230.5 -85.8 -235.9 -85.55 -238.3 -85.6 -239.8 -85.9 -242.75 -86.55 -245.3 -87.9 -249.25 -89.75 -249.9 M-117.1 -197.8 L-114.55 -198.25 Q-110.3 -199.2 -104.2 -201.7 -97.7 -204.5 -93.8 -205.25 L-91.65 -205.6 -91.65 -202.75 Q-91.45 -200.15 -90.85 -198.25 L-90.0 -196.35 -87.25 -192.5 -93.0 -195.2 Q-98.1 -197.55 -101.75 -197.35 -103.9 -197.4 -110.75 -195.65 L-115.25 -194.6 -118.35 -193.95 -118.9 -194.1 -119.15 -194.3 -116.6 -195.75 -113.4 -197.6 -117.1 -197.55 -117.1 -197.8" fill="#807b70" fill-rule="evenodd" stroke="none"/>
    <path d="M-138.0 -191.2 Q-140.45 -192.95 -141.75 -195.0 -142.75 -196.6 -143.05 -198.25 L-143.2 -199.4 -143.1 -199.9 Q-142.15 -204.0 -140.3 -209.15 -139.65 -209.0 -138.9 -208.35 -141.15 -201.05 -141.15 -198.25 L-141.15 -197.95 Q-141.3 -197.6 -140.2 -196.2 L-139.05 -194.55 -138.0 -192.3 -137.5 -191.4 -138.0 -191.2 M-138.6 -213.95 L-136.45 -219.9 -136.0 -220.45 -136.0 -220.5 Q-135.15 -223.3 -134.0 -228.75 L-132.3 -235.85 -131.75 -237.6 Q-130.65 -241.3 -128.9 -244.65 -126.55 -246.25 -122.9 -247.45 L-116.2 -248.9 Q-122.7 -245.5 -124.8 -243.3 -126.35 -241.95 -128.4 -237.0 L-128.75 -235.85 -134.3 -222.3 -137.2 -213.95 -137.85 -214.0 -138.6 -213.95" fill="#bf9bb0" fill-rule="evenodd" stroke="none"/>
    <path d="M-130.55 -197.5 L-130.5 -198.25 Q-130.2 -203.6 -129.4 -207.5 -127.8 -216.4 -125.85 -218.95 -126.3 -217.6 -126.75 -214.55 -127.85 -208.45 -128.05 -208.0 L-128.9 -203.85 -129.3 -200.55 -129.55 -198.25 -129.55 -197.35 -129.85 -191.8 -129.9 -188.9 -130.1 -182.15 Q-130.1 -180.95 -130.75 -177.7 L-131.5 -173.55 -131.75 -172.35 -132.15 -170.65 -132.55 -170.5 Q-133.65 -170.15 -134.2 -169.2 -133.9 -171.65 -133.4 -173.55 L-133.15 -174.55 -133.05 -175.5 -131.55 -184.0 -131.55 -184.05 -131.55 -184.15 -130.95 -188.65 -130.95 -188.95 -130.9 -189.9 -130.75 -191.8 -130.7 -193.95 -130.55 -197.5" fill="#4f2323" fill-rule="evenodd" stroke="none"/>
    <path d="M-68.5 -140.55 L-68.55 -140.75 -69.0 -139.9 -69.15 -139.7 -70.1 -137.7 -70.15 -137.6 -70.15 -137.45 -70.0 -135.7 -69.8 -133.05 -69.65 -131.35 Q-69.55 -126.8 -70.0 -123.95 L-70.6 -122.35 Q-71.3 -120.9 -72.6 -119.4 L-73.2 -118.75 -72.4 -123.95 -72.2 -127.15 Q-72.1 -129.7 -72.35 -133.05 L-72.55 -135.7 -72.85 -138.1 Q-72.85 -141.4 -73.1 -143.55 -73.85 -147.75 -76.2 -147.75 L-74.85 -154.45 -75.05 -156.55 Q-75.75 -156.7 -76.45 -156.05 -77.2 -155.45 -77.8 -155.45 L-77.85 -155.55 -77.85 -155.8 -77.1 -157.35 -76.55 -158.65 -76.65 -159.25 -76.85 -160.3 -77.45 -162.15 -80.1 -162.25 -82.0 -162.25 -82.15 -163.8 -79.25 -170.8 Q-78.7 -172.2 -78.3 -173.55 -77.4 -176.4 -77.2 -178.9 L-78.55 -179.0 -81.55 -177.05 Q-79.5 -181.05 -79.75 -184.6 -80.0 -187.55 -81.3 -189.2 -82.55 -190.65 -84.2 -190.85 L-84.3 -190.85 -84.6 -190.9 -87.15 -194.95 Q-88.4 -196.65 -89.1 -198.25 -89.75 -199.85 -89.9 -201.35 L-89.5 -204.0 -89.15 -205.45 -87.25 -205.25 -87.25 -205.15 -87.25 -205.05 -84.7 -204.6 Q-84.55 -204.75 -84.2 -204.4 L-80.8 -203.0 -80.75 -203.05 -80.25 -202.85 -80.45 -205.0 Q-80.75 -205.95 -81.25 -209.65 L-81.9 -215.4 Q-82.45 -223.65 -80.25 -231.2 -79.6 -233.9 -78.45 -235.85 -75.4 -242.2 -69.4 -242.2 -65.3 -242.2 -63.75 -235.8 -63.2 -233.15 -63.0 -229.6 -62.7 -222.25 -64.1 -213.15 L-66.75 -198.25 -66.95 -198.0 -68.35 -196.8 Q-69.3 -194.55 -70.35 -189.3 -71.95 -181.9 -71.75 -178.6 -71.6 -177.0 -70.5 -173.55 L-70.35 -172.95 Q-69.1 -169.2 -68.9 -166.35 -68.75 -164.8 -69.15 -162.25 L-69.55 -160.2 -69.7 -159.25 Q-70.3 -156.05 -70.1 -153.65 L-69.2 -149.6 -69.15 -149.45 -68.8 -148.35 -68.3 -145.7 -68.3 -140.65 -68.5 -140.55 M-75.3 -116.1 L-76.15 -114.5 -76.4 -114.0 -76.55 -113.6 -78.3 -109.6 -78.7 -109.0 Q-79.45 -107.6 -80.15 -106.55 -79.25 -109.25 -78.8 -111.3 -77.45 -118.35 -76.0 -122.3 L-75.65 -120.8 -75.4 -119.5 -75.3 -117.3 -75.3 -116.1 M-66.75 -162.4 L-66.8 -162.4 -66.8 -162.45 -66.75 -162.4 M-82.1 -196.7 L-82.15 -196.7 -82.15 -196.6 -82.1 -196.7" fill="#331e1e" fill-rule="evenodd" stroke="none"/>
    <path d="M-68.3 -139.3 L-68.5 -140.55 -68.3 -140.65 -68.3 -139.3 M-80.95 -203.2 L-80.75 -203.05 -80.8 -203.0 -80.95 -203.2 M-87.25 -205.25 L-84.7 -204.6 -87.25 -205.05 -87.25 -205.15 -87.25 -205.25 M-82.1 -196.7 L-82.15 -196.6 -82.15 -196.7 -82.1 -196.7" fill="#241010" fill-rule="evenodd" stroke="none"/>
    <path d="M-139.25 -190.05 Q-138.9 -190.7 -138.0 -191.2 L-137.5 -191.4 -136.75 -191.75 Q-135.0 -192.45 -133.4 -192.4 L-131.7 -192.25 Q-131.45 -192.2 -130.75 -191.8 L-130.9 -189.9 -133.1 -189.9 -134.1 -189.7 -135.45 -189.2 -134.05 -188.45 -132.5 -188.05 Q-132.1 -188.05 -131.9 -188.2 L-130.95 -188.65 -131.55 -184.15 -131.65 -184.05 -131.75 -184.0 Q-132.45 -183.55 -133.45 -183.5 -135.5 -183.6 -137.5 -186.75 L-138.1 -187.7 -139.25 -190.05 M-66.8 -162.45 L-66.95 -164.35 -65.35 -167.2 Q-63.9 -169.45 -63.95 -170.2 L-65.6 -173.55 -65.75 -173.95 Q-67.65 -178.0 -67.75 -180.85 -68.1 -187.1 -65.95 -192.5 -63.55 -199.15 -58.55 -199.05 -55.75 -199.1 -53.8 -195.4 -52.35 -192.45 -52.1 -188.7 L-52.2 -187.35 -52.6 -186.7 -54.2 -184.5 Q-54.0 -186.2 -54.5 -187.65 L-55.5 -190.15 -55.75 -189.85 Q-55.4 -186.4 -56.35 -183.55 -57.15 -181.35 -59.1 -178.55 L-60.2 -178.55 Q-59.7 -181.2 -59.8 -182.8 L-60.05 -186.2 Q-60.45 -187.85 -61.85 -188.2 -62.35 -186.75 -63.55 -184.15 -64.25 -182.7 -64.15 -180.45 -64.0 -177.35 -62.15 -173.55 L-60.55 -170.7 -57.95 -173.55 -57.85 -173.7 -55.25 -176.7 -55.15 -174.75 -55.75 -173.55 -59.0 -167.3 Q-62.2 -161.75 -65.2 -161.85 L-66.3 -161.9 -66.55 -162.1 -66.55 -162.25 -66.75 -162.4 -66.8 -162.45 M-52.35 -173.55 L-51.95 -174.85 -49.75 -185.65 -49.4 -184.0 -49.1 -182.55 Q-49.0 -179.1 -51.35 -173.55 L-51.55 -173.05 Q-54.3 -167.1 -56.2 -166.95 -53.8 -169.15 -52.35 -173.55 M-117.7 -190.05 L-117.55 -190.1 -116.2 -191.1 -113.75 -191.55 -109.6 -193.05 Q-103.75 -194.9 -101.85 -194.95 L-97.65 -194.35 -94.3 -193.0 -90.75 -191.6 -88.85 -190.6 Q-90.6 -187.4 -92.9 -184.15 -95.45 -180.8 -97.65 -178.9 L-99.2 -177.95 Q-100.5 -177.35 -101.55 -177.2 -103.75 -177.25 -109.15 -182.15 L-112.45 -185.25 -114.5 -187.05 -116.75 -186.75 Q-118.45 -186.75 -118.6 -187.8 L-118.65 -188.0 Q-118.75 -188.95 -117.7 -190.05 M-108.8 -190.85 L-110.4 -189.5 -108.55 -189.0 -106.9 -188.75 -99.5 -189.6 -94.95 -190.55 -97.15 -191.15 -97.9 -191.3 -100.65 -191.6 -101.6 -191.6 -106.45 -191.4 -106.5 -191.4 -108.8 -190.85" fill="#210c0c" fill-rule="evenodd" stroke="none"/>
    <path d="M-143.5 -87.2 Q-145.6 -88.45 -147.05 -90.0 -150.05 -93.2 -150.65 -97.6 L-150.85 -98.7 -150.85 -98.9 -150.9 -99.25 Q-151.05 -100.05 -150.85 -100.5 L-150.65 -101.6 -150.55 -101.75 -150.55 -101.7 Q-150.3 -100.45 -149.9 -100.05 L-148.95 -99.8 Q-147.95 -99.8 -145.1 -101.95 L-144.4 -102.4 -142.5 -103.85 -143.6 -101.75 -144.75 -100.25 -145.7 -98.9 -145.85 -98.7 -146.2 -98.0 -146.35 -97.5 -145.85 -97.65 Q-146.6 -96.95 -146.3 -96.1 L-145.95 -95.8 Q-145.8 -95.5 -145.3 -95.5 -144.5 -95.6 -143.95 -96.1 L-143.75 -94.9 -143.6 -94.9 -143.4 -94.6 Q-142.25 -95.2 -141.75 -96.55 L-140.9 -98.7 -140.8 -98.85 -140.75 -98.7 Q-140.6 -98.0 -139.9 -97.3 -139.2 -96.75 -138.85 -96.75 -137.05 -96.75 -136.15 -98.65 L-136.15 -98.7 -136.05 -98.9 -136.05 -98.95 Q-135.75 -100.7 -136.65 -102.5 -134.95 -102.5 -132.45 -105.0 -131.2 -106.35 -130.7 -107.55 L-130.75 -107.8 Q-131.55 -109.85 -132.3 -110.85 L-132.55 -111.05 Q-133.45 -112.05 -134.35 -112.05 -135.45 -112.2 -136.5 -111.25 -136.9 -111.15 -137.1 -110.85 L-137.65 -110.25 -139.0 -109.85 -139.2 -110.7 Q-139.35 -111.15 -139.65 -111.4 L-140.05 -111.6 -140.4 -111.7 -140.45 -112.25 -141.9 -113.95 -142.35 -114.5 -144.45 -116.65 -143.1 -117.25 -140.4 -115.5 -140.25 -115.45 Q-128.75 -112.3 -117.15 -115.05 L-115.35 -115.4 -115.3 -115.6 -114.4 -115.85 -112.2 -116.7 Q-104.5 -119.9 -98.55 -124.8 L-96.45 -126.65 -95.9 -127.15 -93.8 -129.3 -90.7 -133.05 -89.5 -134.8 -87.1 -138.9 -85.95 -141.3 -86.0 -141.35 Q-86.95 -143.35 -88.8 -144.65 L-89.25 -145.0 Q-90.1 -145.9 -91.45 -146.45 L-93.5 -146.8 -93.65 -146.9 -93.85 -146.9 -96.1 -146.65 -96.25 -146.6 -100.2 -145.7 -102.4 -144.5 -106.15 -144.1 -108.7 -143.75 -111.85 -143.4 -121.7 -142.1 -123.35 -141.95 -124.1 -141.85 -126.0 -141.8 -129.7 -141.5 -136.3 -141.15 -137.85 -141.15 -138.7 -141.15 Q-139.5 -141.0 -139.85 -141.7 L-140.3 -142.75 Q-138.85 -142.85 -136.75 -143.8 L-135.2 -144.5 -135.15 -144.5 Q-133.25 -143.25 -131.1 -143.25 L-130.9 -143.25 -129.8 -143.3 -127.8 -143.95 -123.7 -145.2 -123.35 -145.3 -119.9 -146.25 -118.85 -146.6 -118.45 -146.7 -117.7 -146.95 -116.65 -147.35 -116.5 -147.45 -116.35 -147.45 -114.4 -147.35 -114.55 -145.7 Q-114.55 -145.0 -113.45 -144.6 -112.9 -144.3 -112.1 -144.35 -111.35 -144.35 -109.95 -146.35 -108.6 -148.25 -108.55 -148.8 L-108.3 -148.8 Q-108.55 -147.6 -107.5 -146.4 -106.6 -145.25 -105.55 -145.3 -102.4 -145.35 -100.6 -147.35 -99.85 -148.35 -99.55 -149.5 L-99.35 -149.5 Q-98.6 -149.7 -97.35 -150.75 L-94.65 -152.25 Q-94.9 -151.3 -94.1 -150.6 L-93.35 -150.2 -92.5 -149.95 Q-91.2 -150.0 -88.0 -151.85 L-86.4 -151.55 -86.75 -151.1 Q-88.1 -149.55 -87.85 -148.05 L-87.55 -147.3 -87.4 -146.9 -86.2 -146.9 -84.4 -148.2 -83.75 -148.75 Q-82.95 -149.15 -82.45 -150.35 L-81.95 -151.1 -79.05 -151.75 -78.95 -151.6 -78.05 -150.8 -81.5 -147.35 Q-84.1 -144.2 -83.5 -140.15 -83.2 -138.15 -80.25 -137.8 L-77.5 -137.85 Q-79.85 -137.6 -81.15 -136.45 L-81.9 -135.7 Q-82.65 -134.65 -82.6 -133.05 L-82.5 -132.05 -82.1 -130.5 -81.75 -129.8 Q-82.7 -130.45 -83.7 -130.4 L-84.4 -130.35 Q-86.4 -130.0 -87.15 -126.6 -87.85 -123.5 -87.25 -119.7 L-87.25 -119.6 -89.45 -116.4 -91.75 -112.15 Q-91.15 -111.8 -90.85 -110.45 -90.75 -109.8 -91.3 -108.7 -90.65 -107.9 -89.8 -107.35 -88.15 -106.2 -87.8 -103.9 L-87.8 -103.85 -88.6 -102.65 -89.75 -101.15 -90.8 -101.15 -91.0 -101.6 -91.25 -102.05 Q-93.65 -100.1 -95.45 -98.9 L-95.75 -98.7 Q-98.7 -96.75 -99.9 -96.75 -101.2 -96.8 -101.45 -97.85 L-101.5 -98.7 -101.55 -98.9 -101.75 -100.05 -102.25 -98.9 -102.3 -98.7 -103.6 -96.05 Q-105.85 -92.35 -107.95 -92.35 -109.25 -92.4 -111.0 -90.85 L-112.35 -90.0 Q-113.8 -89.35 -115.55 -89.3 -117.8 -89.35 -118.9 -90.0 -119.35 -90.25 -119.6 -90.65 L-119.1 -92.25 -118.65 -93.4 -118.2 -94.4 -118.2 -94.6 -118.2 -95.2 -117.95 -96.25 -118.1 -96.1 -118.25 -95.9 -119.9 -93.8 -120.1 -93.4 Q-122.4 -90.8 -123.85 -90.0 -124.6 -89.65 -125.15 -89.65 -125.45 -89.65 -125.75 -90.0 L-126.2 -90.65 -126.8 -90.0 -127.65 -89.3 Q-129.15 -88.25 -130.05 -88.2 -131.1 -88.3 -131.8 -88.95 L-132.55 -90.0 -132.85 -91.25 -132.8 -91.7 -133.35 -91.55 -133.45 -91.35 -133.55 -91.4 -134.8 -90.65 -137.2 -90.15 Q-141.9 -90.2 -146.35 -93.55 L-146.4 -93.55 Q-146.2 -91.7 -145.35 -90.0 L-144.65 -88.75 -143.5 -87.2 M-123.65 -109.05 L-123.65 -109.15 -123.75 -109.2 -123.65 -109.05 M-128.35 -107.25 L-128.55 -107.45 Q-127.4 -109.8 -125.7 -110.3 L-125.7 -110.4 Q-127.75 -110.5 -128.9 -107.45 L-129.05 -106.85 -129.3 -106.15 -129.45 -105.5 -129.5 -105.5 -129.55 -105.45 -129.55 -105.4 -129.55 -105.3 -129.4 -104.85 -129.2 -103.95 -128.4 -103.85 Q-127.55 -103.85 -127.05 -104.95 -126.55 -106.0 -126.7 -106.55 -127.1 -108.25 -128.35 -107.25 M-123.0 -102.25 L-122.55 -102.05 -122.1 -102.05 Q-120.75 -102.15 -120.55 -104.15 L-120.75 -106.65 -120.75 -106.9 -120.3 -106.9 Q-119.95 -106.9 -119.65 -107.4 -119.3 -107.85 -119.4 -108.2 L-119.65 -108.8 -119.75 -108.95 Q-121.15 -109.2 -121.45 -108.5 L-121.3 -107.55 Q-122.45 -107.35 -123.0 -105.5 L-123.3 -103.25 Q-123.25 -102.55 -123.0 -102.25 M-89.95 -125.65 L-89.7 -125.9 -89.75 -125.95 -90.0 -125.7 -89.95 -125.65 M-105.1 -111.5 Q-107.2 -110.85 -108.5 -109.6 -109.4 -108.85 -109.9 -107.9 L-111.05 -105.8 Q-112.9 -105.3 -113.9 -103.05 -114.85 -101.25 -114.85 -98.95 L-114.85 -98.9 -114.85 -98.7 -114.8 -98.25 Q-113.9 -98.3 -113.95 -98.5 L-113.7 -98.5 Q-113.9 -97.9 -113.7 -96.75 L-110.7 -98.7 -110.4 -98.9 -110.35 -98.95 -108.7 -100.4 -108.3 -100.8 -106.9 -103.2 -104.9 -106.3 -104.1 -109.75 -104.35 -111.25 Q-104.7 -111.25 -104.9 -111.4 L-105.1 -111.5 M-101.2 -110.7 L-101.4 -110.95 -101.4 -110.8 -101.4 -110.7 -101.2 -110.7 M-124.5 -95.15 L-124.55 -95.25 -124.55 -95.2 -124.5 -95.15 M-131.8 -93.8 L-131.75 -93.7 -131.75 -94.05 -131.9 -93.9 -131.9 -93.8 -131.8 -93.8" fill="#2e0101" fill-rule="evenodd" stroke="none"/>
    <path d="M-65.75 -137.45 L-65.8 -138.35 -65.75 -138.95 -65.65 -139.8 -65.35 -140.5 -64.5 -141.7 Q-64.05 -142.55 -62.85 -142.6 L-60.7 -142.85 -60.25 -142.85 -60.05 -142.75 -59.75 -142.6 -61.65 -142.05 Q-62.9 -141.8 -63.5 -141.25 -64.4 -140.6 -64.65 -139.25 -65.1 -138.0 -64.95 -136.7 L-64.55 -134.9 -64.8 -135.2 -65.35 -136.25 -65.65 -136.9 -65.6 -136.85 -65.75 -137.15 -65.75 -137.2 -65.75 -137.45" fill="#c48b17" fill-rule="evenodd" stroke="none"/>
    <path d="M-58.2 -141.35 Q-57.4 -140.6 -56.95 -139.6 L-56.8 -138.45 Q-56.7 -136.2 -57.7 -134.4 L-58.7 -133.05 -59.5 -132.45 -60.55 -132.4 -60.8 -132.4 -61.15 -132.4 -62.55 -133.0 -62.6 -133.05 -62.95 -133.35 -63.45 -133.7 -63.8 -133.95 -63.2 -136.05 -62.1 -137.95 -61.9 -137.4 -61.2 -133.95 Q-60.55 -133.6 -60.35 -134.7 L-60.55 -136.9 Q-60.75 -137.4 -60.05 -138.5 L-59.15 -140.05 -59.5 -140.3 -59.3 -140.55 -58.2 -141.35 M-61.25 -138.75 L-60.85 -139.15 -61.15 -138.6 -61.25 -138.75" fill="#987012" fill-rule="evenodd" stroke="none"/>
    <path d="M-60.85 -139.15 L-59.9 -140.55 -59.5 -140.3 -59.15 -140.05 -60.05 -138.5 Q-60.75 -137.4 -60.55 -136.9 L-60.35 -134.7 Q-60.55 -133.6 -61.2 -133.95 L-61.9 -137.4 -62.1 -137.95 -62.75 -138.6 -63.45 -139.3 -63.55 -139.4 -63.55 -139.45 -62.85 -140.35 -61.95 -139.6 -61.25 -138.75 -61.15 -138.6 -60.85 -139.15" fill="#ffba1f" fill-rule="evenodd" stroke="none"/>
    <path d="M-59.75 -142.6 L-58.7 -141.8 -58.2 -141.35 -59.3 -140.55 -59.5 -140.3 -59.9 -140.55 -60.85 -139.15 -61.25 -138.75 -61.95 -139.6 -62.85 -140.35 -63.55 -139.45 -63.55 -139.4 -63.45 -139.3 -62.75 -138.6 -62.1 -137.95 -63.2 -136.05 -63.8 -133.95 -64.55 -134.9 -64.95 -136.7 Q-65.1 -138.0 -64.65 -139.25 -64.4 -140.6 -63.5 -141.25 -62.9 -141.8 -61.65 -142.05 L-59.75 -142.6" fill="#ab7c14" fill-rule="evenodd" stroke="none"/>
    <path d="M-56.5 -137.3 L-56.45 -137.15 -56.45 -136.85 -56.55 -137.15 -56.5 -137.3 M-58.55 -130.8 L-58.9 -130.6 -59.4 -130.45 Q-60.1 -130.1 -60.85 -130.05 L-60.9 -130.05 Q-61.95 -130.1 -62.75 -130.75 L-62.55 -133.0 -61.15 -132.4 -60.8 -132.4 -60.55 -132.4 -59.5 -132.45 -58.25 -133.05 -57.55 -133.65 -57.65 -133.05 -58.15 -131.8 -58.55 -130.8 M-64.55 -134.9 L-63.8 -133.95 -63.85 -133.4 Q-64.4 -134.15 -64.55 -134.9" fill="#8c3c11" fill-rule="evenodd" stroke="none"/>
    <path d="M-56.95 -139.6 Q-56.5 -138.6 -56.5 -137.6 L-56.5 -137.4 -56.5 -137.3 -56.55 -137.15 -56.45 -136.85 -56.4 -136.6 -56.4 -136.55 -56.5 -136.2 -56.8 -134.85 -57.55 -133.7 -57.55 -133.65 -58.25 -133.05 -59.5 -132.45 -58.7 -133.05 -57.7 -134.4 Q-56.7 -136.2 -56.8 -138.45 L-56.95 -139.6" fill="#99782f" fill-rule="evenodd" stroke="none"/>
    <path d="M-64.4 -132.5 L-64.65 -133.05 Q-65.45 -134.55 -65.65 -136.3 L-65.75 -136.75 -65.75 -137.45 -65.75 -137.2 -65.75 -137.15 -65.65 -136.9 -65.35 -136.25 -64.8 -135.2 -64.55 -134.9 Q-64.4 -134.15 -63.85 -133.4 L-63.8 -133.95 -63.45 -133.7 -62.95 -133.35 -62.6 -133.05 -62.55 -133.0 -62.75 -130.75 -64.15 -132.2 -64.4 -132.5 M-56.4 -136.55 L-56.25 -136.2 Q-56.25 -134.9 -56.9 -133.05 L-57.4 -131.85 Q-57.85 -131.15 -58.55 -130.8 L-58.15 -131.8 -57.65 -133.05 -57.55 -133.65 -57.55 -133.7 -56.8 -134.85 -56.5 -136.2 -56.4 -136.55" fill="#804223" fill-rule="evenodd" stroke="none"/>
    <path d="M-87.25 -192.5 L-85.6 -190.4 -85.35 -190.8 -84.8 -190.9 -84.6 -190.9 -84.3 -190.85 -84.55 -190.7 -87.25 -187.9 -89.8 -184.8 Q-93.3 -181.3 -97.65 -178.9 -95.45 -180.8 -92.9 -184.15 -90.6 -187.4 -88.85 -190.6 L-90.75 -191.6 -94.3 -193.0 -97.65 -194.35 -101.85 -194.95 Q-103.75 -194.9 -109.6 -193.05 L-113.75 -191.55 -116.2 -191.1 -117.55 -190.1 -117.7 -190.05 -118.7 -190.35 Q-119.45 -190.65 -119.65 -191.15 L-119.7 -191.25 -116.65 -193.6 -115.25 -194.6 -110.75 -195.65 Q-103.9 -197.4 -101.75 -197.35 -98.1 -197.55 -93.0 -195.2 L-87.25 -192.5" fill="#736f65" fill-rule="evenodd" stroke="none"/>
    <path d="M-97.9 -191.3 L-97.15 -191.15 -94.95 -190.55 -99.5 -189.6 -106.9 -188.75 -108.55 -189.0 -110.4 -189.5 -108.8 -190.85 -106.75 -190.25 -104.2 -190.05 Q-100.5 -190.05 -97.9 -191.3 M-130.95 -188.95 L-130.95 -188.65 -131.9 -188.2 Q-132.1 -188.05 -132.5 -188.05 L-134.05 -188.45 -135.45 -189.2 -134.1 -189.7 -134.1 -189.55 -130.95 -188.95" fill="#a51db8" fill-rule="evenodd" stroke="none"/>
    <path d="M-97.9 -191.3 Q-100.5 -190.05 -104.2 -190.05 L-106.75 -190.25 -108.8 -190.85 -106.5 -191.4 -106.45 -191.4 -105.25 -190.95 -103.55 -190.7 Q-102.4 -190.7 -100.65 -191.6 L-97.9 -191.3 M-130.95 -188.95 L-134.1 -189.55 -134.1 -189.7 -133.1 -189.9 -130.9 -189.9 -130.95 -188.95" fill="#cf25e2" fill-rule="evenodd" stroke="none"/>
    <path d="M-106.45 -191.4 L-101.6 -191.6 -100.65 -191.6 Q-102.4 -190.7 -103.55 -190.7 L-105.25 -190.95 -106.45 -191.4" fill="#e629ff" fill-rule="evenodd" stroke="none"/>
    <path d="M-135.2 -144.5 L-135.7 -144.85 -137.4 -146.45 Q-136.35 -145.85 -135.35 -145.45 L-134.1 -145.05 -132.6 -144.95 -131.5 -145.05 -131.45 -145.05 -131.2 -145.1 -129.95 -145.5 -127.6 -146.55 Q-125.8 -147.4 -123.15 -148.75 -121.65 -149.4 -117.65 -150.3 -114.5 -151.55 -114.5 -154.4 -114.5 -156.4 -115.85 -158.1 L-117.05 -159.25 -118.15 -159.75 -119.8 -160.05 -121.8 -159.9 Q-120.5 -160.6 -119.8 -160.55 -118.45 -160.6 -117.25 -159.75 L-116.5 -159.25 -115.5 -158.15 Q-113.85 -156.05 -113.4 -153.4 -113.2 -152.1 -113.45 -150.75 L-113.65 -150.15 -114.1 -149.35 Q-114.9 -148.3 -116.4 -147.5 L-116.5 -147.45 -116.65 -147.35 -117.7 -146.95 -118.45 -146.7 -117.8 -147.35 -117.15 -147.95 Q-116.45 -148.7 -116.85 -149.55 L-118.1 -149.35 Q-119.7 -149.05 -121.1 -148.05 -123.05 -146.7 -123.35 -145.3 L-123.7 -145.2 -127.8 -143.95 -129.8 -143.3 -130.9 -143.25 -131.1 -143.25 Q-133.25 -143.25 -135.15 -144.5 L-135.2 -144.5" fill="#471515" fill-rule="evenodd" stroke="none"/>
    <path d="M-121.8 -159.9 L-119.8 -160.05 -118.15 -159.75 -117.05 -159.25 -115.85 -158.1 Q-114.5 -156.4 -114.5 -154.4 -114.5 -151.55 -117.65 -150.3 -121.65 -149.4 -123.15 -148.75 -125.8 -147.4 -127.6 -146.55 L-129.95 -145.5 -131.2 -145.1 -131.45 -145.05 -131.45 -145.1 -131.5 -145.05 -133.05 -145.3 Q-133.65 -145.75 -133.65 -147.75 -133.65 -149.0 -131.35 -159.25 L-131.2 -159.75 -131.1 -160.3 -130.65 -162.25 -129.7 -166.55 -129.25 -170.5 -128.8 -170.35 Q-126.95 -169.55 -126.15 -166.75 L-126.05 -166.5 Q-125.8 -165.4 -125.5 -162.25 L-125.35 -159.75 -125.35 -159.35 -125.0 -159.25 -124.9 -159.25 -124.35 -159.1 -123.95 -159.15 -123.7 -159.25 -122.05 -159.75 -121.8 -159.9 M-120.7 -158.8 L-120.95 -158.75 -121.45 -158.4 -122.3 -157.7 Q-123.85 -156.35 -123.85 -155.7 L-123.55 -155.2 -122.9 -155.0 Q-121.5 -155.0 -120.3 -156.1 -119.25 -157.05 -119.25 -157.85 -119.25 -158.2 -119.75 -158.5 L-120.55 -158.8 -120.7 -158.8" fill="#541919" fill-rule="evenodd" stroke="none"/>
    <path d="M-132.15 -170.65 L-130.8 -170.75 -129.35 -170.55 -129.25 -170.5 -129.7 -166.55 -130.65 -162.25 -131.1 -160.3 -131.2 -159.75 -131.35 -159.25 Q-133.65 -149.0 -133.65 -147.75 -133.65 -145.75 -133.05 -145.3 L-131.5 -145.05 -131.45 -145.1 -131.45 -145.05 -131.5 -145.05 -132.6 -144.95 -134.1 -145.05 -135.35 -145.45 Q-135.95 -146.0 -136.25 -146.95 -136.55 -147.85 -136.55 -149.5 -136.55 -150.7 -135.65 -153.9 L-134.45 -158.4 -134.3 -159.25 -134.2 -159.75 -133.85 -162.25 -132.55 -170.5 -132.15 -170.65 M-120.7 -158.8 L-120.55 -158.8 -119.75 -158.5 Q-119.25 -158.2 -119.25 -157.85 -119.25 -157.05 -120.3 -156.1 -121.5 -155.0 -122.9 -155.0 L-123.55 -155.2 -123.85 -155.7 Q-123.85 -156.35 -122.3 -157.7 L-121.45 -158.4 -120.95 -158.75 -120.7 -158.8" fill="#691f1f" fill-rule="evenodd" stroke="none"/>
    <path d="M-123.35 -145.3 Q-123.05 -146.7 -121.1 -148.05 -119.7 -149.05 -118.1 -149.35 L-116.85 -149.55 Q-116.45 -148.7 -117.15 -147.95 L-117.8 -147.35 -118.45 -146.7 -118.85 -146.6 -119.9 -146.25 -123.35 -145.3 M-93.5 -146.8 L-91.45 -146.45 Q-90.1 -145.9 -89.25 -145.0 -88.45 -144.15 -88.1 -142.9 L-87.85 -139.9 -87.1 -138.9 -89.5 -134.8 Q-90.15 -137.15 -92.65 -139.15 -94.85 -140.95 -97.35 -141.5 L-94.45 -141.15 -94.45 -142.55 -94.6 -142.85 -92.9 -142.9 -92.9 -145.9 -93.5 -146.8" fill="#000000" fill-rule="evenodd" stroke="none"/>
    <path d="M-135.25 -162.55 L-138.0 -166.75 -140.05 -169.8 -142.4 -173.55 -142.9 -174.3 -142.6 -174.4 -142.1 -173.55 Q-140.45 -170.85 -139.1 -170.75 L-138.8 -170.75 -136.1 -166.75 -134.8 -165.15 -135.25 -162.55" fill="#4b1937" fill-rule="evenodd" stroke="none"/>
    <path d="M-137.4 -146.45 Q-137.9 -147.2 -137.85 -147.75 -137.95 -149.2 -136.95 -153.05 L-136.85 -153.65 -135.7 -158.5 -135.65 -158.7 -135.55 -159.25 -135.55 -159.75 -135.3 -162.15 -135.25 -162.25 -135.25 -162.55 -134.8 -165.15 -134.65 -166.75 -134.2 -169.2 Q-133.65 -170.15 -132.55 -170.5 L-133.85 -162.25 -134.2 -159.75 -134.3 -159.25 -134.45 -158.4 -135.65 -153.9 Q-136.55 -150.7 -136.55 -149.5 -136.55 -147.85 -136.25 -146.95 -135.95 -146.0 -135.35 -145.45 -136.35 -145.85 -137.4 -146.45" fill="#782323" fill-rule="evenodd" stroke="none"/>
    <path d="M-119.95 -137.95 L-120.6 -137.95 -121.35 -137.4 -122.1 -138.9 Q-123.1 -140.35 -124.95 -140.35 -127.5 -140.35 -128.2 -137.0 L-129.15 -136.95 Q-129.45 -140.75 -131.0 -140.75 -132.6 -140.75 -133.3 -138.3 L-133.35 -138.35 -134.75 -140.15 Q-133.4 -141.15 -129.3 -141.2 L-123.55 -141.0 Q-119.15 -141.0 -113.25 -142.05 L-116.1 -139.15 Q-116.85 -140.35 -117.85 -140.35 -119.05 -140.35 -119.55 -139.5 L-119.9 -138.5 -119.95 -137.95 M-133.2 -119.75 L-133.1 -119.15 Q-132.75 -118.3 -131.6 -118.3 -130.1 -118.3 -129.2 -119.9 L-129.05 -119.85 -126.65 -119.1 -125.65 -118.85 Q-124.95 -117.05 -123.7 -117.05 L-122.95 -117.2 -122.75 -116.5 -122.75 -115.6 -123.7 -115.4 -125.2 -115.2 -127.25 -115.3 Q-128.2 -115.45 -128.4 -116.3 -128.75 -115.9 -131.65 -115.4 L-136.15 -115.2 -137.2 -115.35 -138.0 -115.6 -137.6 -116.5 -136.7 -117.15 -137.5 -117.3 -138.0 -117.8 -136.4 -119.35 -136.35 -119.4 -133.9 -119.4 -133.3 -119.75 -133.2 -119.75 M-119.4 -118.05 L-119.3 -118.05 -118.65 -117.8 Q-118.1 -117.5 -118.1 -116.95 L-118.35 -116.25 Q-118.65 -115.85 -119.2 -115.85 L-120.35 -116.1 -121.15 -116.5 -120.2 -117.5 Q-119.6 -117.8 -119.4 -118.05" fill="#821a35" fill-rule="evenodd" stroke="none"/>
    <path d="M-133.0 -124.25 L-132.7 -128.15 -130.45 -127.6 -127.9 -127.3 Q-127.95 -123.6 -128.6 -121.4 L-128.6 -121.35 -129.2 -119.9 Q-130.1 -118.3 -131.6 -118.3 -132.75 -118.3 -133.1 -119.15 L-133.2 -119.75 -133.3 -121.35 -133.0 -124.15 -133.0 -124.25 M-126.05 -120.25 L-126.5 -121.55 -126.75 -128.4 -122.85 -128.85 -119.75 -129.25 -119.55 -127.1 Q-119.55 -124.85 -120.05 -122.6 L-120.55 -120.8 -120.6 -120.65 Q-121.6 -117.8 -122.95 -117.2 L-123.7 -117.05 Q-124.95 -117.05 -125.65 -118.85 L-125.75 -119.15 -126.05 -120.25 M-121.35 -137.4 L-121.3 -137.0 -121.15 -136.3 -120.65 -133.05 -120.45 -131.15 -124.45 -130.55 -128.4 -129.8 -128.5 -133.05 -128.45 -135.65 -128.2 -137.0 Q-127.5 -140.35 -124.95 -140.35 -123.1 -140.35 -122.1 -138.9 L-121.35 -137.4 M-129.15 -136.95 L-129.1 -135.1 -129.15 -133.05 -129.4 -129.6 -133.75 -130.5 -133.85 -133.05 -133.85 -133.6 -133.8 -135.35 -133.35 -138.05 -133.3 -138.25 -133.3 -138.3 Q-132.6 -140.75 -131.0 -140.75 -129.45 -140.75 -129.15 -136.95" fill="#a8905f" fill-rule="evenodd" stroke="none"/>
    <path d="M-137.65 -119.6 L-136.5 -121.0 -136.5 -119.4 -136.4 -119.35 -138.0 -117.8 -137.5 -117.3 -136.7 -117.15 -137.6 -116.5 -138.0 -115.6 -137.2 -115.35 -136.15 -115.2 -131.65 -115.4 Q-128.75 -115.9 -128.4 -116.3 -128.2 -115.45 -127.25 -115.3 L-125.2 -115.2 -123.7 -115.4 -122.75 -115.6 -122.75 -116.5 -122.95 -117.2 Q-121.6 -117.8 -120.6 -120.65 L-120.55 -120.65 -119.55 -120.8 -118.6 -120.85 -118.55 -120.25 -118.55 -119.8 -118.3 -119.35 -117.85 -118.6 Q-117.5 -118.25 -116.7 -118.25 -115.7 -118.25 -113.6 -120.15 L-113.75 -121.6 -113.25 -121.8 -112.3 -122.15 -111.6 -120.45 -111.65 -120.45 -111.8 -120.35 -111.55 -120.35 -110.4 -120.35 -109.3 -120.75 -108.8 -120.9 -108.7 -120.95 -108.05 -120.85 Q-109.9 -118.55 -112.2 -116.7 L-114.4 -115.85 -115.3 -115.6 -117.15 -115.05 Q-128.75 -112.3 -140.25 -115.45 -140.25 -116.35 -138.5 -118.6 L-137.65 -119.6 M-128.6 -121.35 L-126.05 -120.25 -125.75 -119.15 -125.65 -118.85 -126.65 -119.1 -129.05 -119.85 -129.2 -119.9 -128.6 -121.35 M-135.6 -137.8 L-136.75 -139.6 -137.85 -141.15 -136.3 -141.15 -129.7 -141.5 -126.0 -141.8 -124.1 -141.85 -123.35 -141.95 -121.7 -142.1 -111.85 -143.4 -108.7 -143.75 -108.7 -143.6 -108.65 -143.45 -108.5 -143.4 -111.1 -140.75 -111.15 -140.75 Q-112.35 -140.75 -113.25 -140.25 L-114.15 -139.45 -114.05 -138.75 -114.05 -138.4 -115.5 -137.95 -116.1 -139.15 -113.25 -142.05 Q-119.15 -141.0 -123.55 -141.0 L-129.3 -141.2 Q-133.4 -141.15 -134.75 -140.15 L-133.35 -138.35 -133.55 -138.25 -134.35 -138.95 Q-134.95 -139.5 -135.45 -139.35 L-135.6 -137.8 M-119.4 -118.05 Q-119.6 -117.8 -120.2 -117.5 L-121.15 -116.5 -120.35 -116.1 -119.2 -115.85 Q-118.65 -115.85 -118.35 -116.25 L-118.1 -116.95 Q-118.1 -117.5 -118.65 -117.8 L-119.3 -118.05 -119.4 -118.05" fill="#721632" fill-rule="evenodd" stroke="none"/>
    <path d="M-136.5 -121.0 L-136.5 -121.4 Q-136.1 -122.55 -135.95 -124.0 L-135.65 -126.4 -133.0 -124.25 -133.0 -124.15 -133.3 -121.35 -133.2 -119.75 -133.3 -119.75 -133.9 -119.4 -136.35 -119.4 -136.5 -119.4 -136.5 -121.0 M-118.5 -123.45 Q-118.25 -125.25 -116.75 -126.4 L-115.75 -125.5 -114.15 -124.25 -114.05 -123.6 -113.9 -122.5 -113.75 -121.6 -113.6 -120.15 Q-115.7 -118.25 -116.7 -118.25 -117.5 -118.25 -117.85 -118.6 L-118.3 -119.35 -118.55 -119.8 -118.55 -120.25 -118.6 -120.85 -118.55 -122.95 -118.5 -123.45 M-114.7 -134.85 L-114.95 -134.25 -115.8 -133.05 -118.0 -131.0 -118.1 -131.15 Q-118.5 -132.25 -119.05 -133.05 L-119.75 -133.9 -120.0 -137.25 -119.95 -137.95 -119.9 -138.5 -119.55 -139.5 Q-119.05 -140.35 -117.85 -140.35 -116.85 -140.35 -116.1 -139.15 L-115.5 -137.95 -115.35 -137.6 Q-114.8 -135.95 -114.7 -134.95 L-114.7 -134.85 M-133.85 -133.6 L-135.85 -133.95 -135.6 -137.55 -135.6 -137.8 -135.45 -139.35 Q-134.95 -139.5 -134.35 -138.95 L-133.55 -138.25 -133.35 -138.05 -133.8 -135.35 -133.85 -133.6 M-114.05 -138.4 L-114.05 -138.75 -114.15 -139.45 -113.25 -140.25 Q-112.35 -140.75 -111.15 -140.75 L-111.1 -140.75 Q-109.65 -140.75 -109.1 -139.5 L-109.1 -139.45 -108.9 -138.6 -108.6 -134.4 -108.7 -134.2 -109.55 -134.6 Q-110.65 -135.15 -110.9 -135.15 -111.5 -135.15 -112.35 -134.3 L-113.4 -133.15 -113.85 -134.7 -114.2 -136.6 -114.15 -136.85 -114.05 -138.4 M-112.3 -122.15 L-112.6 -123.8 Q-112.6 -124.55 -111.0 -125.95 L-109.2 -127.3 Q-109.2 -127.2 -109.0 -127.2 -108.65 -126.25 -107.4 -124.75 L-106.8 -124.05 -106.25 -123.4 -106.0 -123.05 -105.6 -122.6 Q-106.45 -121.85 -107.75 -121.35 L-108.7 -120.95 -108.8 -120.9 -109.3 -120.75 -110.4 -120.35 -111.55 -120.35 -111.6 -120.45 -112.3 -122.15" fill="#968055" fill-rule="evenodd" stroke="none"/>
    <path d="M-133.55 -138.25 L-133.35 -138.35 -133.3 -138.3 -133.3 -138.25 -133.35 -138.05 -133.55 -138.25" fill="#7c0371" fill-rule="evenodd" stroke="none"/>
    <path d="M-149.75 -102.95 L-147.65 -107.05 Q-147.3 -108.05 -146.55 -109.05 -145.65 -110.5 -144.05 -111.95 L-141.9 -113.95 -140.45 -112.25 -140.4 -111.7 -140.2 -111.5 -144.35 -106.65 -145.7 -105.2 -148.55 -101.75 -149.55 -102.75 -149.6 -102.75 -149.75 -102.95 M-143.1 -117.25 L-141.35 -118.05 Q-139.2 -119.05 -137.9 -119.8 L-137.65 -119.6 -138.5 -118.6 Q-140.25 -116.35 -140.25 -115.45 L-140.4 -115.5 -143.1 -117.25 M-145.85 -97.65 L-146.35 -97.5 -146.2 -98.0 -145.85 -98.7 -145.7 -98.9 -144.75 -100.25 -143.6 -101.75 -142.5 -103.85 -141.45 -105.9 -140.2 -108.0 Q-140.45 -109.15 -139.0 -109.85 L-137.65 -110.25 -137.1 -110.85 Q-136.9 -111.15 -136.5 -111.25 -135.45 -112.2 -134.35 -112.05 -133.45 -112.05 -132.55 -111.05 L-132.75 -110.9 -134.4 -110.55 Q-133.1 -110.35 -132.75 -108.65 -132.5 -107.7 -133.15 -106.55 -134.05 -105.15 -135.75 -105.1 -136.8 -105.1 -137.6 -106.0 L-137.95 -106.55 Q-138.45 -105.55 -138.55 -104.5 -140.2 -104.95 -141.05 -103.5 -141.95 -101.45 -142.8 -100.35 L-143.75 -98.95 -143.8 -98.95 -143.85 -98.9 -144.0 -98.7 -144.9 -97.85 -145.85 -97.65 M-140.9 -100.75 Q-141.15 -102.2 -139.9 -102.3 -138.55 -102.5 -138.3 -101.2 -138.2 -100.05 -139.6 -99.7 -140.75 -99.7 -140.9 -100.75 M-128.35 -107.25 Q-127.1 -108.25 -126.7 -106.55 -126.55 -106.0 -127.05 -104.95 -127.55 -103.85 -128.4 -103.85 L-129.2 -103.95 -129.4 -104.85 -129.55 -105.3 -129.5 -105.45 -129.5 -105.5 -129.45 -105.5 -129.3 -106.15 -128.9 -106.8 -128.35 -107.25 M-123.0 -102.25 Q-123.25 -102.55 -123.3 -103.25 L-123.0 -105.5 Q-122.45 -107.35 -121.3 -107.55 L-121.45 -108.5 Q-121.15 -109.2 -119.75 -108.95 L-119.65 -108.8 -119.4 -108.2 Q-119.3 -107.85 -119.65 -107.4 -119.95 -106.9 -120.3 -106.9 L-120.75 -106.9 -120.75 -106.65 -120.55 -104.15 Q-120.75 -102.15 -122.1 -102.05 L-122.55 -102.05 -123.0 -102.25" fill="#5e2a2a" fill-rule="evenodd" stroke="none"/>
    <path d="M-149.8 -102.85 L-149.75 -102.95 -149.6 -102.75 -149.8 -102.85" fill="#561e3c" fill-rule="evenodd" stroke="none"/>
    <path d="M-136.4 -119.35 L-136.5 -119.4 -136.35 -119.4 -136.4 -119.35" fill="#7a1863" fill-rule="evenodd" stroke="none"/>
    <path d="M-89.25 -145.0 L-88.8 -144.65 Q-86.95 -143.35 -86.0 -141.35 L-85.95 -141.3 -87.1 -138.9 -87.85 -139.9 -88.1 -142.9 Q-88.45 -144.15 -89.25 -145.0 M-115.3 -115.6 L-115.35 -115.4 -117.15 -115.05 -115.3 -115.6 M-89.95 -125.65 L-90.0 -125.7 -89.75 -125.95 -89.7 -125.9 -89.95 -125.65" fill="#380101" fill-rule="evenodd" stroke="none"/>
    <path d="M-96.1 -146.65 L-93.85 -146.9 -93.65 -146.9 -93.5 -146.8 -92.9 -145.9 -92.9 -142.9 -94.6 -142.85 Q-95.15 -144.2 -96.6 -144.55 L-96.65 -144.55 Q-96.55 -145.85 -96.25 -146.45 L-96.1 -146.65 M-93.8 -129.3 L-95.9 -127.15 -95.85 -127.6 -96.0 -128.75 -96.0 -128.9 Q-95.1 -129.35 -94.45 -130.0 L-94.4 -129.9 -93.8 -129.3" fill="#6b5b3c" fill-rule="evenodd" stroke="none"/>
    <path d="M-95.9 -127.15 L-96.45 -126.65 -98.55 -124.8 -99.7 -125.05 -99.85 -125.1 -99.85 -125.15 -100.2 -127.5 -100.3 -127.95 -100.4 -128.3 Q-100.05 -129.45 -99.05 -130.15 L-96.3 -130.15 -96.05 -130.15 -96.0 -128.9 -96.0 -128.75 -95.85 -127.6 -95.9 -127.15 M-94.6 -142.85 L-94.45 -142.55 -94.45 -141.15 -97.35 -141.5 -98.2 -141.25 Q-99.8 -140.75 -101.2 -138.95 L-101.45 -141.5 -101.45 -141.9 -101.65 -143.25 Q-101.65 -144.15 -100.1 -144.5 L-98.05 -144.75 -96.85 -144.6 -96.65 -144.5 -96.6 -144.55 Q-95.15 -144.2 -94.6 -142.85" fill="#786744" fill-rule="evenodd" stroke="none"/>
    <path d="M-111.1 -140.75 L-108.5 -143.4 -108.65 -143.45 -108.7 -143.6 -108.7 -143.75 -106.15 -144.1 -102.4 -144.5 -100.2 -145.7 -96.25 -146.6 -96.25 -146.45 Q-96.55 -145.85 -96.65 -144.55 L-96.85 -144.6 -98.05 -144.75 -100.1 -144.5 Q-101.65 -144.15 -101.65 -143.25 L-101.45 -141.9 -102.45 -141.5 -102.75 -142.1 Q-103.4 -143.35 -104.75 -143.35 -105.85 -143.35 -106.95 -142.5 L-107.8 -141.75 -107.95 -141.55 -107.9 -141.35 -107.9 -141.15 -107.8 -140.0 -107.85 -140.0 -108.3 -139.85 -109.1 -139.5 Q-109.65 -140.75 -111.1 -140.75 M-98.55 -124.8 Q-104.5 -119.9 -112.2 -116.7 -109.9 -118.55 -108.05 -120.85 L-108.7 -120.95 -107.75 -121.35 Q-106.45 -121.85 -105.6 -122.6 L-106.0 -123.05 -106.25 -123.4 -105.4 -123.6 -104.95 -123.65 -102.9 -123.75 Q-100.55 -124.0 -99.95 -124.7 L-99.95 -124.75 -99.85 -125.1 -99.7 -125.05 -98.55 -124.8" fill="#611327" fill-rule="evenodd" stroke="none"/>
    <path d="M-89.5 -134.8 L-90.7 -133.05 -93.8 -129.3 -94.4 -129.9 Q-94.0 -131.5 -93.9 -133.05 L-93.9 -134.0 -94.05 -134.0 -94.55 -133.05 -96.3 -130.15 -99.05 -130.15 Q-100.05 -129.45 -100.4 -128.3 L-100.6 -129.8 -100.6 -129.75 Q-99.6 -131.65 -99.05 -133.05 -98.35 -135.05 -98.7 -136.15 -98.95 -135.15 -100.1 -133.75 L-100.75 -133.05 Q-101.6 -132.25 -102.45 -131.75 L-101.95 -133.05 -101.8 -133.45 -101.2 -135.35 Q-101.2 -136.85 -102.6 -138.2 L-102.45 -139.55 -102.3 -140.35 -102.45 -141.5 -101.45 -141.9 -101.45 -141.5 -101.2 -138.95 Q-99.8 -140.75 -98.2 -141.25 L-97.35 -141.5 Q-94.85 -140.95 -92.65 -139.15 -90.15 -137.15 -89.5 -134.8" fill="#240505" fill-rule="evenodd" stroke="none"/>
    <path d="M-96.3 -130.15 L-94.55 -133.05 -94.05 -134.0 -93.9 -134.0 -93.9 -133.05 Q-94.0 -131.5 -94.4 -129.9 L-94.45 -130.0 Q-95.1 -129.35 -96.0 -128.9 L-96.05 -130.15 -96.3 -130.15 M-102.6 -138.2 Q-101.2 -136.85 -101.2 -135.35 L-101.8 -133.45 -101.95 -133.05 -102.45 -131.75 Q-101.6 -132.25 -100.75 -133.05 L-100.1 -133.75 Q-98.95 -135.15 -98.7 -136.15 -98.35 -135.05 -99.05 -133.05 -99.6 -131.65 -100.6 -129.75 L-100.65 -129.7 -100.7 -129.65 -102.25 -128.6 -103.4 -129.8 Q-104.05 -129.8 -105.0 -128.95 -106.0 -128.15 -106.0 -127.6 -106.0 -126.6 -105.55 -125.6 L-105.25 -124.6 -105.0 -123.95 -104.95 -123.65 -105.4 -123.6 -106.25 -123.4 -106.8 -124.05 -107.4 -124.75 Q-108.65 -126.25 -109.0 -127.2 -109.2 -127.2 -109.2 -127.3 L-111.0 -125.95 Q-112.6 -124.55 -112.6 -123.8 L-112.3 -122.15 -113.25 -121.8 -113.75 -121.6 -113.9 -122.5 -114.05 -123.6 Q-107.55 -129.05 -107.65 -131.0 L-107.85 -131.0 -109.1 -130.2 Q-110.05 -129.7 -110.6 -129.8 L-110.6 -130.2 Q-110.25 -130.6 -109.85 -131.9 L-109.5 -133.05 -109.4 -133.75 -109.55 -134.6 -108.7 -134.2 -108.6 -134.4 -108.9 -138.6 -109.1 -139.45 -109.1 -139.5 -108.3 -139.85 -107.85 -140.0 -107.8 -139.85 -107.65 -137.95 Q-107.5 -137.3 -106.85 -136.85 -105.95 -136.3 -105.65 -135.95 L-104.7 -136.3 -102.85 -136.75 -102.6 -138.2" fill="#450b0b" fill-rule="evenodd" stroke="none"/>
    <path d="M-102.6 -138.2 L-102.85 -136.75 -104.7 -136.3 -105.65 -135.95 Q-105.95 -136.3 -106.85 -136.85 -107.5 -137.3 -107.65 -137.95 L-107.8 -139.85 -107.8 -140.0 -107.9 -141.15 -107.9 -141.35 -107.95 -141.55 -107.8 -141.75 -106.95 -142.5 Q-105.85 -143.35 -104.75 -143.35 -103.4 -143.35 -102.75 -142.1 L-102.45 -141.5 -102.3 -140.35 -102.45 -139.55 -102.6 -138.2 M-104.95 -123.65 L-105.0 -123.95 -105.25 -124.6 -105.55 -125.6 Q-106.0 -126.6 -106.0 -127.6 -106.0 -128.15 -105.0 -128.95 -104.05 -129.8 -103.4 -129.8 L-102.25 -128.6 -100.7 -129.65 -100.65 -129.7 -100.6 -129.75 -100.6 -129.8 -100.4 -128.3 -100.3 -127.95 -100.2 -127.5 -99.85 -125.15 -99.85 -125.1 -99.95 -124.75 -99.95 -124.7 Q-100.55 -124.0 -102.9 -123.75 L-104.95 -123.65" fill="#8a764e" fill-rule="evenodd" stroke="none"/>
    <path d="M-116.4 -147.5 L-116.35 -147.45 -116.5 -147.45 -116.4 -147.5" fill="#ad8e63" fill-rule="evenodd" stroke="none"/>
    <path d="M-120.05 -122.6 L-118.5 -123.45 -118.55 -122.95 -118.6 -120.85 -119.55 -120.8 -120.55 -120.65 -120.55 -120.8 -120.05 -122.6 M-115.75 -125.5 Q-113.0 -128.1 -113.0 -130.95 -113.0 -131.95 -113.5 -133.05 L-114.7 -134.85 -114.7 -134.95 Q-114.8 -135.95 -115.35 -137.6 L-115.5 -137.95 -114.05 -138.4 -114.15 -136.85 -114.2 -136.6 -113.85 -134.7 -113.4 -133.15 -112.35 -134.3 Q-111.5 -135.15 -110.9 -135.15 -110.65 -135.15 -109.55 -134.6 L-109.4 -133.75 -109.5 -133.05 -109.85 -131.9 Q-110.25 -130.6 -110.6 -130.2 L-110.6 -129.8 Q-110.05 -129.7 -109.1 -130.2 L-107.85 -131.0 -107.65 -131.0 Q-107.55 -129.05 -114.05 -123.6 L-114.15 -124.25 -115.75 -125.5" fill="#600f0f" fill-rule="evenodd" stroke="none"/>
  </g>
</svg>
