<?xml version="1.0" encoding="UTF-8" standalone="no"?>
<svg xmlns:xlink="http://www.w3.org/1999/xlink" height="40.6px" width="22.85px" xmlns="http://www.w3.org/2000/svg">
  <g transform="matrix(1.0, 0.0, 0.0, 1.0, 10.9, 24.3)">
    <path d="M6.05 -21.75 L6.15 -21.8 9.35 -16.3 9.45 -16.1 9.5 -15.8 Q9.5 -15.1 8.35 -14.55 6.8 -15.25 6.1 -17.15 L5.8 -18.15 5.55 -19.0 5.05 -21.05 5.6 -21.25 6.05 -21.75 M-7.2 -14.55 Q-8.4 -15.1 -8.4 -15.8 L-8.35 -16.05 -8.2 -16.35 -5.0 -21.95 -5.0 -21.9 Q-5.0 -21.4 -4.0 -21.05 L-3.65 -20.9 -4.2 -19.0 -4.45 -18.15 -4.8 -17.15 Q-5.45 -15.3 -7.2 -14.55 M2.35 -20.55 L2.9 -19.0 3.15 -18.15 4.4 -13.9 4.35 -13.6 3.0 -13.45 1.05 -13.4 0.25 -14.2 Q-0.25 -15.1 -0.25 -16.3 L0.35 -20.45 0.5 -20.45 0.55 -20.45 2.35 -20.55" fill="#143685" fill-rule="evenodd" stroke="none"/>
    <path d="M-1.55 -24.15 L0.55 -24.3 4.5 -23.85 Q5.55 -23.55 5.9 -23.15 L6.0 -23.0 6.0 -22.55 5.85 -22.35 5.8 -22.3 2.05 -23.4 -1.55 -24.15" fill="#1b44b8" fill-rule="evenodd" stroke="none"/>
    <path d="M-0.2 16.3 L-3.1 16.15 -3.0 15.3 -2.95 14.65 -3.1 14.65 -3.0 13.7 -2.95 13.1 -0.25 13.25 -0.25 13.85 -0.2 14.7 -0.2 14.8 -0.25 14.8 -0.25 15.4 -0.2 16.3 M-6.5 15.6 L-7.55 15.3 -8.2 15.15 -9.2 14.8 -9.15 13.95 -9.15 13.3 -9.2 13.3 -9.2 13.25 -9.15 12.35 -9.15 11.75 -7.55 12.25 -7.15 12.4 -6.55 12.55 -6.55 13.15 -6.5 14.0 -6.5 14.1 -6.55 14.1 -6.55 14.7 -6.5 15.6 M6.0 -22.55 L6.05 -21.75 5.6 -21.25 5.05 -21.05 4.85 -21.85 5.8 -22.3 5.85 -22.35 6.0 -22.55 M0.45 -21.3 L0.5 -20.45 0.35 -20.45 -0.65 -20.5 -1.25 -20.55 -2.15 -20.6 -2.65 -20.7 -3.4 -20.9 -3.65 -20.9 -4.0 -21.05 -3.9 -21.5 -3.75 -21.85 -3.4 -21.75 -2.45 -21.55 -1.9 -21.45 -1.0 -21.35 -0.45 -21.3 -0.35 -21.3 0.45 -21.3" fill="#0e2469" fill-rule="evenodd" stroke="none"/>
    <path d="M11.95 10.25 L11.95 11.7 11.95 11.9 11.95 12.3 11.95 12.5 11.95 13.2 11.95 13.35 11.3 14.2 9.35 15.15 9.4 13.6 9.35 13.65 9.4 12.05 10.85 11.45 11.65 10.9 11.95 10.25 M6.45 15.85 L0.55 16.3 -0.2 16.3 -0.25 15.4 -0.25 14.8 -0.2 14.8 -0.2 14.7 -0.25 13.85 -0.25 13.25 0.15 13.25 0.55 13.25 3.0 13.2 6.5 12.75 6.45 13.35 6.45 14.35 6.5 14.3 6.45 14.95 6.45 15.85 M-9.2 14.8 L-10.45 14.05 -10.7 13.75 -10.9 13.15 -10.9 10.25 -10.7 10.75 -10.55 10.9 -10.2 11.2 -9.15 11.75 -9.15 12.35 -9.2 13.25 -9.2 13.3 -9.15 13.3 -9.15 13.95 -9.2 14.8 M-5.0 -21.95 L-5.0 -22.75 -4.75 -22.35 Q-4.5 -22.05 -3.75 -21.85 L-3.9 -21.5 -4.0 -21.05 Q-5.0 -21.4 -5.0 -21.9 L-5.0 -21.95 M4.85 -21.85 L5.05 -21.05 4.5 -20.9 2.65 -20.55 2.35 -20.55 0.55 -20.45 0.5 -20.45 0.45 -21.3 0.55 -21.3 1.3 -21.3 4.1 -21.65 4.5 -21.75 4.85 -21.85" fill="#0b1c52" fill-rule="evenodd" stroke="none"/>
    <path d="M-4.05 -23.65 L-3.4 -23.85 -1.55 -24.15 2.05 -23.4 5.8 -22.3 4.85 -21.85 4.5 -21.75 4.1 -21.65 1.05 -22.35 -4.05 -23.65 M-1.25 -20.55 L-1.35 -20.2 Q-1.8 -19.2 -2.2 -19.0 L-2.3 -18.95 -2.3 -19.0 -2.4 -19.5 -2.15 -20.6 -1.25 -20.55" fill="#2256e8" fill-rule="evenodd" stroke="none"/>
    <path d="M-5.0 -22.75 L-5.0 -22.8 -4.7 -23.25 -0.85 -22.1 0.05 -21.85 0.5 -21.65 1.3 -21.3 0.55 -21.3 0.45 -21.3 -0.35 -21.3 -0.45 -21.3 -1.0 -21.35 -1.9 -21.45 -2.45 -21.55 -3.4 -21.75 -3.75 -21.85 Q-4.5 -22.05 -4.75 -22.35 L-5.0 -22.75" fill="#527cff" fill-rule="evenodd" stroke="none"/>
    <path d="M-4.7 -23.25 L-4.05 -23.65 1.05 -22.35 4.1 -21.65 1.3 -21.3 0.5 -21.65 0.05 -21.85 -0.85 -22.1 -4.7 -23.25" fill="#265aff" fill-rule="evenodd" stroke="none"/>
    <path d="M8.35 -14.55 L8.3 -14.5 8.05 -14.4 6.9 -14.05 6.1 -13.9 5.25 -13.75 5.15 -13.75 4.35 -13.6 4.4 -13.9 3.15 -18.15 2.9 -19.0 2.35 -20.55 2.65 -20.55 4.5 -20.9 5.05 -21.05 5.55 -19.0 5.8 -18.15 6.1 -17.15 Q6.8 -15.25 8.35 -14.55" fill="#112b75" fill-rule="evenodd" stroke="none"/>
    <path d="M-4.9 -13.85 L-5.8 -14.05 -6.25 -14.2 -7.2 -14.55 Q-5.45 -15.3 -4.8 -17.15 L-4.45 -18.15 -4.2 -19.0 -3.65 -20.9 -3.4 -20.9 -2.65 -20.7 -3.0 -19.45 -3.1 -19.0 -3.25 -18.15 -3.4 -16.8 -3.4 -15.95 Q-3.3 -15.35 -2.85 -15.35 -2.3 -15.35 -1.3 -18.15 L-1.25 -18.35 -1.05 -19.0 -0.65 -20.5 0.35 -20.45 -0.25 -16.3 Q-0.25 -15.1 0.25 -14.2 L1.05 -13.4 0.6 -13.4 -3.35 -13.65 -4.9 -13.85" fill="#1a41b0" fill-rule="evenodd" stroke="none"/>
    <path d="M4.35 -13.6 L5.15 -13.75 5.2 -13.35 5.25 -13.1 5.35 -12.55 4.65 -12.15 0.9 -11.7 -1.0 -11.75 -2.9 -12.0 -3.65 -12.2 -3.4 -13.2 -3.4 -13.35 -3.35 -13.65 0.6 -13.4 1.05 -13.4 3.0 -13.45 4.35 -13.6" fill="#034091" fill-rule="evenodd" stroke="none"/>
    <path d="M6.1 -13.9 L6.2 -13.35 6.25 -13.1 6.3 -12.95 6.45 -12.5 6.5 -12.35 Q7.0 -11.0 7.85 -11.0 L7.55 -10.9 Q6.65 -10.9 6.1 -11.3 L5.75 -11.7 5.35 -12.55 5.25 -13.1 5.2 -13.35 5.15 -13.75 5.25 -13.75 6.1 -13.9 M-4.85 -13.05 L-4.85 -13.35 -4.9 -13.85 -3.35 -13.65 -3.4 -13.35 -3.4 -13.2 -3.65 -12.2 -3.75 -12.05 -3.8 -11.95 Q-4.2 -11.1 -4.9 -10.7 L-5.95 -10.35 -6.3 -10.35 -6.3 -10.45 Q-5.15 -10.85 -4.9 -12.15 L-4.85 -12.7 -4.85 -12.9 -4.85 -13.05" fill="#091338" fill-rule="evenodd" stroke="none"/>
    <path d="M6.3 -12.95 L8.6 -12.45 Q11.95 -11.6 11.95 -10.3 L11.95 -10.15 11.85 -9.75 11.4 -9.3 11.2 -9.25 10.9 -9.65 9.45 -11.5 7.35 -12.15 6.5 -12.35 6.45 -12.5 6.3 -12.95 M-10.75 -9.75 L-10.8 -9.95 -10.9 -10.2 -10.9 -10.3 Q-10.9 -10.9 -10.25 -11.35 L-9.75 -11.65 -7.55 -12.45 -5.35 -12.95 -4.85 -13.05 -4.85 -12.9 -4.85 -12.7 -4.9 -12.15 -8.15 -11.65 Q-10.0 -11.0 -10.5 -9.6 L-10.75 -9.75 M-2.9 -12.0 L-1.0 -11.75 -1.05 -11.35 Q-1.05 -10.75 0.1 -9.95 L0.6 -9.6 Q1.25 -9.0 1.25 -8.3 1.25 -7.7 0.35 -7.3 L0.15 -7.25 -0.3 -7.25 -1.75 -7.2 -2.1 -7.25 -3.85 -7.4 -5.7 -7.8 -6.7 -8.0 Q-7.55 -8.35 -7.55 -8.65 -7.55 -9.0 -5.7 -9.8 L-5.1 -10.1 -3.65 -10.9 Q-3.1 -11.35 -2.9 -12.0 M-4.8 -9.6 L-5.5 -8.95 -5.5 -8.45 -4.7 -8.35 Q-3.8 -8.35 -3.2 -8.8 -2.7 -9.1 -2.55 -9.6 L-2.5 -9.95 -2.6 -10.35 -2.95 -10.35 Q-3.4 -10.35 -3.8 -9.95 L-4.0 -9.75 -4.2 -9.65 -4.8 -9.6" fill="#177bff" fill-rule="evenodd" stroke="none"/>
    <path d="M-3.65 -12.2 L-2.9 -12.0 Q-3.1 -11.35 -3.65 -10.9 L-5.1 -10.1 -5.7 -9.8 Q-7.55 -9.0 -7.55 -8.65 -7.55 -8.35 -6.7 -8.0 L-7.5 -8.25 -9.5 -8.95 -9.6 -9.0 -9.75 -9.1 -10.5 -9.6 Q-10.0 -11.0 -8.15 -11.65 L-4.9 -12.15 Q-5.15 -10.85 -6.3 -10.45 L-6.3 -10.35 -5.95 -10.35 -4.9 -10.7 Q-4.2 -11.1 -3.8 -11.95 L-3.75 -12.05 -3.65 -12.2 M-1.0 -11.75 L0.9 -11.7 4.65 -12.15 5.35 -12.55 5.75 -11.7 6.1 -11.3 Q6.65 -10.9 7.55 -10.9 L7.85 -11.0 Q7.0 -11.0 6.5 -12.35 L7.35 -12.15 9.45 -11.5 10.9 -9.65 11.2 -9.25 10.95 -9.05 10.7 -8.95 9.75 -8.6 7.7 -8.0 6.8 -7.9 2.9 -7.25 2.7 -7.25 0.55 -7.25 0.15 -7.25 0.35 -7.3 Q1.25 -7.7 1.25 -8.3 1.25 -9.0 0.6 -9.6 L0.1 -9.95 Q-1.05 -10.75 -1.05 -11.35 L-1.0 -11.75 M3.2 -7.0 Q4.15 -6.55 4.65 -5.1 L4.7 -4.85 5.1 -1.3 5.55 -4.65 5.65 -4.95 6.85 -6.45 7.8 -5.9 Q9.3 -4.85 9.55 -3.45 L9.6 -3.2 9.5 -3.15 9.4 -2.5 9.1 0.1 8.95 2.45 Q8.95 4.0 9.3 5.75 L9.8 8.1 10.85 11.45 9.4 12.05 8.6 12.25 8.4 12.35 Q6.7 11.15 6.1 8.15 L6.0 7.1 5.45 1.45 5.4 1.45 5.4 2.0 5.15 7.1 5.05 7.7 4.4 10.7 Q3.9 12.4 3.0 13.2 L0.55 13.25 0.15 13.25 Q-0.55 12.1 -1.1 9.75 -1.9 6.4 -1.9 3.1 L-1.55 0.1 -1.25 -1.1 -0.65 -4.05 Q-0.65 -4.85 -0.9 -5.3 L-0.95 -5.3 -0.95 -5.4 -1.45 -6.0 -2.65 -6.35 -2.75 -6.3 -4.15 -6.2 -4.6 -5.95 -4.7 -5.85 -5.1 -5.65 Q-6.35 -4.9 -6.35 -2.45 L-5.85 0.1 Q-5.1 3.9 -5.1 4.95 -5.1 7.4 -5.85 9.6 -6.4 11.35 -7.15 12.4 L-7.55 12.25 -9.15 11.75 -10.2 11.2 -9.5 7.6 Q-8.4 2.0 -8.25 0.1 L-8.25 -0.35 -8.45 -2.95 -8.1 -4.25 -7.25 -5.35 Q-6.4 -5.95 -5.25 -6.2 L-1.8 -6.95 1.5 -6.9 3.2 -7.0" fill="url(#gradient0)" fill-rule="evenodd" stroke="none"/>
    <path d="M3.2 -7.0 L4.95 -6.9 6.55 -6.55 6.85 -6.45 5.65 -4.95 5.55 -4.65 5.1 -1.3 4.7 -4.85 4.65 -5.1 Q4.15 -6.55 3.2 -7.0" fill="#043a84" fill-rule="evenodd" stroke="none"/>
    <path d="M6.85 -6.45 L6.55 -6.55 4.95 -6.9 3.2 -7.0 1.5 -6.9 -1.8 -6.95 -5.25 -6.2 Q-6.4 -5.95 -7.25 -5.35 L-8.1 -4.25 -8.45 -2.95 -8.7 -4.35 -8.85 -5.25 Q-8.65 -6.1 -7.9 -6.75 -7.1 -7.45 -5.7 -7.8 L-3.85 -7.4 -2.1 -7.25 -1.75 -7.2 -0.3 -7.25 0.15 -7.25 0.55 -7.25 2.7 -7.25 2.9 -7.25 6.8 -7.9 7.7 -8.0 Q8.95 -7.75 9.6 -6.25 L9.95 -5.5 9.55 -3.45 Q9.3 -4.85 7.8 -5.9 L6.85 -6.45" fill="#043d8a" fill-rule="evenodd" stroke="none"/>
    <path d="M9.95 -5.5 L9.6 -6.25 Q8.95 -7.75 7.7 -8.0 L9.75 -8.6 10.7 -8.95 9.95 -5.5 M-5.7 -7.8 Q-7.1 -7.45 -7.9 -6.75 -8.65 -6.1 -8.85 -5.25 L-9.05 -6.4 -9.6 -9.0 -9.5 -8.95 -7.5 -8.25 -6.7 -8.0 -5.7 -7.8" fill="#032d70" fill-rule="evenodd" stroke="none"/>
    <path d="M10.0 -0.05 L10.0 0.1 10.05 0.8 10.05 1.45 10.35 4.3 Q10.8 6.85 11.75 9.5 L11.95 10.05 11.95 10.25 11.65 10.9 10.85 11.45 9.8 8.1 9.3 5.75 Q8.95 4.0 8.95 2.45 L9.1 0.1 9.4 -2.5 9.5 -3.15 9.6 -3.2 9.75 -2.1 10.0 -0.05 M-10.9 10.25 L-10.9 10.05 -10.75 9.55 -10.7 9.4 Q-9.35 5.15 -9.0 1.45 L-8.9 0.1 -8.9 -0.45 -8.55 -2.55 -8.45 -2.95 -8.25 -0.35 -8.25 0.1 Q-8.4 2.0 -9.5 7.6 L-10.2 11.2 -10.55 10.9 -10.7 10.75 -10.9 10.25" fill="#0157bd" fill-rule="evenodd" stroke="none"/>
    <path d="M11.85 -9.75 L11.55 -8.7 11.05 -7.3 11.05 -7.25 10.5 -4.9 10.4 -4.2 10.35 -3.75 10.15 -2.45 10.1 -1.6 10.0 -0.05 9.75 -2.1 9.6 -3.2 9.55 -3.45 9.95 -5.5 10.7 -8.95 10.95 -9.05 11.2 -9.25 11.4 -9.3 11.85 -9.75 M-8.9 -0.45 L-9.05 -3.0 -9.35 -5.4 -9.75 -7.25 -10.25 -8.65 -10.55 -9.4 -10.75 -9.75 -10.5 -9.6 -9.75 -9.1 -9.6 -9.0 -9.05 -6.4 -8.85 -5.25 -8.7 -4.35 -8.45 -2.95 -8.55 -2.55 -8.9 -0.45" fill="#0653cf" fill-rule="evenodd" stroke="none"/>
    <path d="M3.0 13.2 Q3.9 12.4 4.4 10.7 L5.05 7.7 5.15 7.1 5.4 2.0 5.4 1.45 5.45 1.45 6.0 7.1 6.1 8.15 Q6.7 11.15 8.4 12.35 L6.5 12.75 3.0 13.2" fill="#08143a" fill-rule="evenodd" stroke="none"/>
    <path d="M9.35 15.15 L8.6 15.3 6.45 15.85 6.45 14.95 6.5 14.3 6.45 14.35 6.45 13.35 6.5 12.75 8.4 12.35 8.6 12.25 9.4 12.05 9.35 13.65 9.4 13.6 9.35 15.15" fill="#08133b" fill-rule="evenodd" stroke="none"/>
    <path d="M-0.65 -20.5 L-1.05 -19.0 -1.25 -18.35 -1.3 -18.15 Q-2.3 -15.35 -2.85 -15.35 -3.3 -15.35 -3.4 -15.95 L-3.4 -16.8 -3.25 -18.15 -3.1 -19.0 -3.0 -19.45 -2.65 -20.7 -2.15 -20.6 -2.4 -19.5 -2.3 -19.0 -2.3 -18.95 -2.2 -19.0 Q-1.8 -19.2 -1.35 -20.2 L-1.25 -20.55 -0.65 -20.5" fill="#1e4ccc" fill-rule="evenodd" stroke="none"/>
    <path d="M-4.8 -9.6 L-4.2 -9.65 -4.0 -9.75 -3.8 -9.95 Q-3.4 -10.35 -2.95 -10.35 L-2.6 -10.35 -2.5 -9.95 -2.55 -9.6 Q-2.7 -9.1 -3.2 -8.8 -3.8 -8.35 -4.7 -8.35 L-5.5 -8.45 -5.5 -8.95 -4.8 -9.6" fill="#3b8bff" fill-rule="evenodd" stroke="none"/>
    <path d="M-4.7 -5.85 L-4.6 -5.95 -4.15 -6.2 -2.75 -6.3 -2.65 -6.35 -1.45 -6.0 -0.95 -5.4 -0.95 -5.3 Q-0.95 -4.6 -1.7 -3.85 -2.4 -3.1 -2.4 -2.3 L-2.5 3.15 -2.05 7.1 -2.0 7.4 Q-1.45 9.75 -1.45 10.15 -1.45 10.85 -1.9 11.55 -2.3 12.25 -2.9 12.35 L-3.2 12.4 -4.2 12.05 -5.0 11.45 -4.6 9.8 Q-4.25 8.5 -4.2 7.3 L-4.2 6.9 -4.4 1.25 -4.55 0.1 -4.95 -1.35 Q-5.5 -2.95 -5.5 -3.9 -5.5 -5.2 -4.7 -5.85 M-3.45 -5.7 L-3.55 -5.65 -3.65 -5.55 -3.95 -5.5 -4.35 -5.15 -4.4 -5.1 -4.5 -4.85 -4.6 -4.7 -4.65 -4.1 -4.5 -3.3 -4.5 -3.25 -4.5 -3.15 -4.35 -2.8 -4.3 -2.6 -4.3 -2.45 -4.3 -2.35 -4.25 -2.25 -4.1 -1.85 -3.95 -1.55 -3.95 -1.35 -3.95 -1.2 -3.95 -1.15 -4.0 -1.1 -4.0 -1.05 -4.0 -0.9 -4.0 -0.65 -3.95 -0.5 -3.7 -0.4 -3.55 -0.4 -3.5 -0.5 -3.35 -0.65 -3.3 -0.7 -3.25 -1.5 -3.25 -3.05 -2.8 -3.8 Q-2.5 -4.75 -2.85 -5.65 L-2.95 -5.7 -3.3 -5.75 -3.45 -5.7 M-3.3 9.7 L-3.6 9.7 -4.1 10.2 -4.25 10.5 -4.25 10.7 -4.2 11.1 -4.1 11.25 Q-3.95 11.4 -3.75 11.5 L-3.0 11.55 -2.9 11.55 -2.85 11.45 -2.75 11.4 -2.75 11.3 -2.7 11.25 -2.65 11.2 -2.55 11.15 -2.4 10.25 -2.7 9.75 -3.3 9.7" fill="#0156bb" fill-rule="evenodd" stroke="none"/>
    <path d="M-0.95 -5.3 L-0.9 -5.3 Q-0.65 -4.85 -0.65 -4.05 L-1.25 -1.1 -1.55 0.1 -1.9 3.1 Q-1.9 6.4 -1.1 9.75 -0.55 12.1 0.15 13.25 L-0.25 13.25 -2.95 13.1 -6.55 12.55 -7.15 12.4 Q-6.4 11.35 -5.85 9.6 -5.1 7.4 -5.1 4.95 -5.1 3.9 -5.85 0.1 L-6.35 -2.45 Q-6.35 -4.9 -5.1 -5.65 L-4.7 -5.85 Q-5.5 -5.2 -5.5 -3.9 -5.5 -2.95 -4.95 -1.35 L-4.55 0.1 -4.4 1.25 -4.2 6.9 -4.2 7.3 Q-4.25 8.5 -4.6 9.8 L-5.0 11.45 -4.2 12.05 -3.2 12.4 -2.9 12.35 Q-2.3 12.25 -1.9 11.55 -1.45 10.85 -1.45 10.15 -1.45 9.75 -2.0 7.4 L-2.05 7.1 -2.5 3.15 -2.4 -2.3 Q-2.4 -3.1 -1.7 -3.85 -0.95 -4.6 -0.95 -5.3" fill="#014094" fill-rule="evenodd" stroke="none"/>
    <path d="M-3.45 -5.7 L-3.3 -5.75 -2.95 -5.7 -2.85 -5.65 Q-2.5 -4.75 -2.8 -3.8 L-3.25 -3.05 -3.25 -1.5 -3.3 -0.7 -3.35 -0.65 -3.5 -0.5 -3.55 -0.4 -3.7 -0.4 -3.95 -0.5 -4.0 -0.65 -4.0 -0.9 -4.0 -1.05 -4.0 -1.1 -3.95 -1.15 -3.95 -1.2 -3.95 -1.35 -3.95 -1.55 -4.1 -1.85 -4.25 -2.25 -4.3 -2.35 -4.3 -2.45 -4.3 -2.6 -4.35 -2.8 -4.5 -3.15 -4.5 -3.25 -4.5 -3.3 -4.65 -4.1 -4.6 -4.7 -4.5 -4.85 -4.4 -5.1 -4.35 -5.15 -3.95 -5.5 -3.65 -5.55 -3.55 -5.65 -3.45 -5.7 M-3.05 -4.75 L-3.25 -5.15 -3.5 -5.2 -3.8 -5.25 -3.9 -5.2 -3.95 -5.2 -4.05 -5.15 -4.25 -4.9 -4.3 -4.85 -4.3 -4.65 -4.3 -4.5 -4.25 -4.5 -4.0 -4.15 -3.6 -4.1 -3.45 -4.15 -3.3 -4.2 -3.05 -4.75 M-3.3 9.7 L-2.7 9.75 -2.4 10.25 -2.55 11.15 -2.65 11.2 -2.7 11.25 -2.75 11.3 -2.75 11.4 -2.85 11.45 -2.9 11.55 -3.0 11.55 -3.75 11.5 Q-3.95 11.4 -4.1 11.25 L-4.2 11.1 -4.25 10.7 -4.25 10.5 -4.1 10.2 -3.6 9.7 -3.3 9.7" fill="#036fff" fill-rule="evenodd" stroke="none"/>
    <path d="M-3.05 -4.75 L-3.3 -4.2 -3.45 -4.15 -3.6 -4.1 -4.0 -4.15 -4.25 -4.5 -4.3 -4.5 -4.3 -4.65 -4.3 -4.85 -4.25 -4.9 -4.05 -5.15 -3.95 -5.2 -3.9 -5.2 -3.8 -5.25 -3.5 -5.2 -3.25 -5.15 -3.05 -4.75" fill="#67b3fe" fill-rule="evenodd" stroke="none"/>
    <path d="M-3.1 16.15 L-5.8 15.75 -6.5 15.6 -6.55 14.7 -6.55 14.1 -6.5 14.1 -6.5 14.0 -6.55 13.15 -6.55 12.55 -2.95 13.1 -3.0 13.7 -3.1 14.65 -2.95 14.65 -3.0 15.3 -3.1 16.15" fill="#122d8f" fill-rule="evenodd" stroke="none"/>
  </g>
  <defs>
    <linearGradient gradientTransform="matrix(0.0, -0.0128, 0.0139, 0.0, 0.5, 0.95)" gradientUnits="userSpaceOnUse" id="gradient0" spreadMethod="pad" x1="-819.2" x2="819.2">
      <stop offset="0.0" stop-color="#091338"/>
      <stop offset="1.0" stop-color="#0065d7"/>
    </linearGradient>
  </defs>
</svg>
