<?xml version="1.0" encoding="UTF-8" standalone="no"?>
<svg xmlns:xlink="http://www.w3.org/1999/xlink" height="7.55px" width="7.55px" xmlns="http://www.w3.org/2000/svg">
  <g transform="matrix(1.0, 0.0, 0.0, 1.0, 3.75, 3.75)">
    <path d="M0.4 -0.7 L3.6 -3.6 0.75 -0.35 0.6 0.0 0.7 0.4 3.6 3.6 3.8 3.8 3.55 3.65 0.35 0.75 0.0 0.6 -0.35 0.75 -3.6 3.6 -0.7 0.4 -0.55 0.05 -0.7 -0.3 -3.65 -3.55 -3.75 -3.75 -3.6 -3.6 -0.35 -0.65 0.05 -0.55 Q0.25 -0.55 0.4 -0.7" fill="#ffffff" fill-rule="evenodd" stroke="none"/>
  </g>
</svg>
