<?xml version="1.0" encoding="UTF-8" standalone="no"?>
<svg xmlns:xlink="http://www.w3.org/1999/xlink" height="276.0px" width="186.0px" xmlns="http://www.w3.org/2000/svg">
  <g transform="matrix(1.0, 0.0, 0.0, 1.0, 0.0, 0.0)">
    <path d="M182.0 270.0 L180.1 116.3 181.1 111.45 Q181.05 109.2 181.15 107.25 L181.35 97.8 180.65 91.7 179.75 89.8 178.8 13.45 178.65 13.45 186.0 3.0 186.0 273.0 182.0 270.0 M7.0 4.0 L3.0 272.0 0.0 276.0 3.0 0.0 7.0 4.0" fill="#1a1a1a" fill-rule="evenodd" stroke="none"/>
    <path d="M182.0 270.0 L186.0 273.0 0.0 276.0 3.0 272.0 182.0 270.0 M186.0 3.0 L178.65 13.45 76.0 7.8 74.4 5.35 73.15 6.75 72.45 7.6 7.0 4.0 3.0 0.0 186.0 3.0" fill="#262626" fill-rule="evenodd" stroke="none"/>
    <path d="M180.15 13.45 L179.8 13.05 179.75 13.0 Q179.0 12.15 177.9 12.1 L10.95 6.45 Q9.8 6.45 9.0 7.2 L8.95 7.25 Q8.15 8.05 8.15 9.2 L5.4 268.65 Q5.4 269.4 5.75 270.05 L6.8 271.1 Q7.45 271.5 8.2 271.5 L177.9 271.6 Q179.0 271.65 179.75 270.85 L179.8 270.8 Q180.6 269.95 180.6 268.85 L180.6 44.9 184.25 44.9 184.25 269.0 Q184.2 271.6 182.45 273.4 L182.35 273.5 182.3 273.6 Q180.5 275.35 178.0 275.4 L34.65 275.3 34.65 272.35 3.2 272.35 3.2 272.8 2.95 272.45 2.6 271.85 Q1.7 270.3 1.75 268.6 L4.5 9.1 Q4.5 6.55 6.25 4.65 L6.5 4.4 6.6 4.3 Q8.45 2.6 11.0 2.7 L177.95 8.4 Q180.5 8.45 182.3 10.4 L182.35 10.45 182.45 10.45 Q183.65 11.8 184.05 13.45 L180.15 13.45" fill="#ffffff" fill-opacity="0.047058824" fill-rule="evenodd" stroke="none"/>
    <path d="M180.6 44.9 L180.6 268.85 Q180.6 269.95 179.8 270.8 L179.75 270.85 Q179.0 271.65 177.9 271.6 L8.2 271.5 Q7.45 271.5 6.8 271.1 L5.75 270.05 Q5.4 269.4 5.4 268.65 L8.15 9.2 Q8.15 8.05 8.95 7.25 L9.0 7.2 Q9.8 6.45 10.95 6.45 L177.9 12.1 Q179.0 12.15 179.75 13.0 L179.8 13.05 180.15 13.45 178.75 13.45 178.75 44.9 180.6 44.9" fill="#ffffff" fill-opacity="0.06666667" fill-rule="evenodd" stroke="none"/>
  </g>
</svg>
