<?xml version="1.0" encoding="UTF-8" standalone="no"?>
<svg xmlns:xlink="http://www.w3.org/1999/xlink" height="32.75px" width="31.6px" xmlns="http://www.w3.org/2000/svg">
  <g transform="matrix(1.0, 0.0, 0.0, 1.0, 0.3, -0.1)">
    <path d="M30.4 13.1 L30.4 13.15 30.4 13.1" fill="#4a4035" fill-rule="evenodd" stroke="none"/>
    <path d="M6.1 23.95 L6.0 23.9 6.35 20.05 6.35 21.05 6.1 23.95" fill="#5f4e43" fill-rule="evenodd" stroke="none"/>
    <path d="M30.4 13.1 L30.25 12.25 30.2 11.95 30.1 11.6 30.05 11.3 29.55 9.8 29.45 9.45 29.05 8.6 Q27.1 5.6 24.65 3.6 L24.5 3.5 24.4 3.45 24.25 3.35 20.65 4.1 18.75 1.2 12.55 1.4 Q9.3 2.15 6.8 3.95 L6.3 7.35 2.8 8.2 Q0.45 11.9 0.75 16.0 L0.8 16.7 0.8 16.75 Q0.55 18.9 1.05 21.2 L1.5 22.65 1.6 22.7 4.5 23.9 4.45 24.45 4.45 27.45 Q5.75 28.75 7.45 29.7 9.15 30.65 10.9 31.2 L11.3 31.3 15.65 31.8 18.15 29.15 21.55 30.45 22.1 30.2 Q25.65 28.45 27.95 25.05 L28.05 24.95 29.8 21.7 29.8 18.7 29.1 17.55 30.4 16.1 30.45 15.1 30.4 14.7 30.4 13.15 30.4 13.1 M30.4 9.05 L30.4 9.15 30.5 9.5 30.6 9.85 30.95 10.9 31.05 11.3 31.1 11.35 31.2 11.7 31.2 11.95 31.25 12.1 31.3 16.65 30.35 17.65 30.6 18.45 30.75 21.9 30.7 22.1 29.85 23.8 28.8 25.55 27.4 27.35 26.0 28.85 Q24.45 30.3 22.55 31.1 L21.55 31.55 18.45 30.3 15.7 32.8 Q13.2 32.95 11.05 32.3 L10.9 32.25 Q7.85 31.35 5.3 29.45 L3.45 27.9 3.45 24.55 1.65 23.6 0.55 23.0 Q0.0 21.1 -0.1 19.1 L-0.2 16.7 -0.25 16.0 Q-0.5 12.85 0.85 9.9 L2.15 7.35 5.4 6.55 5.9 3.4 6.25 3.15 7.65 2.2 Q9.7 1.0 12.35 0.45 L17.4 0.1 19.35 0.3 21.1 3.0 24.05 2.4 24.75 2.55 24.6 2.45 24.8 2.5 25.3 2.85 Q27.35 4.6 28.85 6.65 L29.9 8.15 30.4 9.05" fill="#552d23" fill-rule="evenodd" stroke="none"/>
    <path d="M17.15 8.65 L19.25 9.45 Q20.65 10.25 21.45 11.5 L22.2 13.15 22.25 13.4 22.4 15.1 22.2 16.25 22.1 16.55 21.25 18.15 Q20.15 19.85 18.35 20.65 L17.0 21.05 15.1 21.25 14.55 21.25 Q13.15 21.05 11.85 20.3 L11.3 19.95 10.9 19.65 10.0 18.7 9.7 18.25 Q9.2 17.5 9.0 16.6 L8.95 16.45 8.9 16.0 Q8.7 14.9 8.95 13.8 L9.25 12.85 9.85 11.6 Q11.4 9.45 14.0 8.75 L16.3 8.55 17.05 8.65 17.15 8.65" fill="url(#gradient0)" fill-rule="evenodd" stroke="none"/>
    <path d="M17.15 8.65 Q18.5 8.85 19.75 9.6 22.6 11.2 23.25 14.2 L23.4 15.1 23.45 15.25 23.0 17.05 22.1 18.75 22.1 18.7 Q20.7 20.85 18.35 21.7 L17.25 22.05 Q14.1 22.75 11.35 21.2 L11.3 21.15 10.9 20.9 Q8.6 19.35 8.0 16.7 L8.0 16.65 7.85 16.0 7.85 15.7 Q7.9 13.8 9.0 12.1 L9.05 12.05 Q10.85 9.45 14.0 8.75 11.4 9.45 9.85 11.6 L9.25 12.85 8.95 13.8 Q8.7 14.9 8.9 16.0 L8.95 16.45 9.0 16.6 Q9.2 17.5 9.7 18.25 L10.0 18.7 10.9 19.65 11.3 19.95 11.85 20.3 Q13.15 21.05 14.55 21.25 L15.1 21.25 17.0 21.05 18.35 20.65 Q20.15 19.85 21.25 18.15 L22.1 16.55 22.2 16.25 22.4 15.1 22.25 13.4 22.2 13.15 21.45 11.5 Q20.65 10.25 19.25 9.45 L17.15 8.65" fill="url(#gradient1)" fill-rule="evenodd" stroke="none"/>
    <path d="M2.25 15.75 Q2.1 12.5 3.8 9.5 L7.65 8.6 8.2 4.85 Q10.25 3.45 12.9 2.85 L12.9 2.9 17.9 2.6 19.95 5.8 23.95 4.95 Q27.65 7.5 28.65 11.95 L28.65 12.0 28.8 12.65 28.75 12.7 28.65 12.3 28.65 12.25 Q27.65 7.8 23.95 5.25 L19.95 6.1 17.9 2.9 12.9 3.2 12.9 3.15 Q10.25 3.75 8.2 5.15 L7.65 8.9 3.8 9.8 Q2.25 12.5 2.25 15.45 L2.25 15.75 M26.15 15.6 L28.15 18.8 28.05 18.95 26.15 15.9 26.15 15.6 M7.85 15.7 L7.85 16.0 8.0 16.65 8.0 16.7 7.95 16.7 7.95 16.65 7.85 16.3 7.85 16.55 7.85 16.3 7.85 16.0 7.85 15.7 M23.0 17.05 L23.45 15.25 23.45 15.6 23.15 17.05 23.0 17.05 M22.1 19.0 L22.15 19.0 22.1 19.05 22.1 19.0" fill="url(#gradient2)" fill-rule="evenodd" stroke="none"/>
    <path d="M29.8 18.7 L29.8 21.7 28.05 24.95 27.95 25.05 Q25.65 28.45 22.1 30.2 L21.55 30.45 21.55 27.45 Q23.7 26.5 25.45 24.95 26.85 23.7 27.95 22.05 L29.8 18.7" fill="url(#gradient3)" fill-rule="evenodd" stroke="none"/>
    <path d="M21.55 30.45 L18.15 29.15 18.15 26.15 21.55 27.45 21.55 30.45" fill="url(#gradient4)" fill-rule="evenodd" stroke="none"/>
    <path d="M1.5 22.65 L1.05 21.2 Q0.55 18.9 0.8 16.75 L1.05 18.2 1.4 19.35 1.5 22.65" fill="url(#gradient5)" fill-rule="evenodd" stroke="none"/>
    <path d="M30.4 13.15 L30.4 14.7 30.45 15.1 30.4 16.1 29.1 17.55 28.0 15.75 30.4 13.15" fill="url(#gradient6)" fill-rule="evenodd" stroke="none"/>
    <path d="M28.55 12.95 L26.15 15.6 26.15 15.9 26.15 16.2 26.15 17.2 27.7 19.65 26.75 21.2 26.7 21.25 Q24.65 24.25 21.5 25.85 L17.75 24.4 15.0 27.3 10.9 26.65 8.2 25.4 6.1 23.95 6.35 21.05 6.35 20.05 2.75 18.55 2.55 17.9 2.25 16.1 2.3 15.75 Q2.5 13.35 3.8 11.1 L7.65 10.2 8.2 6.45 Q10.25 5.05 12.9 4.45 L12.9 4.5 17.9 4.2 19.95 7.4 23.95 6.55 Q27.4 8.85 28.55 12.95 M2.25 16.0 L2.25 15.75 2.25 15.45 2.25 15.75 2.25 16.0 M23.45 15.25 L23.4 15.1 23.25 14.2 Q22.6 11.2 19.75 9.6 18.5 8.85 17.15 8.65 L17.05 8.65 16.3 8.55 14.0 8.75 Q10.85 9.45 9.05 12.05 L9.0 12.1 Q7.9 13.8 7.85 15.7 L7.85 16.0 7.85 16.3 7.85 16.55 7.85 16.6 7.85 16.85 8.0 18.25 8.0 18.3 Q8.6 20.95 10.9 22.55 L11.35 22.8 Q14.1 24.35 17.25 23.65 L18.35 23.35 Q20.7 22.45 22.1 20.3 L22.15 20.3 Q23.55 18.25 23.45 16.1 L23.45 15.95 23.45 15.9 23.45 15.6 23.45 15.25" fill="url(#gradient7)" fill-rule="evenodd" stroke="none"/>
    <path d="M28.75 12.7 L28.8 12.95 28.75 13.0 28.65 12.6 28.65 12.55 Q27.65 8.1 23.95 5.55 L19.95 6.4 17.9 3.2 12.9 3.5 12.9 3.45 Q10.25 4.05 8.2 5.45 L7.65 9.2 3.8 10.1 Q2.35 12.65 2.25 15.45 2.25 12.5 3.8 9.8 L7.65 8.9 8.2 5.15 Q10.25 3.75 12.9 3.15 L12.9 3.2 17.9 2.9 19.95 6.1 23.95 5.25 Q27.65 7.8 28.65 12.25 L28.65 12.3 28.75 12.7 M28.05 18.95 L28.15 19.1 28.05 19.25 26.15 16.2 26.15 15.9 28.05 18.95 M8.0 16.7 Q8.6 19.35 10.9 20.9 L11.3 21.15 11.35 21.2 Q14.1 22.75 17.25 22.05 L18.35 21.7 Q20.7 20.85 22.1 18.7 L22.1 18.75 23.0 17.05 23.15 17.05 23.45 15.6 23.45 15.9 23.45 15.95 23.15 17.35 23.0 17.35 22.15 19.0 22.1 19.0 Q20.7 21.15 18.35 22.0 L17.25 22.35 Q14.1 23.05 11.35 21.5 L11.3 21.45 10.9 21.2 Q8.6 19.65 8.0 17.0 L7.95 17.0 7.95 16.95 7.85 16.6 7.85 16.55 7.85 16.3 7.95 16.65 7.95 16.7 8.0 16.7 M22.1 19.35 L22.1 19.3 22.15 19.3 22.1 19.35" fill="url(#gradient8)" fill-rule="evenodd" stroke="none"/>
    <path d="M28.75 13.0 L28.8 13.25 28.65 13.45 28.6 13.2 28.55 12.95 Q27.4 8.85 23.95 6.55 L19.95 7.4 17.9 4.2 12.9 4.5 12.9 4.45 Q10.25 5.05 8.2 6.45 L7.65 10.2 3.8 11.1 Q2.5 13.35 2.3 15.75 L2.25 16.1 2.25 16.0 2.25 15.75 2.25 15.45 Q2.35 12.65 3.8 10.1 L7.65 9.2 8.2 5.45 Q10.25 4.05 12.9 3.45 L12.9 3.5 17.9 3.2 19.95 6.4 23.95 5.55 Q27.65 8.1 28.65 12.55 L28.65 12.6 28.75 13.0 M28.05 19.25 L28.15 19.4 27.85 19.95 27.7 19.65 26.15 17.2 26.15 16.2 28.05 19.25 M23.45 15.95 L23.45 16.1 Q23.55 18.25 22.15 20.3 L22.1 20.3 Q20.7 22.45 18.35 23.35 L17.25 23.65 Q14.1 24.35 11.35 22.8 L10.9 22.55 Q8.6 20.95 8.0 18.3 L8.0 18.25 7.85 16.85 7.85 16.6 7.95 16.95 7.95 17.0 8.0 17.0 Q8.6 19.65 10.9 21.2 L11.3 21.45 11.35 21.5 Q14.1 23.05 17.25 22.35 L18.35 22.0 Q20.7 21.15 22.1 19.0 L22.1 19.05 22.15 19.0 23.0 17.35 23.15 17.35 23.45 15.95 M22.1 19.35 L22.15 19.3 22.1 19.3 22.1 19.35" fill="url(#gradient9)" fill-rule="evenodd" stroke="none"/>
    <path d="M4.5 23.9 L1.6 22.7 1.5 22.65 1.4 19.35 1.5 19.65 4.75 21.0 4.5 23.9" fill="url(#gradient10)" fill-rule="evenodd" stroke="none"/>
    <path d="M18.15 29.15 L15.65 31.8 15.65 28.8 18.15 26.15 18.15 29.15" fill="url(#gradient11)" fill-rule="evenodd" stroke="none"/>
    <path d="M15.65 31.8 L11.3 31.3 10.9 31.2 Q9.15 30.65 7.45 29.7 5.75 28.75 4.45 27.45 L4.45 24.45 Q5.75 25.75 7.45 26.7 9.15 27.65 10.9 28.2 13.2 28.9 15.65 28.8 L15.65 31.8" fill="url(#gradient12)" fill-rule="evenodd" stroke="none"/>
    <path d="M24.65 3.6 Q27.1 5.6 29.05 8.6 L29.45 9.45 29.55 9.8 30.05 11.3 30.1 11.6 30.2 11.95 30.25 12.25 30.4 13.1 28.0 15.75 29.8 18.7 27.95 22.05 Q26.85 23.7 25.45 24.95 23.7 26.5 21.55 27.45 L18.15 26.15 15.65 28.8 Q13.2 28.9 10.9 28.2 9.15 27.65 7.45 26.7 5.75 25.75 4.45 24.45 L4.75 21.0 1.5 19.65 1.4 19.35 1.05 18.2 0.8 16.75 0.8 16.7 0.75 16.0 Q0.45 11.9 2.8 8.2 L6.3 7.35 6.8 3.95 Q9.3 2.15 12.55 1.4 L18.75 1.2 20.65 4.1 24.25 3.35 24.4 3.45 24.5 3.5 24.65 3.6 M28.65 12.0 L28.65 11.95 Q27.65 7.5 23.95 4.95 L19.95 5.8 17.9 2.6 12.9 2.9 12.9 2.85 Q10.25 3.45 8.2 4.85 L7.65 8.6 3.8 9.5 Q2.1 12.5 2.25 15.75 L2.25 16.0 2.55 17.9 2.75 18.55 6.35 20.05 6.0 23.9 6.1 23.95 8.2 25.4 10.9 26.65 15.0 27.3 17.75 24.4 21.5 25.85 Q24.65 24.25 26.7 21.25 L26.75 21.2 27.85 19.35 28.15 18.8 26.15 15.6 28.8 12.65 28.65 12.0" fill="url(#gradient13)" fill-rule="evenodd" stroke="none"/>
    <path d="M21.65 13.55 L21.65 13.45 Q21.65 13.0 21.2 13.0 20.45 13.0 20.45 13.6 L20.6 13.9 20.8 14.15 Q20.85 14.4 21.15 14.4 21.75 14.4 21.75 13.9 L21.65 13.55 M21.45 12.8 Q21.9 13.0 21.9 13.65 L21.6 14.7 21.5 14.8 21.15 14.85 Q20.6 14.85 20.35 14.5 L20.15 13.75 Q20.15 12.75 21.05 12.75 L21.45 12.8 M21.45 16.95 L21.2 17.75 Q20.85 18.3 20.25 18.3 19.45 18.3 19.45 17.35 19.45 16.15 20.75 16.15 21.4 16.15 21.45 16.95 M20.95 17.0 L20.95 16.95 Q20.95 16.35 20.4 16.4 19.85 16.45 19.85 17.0 19.85 17.35 20.0 17.5 20.0 18.0 20.5 18.0 L20.85 17.75 21.05 17.3 20.95 17.0 M15.05 9.6 L15.05 9.45 14.9 9.2 14.5 9.05 14.0 9.25 13.95 9.65 Q13.95 9.95 14.25 10.0 L14.3 10.3 14.6 10.55 15.0 10.3 15.15 9.95 15.05 9.6 M11.45 12.3 L11.45 12.1 Q11.45 11.55 10.95 11.65 10.45 11.75 10.45 12.15 10.45 12.5 10.7 12.65 L10.65 12.8 Q10.65 13.2 11.15 13.2 11.65 13.2 11.65 12.7 11.65 12.35 11.45 12.3 M12.0 12.15 L11.75 12.9 10.95 13.45 Q10.15 13.45 10.15 12.65 10.15 11.45 11.1 11.4 12.0 11.35 12.0 12.15 M14.35 10.8 Q13.4 10.8 13.4 10.05 L13.65 9.45 Q14.0 8.95 14.5 8.95 14.9 8.95 15.2 9.35 L15.45 9.85 15.15 10.5 14.35 10.8 M18.75 10.6 L18.75 10.8 19.1 11.0 Q19.6 11.0 19.6 10.45 L19.4 10.05 Q19.25 9.7 18.85 9.65 18.3 9.6 18.3 10.05 L18.45 10.4 18.75 10.6 M19.95 10.6 L19.85 11.1 19.6 11.3 19.25 11.35 19.1 11.35 19.0 11.35 18.6 11.3 18.55 11.3 Q18.25 11.2 18.05 10.95 L17.8 10.35 Q17.8 9.55 18.55 9.5 L18.6 9.5 19.1 9.65 19.65 10.0 19.75 10.1 19.95 10.6 M11.0 16.0 L11.0 15.95 Q11.0 15.5 10.45 15.55 9.9 15.55 9.9 16.05 L10.0 16.3 10.25 16.55 10.3 16.65 10.75 16.95 Q11.3 16.95 11.3 16.45 11.3 16.15 11.0 16.0 M10.35 17.2 Q9.65 17.2 9.65 16.35 9.65 15.35 10.6 15.3 11.5 15.25 11.5 16.15 L11.2 16.8 Q10.8 17.2 10.35 17.2 M13.95 18.45 L14.0 18.55 14.25 19.05 14.05 19.7 13.8 19.95 13.25 20.1 Q12.05 20.1 12.05 18.95 12.05 18.0 13.15 18.0 13.6 18.0 13.95 18.45 M12.8 19.35 Q12.8 19.85 13.45 19.85 L13.8 19.65 13.9 19.35 Q13.9 18.85 13.55 18.8 13.55 18.2 13.0 18.15 12.45 18.15 12.45 18.7 L12.5 19.05 12.8 19.35 M16.65 19.5 L16.6 19.75 16.75 20.05 Q16.95 20.3 17.25 20.3 17.75 20.3 17.75 19.75 L17.75 19.6 17.75 19.45 Q17.75 18.9 17.2 18.95 16.65 19.0 16.65 19.45 L16.65 19.5 M17.95 20.25 L17.7 20.5 17.0 20.7 Q16.1 20.7 16.1 19.9 L16.35 19.2 Q16.65 18.65 17.25 18.65 L17.45 18.7 Q17.75 18.7 18.05 19.05 L18.3 19.5 17.95 20.25" fill="#b57a5e" fill-rule="evenodd" stroke="none"/>
    <path d="M21.65 13.55 L21.75 13.9 Q21.75 14.4 21.15 14.4 20.85 14.4 20.8 14.15 L21.05 14.2 21.4 13.9 21.65 13.55 M20.95 17.0 L21.05 17.3 20.85 17.75 20.5 18.0 Q20.0 18.0 20.0 17.5 L20.25 17.55 20.75 17.35 20.95 17.0 M15.05 9.6 L15.15 9.95 15.0 10.3 14.6 10.55 14.3 10.3 14.25 10.0 14.35 10.0 Q14.95 10.0 15.05 9.6 M11.45 12.3 Q11.65 12.35 11.65 12.7 11.65 13.2 11.15 13.2 10.65 13.2 10.65 12.8 L10.7 12.65 10.95 12.7 Q11.35 12.7 11.45 12.3 M18.75 10.6 L19.05 10.65 19.4 10.3 19.4 10.05 19.6 10.45 Q19.6 11.0 19.1 11.0 L18.75 10.8 18.75 10.6 M11.0 16.0 Q11.3 16.15 11.3 16.45 11.3 16.95 10.75 16.95 L10.3 16.65 10.25 16.55 10.4 16.55 10.8 16.3 11.0 16.0 M12.8 19.35 L12.95 19.35 Q13.55 19.35 13.55 18.8 13.9 18.85 13.9 19.35 L13.8 19.65 13.45 19.85 Q12.8 19.85 12.8 19.35 M17.75 19.6 L17.75 19.75 Q17.75 20.3 17.25 20.3 16.95 20.3 16.75 20.05 L16.6 19.75 16.65 19.5 Q16.7 19.95 17.2 19.95 17.65 19.95 17.75 19.6" fill="#552d23" fill-rule="evenodd" stroke="none"/>
    <path d="M20.8 14.15 L20.6 13.9 20.45 13.6 Q20.45 13.0 21.2 13.0 21.65 13.0 21.65 13.45 L21.65 13.55 21.4 13.9 21.05 14.2 20.8 14.15 M20.0 17.5 Q19.85 17.35 19.85 17.0 19.85 16.45 20.4 16.4 20.95 16.35 20.95 16.95 L20.95 17.0 20.75 17.35 20.25 17.55 20.0 17.5 M14.25 10.0 Q13.95 9.95 13.95 9.65 L14.0 9.25 14.5 9.05 14.9 9.2 15.05 9.45 15.05 9.6 Q14.95 10.0 14.35 10.0 L14.25 10.0 M10.7 12.65 Q10.45 12.5 10.45 12.15 10.45 11.75 10.95 11.65 11.45 11.55 11.45 12.1 L11.45 12.3 Q11.35 12.7 10.95 12.7 L10.7 12.65 M19.4 10.05 L19.4 10.3 19.05 10.65 18.75 10.6 18.45 10.4 18.3 10.05 Q18.3 9.6 18.85 9.65 19.25 9.7 19.4 10.05 M10.25 16.55 L10.0 16.3 9.9 16.05 Q9.9 15.55 10.45 15.55 11.0 15.5 11.0 15.95 L11.0 16.0 10.8 16.3 10.4 16.55 10.25 16.55 M13.55 18.8 Q13.55 19.35 12.95 19.35 L12.8 19.35 12.5 19.05 12.45 18.7 Q12.45 18.15 13.0 18.15 13.55 18.2 13.55 18.8 M17.75 19.6 Q17.65 19.95 17.2 19.95 16.7 19.95 16.65 19.5 L16.65 19.45 Q16.65 19.0 17.2 18.95 17.75 18.9 17.75 19.45 L17.75 19.6" fill="#feeacd" fill-rule="evenodd" stroke="none"/>
  </g>
  <defs>
    <linearGradient gradientTransform="matrix(0.001, 0.0071, -0.0082, 0.0012, 15.65, 15.3)" gradientUnits="userSpaceOnUse" id="gradient0" spreadMethod="pad" x1="-819.2" x2="819.2">
      <stop offset="0.0" stop-color="#fee8c3"/>
      <stop offset="0.9764705882352941" stop-color="#e49b7c"/>
    </linearGradient>
    <linearGradient gradientTransform="matrix(0.0098, 0.0051, -0.004, 0.0077, 17.3, 16.25)" gradientUnits="userSpaceOnUse" id="gradient1" spreadMethod="pad" x1="-819.2" x2="819.2">
      <stop offset="0.0" stop-color="#fee8c3"/>
      <stop offset="0.18823529411764706" stop-color="#e49b7c"/>
      <stop offset="0.3058823529411765" stop-color="#552d23"/>
      <stop offset="0.5215686274509804" stop-color="#ba7d61"/>
      <stop offset="0.7372549019607844" stop-color="#e49b7c"/>
      <stop offset="1.0" stop-color="#d39b84"/>
    </linearGradient>
    <linearGradient gradientTransform="matrix(-0.0281, 3.0E-4, -1.0E-4, -0.008, 4.95, 9.15)" gradientUnits="userSpaceOnUse" id="gradient2" spreadMethod="pad" x1="-819.2" x2="819.2">
      <stop offset="0.0" stop-color="#fee8c3"/>
      <stop offset="0.18823529411764706" stop-color="#e49b7c"/>
      <stop offset="0.3058823529411765" stop-color="#552d23"/>
      <stop offset="0.5215686274509804" stop-color="#ba7d61"/>
      <stop offset="0.7372549019607844" stop-color="#e49b7c"/>
      <stop offset="1.0" stop-color="#d39b84"/>
    </linearGradient>
    <linearGradient gradientTransform="matrix(-0.004, 0.005, -0.0017, -0.0014, 25.65, 25.2)" gradientUnits="userSpaceOnUse" id="gradient3" spreadMethod="pad" x1="-819.2" x2="819.2">
      <stop offset="0.0" stop-color="#552d23"/>
      <stop offset="0.5490196078431373" stop-color="#ba7d61"/>
      <stop offset="1.0" stop-color="#d39b84"/>
    </linearGradient>
    <linearGradient gradientTransform="matrix(-0.0018, -5.0E-4, 5.0E-4, -0.0019, 19.3, 28.2)" gradientUnits="userSpaceOnUse" id="gradient4" spreadMethod="pad" x1="-819.2" x2="819.2">
      <stop offset="0.0" stop-color="#b57a5e"/>
      <stop offset="1.0" stop-color="#e49b7c"/>
    </linearGradient>
    <linearGradient gradientTransform="matrix(0.0018, 5.0E-4, -9.0E-4, 0.0033, 2.05, 19.9)" gradientUnits="userSpaceOnUse" id="gradient5" spreadMethod="pad" x1="-819.2" x2="819.2">
      <stop offset="0.0" stop-color="#fee8c3"/>
      <stop offset="0.49019607843137253" stop-color="#e49b7c"/>
      <stop offset="0.8352941176470589" stop-color="#d39b84"/>
      <stop offset="1.0" stop-color="#b57a5e"/>
    </linearGradient>
    <linearGradient gradientTransform="matrix(-0.003, 8.0E-4, -4.0E-4, -0.0013, 28.75, 16.35)" gradientUnits="userSpaceOnUse" id="gradient6" spreadMethod="pad" x1="-819.2" x2="819.2">
      <stop offset="0.0" stop-color="#552d23"/>
      <stop offset="0.5490196078431373" stop-color="#ba7d61"/>
      <stop offset="1.0" stop-color="#d39b84"/>
    </linearGradient>
    <linearGradient gradientTransform="matrix(0.0021, 0.0127, -0.016, 0.0027, 15.6, 15.3)" gradientUnits="userSpaceOnUse" id="gradient7" spreadMethod="pad" x1="-819.2" x2="819.2">
      <stop offset="0.0" stop-color="#fee8c3"/>
      <stop offset="0.5176470588235295" stop-color="#e49b7c"/>
      <stop offset="1.0" stop-color="#d39b84"/>
    </linearGradient>
    <linearGradient gradientTransform="matrix(-0.0281, 3.0E-4, -1.0E-4, -0.008, 4.95, 9.45)" gradientUnits="userSpaceOnUse" id="gradient8" spreadMethod="pad" x1="-819.2" x2="819.2">
      <stop offset="0.0" stop-color="#fee8c3"/>
      <stop offset="0.18823529411764706" stop-color="#e49b7c"/>
      <stop offset="0.3058823529411765" stop-color="#552d23"/>
      <stop offset="0.5215686274509804" stop-color="#ba7d61"/>
      <stop offset="0.7372549019607844" stop-color="#e49b7c"/>
      <stop offset="1.0" stop-color="#d39b84"/>
    </linearGradient>
    <linearGradient gradientTransform="matrix(-0.0281, 3.0E-4, -1.0E-4, -0.008, 4.95, 9.75)" gradientUnits="userSpaceOnUse" id="gradient9" spreadMethod="pad" x1="-819.2" x2="819.2">
      <stop offset="0.0" stop-color="#fee8c3"/>
      <stop offset="0.18823529411764706" stop-color="#e49b7c"/>
      <stop offset="0.3058823529411765" stop-color="#552d23"/>
      <stop offset="0.5215686274509804" stop-color="#ba7d61"/>
      <stop offset="0.7372549019607844" stop-color="#e49b7c"/>
      <stop offset="1.0" stop-color="#d39b84"/>
    </linearGradient>
    <linearGradient gradientTransform="matrix(-0.0053, 4.0E-4, -2.0E-4, -0.0029, 0.2, 21.7)" gradientUnits="userSpaceOnUse" id="gradient10" spreadMethod="pad" x1="-819.2" x2="819.2">
      <stop offset="0.0" stop-color="#552d23"/>
      <stop offset="0.5490196078431373" stop-color="#ba7d61"/>
      <stop offset="1.0" stop-color="#d39b84"/>
    </linearGradient>
    <linearGradient gradientTransform="matrix(0.0032, -9.0E-4, 6.0E-4, 0.0022, 19.15, 29.9)" gradientUnits="userSpaceOnUse" id="gradient11" spreadMethod="pad" x1="-819.2" x2="819.2">
      <stop offset="0.0" stop-color="#552d23"/>
      <stop offset="0.5490196078431373" stop-color="#ba7d61"/>
      <stop offset="1.0" stop-color="#d39b84"/>
    </linearGradient>
    <linearGradient gradientTransform="matrix(-0.0072, -0.0023, 8.0E-4, -0.0026, 9.7, 28.6)" gradientUnits="userSpaceOnUse" id="gradient12" spreadMethod="pad" x1="-819.2" x2="819.2">
      <stop offset="0.0" stop-color="#925d48"/>
      <stop offset="0.8666666666666667" stop-color="#e1997a"/>
      <stop offset="1.0" stop-color="#fee8c3"/>
    </linearGradient>
    <linearGradient gradientTransform="matrix(3.0E-4, 0.0222, -0.0181, 2.0E-4, 15.8, 28.5)" gradientUnits="userSpaceOnUse" id="gradient13" spreadMethod="pad" x1="-819.2" x2="819.2">
      <stop offset="0.0" stop-color="#fee8c3"/>
      <stop offset="0.5176470588235295" stop-color="#e49b7c"/>
      <stop offset="1.0" stop-color="#d39b84"/>
    </linearGradient>
  </defs>
</svg>
