<?xml version="1.0" encoding="UTF-8" standalone="no"?>
<svg xmlns:xlink="http://www.w3.org/1999/xlink" height="122.05px" width="94.45px" xmlns="http://www.w3.org/2000/svg">
  <g transform="matrix(1.0, 0.0, 0.0, 1.0, -126.85, -110.8)">
    <path d="M204.75 120.55 L202.85 119.0 Q199.55 116.95 195.4 117.7 L195.35 117.75 Q191.6 118.4 188.45 120.4 L186.55 121.85 Q179.0 128.45 176.7 139.4 174.8 148.4 174.25 157.65 L179.25 156.75 Q183.5 156.15 187.6 154.95 183.35 157.7 182.15 158.05 L182.2 158.35 Q188.5 156.2 195.2 154.35 199.7 152.8 204.4 149.3 L206.2 147.8 Q207.65 146.3 208.75 144.35 L209.15 143.65 209.45 143.05 210.75 140.1 211.15 139.2 211.15 139.15 211.2 139.05 209.2 140.65 209.0 140.9 209.4 140.05 209.55 138.95 209.55 136.4 209.4 134.9 209.25 134.05 209.3 133.65 209.4 131.8 209.4 130.9 Q209.3 129.1 208.8 127.4 L207.7 124.5 206.65 122.85 205.2 121.0 204.75 120.55 M203.3 113.55 Q206.75 115.05 209.5 118.35 L209.85 118.85 210.75 120.0 Q215.75 127.15 214.05 136.2 L214.05 136.25 212.95 140.2 Q211.4 144.95 208.65 148.5 206.8 150.8 204.45 152.65 202.4 154.3 199.95 155.55 190.45 160.2 180.0 161.65 L174.15 162.75 174.1 163.4 174.3 172.6 174.7 181.4 174.7 182.1 175.05 188.4 175.45 199.55 175.6 203.9 175.9 204.75 Q176.7 206.2 177.85 207.4 179.55 209.15 181.8 210.05 182.75 210.5 183.85 210.75 L183.9 210.7 203.55 214.5 Q206.1 214.85 207.45 217.0 L208.0 218.2 207.95 218.05 Q209.0 220.55 208.15 222.4 207.6 223.6 206.25 224.55 L206.2 224.55 Q203.7 226.3 200.85 226.3 L199.0 226.05 199.2 226.1 194.0 225.45 Q187.65 224.8 181.55 223.25 L181.4 223.2 172.9 220.65 172.85 220.6 169.9 219.65 159.0 223.4 158.85 223.45 Q154.65 224.65 150.4 225.1 144.95 226.4 139.6 225.3 L139.45 225.3 138.3 224.9 Q135.85 223.65 135.8 220.45 L135.75 220.45 Q135.7 216.15 139.1 215.2 L140.2 215.0 140.85 214.9 140.35 215.25 137.3 217.35 137.35 217.6 140.15 216.6 143.15 215.95 143.45 215.9 141.65 217.2 143.55 217.0 153.65 213.1 160.5 210.2 162.9 208.6 Q163.85 207.7 164.45 206.0 L164.75 204.25 164.95 202.65 164.3 196.95 163.65 200.45 163.4 200.7 163.4 198.85 163.0 182.55 162.7 173.75 162.5 169.85 162.4 167.2 162.35 166.05 162.3 165.55 162.3 165.5 162.3 164.15 Q153.75 164.4 145.25 163.95 L145.2 164.0 Q141.55 163.8 138.35 162.25 L135.45 160.5 135.4 160.5 134.85 160.05 Q131.8 157.8 129.95 154.8 L129.45 153.9 127.95 146.35 Q128.2 147.4 129.35 149.85 130.85 152.85 131.65 153.45 L131.45 152.7 Q129.95 147.95 129.6 144.9 129.15 140.75 130.25 137.15 131.2 133.9 133.4 131.15 137.7 125.5 144.25 124.85 L147.45 124.95 150.15 125.1 151.6 124.6 152.0 124.35 Q155.1 126.1 157.55 128.85 160.55 132.45 162.35 137.6 L162.95 139.35 Q164.6 144.55 165.65 150.05 166.75 155.6 167.2 161.45 L167.2 161.75 167.3 165.35 167.65 173.25 168.0 182.05 168.4 198.85 168.35 202.6 168.25 204.15 168.25 204.2 Q167.9 208.3 165.3 211.05 L162.3 213.3 162.2 213.3 158.0 215.2 Q153.75 216.9 149.45 218.15 L144.7 219.3 141.0 220.0 140.95 220.0 Q140.75 220.1 140.75 220.45 L140.7 220.45 140.75 220.5 145.2 220.85 149.4 220.25 149.7 220.2 154.0 219.5 157.3 218.75 159.25 218.05 155.15 220.25 Q157.8 220.0 169.45 216.95 171.2 216.75 181.7 220.0 192.2 223.2 198.75 222.55 L199.55 222.45 Q198.85 222.5 197.85 221.95 196.95 221.35 196.3 221.4 L198.65 221.5 197.9 220.85 199.75 221.15 199.95 221.1 Q201.8 221.5 203.3 220.45 L203.35 220.4 203.35 220.05 203.3 219.95 202.8 219.45 Q192.75 217.8 182.85 215.6 179.4 214.85 176.7 212.95 174.75 211.6 173.25 209.7 L171.9 207.85 171.5 207.15 171.45 207.05 Q170.6 205.55 170.55 204.05 L170.55 203.95 170.5 201.95 169.75 182.35 169.75 181.9 169.35 173.1 Q169.1 167.4 169.15 161.7 L169.35 163.75 169.6 165.85 169.65 168.55 169.85 170.45 170.95 154.5 171.35 151.45 Q171.95 146.75 173.1 143.0 L172.75 146.9 172.95 146.95 173.6 144.4 176.9 132.35 Q178.95 126.05 182.75 123.0 L185.65 120.7 Q189.6 117.8 192.4 116.25 196.6 113.95 200.4 113.6 L203.3 113.55 M169.25 158.0 L169.15 161.55 169.15 161.0 169.15 160.65 169.25 158.0 M161.55 159.2 L162.25 163.2 163.6 159.45 Q164.05 157.5 163.9 156.15 L163.35 153.2 161.4 148.0 161.3 147.8 159.25 144.1 159.05 143.8 158.9 143.15 158.5 141.75 158.2 140.95 157.6 139.15 157.65 139.15 157.4 138.5 155.8 135.1 Q154.45 132.8 152.7 131.1 L152.5 130.95 Q150.55 129.0 147.9 127.85 146.55 127.3 145.3 127.3 L145.25 127.3 Q140.15 127.1 136.75 130.5 135.5 131.65 134.55 133.3 L134.6 133.35 Q133.35 135.2 132.75 137.3 131.75 140.6 131.9 144.25 132.15 149.0 134.4 152.4 135.9 154.75 138.25 156.35 L138.25 156.4 Q141.55 158.7 145.45 159.0 L151.7 159.25 147.7 160.05 147.15 160.35 151.25 160.45 156.5 160.85 160.1 160.5 159.65 159.25 161.55 159.2" fill="#9f2d2d" fill-rule="evenodd" stroke="none"/>
    <path d="M204.75 120.55 L205.2 121.0 Q202.8 120.05 200.0 120.5 195.6 121.35 191.85 124.45 L191.8 124.45 Q184.85 130.55 182.7 140.7 181.05 148.1 180.45 155.6 L183.4 155.15 188.95 154.1 181.8 155.55 181.75 155.55 178.65 156.05 Q179.2 147.95 180.9 140.05 L180.9 140.1 Q183.2 129.6 190.4 123.3 193.95 120.25 198.35 119.45 L198.45 119.45 200.25 119.25 Q202.7 119.3 204.75 120.55 M214.35 118.8 L213.7 117.95 Q206.9 109.5 196.85 111.6 L196.9 111.55 196.05 111.75 198.55 111.15 Q208.6 109.2 215.35 117.8 L216.15 118.85 216.3 119.1 Q220.75 125.35 220.6 132.8 L220.0 137.4 219.1 141.0 Q217.6 146.1 214.75 150.05 212.75 152.75 210.25 154.9 207.9 156.8 204.95 158.25 L204.9 158.3 Q195.3 163.05 184.6 164.6 L180.2 165.35 180.1 165.35 180.35 172.0 180.4 173.25 180.7 180.8 180.8 182.6 181.4 194.25 181.6 200.1 181.7 204.15 Q182.6 205.75 183.9 206.9 L185.1 207.8 Q186.4 208.65 187.95 209.05 L188.45 209.1 188.85 209.2 190.15 209.5 208.15 212.9 Q212.1 213.55 213.85 217.7 L214.25 218.75 214.4 219.4 Q215.2 222.5 213.75 224.85 212.9 226.15 211.35 227.25 L211.4 227.25 Q208.9 229.05 206.0 229.15 L203.45 229.0 198.35 228.3 189.95 227.1 186.25 226.3 179.45 224.35 177.0 223.5 177.0 223.45 174.5 222.6 163.8 226.3 163.6 226.3 155.0 228.05 147.8 228.7 143.85 228.2 143.65 228.15 Q141.85 227.7 140.65 226.7 L141.8 227.1 142.15 227.15 146.9 227.65 153.6 226.95 Q157.9 226.4 162.1 225.2 L162.35 225.1 172.75 221.5 175.15 222.35 175.25 222.4 180.15 223.95 183.65 224.95 188.65 226.05 196.55 227.25 196.65 227.3 201.75 227.8 203.95 228.0 Q207.1 227.95 209.85 226.1 L209.8 226.15 211.95 224.1 Q213.5 221.65 212.25 218.25 L212.2 218.0 212.15 217.85 212.1 217.8 Q210.5 213.95 206.7 213.35 L206.55 213.3 191.75 210.55 191.45 210.5 189.3 210.05 189.25 210.0 187.0 209.55 186.85 209.5 Q184.05 208.95 182.05 207.05 L181.05 206.0 181.05 206.05 179.95 204.4 179.85 204.25 179.75 199.95 179.55 192.5 179.0 182.3 178.9 181.0 178.6 173.8 178.6 173.75 178.55 172.2 178.4 164.5 178.4 164.25 183.0 163.45 Q193.7 161.9 203.4 157.2 L203.45 157.2 208.3 154.1 Q210.8 152.1 212.7 149.6 215.65 145.7 217.35 140.55 L218.25 136.8 218.3 136.75 Q219.1 132.6 218.55 128.8 217.85 123.8 214.8 119.45 L214.8 119.4 214.35 118.8 M171.9 207.85 L173.25 209.7 Q172.3 211.75 170.7 213.45 L170.3 213.85 164.95 215.65 160.5 217.25 159.8 217.55 159.6 217.6 159.55 217.6 Q160.1 217.35 160.75 217.15 L164.2 215.65 165.65 214.95 165.8 214.9 Q167.6 214.0 169.05 212.45 L169.05 212.4 Q171.0 210.45 171.9 207.85 M162.35 166.05 L162.4 167.2 149.6 166.9 149.55 166.9 Q143.95 166.45 139.15 163.2 143.25 165.45 147.85 165.8 L147.95 165.8 Q155.15 166.2 162.35 166.05 M170.5 145.0 L169.95 149.9 Q168.95 145.2 167.55 140.65 L166.5 137.4 Q164.8 132.4 162.0 128.9 159.4 125.7 156.0 123.6 L154.4 122.8 153.05 122.15 153.0 122.2 Q150.65 121.2 148.3 121.05 L143.85 121.3 Q146.65 120.45 149.9 120.65 152.2 120.7 154.55 121.65 L155.4 122.05 Q156.7 122.65 157.95 123.4 L160.0 124.95 Q161.55 126.15 162.85 127.7 L163.5 128.5 163.85 128.9 Q166.55 132.4 168.25 137.3 L169.45 141.1 169.5 141.35 170.5 145.0 M161.85 157.65 L161.9 158.05 161.3 158.05 159.3 158.1 155.7 158.05 148.35 157.8 Q144.85 157.55 141.85 155.45 L141.9 155.5 Q139.75 154.05 138.5 152.0 136.4 148.8 136.2 144.45 136.0 141.05 136.9 138.05 137.5 136.15 138.6 134.45 139.7 132.6 141.1 131.4 143.9 128.9 148.0 129.05 L150.1 129.55 Q151.4 130.15 152.5 130.95 L152.7 131.1 151.8 130.7 151.7 130.65 149.75 130.15 149.7 130.15 Q145.95 130.0 143.25 132.1 141.5 133.35 140.15 135.4 L140.15 135.45 Q139.3 136.85 138.75 138.45 137.8 141.35 137.95 144.65 138.3 151.45 143.4 155.0 146.4 157.15 149.9 157.35 L157.3 157.65 159.2 157.65 161.2 157.65 161.85 157.65 M142.7 213.8 L144.4 213.4 148.8 212.6 142.7 213.8 M177.55 213.7 Q179.05 215.0 180.9 215.85 L177.85 214.85 177.8 214.85 173.85 213.45 172.45 213.3 173.15 213.1 175.35 213.0 177.55 213.7" fill="#4f2020" fill-rule="evenodd" stroke="none"/>
    <path d="M205.2 121.0 L206.65 122.85 207.7 124.5 206.1 124.65 Q198.5 125.4 190.85 133.25 183.3 141.05 183.95 147.25 184.2 149.55 185.3 150.75 186.5 152.2 188.65 152.0 189.45 151.9 196.65 147.8 203.65 143.75 205.95 143.4 203.1 148.15 198.15 150.8 L197.7 151.0 Q193.55 152.8 189.25 154.0 L188.95 154.1 183.4 155.15 180.45 155.6 Q181.05 148.1 182.7 140.7 184.85 130.55 191.8 124.45 L191.85 124.45 Q195.6 121.35 200.0 120.5 202.8 120.05 205.2 121.0 M173.25 209.7 Q174.75 211.6 176.7 212.95 L177.55 213.7 175.35 213.0 173.15 213.1 172.45 213.3 171.5 213.5 170.3 213.85 170.7 213.45 Q172.3 211.75 173.25 209.7 M161.05 152.3 L161.85 157.65 161.2 157.65 159.2 157.65 157.3 157.65 149.9 157.35 Q146.4 157.15 143.4 155.0 138.3 151.45 137.95 144.65 137.8 141.35 138.75 138.45 139.3 136.85 140.15 135.45 L140.15 135.4 Q141.5 133.35 143.25 132.1 145.95 130.0 149.7 130.15 L149.75 130.15 151.7 130.65 151.8 130.7 152.7 131.1 Q154.45 132.8 155.8 135.1 L155.15 135.0 152.6 134.8 Q147.8 135.25 144.6 139.15 141.5 143.0 142.0 147.55 142.15 149.1 143.3 150.5 144.5 152.0 145.85 151.9 L148.15 151.35 151.1 150.75 157.3 151.05 161.05 152.3" fill="#140808" fill-rule="evenodd" stroke="none"/>
    <path d="M187.6 154.95 Q183.5 156.15 179.25 156.75 L174.25 157.65 Q174.8 148.4 176.7 139.4 179.0 128.45 186.55 121.85 L188.45 120.4 Q191.6 118.4 195.35 117.75 L195.4 117.7 Q199.55 116.95 202.85 119.0 L204.75 120.55 Q202.7 119.3 200.25 119.25 L198.45 119.45 198.35 119.45 Q193.95 120.25 190.4 123.3 183.2 129.6 180.9 140.1 L180.9 140.05 Q179.2 147.95 178.65 156.05 L181.75 155.55 181.8 155.55 188.95 154.1 189.25 154.0 Q193.55 152.8 197.7 151.0 192.8 153.45 187.6 154.95 M209.85 118.85 L209.5 118.35 Q206.75 115.05 203.3 113.55 199.3 111.85 194.45 112.75 L194.4 112.75 Q191.6 113.25 189.2 114.35 192.4 112.45 196.05 111.75 L196.9 111.55 196.85 111.6 Q206.9 109.5 213.7 117.95 L214.35 118.8 211.15 118.8 209.85 118.85 M176.7 212.95 Q179.4 214.85 182.85 215.6 192.75 217.8 202.8 219.45 L203.3 219.95 203.35 220.05 203.35 220.4 203.3 220.45 Q201.8 221.5 199.95 221.1 L199.75 221.15 197.9 220.85 194.45 220.45 194.4 220.45 Q184.4 219.35 174.5 215.95 L174.65 215.95 170.6 214.6 169.05 214.65 165.55 215.85 164.95 215.65 170.3 213.85 171.5 213.5 172.45 213.3 173.85 213.45 177.8 214.85 177.85 214.85 180.9 215.85 Q179.05 215.0 177.55 213.7 L176.7 212.95 M140.75 220.5 L140.7 220.45 140.75 220.45 140.75 220.5 M157.55 128.85 Q155.1 126.1 152.0 124.35 L151.5 124.05 149.8 123.25 149.7 123.2 Q147.55 122.35 145.4 122.3 141.45 122.1 138.2 123.5 140.8 121.85 143.85 121.3 L148.3 121.05 Q150.65 121.2 153.0 122.2 L153.05 122.15 154.4 122.8 156.0 123.6 Q159.4 125.7 162.0 128.9 L160.0 128.85 157.55 128.85 M134.85 160.05 L135.4 160.5 135.45 160.5 138.35 162.25 Q141.55 163.8 145.2 164.0 L145.25 163.95 Q153.75 164.4 162.3 164.15 L162.3 165.5 162.3 165.55 162.35 166.05 Q155.15 166.2 147.95 165.8 L147.85 165.8 Q143.25 165.45 139.15 163.2 L138.6 162.85 137.4 162.05 137.35 162.05 134.85 160.05 M140.85 214.9 L140.2 215.0 139.1 215.2 Q140.35 214.25 142.3 213.9 L142.6 213.8 142.7 213.8 148.8 212.6 Q154.8 211.1 160.45 208.55 L159.95 208.85 Q150.85 213.15 140.85 214.9 M138.3 224.9 L139.45 225.3 139.6 225.3 Q144.95 226.4 150.4 225.1 154.65 224.65 158.85 223.45 L159.0 223.4 169.9 219.65 172.85 220.6 172.9 220.65 181.4 223.2 181.35 223.2 181.45 223.3 182.05 223.85 183.65 224.95 180.15 223.95 175.25 222.4 175.15 222.35 172.75 221.5 162.35 225.1 162.1 225.2 Q157.9 226.4 153.6 226.95 L146.9 227.65 142.15 227.15 141.8 227.1 140.65 226.7 Q139.15 226.0 138.3 224.9 M207.45 217.0 Q206.1 214.85 203.55 214.5 L183.9 210.7 183.85 210.75 Q182.75 210.5 181.8 210.05 L181.9 210.05 186.85 209.5 187.0 209.55 189.25 210.0 189.3 210.05 191.45 210.5 191.75 210.55 206.55 213.3 206.7 213.35 Q210.5 213.95 212.1 217.8 L212.15 217.85 212.2 218.0 212.25 218.25 209.3 217.45 207.45 217.0 M175.05 188.4 L174.7 182.1 174.7 181.4 174.3 172.6 174.1 163.4 178.3 164.5 178.4 164.5 178.55 172.2 178.6 173.75 178.6 173.8 178.9 181.0 179.0 182.3 179.55 192.5 177.65 190.75 175.05 188.4 M197.7 151.0 L198.15 150.8 197.65 151.05 197.7 151.0 M161.9 158.05 L162.0 159.2 161.55 159.2 159.65 159.25 151.7 159.25 145.45 159.0 Q141.55 158.7 138.25 156.4 L138.25 156.35 Q135.9 154.75 134.4 152.4 L138.5 152.0 Q139.75 154.05 141.9 155.5 L141.85 155.45 Q144.85 157.55 148.35 157.8 L155.7 158.05 159.3 158.1 161.3 158.05 161.9 158.05" fill="#7a3030" fill-rule="evenodd" stroke="none"/>
    <path d="M209.85 118.85 L211.15 118.8 214.35 118.8 214.8 119.4 214.8 119.45 Q217.85 123.8 218.55 128.8 219.1 132.6 218.3 136.75 L218.25 136.8 217.35 140.55 215.65 140.3 212.95 140.2 214.05 136.25 214.05 136.2 Q215.75 127.15 210.75 120.0 L209.85 118.85 M159.25 218.05 L157.3 218.75 154.0 219.5 Q151.8 218.55 149.45 218.15 153.75 216.9 158.0 215.2 L164.2 215.65 160.75 217.15 Q160.1 217.35 159.55 217.6 L159.6 217.6 159.8 217.55 160.5 217.25 164.95 215.65 165.55 215.85 159.25 218.05 M162.95 139.35 L162.35 137.6 Q160.55 132.45 157.55 128.85 L160.0 128.85 162.0 128.9 Q164.8 132.4 166.5 137.4 L167.55 140.65 163.85 139.6 162.95 139.35 M181.4 223.2 L181.55 223.25 Q187.65 224.8 194.0 225.45 L199.2 226.1 199.0 226.05 200.85 226.3 203.95 228.0 201.75 227.8 196.65 227.3 196.55 227.25 188.65 226.05 183.65 224.95 182.05 223.85 181.45 223.3 181.35 223.2 181.4 223.2 M208.15 222.4 Q209.0 220.55 207.95 218.05 L208.0 218.2 207.45 217.0 209.3 217.45 212.25 218.25 Q213.5 221.65 211.95 224.1 L208.15 222.4 M181.8 210.05 Q179.55 209.15 177.85 207.4 L182.05 207.05 Q184.05 208.95 186.85 209.5 L181.9 210.05 181.8 210.05 M175.45 199.55 L175.05 188.4 177.65 190.75 179.55 192.5 179.75 199.95 177.7 199.75 175.45 199.55 M174.1 163.4 L174.15 162.75 180.0 161.65 Q190.45 160.2 199.95 155.55 202.4 154.3 204.45 152.65 L206.5 153.4 208.3 154.1 203.45 157.2 203.4 157.2 Q193.7 161.9 183.0 163.45 L178.4 164.25 178.3 164.5 174.1 163.4 M134.4 152.4 Q132.15 149.0 131.9 144.25 131.75 140.6 132.75 137.3 L136.2 137.9 136.9 138.05 Q136.0 141.05 136.2 144.45 136.4 148.8 138.5 152.0 L134.4 152.4" fill="#692a2a" fill-rule="evenodd" stroke="none"/>
    <path d="M162.4 167.2 L162.5 169.85 156.9 170.9 Q149.2 171.65 144.8 169.45 140.7 167.45 138.6 162.85 L139.15 163.2 Q143.95 166.45 149.55 166.9 L149.6 166.9 162.4 167.2 M220.6 132.8 L221.2 135.4 Q221.55 138.55 220.8 142.6 220.1 146.35 218.8 148.95 217.0 153.05 215.3 155.05 L210.45 159.35 Q204.1 164.25 197.15 166.8 193.2 168.2 185.45 169.9 L185.45 171.5 185.45 180.35 185.45 182.5 Q185.35 192.1 186.0 198.15 186.45 202.2 187.55 205.1 188.55 208.0 190.15 209.5 L188.85 209.2 188.45 209.1 187.95 209.05 Q186.4 208.65 185.1 207.8 L183.9 206.9 Q182.6 205.75 181.7 204.15 L181.6 200.1 181.4 194.25 180.8 182.6 180.7 180.8 180.4 173.25 180.35 172.0 180.1 165.35 180.2 165.35 184.6 164.6 Q195.3 163.05 204.9 158.3 L204.95 158.25 Q207.9 156.8 210.25 154.9 212.75 152.75 214.75 150.05 217.6 146.1 219.1 141.0 L220.0 137.4 220.6 132.8 M214.4 219.4 Q215.75 220.45 216.0 222.75 216.55 228.05 212.15 230.5 209.25 232.15 203.2 232.75 197.8 233.25 186.6 230.6 L173.2 227.8 170.9 229.0 Q165.3 232.05 158.9 232.65 L152.55 232.5 Q150.7 231.85 147.8 228.7 L155.0 228.05 163.6 226.3 163.8 226.3 174.5 222.6 177.0 223.45 177.0 223.5 179.45 224.35 186.25 226.3 189.95 227.1 198.35 228.3 203.45 229.0 206.0 229.15 Q208.9 229.05 211.4 227.25 L211.35 227.25 Q212.9 226.15 213.75 224.85 215.2 222.5 214.4 219.4 M171.8 137.95 L171.75 138.3 171.75 138.35 170.5 145.0 169.5 141.35 169.45 141.1 168.25 137.3 Q166.55 132.4 163.85 128.9 L163.5 128.5 163.7 128.3 168.05 131.95 Q170.35 134.45 171.8 137.95" fill="#000000" fill-opacity="0.1882353" fill-rule="evenodd" stroke="none"/>
    <path d="M207.7 124.5 L208.8 127.4 207.85 127.45 Q202.45 128.0 196.7 132.85 193.45 135.55 191.4 138.3 L190.3 139.55 Q188.95 141.1 188.3 142.2 186.65 145.05 186.85 147.05 187.0 148.25 187.6 148.95 188.3 149.65 189.2 149.55 191.05 149.4 196.5 144.45 201.95 139.4 207.35 138.9 L208.1 138.85 Q207.25 141.3 205.95 143.4 203.65 143.75 196.65 147.8 189.45 151.9 188.65 152.0 186.5 152.2 185.3 150.75 184.2 149.55 183.95 147.25 183.3 141.05 190.85 133.25 198.5 125.4 206.1 124.65 L207.7 124.5 M160.0 147.4 L161.05 152.3 157.3 151.05 151.1 150.75 148.15 151.35 145.85 151.9 Q144.5 152.0 143.3 150.5 142.15 149.1 142.0 147.55 141.5 143.0 144.6 139.15 147.8 135.25 152.6 134.8 L155.15 135.0 155.8 135.1 157.4 138.5 155.9 138.25 Q153.85 138.05 152.5 138.2 148.95 138.55 146.45 141.55 144.2 144.25 144.5 146.75 144.6 148.0 145.3 148.75 145.95 149.5 147.0 149.4 148.05 149.3 150.7 148.05 153.35 146.75 154.65 146.65 L158.25 146.95 160.0 147.4" fill="#0a2a30" fill-rule="evenodd" stroke="none"/>
    <path d="M208.8 127.4 Q209.3 129.1 209.4 130.9 L208.65 130.9 Q198.25 131.95 191.0 142.45 L190.9 142.55 Q189.55 143.95 189.15 144.65 L188.75 145.3 188.5 145.9 Q188.6 146.9 189.9 146.75 190.75 146.7 192.3 145.05 L195.55 141.45 Q200.7 136.25 205.85 135.75 L208.2 136.05 208.9 136.2 208.1 138.85 207.35 138.9 Q201.95 139.4 196.5 144.45 191.05 149.4 189.2 149.55 188.3 149.65 187.6 148.95 187.0 148.25 186.85 147.05 186.65 145.05 188.3 142.2 188.95 141.1 190.3 139.55 L191.4 138.3 Q193.45 135.55 196.7 132.85 202.45 128.0 207.85 127.45 L208.8 127.4 M159.15 144.1 L160.0 147.4 158.25 146.95 154.65 146.65 Q153.35 146.75 150.7 148.05 148.05 149.3 147.0 149.4 145.95 149.5 145.3 148.75 144.6 148.0 144.5 146.75 144.2 144.25 146.45 141.55 148.95 138.55 152.5 138.2 153.85 138.05 155.9 138.25 L157.4 138.5 157.65 139.15 157.6 139.15 158.2 140.95 157.55 140.75 156.1 140.8 Q153.4 141.1 150.45 142.95 147.65 144.55 147.1 145.8 L147.2 146.8 148.3 146.9 151.05 145.25 Q153.0 143.65 155.0 143.45 L158.3 143.9 159.15 144.1" fill="#155863" fill-rule="evenodd" stroke="none"/>
    <path d="M209.4 130.9 L209.4 131.8 208.7 131.85 Q203.25 132.35 198.45 135.95 194.65 138.75 191.85 143.0 L191.85 143.35 Q196.75 138.85 198.6 137.45 203.35 133.9 207.5 133.5 L209.3 133.65 209.25 134.05 209.05 135.2 209.1 135.15 208.9 136.2 208.2 136.05 205.85 135.75 Q200.7 136.25 195.55 141.45 L192.3 145.05 Q190.75 146.7 189.9 146.75 188.6 146.9 188.5 145.9 L188.75 145.3 189.15 144.65 Q189.55 143.95 190.9 142.55 L191.0 142.45 Q198.25 131.95 208.65 130.9 L209.4 130.9 M159.05 143.8 L159.15 144.1 158.3 143.9 155.0 143.45 Q153.0 143.65 151.05 145.25 L148.3 146.9 147.2 146.8 147.1 145.8 Q147.65 144.55 150.45 142.95 153.4 141.1 156.1 140.8 L157.55 140.75 158.2 140.95 158.5 141.75 156.6 141.8 Q154.4 142.0 152.35 142.9 149.85 143.9 149.7 145.15 L152.55 143.65 Q153.75 143.05 155.5 142.85 L157.75 142.75 158.9 143.15 159.05 143.8" fill="#1a6a7a" fill-rule="evenodd" stroke="none"/>
    <path d="M209.25 134.05 L209.4 134.9 209.55 136.4 209.55 138.95 209.4 140.05 209.0 140.9 209.2 140.65 211.2 139.05 211.15 139.15 211.15 139.2 210.75 140.1 209.45 143.05 209.15 143.65 208.75 144.35 Q207.65 146.3 206.2 147.8 L204.4 149.3 Q199.7 152.8 195.2 154.35 188.5 156.2 182.2 158.35 L182.15 158.05 Q183.35 157.7 187.6 154.95 192.8 153.45 197.7 151.0 L197.65 151.05 198.15 150.8 Q203.1 148.15 205.95 143.4 207.25 141.3 208.1 138.85 L208.9 136.2 209.1 135.15 209.05 135.2 209.25 134.05 M189.2 114.35 Q191.6 113.25 194.4 112.75 L194.45 112.75 Q199.3 111.85 203.3 113.55 L200.4 113.6 Q196.6 113.95 192.4 116.25 189.6 117.8 185.65 120.7 L182.75 123.0 Q178.95 126.05 176.9 132.35 L173.6 144.4 172.95 146.95 172.75 146.9 173.1 143.0 Q171.95 146.75 171.35 151.45 L170.95 154.5 169.85 170.45 169.65 168.55 169.6 165.85 169.35 163.75 169.15 161.7 169.15 161.55 169.25 158.0 169.7 151.95 169.75 151.1 169.95 149.9 170.5 145.0 171.75 138.35 171.75 138.3 171.8 137.95 Q174.05 128.0 180.0 121.25 181.55 119.6 183.3 118.05 186.05 115.7 189.2 114.35 M197.9 220.85 L198.65 221.5 196.3 221.4 Q196.95 221.35 197.85 221.95 198.85 222.5 199.55 222.45 L198.75 222.55 Q192.2 223.2 181.7 220.0 171.2 216.75 169.45 216.95 157.8 220.0 155.15 220.25 L159.25 218.05 165.55 215.85 169.05 214.65 170.6 214.6 174.65 215.95 174.5 215.95 Q184.4 219.35 194.4 220.45 L194.45 220.45 197.9 220.85 M152.0 124.35 L151.6 124.6 150.15 125.1 147.45 124.95 144.25 124.85 Q137.7 125.5 133.4 131.15 131.2 133.9 130.25 137.15 129.15 140.75 129.6 144.9 129.95 147.95 131.45 152.7 L131.65 153.45 Q130.85 152.85 129.35 149.85 128.2 147.4 127.95 146.35 L129.45 153.9 Q127.2 149.85 126.9 144.45 L126.9 144.4 Q126.55 136.75 130.25 130.65 L130.3 130.65 Q132.1 127.65 134.45 125.7 136.1 124.3 138.2 123.5 141.45 122.1 145.4 122.3 147.55 122.35 149.7 123.2 L149.8 123.25 151.5 124.05 152.0 124.35 M163.4 200.7 L163.65 200.45 164.3 196.95 164.95 202.65 164.75 204.25 164.45 206.0 Q163.85 207.7 162.9 208.6 L160.5 210.2 153.65 213.1 143.55 217.0 141.65 217.2 143.45 215.9 143.15 215.95 140.15 216.6 137.35 217.6 137.3 217.35 140.35 215.25 140.85 214.9 Q150.85 213.15 159.95 208.85 L160.45 208.55 161.6 207.6 161.65 207.55 Q163.1 206.0 163.3 203.7 L163.4 200.7 M159.05 143.8 L159.25 144.1 161.3 147.8 161.4 148.0 163.35 153.2 163.9 156.15 Q164.05 157.5 163.6 159.45 L162.25 163.2 161.55 159.2 162.0 159.2 161.9 158.05 161.85 157.65 161.05 152.3 160.0 147.4 159.15 144.1 159.05 143.8 M159.65 159.25 L160.1 160.5 156.5 160.85 151.25 160.45 147.15 160.35 147.7 160.05 151.7 159.25 159.65 159.25" fill="#c23838" fill-rule="evenodd" stroke="none"/>
    <path d="M209.4 131.8 L209.3 133.65 207.5 133.5 Q203.35 133.9 198.6 137.45 196.75 138.85 191.85 143.35 L191.85 143.0 Q194.65 138.75 198.45 135.95 203.25 132.35 208.7 131.85 L209.4 131.8 M158.5 141.75 L158.9 143.15 157.75 142.75 155.5 142.85 Q153.75 143.05 152.55 143.65 L149.7 145.15 Q149.85 143.9 152.35 142.9 154.4 142.0 156.6 141.8 L158.5 141.75" fill="#2dc2d2" fill-rule="evenodd" stroke="none"/>
    <path d="M169.15 161.7 Q169.1 167.4 169.35 173.1 L169.75 181.9 169.75 182.35 170.5 201.95 169.9 202.1 Q168.75 202.35 168.4 202.6 L168.35 202.6 168.4 198.85 168.0 182.05 167.65 173.25 167.3 165.35 167.2 161.75 167.2 161.45 Q166.75 155.6 165.65 150.05 L167.1 150.4 169.75 151.1 169.7 151.95 169.25 158.0 169.15 160.65 169.15 161.0 169.15 161.55 169.15 161.7 M145.2 220.85 L140.75 220.5 140.75 220.45 Q140.75 220.1 140.95 220.0 L141.0 220.0 144.7 219.3 145.2 220.85 M208.65 148.5 Q211.4 144.95 212.95 140.2 L215.65 140.3 217.35 140.55 Q215.65 145.7 212.7 149.6 L208.65 148.5 M136.75 130.5 Q140.15 127.1 145.25 127.3 L145.3 127.3 Q146.55 127.3 147.9 127.85 150.55 129.0 152.5 130.95 151.4 130.15 150.1 129.55 L148.0 129.05 Q143.9 128.9 141.1 131.4 L139.35 131.0 136.75 130.5" fill="#572222" fill-rule="evenodd" stroke="none"/>
    <path d="M170.5 201.95 L170.55 203.95 170.55 204.05 Q170.6 205.55 171.45 207.05 L171.5 207.15 171.9 207.85 Q171.0 210.45 169.05 212.4 L169.05 212.45 Q167.6 214.0 165.8 214.9 L165.65 214.95 164.2 215.65 158.0 215.2 162.2 213.3 162.3 213.3 165.3 211.05 Q167.9 208.3 168.25 204.2 L168.25 204.15 168.35 202.6 168.4 202.6 Q168.75 202.35 169.9 202.1 L170.5 201.95 M154.0 219.5 L149.7 220.2 149.4 220.25 145.2 220.85 144.7 219.3 149.45 218.15 Q151.8 218.55 154.0 219.5 M165.65 150.05 Q164.6 144.55 162.95 139.35 L163.85 139.6 167.55 140.65 Q168.95 145.2 169.95 149.9 L169.75 151.1 167.1 150.4 165.65 150.05 M200.85 226.3 Q203.7 226.3 206.2 224.55 L206.25 224.55 Q207.6 223.6 208.15 222.4 L211.95 224.1 209.8 226.15 209.85 226.1 Q207.1 227.95 203.95 228.0 L200.85 226.3 M177.85 207.4 Q176.7 206.2 175.9 204.75 L175.6 203.9 175.45 199.55 177.7 199.75 179.75 199.95 179.85 204.25 179.95 204.4 181.05 206.05 181.05 206.0 182.05 207.05 177.85 207.4 M204.45 152.65 Q206.8 150.8 208.65 148.5 L212.7 149.6 Q210.8 152.1 208.3 154.1 L206.5 153.4 204.45 152.65 M132.75 137.3 Q133.35 135.2 134.6 133.35 L134.55 133.3 Q135.5 131.65 136.75 130.5 L139.35 131.0 141.1 131.4 Q139.7 132.6 138.6 134.45 137.5 136.15 136.9 138.05 L136.2 137.9 132.75 137.3" fill="#5e2525" fill-rule="evenodd" stroke="none"/>
    <path d="M178.4 164.25 L178.4 164.5 178.3 164.5 178.4 164.25" fill="#702c2c" fill-rule="evenodd" stroke="none"/>
  </g>
</svg>
