<?xml version="1.0" encoding="UTF-8" standalone="no"?>
<svg xmlns:xlink="http://www.w3.org/1999/xlink" height="5.9px" width="3.75px" xmlns="http://www.w3.org/2000/svg">
  <g transform="matrix(1.0, 0.0, 0.0, 1.0, 1.85, 3.45)">
    <path d="M1.1 -1.0 Q0.2 -0.95 0.15 -1.95 -0.05 -3.1 0.8 -3.4 1.65 -3.65 1.9 -2.6 L1.8 -1.7 Q1.6 -1.05 1.1 -1.0 M-1.6 1.5 Q-2.15 0.15 -1.5 -0.35 -0.75 -0.8 -0.25 0.5 0.45 2.45 -0.75 2.45 -1.4 2.45 -1.6 1.5" fill="#3399cc" fill-rule="evenodd" stroke="none"/>
  </g>
</svg>
