<?xml version="1.0" encoding="UTF-8" standalone="no"?>
<svg xmlns:xlink="http://www.w3.org/1999/xlink" height="61.45px" width="70.05px" xmlns="http://www.w3.org/2000/svg">
  <g transform="matrix(1.0, 0.0, 0.0, 1.0, 35.0, 30.7)">
    <path d="M14.3 -20.6 Q17.45 -21.7 22.8 -21.7 28.4 -21.7 31.75 -20.2 34.35 -19.0 35.05 -17.15 L34.1 -17.4 Q31.95 -18.65 29.65 -19.15 L22.7 -19.65 Q17.4 -19.65 11.75 -18.4 L11.9 -18.7 14.25 -20.8 14.3 -20.6 M-29.1 9.7 L-30.4 9.4 Q-29.85 6.65 -28.9 4.1 L-27.6 4.55 -27.3 2.5 -26.4 2.15 -26.25 2.1 -28.1 6.75 -28.2 6.6 -28.45 6.5 -28.45 7.65 -28.65 8.2 -29.3 7.45 -29.4 7.45 -29.4 7.9 -28.9 9.0 -29.1 9.7 M-27.0 -0.3 L-26.05 -2.05 -25.8 -1.9 -25.2 -1.65 -24.55 -1.3 -25.05 -0.35 -26.05 -0.35 -26.7 -0.3 -27.0 -0.3 M-25.1 -3.65 Q-23.1 -6.7 -20.55 -9.0 -17.4 -11.8 -13.4 -13.4 L-17.2 -10.4 -20.55 -6.75 -22.3 -4.75 -23.45 -3.15 -25.1 -3.65 M1.5 -15.65 Q2.9 -21.45 2.65 -24.45 L3.85 -21.25 Q4.15 -19.85 3.9 -17.35 4.4 -18.55 5.05 -19.4 6.3 -21.05 9.6 -24.3 11.25 -25.9 13.65 -27.25 15.35 -28.2 17.4 -29.05 L22.1 -30.7 22.35 -30.6 Q22.1 -29.15 20.6 -27.25 L20.5 -27.15 20.2 -27.05 Q16.2 -26.1 12.2 -23.7 5.0 -19.4 2.5 -12.95 L2.5 -14.3 Q2.05 -11.9 0.95 -9.3 -0.1 -6.8 -1.35 -5.05 L-2.15 -4.0 -2.2 -4.1 Q-0.9 -7.3 0.5 -12.05 L1.1 -14.15 1.15 -14.25 1.3 -14.95 1.5 -15.65" fill="#fff7f7" fill-rule="evenodd" stroke="none"/>
    <path d="M20.5 -27.15 L20.25 -26.85 20.2 -27.05 20.5 -27.15 M-2.5 -3.3 L-2.55 -3.3 -2.5 -3.3" fill="#7f7f8c" fill-rule="evenodd" stroke="none"/>
    <path d="M20.25 -26.85 Q18.8 -25.1 14.95 -21.25 L14.25 -20.8 11.9 -18.7 11.75 -18.4 Q17.4 -19.65 22.7 -19.65 L29.65 -19.15 Q31.95 -18.65 34.1 -17.4 L31.55 -17.8 Q30.3 -17.8 25.55 -16.1 21.05 -14.5 19.35 -14.4 21.15 -13.35 22.55 -11.7 25.75 -7.95 25.25 -2.2 L24.65 -3.2 24.35 -3.65 23.95 -4.3 23.7 -4.6 21.6 -7.25 20.8 -10.45 Q19.5 -13.85 17.05 -14.8 L20.9 -16.8 Q16.05 -16.8 11.45 -15.45 L9.2 -14.95 11.35 -17.1 10.1 -16.35 Q6.3 -13.95 3.6 -10.1 L3.15 -9.75 0.85 -7.35 -1.15 -5.0 -1.45 -4.6 -1.85 -4.1 -1.9 -4.05 -2.2 -3.7 -2.45 -3.3 -2.5 -3.3 -2.55 -3.3 -2.35 -3.8 -2.3 -3.85 -2.15 -4.0 -1.35 -5.05 Q-0.1 -6.8 0.95 -9.3 2.05 -11.9 2.5 -14.3 L2.5 -12.95 Q5.0 -19.4 12.2 -23.7 16.2 -26.1 20.2 -27.05 L20.25 -26.85 M19.35 -14.4 L19.25 -14.45 19.2 -14.4 19.35 -14.4" fill="#b38484" fill-rule="evenodd" stroke="none"/>
    <path d="M14.95 -21.25 L14.3 -20.6 14.25 -20.8 14.95 -21.25" fill="#a2a2b3" fill-rule="evenodd" stroke="none"/>
    <path d="M9.15 28.4 L8.6 28.0 5.9 25.85 -2.8 19.25 Q-6.6 16.4 -10.9 14.65 L-10.2 14.6 Q-7.5 14.6 -4.5 16.1 -2.75 17.0 0.1 18.8 L-1.1 18.95 -2.1 18.75 -3.25 18.5 Q-3.05 18.8 -1.2 19.7 1.1 20.85 2.65 21.95 5.25 23.75 11.95 24.2 L19.2 24.55 16.75 22.85 18.2 23.15 20.9 23.35 24.85 22.75 18.6 21.85 18.65 21.65 Q20.2 21.65 24.35 19.75 L24.4 19.7 24.25 19.55 Q23.0 19.7 21.1 17.6 19.85 16.2 19.35 15.25 L19.45 14.9 20.95 14.9 20.35 14.0 20.5 14.0 23.0 14.25 24.5 15.1 25.6 15.9 25.0 14.6 23.45 12.45 21.65 11.2 22.3 11.15 23.6 11.4 23.45 10.5 25.55 9.75 25.55 9.7 24.6 9.85 23.7 9.85 23.55 9.85 23.3 9.85 23.2 9.55 22.0 7.25 24.8 6.65 25.55 6.4 23.9 6.05 23.55 6.05 21.1 5.65 20.55 5.6 18.8 4.2 Q14.95 1.55 11.0 1.55 L9.25 1.65 7.0 1.85 12.15 0.15 Q15.85 -1.0 16.6 -1.0 L10.45 -1.75 Q7.25 -1.75 3.15 -0.75 L-0.6 0.15 1.3 -1.55 3.05 -2.9 3.1 -2.95 2.95 -2.95 -3.1 -0.25 Q-3.25 -1.5 -2.4 -3.1 L-2.1 -3.65 Q-1.15 -4.35 0.35 -5.0 L4.25 -6.25 9.25 -7.45 10.45 -7.45 7.55 -6.3 5.0 -5.2 6.45 -5.5 10.25 -5.8 Q13.45 -5.8 16.75 -4.55 19.75 -3.4 20.95 -1.3 L19.25 -1.0 17.65 -0.25 Q23.85 1.9 26.5 6.75 27.25 8.1 27.65 9.55 28.15 11.35 28.15 13.3 28.15 14.65 27.8 15.3 27.35 16.05 26.05 16.7 L26.05 17.0 26.95 17.0 Q27.25 16.8 28.3 16.5 L25.6 18.8 25.5 18.95 26.3 19.1 27.85 18.8 26.95 19.25 26.8 19.55 27.4 19.55 26.05 20.5 24.25 21.35 26.4 21.05 28.6 20.6 Q27.55 23.95 22.35 25.75 L22.05 25.85 Q18.9 26.9 15.55 27.1 L17.5 27.9 19.75 28.9 19.75 28.95 15.55 29.35 12.5 29.0 9.15 28.4 M-15.6 -9.7 Q-9.9 -13.9 0.15 -14.95 L1.3 -14.95 1.15 -14.25 1.1 -14.15 Q-0.85 -14.0 -3.25 -13.1 L-8.1 -10.45 Q-6.85 -11.25 -4.35 -11.6 -8.05 -10.2 -12.5 -4.1 L-15.35 0.55 -15.65 0.1 -15.95 -0.4 -16.55 -1.45 -15.8 1.05 -15.7 1.2 -15.85 1.05 Q-16.6 0.05 -18.55 -1.1 L-21.1 -2.3 -20.55 -3.1 -19.05 -4.9 Q-15.7 -8.45 -9.05 -11.4 L-8.65 -11.6 -9.15 -11.6 -9.35 -11.55 -11.7 -10.8 -15.55 -9.55 -15.6 -9.7 M19.4 12.0 L19.15 12.65 18.85 12.35 19.4 12.0 M-13.0 3.7 Q-10.75 1.65 -10.15 1.35 -11.5 2.9 -12.3 4.5 L-12.55 4.25 -13.0 3.7 M-12.6 5.1 L-13.05 6.2 Q-13.6 7.65 -13.75 9.55 L-13.9 11.7 -14.5 11.55 -16.2 12.9 -23.8 10.95 -24.8 10.7 -24.8 10.3 Q-24.7 5.25 -23.05 1.3 L-22.6 1.25 -22.35 1.2 Q-19.25 1.0 -16.15 2.45 -17.1 4.8 -17.1 6.85 L-17.1 7.35 -13.55 4.2 -13.3 4.45 -12.7 5.0 -12.6 5.1 M-13.9 12.85 L-13.9 13.25 -14.6 13.35 -14.65 13.3 -13.9 12.85" fill="#d2b6b6" fill-rule="evenodd" stroke="none"/>
    <path d="M-13.65 13.65 L-17.1 14.9 -20.0 15.7 Q-23.1 15.05 -24.35 14.15 L-26.05 12.4 -28.0 10.25 -28.3 9.85 -29.1 9.7 -28.9 9.0 -29.4 7.9 -29.4 7.45 -29.3 7.45 -28.65 8.2 -28.45 7.65 -28.45 6.5 -28.2 6.6 -28.1 6.75 -26.25 2.1 Q-24.65 1.45 -23.05 1.3 -24.7 5.25 -24.8 10.3 L-24.8 10.7 -25.9 10.45 -26.65 10.25 Q-24.9 14.6 -19.9 14.1 -17.85 13.85 -16.2 12.9 L-14.5 11.55 -13.9 11.7 -13.6 11.7 -12.75 11.5 -12.05 11.35 -12.05 11.45 -13.9 12.85 -14.65 13.3 -14.7 13.35 -15.05 13.4 -15.25 13.5 -14.7 13.35 -14.6 13.35 -13.9 13.25 -12.55 13.05 -13.65 13.65 M-13.4 -13.4 L-10.65 -14.35 Q-4.55 -15.95 1.5 -15.65 L1.3 -14.95 0.15 -14.95 Q-9.9 -13.9 -15.6 -9.7 L-15.6 -9.55 -15.55 -9.55 -11.7 -10.8 -9.35 -11.55 -9.15 -11.6 -9.05 -11.4 Q-15.7 -8.45 -19.05 -4.9 L-20.55 -3.1 -21.1 -2.3 -22.1 -2.7 -23.45 -3.15 -22.3 -4.75 -20.55 -6.75 -17.2 -10.4 -13.4 -13.4 M19.45 14.9 L19.35 15.25 18.95 16.1 Q17.85 18.25 16.45 19.3 17.65 18.7 18.25 18.7 L18.25 18.85 Q17.2 19.8 14.85 20.75 12.2 21.85 10.45 21.65 L15.15 22.4 12.2 22.65 8.05 22.15 6.0 21.4 5.45 20.95 Q2.0 18.2 0.95 15.2 0.45 12.1 0.05 11.25 L0.05 9.95 0.2 9.95 1.3 12.5 2.5 14.55 2.7 14.55 2.25 13.35 Q1.95 12.1 1.95 11.15 L2.0 9.9 2.05 9.6 2.15 9.6 3.0 9.75 3.05 9.8 3.0 10.0 2.8 12.6 Q2.75 13.95 3.1 15.0 3.85 18.0 6.6 19.6 11.75 22.4 16.4 17.05 L16.7 16.65 17.7 15.35 17.85 15.1 18.6 13.85 19.75 14.0 19.45 14.9 M10.05 21.55 L9.9 21.55 10.35 21.65 10.05 21.55 M-25.05 -0.35 L-24.55 -1.3 -23.2 -0.85 -24.1 -0.5 -25.05 -0.35" fill="#f2eaea" fill-rule="evenodd" stroke="none"/>
    <path d="M25.25 -2.2 Q28.35 3.3 29.15 9.55 29.5 12.5 29.35 15.65 L29.35 15.7 29.45 15.65 32.75 13.9 32.75 15.4 Q31.35 20.45 30.75 21.65 31.1 21.1 32.3 20.8 L33.9 20.25 Q32.95 21.95 30.5 24.05 L28.4 25.85 27.45 26.7 27.4 26.65 26.6 27.25 Q23.75 29.3 20.1 30.2 14.0 31.9 9.15 28.4 L12.5 29.0 15.55 29.35 19.75 28.95 19.9 28.9 19.75 28.9 17.5 27.9 15.55 27.1 Q18.9 26.9 22.05 25.85 L22.35 25.75 Q27.55 23.95 28.6 20.6 L26.4 21.05 24.25 21.35 26.05 20.5 27.4 19.55 26.8 19.55 26.95 19.25 27.85 18.8 26.3 19.1 25.5 18.95 25.6 18.8 28.3 16.5 Q27.25 16.8 26.95 17.0 L26.05 17.0 26.05 16.7 Q27.35 16.05 27.8 15.3 28.15 14.65 28.15 13.3 28.15 11.35 27.65 9.55 27.25 8.1 26.5 6.75 23.85 1.9 17.65 -0.25 L19.25 -1.0 20.95 -1.3 Q19.75 -3.4 16.75 -4.55 13.45 -5.8 10.25 -5.8 L6.45 -5.5 5.0 -5.2 7.55 -6.3 10.45 -7.45 9.25 -7.45 4.25 -6.25 0.35 -5.0 Q1.8 -5.65 3.8 -6.3 L4.2 -6.4 9.25 -7.7 13.25 -8.3 Q17.6 -8.8 20.35 -7.2 L21.75 -6.35 23.7 -4.6 23.95 -4.3 24.35 -3.65 24.65 -3.2 25.25 -2.2 M18.65 21.65 L18.6 21.85 18.55 21.8 18.65 21.65" fill="#c29c9c" fill-rule="evenodd" stroke="none"/>
    <path d="M-28.9 4.1 L-29.4 3.9 Q-30.9 3.3 -31.8 3.25 L-33.6 3.4 -35.0 3.7 -33.7 2.8 Q-32.35 1.85 -31.25 1.45 -30.1 1.05 -28.75 1.0 L-27.55 0.85 Q-28.45 0.8 -29.7 0.05 -31.0 -0.75 -31.65 -1.75 L-31.6 -1.8 -30.9 -1.25 -30.1 -0.95 -29.95 -0.95 -27.0 -0.3 -26.7 -0.3 -26.05 -0.35 -25.05 -0.35 -24.1 -0.5 -23.2 -0.85 -24.55 -1.3 -25.2 -1.65 -25.8 -1.9 -26.05 -2.05 -26.55 -2.35 -27.2 -2.7 -29.4 -4.25 -29.95 -4.8 -28.3 -4.45 -27.95 -4.35 -25.5 -3.75 -25.1 -3.65 -23.45 -3.15 -22.1 -2.7 -21.1 -2.3 -18.55 -1.1 Q-16.6 0.05 -15.85 1.05 L-15.7 1.2 -15.8 1.05 -16.55 -1.45 -15.95 -0.4 -15.65 0.1 -15.35 0.55 -13.15 3.55 -13.0 3.7 -12.55 4.25 -12.3 4.5 -11.85 4.95 -10.65 6.05 -10.45 6.25 -9.4 6.85 -10.65 6.8 -11.5 6.65 -11.6 6.5 -11.6 6.45 -12.6 5.1 -12.7 5.0 -13.3 4.45 -13.55 4.2 Q-14.6 3.2 -15.8 2.6 L-16.15 2.45 Q-19.25 1.0 -22.35 1.2 L-22.6 1.25 -23.05 1.3 Q-24.65 1.45 -26.25 2.1 L-26.4 2.15 -27.3 2.5 -27.6 4.55 -28.9 4.1 M-2.2 -3.7 L-1.9 -4.05 -1.85 -4.1 -1.45 -4.6 -1.15 -5.0 0.85 -7.35 3.15 -9.75 3.6 -10.1 Q7.2 -13.3 12.05 -13.65 17.6 -11.65 21.6 -7.25 L23.7 -4.6 21.75 -6.35 20.35 -7.2 Q17.6 -8.8 13.25 -8.3 L9.25 -7.7 4.2 -6.4 3.8 -6.3 Q1.8 -5.65 0.35 -5.0 -1.15 -4.35 -2.1 -3.65 L-2.2 -3.7 M20.55 5.6 L21.1 5.65 23.55 6.05 23.9 6.05 25.55 6.4 24.8 6.65 22.0 7.25 21.25 7.35 20.4 7.4 19.7 7.45 17.5 7.45 18.1 8.1 Q18.75 8.6 19.75 8.95 L20.3 9.2 23.3 9.85 23.55 9.85 23.7 9.85 24.6 9.85 25.55 9.7 25.55 9.75 23.45 10.5 22.8 10.65 20.35 10.55 21.45 11.1 21.65 11.2 23.45 12.45 25.0 14.6 25.6 15.9 24.5 15.1 23.0 14.25 20.5 14.0 20.35 14.0 19.75 14.0 18.6 13.85 19.1 12.75 19.15 12.65 19.4 12.0 19.4 11.9 18.8 11.25 Q17.45 9.85 15.75 9.0 12.85 7.55 9.0 7.8 L7.65 8.0 5.8 8.45 Q4.5 8.9 3.2 9.65 L3.05 9.8 3.0 9.75 2.15 9.6 2.05 9.6 1.0 9.15 2.25 9.05 2.45 9.0 2.55 8.95 4.25 8.45 6.15 7.65 Q8.1 6.75 10.25 5.5 L10.75 5.1 11.85 4.45 9.95 6.3 Q11.2 5.75 13.45 5.5 16.55 5.1 20.55 5.6" fill="#bb9191" fill-rule="evenodd" stroke="none"/>
    <path d="M-10.9 14.65 L-13.65 13.65 -12.55 13.05 -13.9 13.25 -13.9 12.85 -12.05 11.45 -12.05 11.35 -12.75 11.5 -13.6 11.7 -13.9 11.7 -13.75 9.55 Q-13.6 7.65 -13.05 6.2 L-12.6 5.1 -11.6 6.45 -11.6 6.5 -11.5 6.65 -10.65 6.8 -9.4 6.85 -10.45 6.25 -10.65 6.05 -11.85 4.95 -12.3 4.5 Q-11.5 2.9 -10.15 1.35 -10.75 1.65 -13.0 3.7 L-13.15 3.55 -15.35 0.55 -12.5 -4.1 Q-8.05 -10.2 -4.35 -11.6 -6.85 -11.25 -8.1 -10.45 L-3.25 -13.1 Q-0.85 -14.0 1.1 -14.15 L0.5 -12.05 Q-0.9 -7.3 -2.2 -4.1 L-2.15 -4.0 -2.3 -3.85 -2.35 -3.8 -2.55 -3.3 -2.5 -3.3 -2.45 -3.3 -2.1 -3.65 -2.4 -3.1 Q-3.25 -1.5 -3.1 -0.25 L2.95 -2.95 3.05 -2.9 1.3 -1.55 -0.6 0.15 3.15 -0.75 Q7.25 -1.75 10.45 -1.75 L16.6 -1.0 Q15.85 -1.0 12.15 0.15 L7.0 1.85 9.25 1.65 11.0 1.55 Q14.95 1.55 18.8 4.2 L20.55 5.6 Q16.55 5.1 13.45 5.5 11.2 5.75 9.95 6.3 L11.85 4.45 10.75 5.1 10.25 5.5 Q8.1 6.75 6.15 7.65 L4.25 8.45 2.55 8.95 2.45 9.0 2.25 9.05 1.0 9.15 2.05 9.6 2.0 9.9 1.95 11.15 Q1.95 12.1 2.25 13.35 L2.7 14.55 2.5 14.55 1.3 12.5 0.2 9.95 0.05 9.95 0.05 11.25 Q0.45 12.1 0.95 15.2 2.0 18.2 5.45 20.95 L6.0 21.4 8.05 22.15 12.2 22.65 15.15 22.4 10.45 21.65 Q12.2 21.85 14.85 20.75 17.2 19.8 18.25 18.85 L18.25 18.7 Q17.65 18.7 16.45 19.3 17.85 18.25 18.95 16.1 L19.35 15.25 Q19.85 16.2 21.1 17.6 23.0 19.7 24.25 19.55 L24.35 19.75 Q20.2 21.65 18.65 21.65 L17.35 21.35 18.55 21.8 18.6 21.85 24.85 22.75 20.9 23.35 18.2 23.15 16.75 22.85 19.2 24.55 11.95 24.2 Q5.25 23.75 2.65 21.95 1.1 20.85 -1.2 19.7 -3.05 18.8 -3.25 18.5 L-2.1 18.75 -1.1 18.95 0.1 18.8 Q-2.75 17.0 -4.5 16.1 -7.5 14.6 -10.2 14.6 L-10.9 14.65 M22.0 7.25 L23.2 9.55 23.3 9.85 20.3 9.2 19.75 8.95 Q18.75 8.6 18.1 8.1 L17.5 7.45 19.7 7.45 20.4 7.4 21.25 7.35 22.0 7.25 M23.45 10.5 L23.6 11.4 22.3 11.15 21.65 11.2 21.45 11.1 20.35 10.55 22.8 10.65 23.45 10.5 M20.35 14.0 L20.95 14.9 19.45 14.9 19.75 14.0 20.35 14.0 M3.05 9.8 L3.2 9.65 Q4.5 8.9 5.8 8.45 L7.65 8.0 9.0 7.8 Q12.85 7.55 15.75 9.0 17.45 9.85 18.8 11.25 L19.4 11.9 19.4 12.0 18.85 12.35 19.15 12.65 19.1 12.75 18.6 13.85 17.85 15.1 17.7 15.35 16.7 16.65 16.4 17.05 Q11.75 22.4 6.6 19.6 3.85 18.0 3.1 15.0 2.75 13.95 2.8 12.6 L3.0 10.0 3.05 9.8 M10.05 21.55 L10.35 21.65 9.9 21.55 10.05 21.55 M-13.55 4.2 L-17.1 7.35 -17.1 6.85 Q-17.1 4.8 -16.15 2.45 L-15.8 2.6 Q-14.6 3.2 -13.55 4.2" fill="#e0cdcd" fill-rule="evenodd" stroke="none"/>
    <path d="M27.45 26.7 L27.45 26.75 27.4 26.65 27.45 26.7 M24.25 19.55 L24.4 19.7 24.35 19.75 24.25 19.55 M2.95 -2.95 L3.1 -2.95 3.05 -2.9 2.95 -2.95 M-15.55 -9.55 L-15.6 -9.55 -15.6 -9.7 -15.55 -9.55" fill="#bfc2d3" fill-rule="evenodd" stroke="none"/>
    <path d="M3.6 -10.1 Q6.3 -13.95 10.1 -16.35 L11.35 -17.1 9.2 -14.95 11.45 -15.45 Q16.05 -16.8 20.9 -16.8 L17.05 -14.8 Q19.5 -13.85 20.8 -10.45 L21.6 -7.25 Q17.6 -11.65 12.05 -13.65 7.2 -13.3 3.6 -10.1" fill="#a36a6a" fill-rule="evenodd" stroke="none"/>
    <path d="M19.75 28.9 L19.9 28.9 19.75 28.95 19.75 28.9 M18.55 21.8 L17.35 21.35 18.65 21.65 18.55 21.8" fill="#abadbd" fill-rule="evenodd" stroke="none"/>
    <path d="M-9.05 -11.4 L-9.15 -11.6 -8.65 -11.6 -9.05 -11.4" fill="#d1d3e6" fill-rule="evenodd" stroke="none"/>
    <path d="M-2.1 -3.65 L-2.45 -3.3 -2.2 -3.7 -2.1 -3.65" fill="#9798a6" fill-rule="evenodd" stroke="none"/>
  </g>
</svg>
