<?xml version="1.0" encoding="UTF-8" standalone="no"?>
<svg xmlns:xlink="http://www.w3.org/1999/xlink" height="84.6px" width="90.6px" xmlns="http://www.w3.org/2000/svg">
  <g transform="matrix(1.0, 0.0, 0.0, 1.0, 151.05, 185.05)">
    <path d="M-69.6 -128.8 L-69.55 -129.5 -70.0 -130.4 -70.7 -131.05 Q-70.15 -132.6 -69.55 -135.05 -68.5 -139.25 -68.5 -142.95 -68.5 -148.45 -70.3 -148.45 L-71.05 -148.35 -70.3 -145.5 Q-69.65 -143.2 -69.65 -141.95 -69.65 -137.95 -72.05 -131.55 L-72.2 -132.75 Q-72.35 -134.25 -73.25 -134.5 L-74.6 -130.05 Q-75.35 -127.1 -76.5 -126.1 L-76.85 -126.3 Q-76.5 -126.95 -77.75 -128.0 -78.9 -126.95 -79.5 -126.7 -80.25 -127.35 -80.25 -127.75 -79.05 -130.3 -79.05 -130.95 -79.05 -131.95 -80.25 -131.95 -80.7 -131.95 -86.05 -123.65 -91.6 -115.3 -93.8 -115.3 L-94.85 -115.45 Q-94.4 -118.55 -94.4 -120.05 -95.55 -119.4 -97.2 -116.75 -99.0 -113.95 -100.65 -112.9 -101.9 -112.05 -103.95 -111.4 -104.15 -112.4 -104.55 -112.9 L-105.1 -112.85 Q-105.45 -112.4 -105.45 -111.4 -105.85 -110.55 -108.1 -110.55 -110.0 -110.55 -110.3 -113.2 -110.75 -117.05 -110.9 -117.25 L-111.55 -117.25 Q-111.55 -114.3 -111.7 -112.9 -111.95 -111.35 -113.1 -110.55 L-115.3 -110.9 -115.8 -111.35 -116.25 -111.9 -115.95 -112.0 Q-116.85 -115.1 -118.2 -116.35 -118.2 -116.1 -118.5 -116.1 L-118.8 -114.45 -119.2 -114.45 Q-120.25 -115.6 -121.3 -118.4 -122.5 -121.45 -122.95 -122.1 L-123.25 -122.0 -123.55 -120.45 -122.65 -116.85 -121.9 -114.45 -122.2 -114.15 -123.4 -115.45 -124.3 -116.1 -125.8 -115.1 Q-126.15 -115.1 -126.35 -115.4 -127.0 -116.2 -127.35 -118.75 L-127.55 -120.55 Q-128.0 -126.1 -129.2 -126.1 -130.25 -126.1 -130.7 -123.25 L-130.85 -120.2 Q-133.05 -120.55 -133.4 -123.4 -133.7 -126.45 -134.85 -127.1 L-135.0 -129.8 Q-135.0 -129.5 -135.3 -129.5 -135.3 -128.9 -136.2 -128.9 -137.35 -128.9 -137.35 -139.25 L-137.35 -139.35 -137.4 -139.25 -139.5 -132.75 Q-140.5 -137.35 -140.5 -143.2 -140.5 -156.25 -133.55 -163.7 L-133.8 -164.05 Q-137.55 -161.0 -139.9 -154.6 -142.15 -148.45 -142.15 -142.55 -142.15 -138.75 -140.95 -133.9 L-140.05 -130.55 -140.65 -128.9 -141.85 -131.85 Q-142.45 -133.75 -142.9 -134.25 L-144.1 -134.0 Q-144.7 -135.4 -144.85 -137.35 L-145.1 -140.8 Q-145.55 -140.3 -146.15 -140.8 L-146.35 -144.6 -146.9 -144.6 -147.5 -143.45 -146.9 -139.65 -146.7 -138.55 Q-147.65 -142.1 -147.65 -146.05 -147.65 -160.35 -136.65 -170.45 L-135.3 -171.6 Q-123.25 -182.1 -105.85 -182.1 -88.45 -182.1 -76.25 -171.6 -63.9 -161.1 -63.9 -146.05 -63.9 -140.5 -65.6 -135.6 L-65.6 -136.05 -65.8 -136.3 -65.85 -136.2 -67.35 -133.5 -68.75 -130.25 -69.6 -128.8 M-89.9 -112.65 Q-89.8 -113.95 -88.9 -116.2 -87.4 -120.2 -86.05 -120.2 -85.0 -120.2 -85.0 -119.4 L-84.85 -119.4 -82.8 -121.6 Q-81.0 -123.5 -79.5 -123.65 L-79.45 -122.9 -79.75 -121.5 -79.05 -122.9 -78.3 -123.9 Q-77.25 -123.5 -77.25 -122.1 L-77.5 -119.55 -77.7 -119.35 Q-83.3 -114.95 -89.9 -112.65 M-74.8 -122.8 L-74.3 -124.8 Q-73.4 -127.85 -71.45 -128.0 L-71.45 -125.55 -71.45 -125.5 -73.3 -124.65 Q-74.25 -123.95 -74.8 -122.8 M-115.35 -136.15 L-115.35 -136.3 -115.65 -136.15 -115.35 -136.15" fill="url(#gradient0)" fill-rule="evenodd" stroke="none"/>
    <path d="M-65.85 -136.2 L-65.8 -136.3 -65.6 -136.05 -65.85 -136.2" fill="#974646" fill-rule="evenodd" stroke="none"/>
    <path d="M-103.95 -111.4 Q-101.9 -112.05 -100.65 -112.9 -99.0 -113.95 -97.2 -116.75 -95.55 -119.4 -94.4 -120.05 -94.4 -118.55 -94.85 -115.45 L-93.8 -115.3 Q-91.6 -115.3 -86.05 -123.65 -80.7 -131.95 -80.25 -131.95 -79.05 -131.95 -79.05 -130.95 -79.05 -130.3 -80.25 -127.75 -80.25 -127.35 -79.5 -126.7 -78.9 -126.95 -77.75 -128.0 -76.5 -126.95 -76.85 -126.3 L-76.5 -126.1 Q-75.35 -127.1 -74.6 -130.05 L-73.25 -134.5 Q-72.35 -134.25 -72.2 -132.75 L-72.05 -131.55 Q-69.65 -137.95 -69.65 -141.95 -69.65 -143.2 -70.3 -145.5 L-71.05 -148.35 -70.3 -148.45 Q-68.5 -148.45 -68.5 -142.95 -68.5 -139.25 -69.55 -135.05 -70.15 -132.6 -70.7 -131.05 L-70.0 -130.4 -69.55 -129.5 -69.6 -128.8 -70.45 -127.3 -71.35 -125.55 -71.45 -125.55 -71.45 -128.0 Q-73.4 -127.85 -74.3 -124.8 L-74.8 -122.8 -74.9 -122.65 Q-75.25 -121.8 -76.85 -120.25 L-77.5 -119.55 -77.25 -122.1 Q-77.25 -123.5 -78.3 -123.9 L-79.05 -122.9 -79.45 -122.9 -79.5 -123.65 Q-81.0 -123.5 -82.8 -121.6 L-84.85 -119.4 -85.0 -119.4 Q-85.0 -120.2 -86.05 -120.2 -87.4 -120.2 -88.9 -116.2 -89.8 -113.95 -89.9 -112.65 L-90.25 -112.5 -90.35 -112.5 -91.5 -112.1 -91.75 -112.45 Q-91.85 -113.3 -92.75 -113.3 L-94.05 -112.9 -95.25 -112.05 Q-96.7 -113.8 -97.2 -113.95 -97.7 -114.05 -98.85 -112.85 L-100.9 -110.75 -101.25 -110.75 -102.2 -110.85 -103.95 -110.75 -103.95 -111.4 M-146.7 -138.55 L-146.9 -139.65 -147.5 -143.45 -146.9 -144.6 -146.35 -144.6 -146.15 -140.8 Q-145.55 -140.3 -145.1 -140.8 L-144.85 -137.35 Q-144.7 -135.4 -144.1 -134.0 L-142.9 -134.25 Q-142.45 -133.75 -141.85 -131.85 L-140.65 -128.9 -140.05 -130.55 -140.95 -133.9 Q-142.15 -138.75 -142.15 -142.55 -142.15 -148.45 -139.9 -154.6 -137.55 -161.0 -133.8 -164.05 L-133.55 -163.7 Q-140.5 -156.25 -140.5 -143.2 -140.5 -137.35 -139.5 -132.75 L-137.4 -139.25 -137.35 -139.25 Q-137.35 -128.9 -136.2 -128.9 -135.3 -128.9 -135.3 -129.5 -135.0 -129.5 -135.0 -129.8 L-134.85 -127.1 Q-133.7 -126.45 -133.4 -123.4 -133.05 -120.55 -130.85 -120.2 L-130.7 -123.25 Q-130.25 -126.1 -129.2 -126.1 -128.0 -126.1 -127.55 -120.55 L-127.35 -118.75 -127.4 -118.75 Q-127.6 -120.25 -129.15 -120.25 L-130.05 -120.05 -130.2 -119.8 Q-130.2 -118.15 -129.8 -117.1 L-130.0 -117.0 Q-131.85 -118.3 -133.5 -120.65 -135.2 -123.15 -135.9 -123.7 L-136.65 -123.35 -137.05 -123.25 -137.8 -125.3 Q-138.2 -126.55 -139.3 -127.25 L-140.0 -126.75 -140.05 -125.35 -140.95 -126.45 Q-144.85 -131.45 -146.35 -137.1 L-146.65 -138.2 -146.65 -138.4 -146.7 -138.55 M-126.35 -115.4 Q-126.15 -115.1 -125.8 -115.1 L-124.3 -116.1 -123.4 -115.45 -122.2 -114.15 -121.9 -114.45 -122.65 -116.85 -123.55 -120.45 -123.25 -122.0 -122.95 -122.1 Q-122.5 -121.45 -121.3 -118.4 -120.25 -115.6 -119.2 -114.45 L-118.8 -114.45 -118.5 -116.1 Q-118.2 -116.1 -118.2 -116.35 -116.85 -115.1 -115.95 -112.0 L-116.25 -111.9 -115.8 -111.35 -115.9 -111.05 -117.9 -111.5 -118.45 -111.65 -118.95 -111.8 -120.9 -112.35 -121.75 -112.65 -122.8 -113.05 -123.8 -113.45 -125.05 -113.95 -125.7 -114.4 -126.7 -115.2 -126.35 -115.4" fill="#ba6b8f" fill-rule="evenodd" stroke="none"/>
    <path d="M-69.6 -128.8 L-68.75 -130.25 -67.35 -133.5 -65.85 -136.2 -65.6 -136.05 -65.6 -135.6 Q-63.9 -140.5 -63.9 -146.05 -63.9 -161.1 -76.25 -171.6 -88.45 -182.1 -105.85 -182.1 -123.25 -182.1 -135.3 -171.6 L-136.65 -170.45 Q-147.65 -160.35 -147.65 -146.05 -147.65 -142.1 -146.7 -138.55 L-146.65 -138.4 -146.65 -138.2 -146.35 -137.1 Q-144.85 -131.45 -140.95 -126.45 L-140.05 -125.35 -140.0 -126.75 -139.3 -127.25 Q-138.2 -126.55 -137.8 -125.3 L-137.05 -123.25 -136.65 -123.35 -135.9 -123.7 Q-135.2 -123.15 -133.5 -120.65 -131.85 -118.3 -130.0 -117.0 L-129.8 -117.1 Q-130.2 -118.15 -130.2 -119.8 L-130.05 -120.05 -129.15 -120.25 Q-127.6 -120.25 -127.4 -118.75 L-127.35 -116.3 -126.7 -115.2 -125.7 -114.4 -125.05 -113.95 -123.8 -113.45 -122.8 -113.05 -121.75 -112.65 -120.9 -112.35 -118.95 -111.8 -118.45 -111.65 -117.9 -111.5 -115.9 -111.05 -115.65 -111.0 -115.5 -111.0 -115.4 -110.95 -115.3 -110.9 -113.1 -110.55 Q-111.95 -111.35 -111.7 -112.9 -111.55 -114.3 -111.55 -117.25 L-110.9 -117.25 Q-110.75 -117.05 -110.3 -113.2 -110.0 -110.55 -108.1 -110.55 -105.85 -110.55 -105.45 -111.4 -105.45 -112.4 -105.1 -112.85 L-104.55 -112.9 Q-104.15 -112.4 -103.95 -111.4 L-103.95 -110.75 -102.2 -110.85 -101.25 -110.75 -101.2 -110.7 -100.9 -110.75 -98.85 -112.85 Q-97.7 -114.05 -97.2 -113.95 -96.7 -113.8 -95.25 -112.05 L-94.05 -112.9 -92.75 -113.3 Q-91.85 -113.3 -91.75 -112.45 L-91.5 -112.1 -90.25 -112.5 -89.9 -112.65 Q-83.3 -114.95 -77.7 -119.35 L-77.5 -119.55 -76.85 -120.25 Q-75.25 -121.8 -74.9 -122.65 L-74.8 -122.8 Q-74.25 -123.95 -73.3 -124.65 L-71.45 -125.5 -71.35 -125.55 -70.45 -127.3 -69.6 -128.8 M-79.6 -114.1 L-79.6 -113.55 Q-79.6 -113.05 -81.7 -111.35 L-84.65 -109.2 -86.25 -108.85 -87.25 -108.6 -87.35 -104.55 -87.5 -104.3 Q-87.65 -104.1 -88.3 -104.1 -89.8 -104.1 -89.85 -105.9 L-89.8 -107.3 -90.7 -106.65 -90.75 -105.45 -90.8 -100.7 -91.65 -100.45 Q-92.7 -101.4 -92.65 -103.75 L-92.65 -105.8 -93.4 -105.7 Q-94.35 -105.7 -95.9 -106.45 L-97.8 -107.45 -98.55 -107.6 -102.4 -107.2 -102.95 -107.1 -107.0 -106.4 -108.3 -105.75 -110.25 -105.15 Q-113.7 -105.15 -115.15 -106.35 -116.55 -107.55 -117.9 -107.55 -118.45 -107.55 -119.1 -107.1 -119.75 -106.7 -120.3 -106.7 L-120.35 -106.7 Q-120.7 -106.1 -121.55 -106.1 -123.25 -106.1 -124.1 -107.8 L-124.75 -109.75 -125.55 -110.4 -127.0 -111.2 Q-127.55 -111.4 -128.15 -112.1 L-128.55 -112.3 -130.2 -112.5 -132.35 -112.85 Q-133.5 -113.6 -134.1 -114.7 L-134.75 -116.15 -137.7 -118.55 -139.65 -120.2 Q-142.75 -123.25 -144.95 -126.45 -148.4 -131.45 -149.9 -137.1 -151.05 -141.3 -151.05 -146.05 -151.05 -160.1 -141.1 -170.45 L-137.7 -173.7 Q-130.55 -179.95 -121.45 -182.75 L-118.35 -183.65 Q-112.4 -185.05 -105.85 -185.05 -99.15 -185.05 -93.2 -183.65 L-89.9 -182.75 Q-81.0 -179.95 -73.55 -173.7 -60.45 -162.3 -60.45 -146.05 -60.45 -129.9 -73.55 -118.55 -76.45 -116.05 -79.6 -114.1 M-97.4 -111.2 L-97.6 -111.4 -97.75 -111.2 -97.4 -111.2" fill="#874e66" fill-rule="evenodd" stroke="none"/>
    <path d="M-127.35 -118.75 Q-127.0 -116.2 -126.35 -115.4 L-126.7 -115.2 -127.35 -116.3 -127.4 -118.75 -127.35 -118.75 M-101.25 -110.75 L-100.9 -110.75 -101.2 -110.7 -101.25 -110.75 M-71.45 -125.55 L-71.35 -125.55 -71.45 -125.5 -71.45 -125.55 M-97.4 -111.2 L-97.75 -111.2 -97.6 -111.4 -97.4 -111.2" fill="#c2826a" fill-rule="evenodd" stroke="none"/>
    <path d="M-137.4 -139.25 L-137.35 -139.35 -137.35 -139.25 -137.4 -139.25 M-115.8 -111.35 L-115.3 -110.9 -115.4 -110.95 -115.5 -111.0 -115.65 -111.0 -115.9 -111.05 -115.8 -111.35 M-79.45 -122.9 L-79.05 -122.9 -79.75 -121.5 -79.45 -122.9" fill="#a12020" fill-opacity="0.32941177" fill-rule="evenodd" stroke="none"/>
    <path d="M-115.35 -136.15 L-115.65 -136.15 -115.35 -136.3 -115.35 -136.15" fill="#a13d3d" fill-opacity="0.88235295" fill-rule="evenodd" stroke="none"/>
    <path d="M-91.5 -112.1 L-90.35 -112.5 -90.25 -112.5 -91.5 -112.1" fill="url(#gradient1)" fill-rule="evenodd" stroke="none"/>
    <path d="M-100.4 -179.2 Q-92.0 -174.9 -89.85 -165.35 -87.6 -156.15 -92.95 -147.15 -98.45 -138.55 -108.0 -135.5 -117.55 -132.55 -125.8 -137.0 -134.25 -141.65 -136.35 -150.9 -138.5 -160.45 -133.25 -169.15 -128.25 -177.65 -118.35 -180.8 -108.9 -183.55 -100.4 -179.2 M-117.6 -175.3 Q-125.75 -172.7 -130.35 -165.45 -135.1 -158.1 -133.2 -150.2 -131.1 -142.6 -124.1 -139.0 -116.75 -135.6 -108.2 -138.05 -99.6 -140.95 -95.05 -148.3 -90.35 -155.5 -92.4 -163.25 -94.15 -171.1 -101.7 -174.65 -108.95 -177.85 -117.6 -175.3" fill="url(#gradient2)" fill-rule="evenodd" stroke="none"/>
    <path d="M-117.6 -175.3 Q-108.95 -177.85 -101.7 -174.65 -94.15 -171.1 -92.4 -163.25 -90.35 -155.5 -95.05 -148.3 -99.6 -140.95 -108.2 -138.05 -116.75 -135.6 -124.1 -139.0 -131.1 -142.6 -133.2 -150.2 -135.1 -158.1 -130.35 -165.45 -125.75 -172.7 -117.6 -175.3 M-104.3 -159.5 Q-105.75 -165.0 -109.4 -168.05 -112.95 -171.0 -116.6 -170.05 -120.4 -169.0 -121.85 -164.15 -123.6 -159.4 -122.2 -153.75 -120.75 -148.2 -117.05 -145.15 -113.65 -142.0 -109.9 -143.15 -106.25 -144.25 -104.7 -149.15 -103.0 -153.85 -104.3 -159.5" fill="url(#gradient3)" fill-rule="evenodd" stroke="none"/>
    <path d="M-104.3 -159.5 Q-103.0 -153.85 -104.7 -149.15 -106.25 -144.25 -109.9 -143.15 -113.65 -142.0 -117.05 -145.15 -120.75 -148.2 -122.2 -153.75 -123.6 -159.4 -121.85 -164.15 -120.4 -169.0 -116.6 -170.05 -112.95 -171.0 -109.4 -168.05 -105.75 -165.0 -104.3 -159.5" fill="#3c0c00" fill-rule="evenodd" stroke="none"/>
    <path d="M-101.65 -148.6 L-101.65 -148.65 Q-104.1 -142.45 -109.3 -140.95 -114.75 -139.25 -119.35 -142.95 L-119.3 -142.9 Q-124.05 -146.25 -125.7 -152.65 -127.4 -159.05 -124.9 -164.6 L-124.85 -164.65 Q-122.7 -170.75 -117.15 -172.2 -111.95 -173.7 -107.15 -170.2 -102.45 -166.9 -100.8 -160.6 -99.35 -154.1 -101.65 -148.6" fill="#3d0b00" fill-opacity="0.3764706" fill-rule="evenodd" stroke="none"/>
    <path d="M-120.95 -150.45 Q-120.95 -153.45 -118.65 -152.0 -116.25 -150.75 -116.35 -148.05 -116.25 -147.3 -116.45 -147.15 L-117.5 -147.1 Q-119.05 -147.15 -120.05 -148.4 -120.9 -149.6 -120.95 -150.45 M-116.95 -154.85 Q-117.1 -158.0 -112.65 -155.4 -108.25 -152.55 -108.25 -151.55 L-108.35 -150.85 Q-108.8 -150.25 -110.5 -150.35 -114.6 -150.6 -116.95 -154.85 M-130.1 -170.45 Q-129.25 -173.35 -125.45 -172.1 -121.75 -171.05 -122.6 -168.3 -123.4 -165.75 -127.15 -166.6 -129.05 -167.05 -129.8 -168.55 -130.3 -169.95 -130.1 -170.45" fill="#ffffff" fill-opacity="0.76862746" fill-rule="evenodd" stroke="none"/>
    <path d="M-130.1 -170.45 Q-130.3 -169.95 -129.8 -168.55 -129.05 -167.05 -127.15 -166.6 -123.4 -165.75 -122.6 -168.3 -121.75 -171.05 -125.45 -172.1 -129.25 -173.35 -130.1 -170.45 M-127.3 -165.15 Q-130.75 -165.0 -132.75 -167.1 -136.0 -169.85 -135.05 -173.9 -133.85 -177.85 -128.2 -176.65 -117.45 -172.9 -120.85 -165.15 -123.95 -164.95 -127.3 -165.15" fill="#ffffff" fill-opacity="0.4117647" fill-rule="evenodd" stroke="none"/>
  </g>
  <defs>
    <radialGradient cx="0" cy="0" fx="448.0" fy="0" gradientTransform="matrix(-0.0256, -0.0379, -0.0473, 0.0236, -107.2, -148.85)" gradientUnits="userSpaceOnUse" id="gradient0" r="819.2" spreadMethod="pad">
      <stop offset="0.24313725490196078" stop-color="#ffffff"/>
      <stop offset="0.7607843137254902" stop-color="#dec1d7"/>
      <stop offset="1.0" stop-color="#cc709c"/>
    </radialGradient>
    <radialGradient cx="0" cy="0" fx="448.0" fy="0" gradientTransform="matrix(-0.0256, -0.0379, -0.0473, 0.0236, -107.2, -148.85)" gradientUnits="userSpaceOnUse" id="gradient1" r="819.2" spreadMethod="pad">
      <stop offset="0.24313725490196078" stop-color="#ffffff"/>
      <stop offset="0.7607843137254902" stop-color="#ddccc1"/>
      <stop offset="1.0" stop-color="#cc8a70"/>
    </radialGradient>
    <linearGradient gradientTransform="matrix(0.0025, 0.0259, -0.0289, 0.007, -112.95, -157.45)" gradientUnits="userSpaceOnUse" id="gradient2" spreadMethod="pad" x1="-819.2" x2="819.2">
      <stop offset="0.0" stop-color="#874e66" stop-opacity="0.42352942"/>
      <stop offset="1.0" stop-color="#ffffff"/>
    </linearGradient>
    <radialGradient cx="0" cy="0" gradientTransform="matrix(-0.0298, 0.0091, 0.0061, 0.029, -106.7, -156.15)" gradientUnits="userSpaceOnUse" id="gradient3" r="819.2" spreadMethod="pad">
      <stop offset="0.0" stop-color="#730187"/>
      <stop offset="0.6313725490196078" stop-color="#aa00ff"/>
      <stop offset="1.0" stop-color="#ff00e1"/>
    </radialGradient>
  </defs>
</svg>
