<?xml version="1.0" encoding="UTF-8" standalone="no"?>
<svg xmlns:xlink="http://www.w3.org/1999/xlink" height="4.35px" width="12.15px" xmlns="http://www.w3.org/2000/svg">
  <g transform="matrix(1.0, 0.0, 0.0, 1.0, 0.0, 0.35)">
    <path d="M5.5 2.7 L6.05 2.7 5.9 2.95 5.5 3.25 5.25 3.05 5.45 2.75 5.5 2.7" fill="#cca9a9" fill-rule="evenodd" stroke="none"/>
    <path d="M11.25 -0.1 L12.15 -0.1 11.6 0.35 11.1 0.6 10.7 0.15 10.4 -0.35 11.25 -0.1 M9.35 0.75 L9.5 0.8 Q8.45 1.7 7.2 2.05 L7.05 2.1 6.6 2.2 6.05 2.25 5.5 2.25 5.05 2.3 4.7 2.25 3.35 2.0 3.25 1.95 Q2.0 1.4 1.0 1.35 L1.0 1.3 1.1 1.3 1.65 1.1 2.75 0.75 2.8 0.75 2.0 1.1 2.0 1.15 3.0 1.45 3.15 1.45 3.35 1.5 3.75 1.6 3.85 1.6 4.0 1.65 4.35 1.7 5.8 1.85 6.95 1.65 7.1 1.6 8.0 1.25 8.8 0.9 8.65 0.6 9.0 0.7 9.35 0.75 M6.05 2.7 L6.6 2.65 6.45 2.7 6.45 2.75 6.05 3.45 Q5.3 4.0 5.0 4.0 L4.05 3.4 5.0 2.85 5.25 2.75 5.05 2.75 5.5 2.7 5.45 2.75 5.25 3.05 5.5 3.25 5.9 2.95 6.05 2.7" fill="#c7a3a3" fill-opacity="0.5529412" fill-rule="evenodd" stroke="none"/>
    <path d="M8.65 0.6 L8.8 0.9 8.0 1.25 7.7 1.0 7.1 1.15 6.7 1.25 Q6.65 1.45 6.95 1.65 L5.8 1.85 4.35 1.7 4.4 1.2 Q4.15 1.25 4.0 1.65 L3.85 1.6 3.75 1.6 3.85 1.2 3.6 1.0 Q3.05 1.05 3.05 1.4 L3.0 1.45 2.0 1.15 2.0 1.1 2.8 0.75 5.15 1.1 5.55 1.2 6.0 1.05 8.4 0.5 8.65 0.6" fill="#c7a3a3" fill-opacity="0.28235295" fill-rule="evenodd" stroke="none"/>
    <path d="M9.5 0.8 L9.35 0.75 9.0 0.7 8.65 0.6 8.4 0.5 6.0 1.05 5.55 1.2 5.15 1.1 2.8 0.75 2.75 0.75 1.65 1.1 1.1 1.25 0.95 1.2 0.85 1.2 0.35 1.4 0.15 1.3 0.15 1.25 0.0 0.75 0.35 0.9 0.6 0.95 0.65 1.0 Q0.55 0.95 1.4 0.45 L2.65 -0.1 5.65 0.2 8.45 -0.35 9.9 0.4 10.4 0.75 10.0 0.8 9.6 0.8 9.5 0.8" fill="url(#gradient0)" fill-rule="evenodd" stroke="none"/>
    <path d="M9.5 0.8 L9.35 0.75 M9.0 0.7 L8.65 0.6 8.4 0.5 6.0 1.05 5.55 1.2 5.15 1.1 2.8 0.75 2.75 0.75 1.65 1.1 M9.5 0.8 L9.6 0.8 10.0 0.8 10.4 0.75 M0.0 0.75 L0.15 1.25 0.15 1.3 0.35 1.4 0.85 1.2 0.95 1.2 1.1 1.25 1.65 1.1" fill="none" stroke="#a36a6a" stroke-linecap="round" stroke-linejoin="round" stroke-opacity="0.49803922" stroke-width="0.05"/>
  </g>
  <defs>
    <linearGradient gradientTransform="matrix(0.0, -0.0012, 0.0067, -3.0E-4, 5.5, 0.7)" gradientUnits="userSpaceOnUse" id="gradient0" spreadMethod="pad" x1="-819.2" x2="819.2">
      <stop offset="0.0" stop-color="#e0cbcb"/>
      <stop offset="1.0" stop-color="#a36a6a"/>
    </linearGradient>
  </defs>
</svg>
