<?xml version="1.0" encoding="UTF-8" standalone="no"?>
<svg xmlns:xlink="http://www.w3.org/1999/xlink" height="193.1px" width="246.75px" xmlns="http://www.w3.org/2000/svg">
  <g transform="matrix(1.0, 0.0, 0.0, 1.0, 146.4, 66.9)">
    <path d="M31.85 -30.25 Q29.7 -29.65 29.55 -31.8 29.35 -35.1 32.75 -35.45 37.95 -31.9 31.85 -30.25 M100.25 -65.15 L100.35 -64.85 Q100.3 -64.0 99.65 -63.3 L98.75 -62.75 Q97.75 -62.5 96.9 -63.1 95.05 -65.25 97.5 -66.6 L98.2 -66.9 Q99.95 -66.7 100.25 -65.15 M93.55 -14.8 Q91.75 -13.95 90.9 -15.75 89.05 -20.0 94.0 -21.05 100.0 -17.9 93.55 -14.8 M45.05 44.2 Q45.7 44.2 46.2 44.65 46.65 45.1 46.65 45.75 46.65 46.4 46.2 46.85 45.7 47.3 45.05 47.3 44.4 47.3 43.95 46.85 43.45 46.4 43.45 45.75 43.45 45.1 43.95 44.65 44.4 44.2 45.05 44.2 M21.85 27.5 Q18.2 32.3 14.65 27.05 12.45 23.8 15.75 21.55 17.15 20.6 18.65 20.4 26.05 22.05 21.85 27.5 M28.6 68.55 Q26.45 70.05 25.3 67.35 23.65 63.35 28.15 62.05 33.8 65.05 28.6 68.55 M-118.15 -56.8 L-118.4 -56.95 Q-118.75 -57.8 -117.95 -58.15 L-117.6 -58.25 Q-115.75 -56.75 -118.15 -56.8 M-43.25 -36.7 Q-45.05 -38.85 -42.65 -40.2 L-41.9 -40.5 Q-40.2 -40.3 -39.85 -38.75 L-39.8 -38.45 Q-39.85 -37.6 -40.45 -36.9 -40.85 -36.5 -41.4 -36.35 -42.35 -36.1 -43.25 -36.7 M-29.45 -18.35 Q-29.45 -17.55 -30.0 -17.0 -30.55 -16.45 -31.35 -16.45 -32.15 -16.45 -32.7 -17.0 -33.25 -17.55 -33.25 -18.35 -33.25 -19.15 -32.7 -19.7 -32.15 -20.25 -31.35 -20.25 -30.55 -20.25 -30.0 -19.7 -29.45 -19.15 -29.45 -18.35 M-4.9 4.5 L-6.8 2.6 Q-5.9 -0.2 -3.2 -0.85 1.9 2.25 -4.05 4.65 -4.5 4.85 -4.9 4.5 M-30.9 17.95 Q-30.35 18.5 -30.35 19.35 -30.35 20.2 -30.9 20.8 -31.5 21.35 -32.35 21.35 -33.2 21.35 -33.75 20.8 -34.35 20.2 -34.35 19.35 -34.35 18.5 -33.75 17.95 -33.2 17.35 -32.35 17.35 -31.5 17.35 -30.9 17.95 M-142.3 58.6 Q-142.3 59.4 -142.9 59.95 -143.5 60.5 -144.35 60.5 -145.2 60.5 -145.8 59.95 -146.4 59.4 -146.4 58.6 -146.4 57.8 -145.8 57.25 -145.2 56.7 -144.35 56.7 -143.5 56.7 -142.9 57.25 -142.3 57.8 -142.3 58.6 M-61.9 123.5 Q-61.45 123.95 -61.45 124.6 -61.45 125.25 -61.9 125.75 L-63.05 126.2 Q-63.7 126.2 -64.15 125.75 -64.65 125.25 -64.65 124.6 -64.65 123.95 -64.15 123.5 -63.7 123.0 -63.05 123.0 -62.4 123.0 -61.9 123.5" fill="#ffffff" fill-opacity="0.49803922" fill-rule="evenodd" stroke="none"/>
    <path d="M-63.45 125.05 L-63.4 125.0 -63.45 125.0 -63.45 125.05 M-63.7 124.65 L-63.5 125.1 -63.15 125.3 -63.35 125.85 -64.3 124.9 -63.7 124.65 M-63.5 124.15 L-63.75 124.5 -64.3 124.3 -63.35 123.35 -63.1 123.95 -63.5 124.15 -62.55 124.15 -62.55 125.1 -62.35 124.7 -61.8 124.9 -62.75 125.85 -63.0 125.25 -62.55 125.1 -63.5 125.1 -63.55 124.6 -63.5 124.15 M-62.65 125.0 L-62.65 125.05 -62.6 125.0 -62.65 125.0 M-62.65 124.2 L-62.65 124.25 -62.6 124.2 -62.65 124.2 M-62.35 124.5 L-62.55 124.15 -63.0 123.95 -62.75 123.35 -61.8 124.3 -62.35 124.5 M-31.65 18.7 L-31.65 20.05 -33.0 20.05 -33.0 18.7 -31.65 18.7 M-31.35 -19.15 L-30.75 -18.9 -30.55 -18.35 -30.75 -17.75 -31.35 -17.55 -31.9 -17.75 -32.15 -18.35 -31.9 -18.9 -31.35 -19.15 M-42.5 -39.0 L-41.9 -39.25 -41.3 -39.0 -41.05 -38.4 Q-41.05 -38.05 -41.3 -37.8 L-41.9 -37.55 -42.5 -37.8 -42.75 -38.4 -42.5 -39.0 M-117.9 -57.5 L-117.9 -57.45 -117.95 -57.5 -117.9 -57.5 M-117.4 -57.7 L-117.6 -57.3 -117.8 -57.7 -117.4 -57.7 M-117.6 -57.8 L-117.6 -57.85 -117.55 -57.8 -117.6 -57.8 M27.45 65.6 L27.6 65.25 Q27.7 65.1 27.9 65.1 28.1 65.1 28.25 65.25 L28.35 65.6 28.25 65.95 27.9 66.1 27.6 65.95 27.45 65.6 M18.6 23.35 Q19.3 23.35 19.85 23.9 20.35 24.4 20.35 25.1 20.35 25.8 19.85 26.35 19.3 26.85 18.6 26.85 17.9 26.85 17.4 26.35 16.85 25.8 16.85 25.1 16.85 24.4 17.4 23.9 17.9 23.35 18.6 23.35 M45.65 45.75 L45.55 46.2 44.6 46.2 44.45 45.75 44.6 45.35 45.55 45.35 45.65 45.75 M93.9 -18.0 L93.95 -17.8 93.9 -17.6 93.7 -17.5 93.55 -17.6 93.45 -17.8 93.55 -18.0 93.7 -18.1 93.9 -18.0 M97.65 -65.4 L98.25 -65.65 98.85 -65.4 99.1 -64.8 98.85 -64.2 Q98.6 -63.95 98.25 -63.95 97.9 -63.95 97.65 -64.2 97.4 -64.45 97.4 -64.8 L97.65 -65.4 M32.2 -32.6 L32.2 -33.05 32.6 -33.05 32.6 -32.6 32.2 -32.6" fill="#ffffff" fill-rule="evenodd" stroke="none"/>
  </g>
</svg>
