<?xml version="1.0" encoding="UTF-8" standalone="no"?>
<svg xmlns:xlink="http://www.w3.org/1999/xlink" height="27.1px" width="57.45px" xmlns="http://www.w3.org/2000/svg">
  <g transform="matrix(1.0, 0.0, 0.0, 1.0, 28.7, 13.55)">
    <path d="M14.8 -3.9 L14.75 -2.85 14.7 1.85 14.8 6.0 9.95 7.7 9.8 2.8 Q9.75 -1.8 10.35 -4.0 L14.8 -3.9 M-18.1 -6.95 L-11.0 -5.7 -22.55 6.65 -24.75 5.65 -21.45 -0.35 -18.1 -6.95" fill="#d2b6b6" fill-rule="evenodd" stroke="none"/>
    <path d="M14.8 6.0 L14.7 1.85 14.75 -2.85 14.8 -3.9 19.0 -3.9 19.25 -3.85 19.4 -1.65 19.7 3.4 18.65 4.0 14.8 6.0 M-20.85 -7.55 L-18.1 -6.95 -21.45 -0.35 -24.75 5.65 -25.45 5.3 Q-28.05 3.85 -28.7 2.3 L-28.6 2.2 -20.85 -7.55" fill="#e0cdcd" fill-rule="evenodd" stroke="none"/>
    <path d="M14.8 -3.9 L10.35 -4.0 -11.0 -5.7 -18.1 -6.95 -20.85 -7.55 -19.6 -9.1 -16.75 -12.45 -12.95 -12.45 4.95 -12.6 21.65 -13.55 Q23.4 -11.5 25.15 -8.45 L26.1 -6.7 20.1 -4.15 Q20.1 -3.75 19.8 -3.8 L19.25 -3.85 19.25 -3.9 19.0 -3.9 14.8 -3.9 M-17.55 -8.25 L-17.8 -8.25 -17.75 -7.7 -17.55 -8.25" fill="#b38484" fill-rule="evenodd" stroke="none"/>
    <path d="M19.7 3.4 L19.4 -1.65 19.25 -3.85 19.8 -3.8 Q20.1 -3.75 20.1 -4.15 L26.1 -6.7 28.75 -1.75 19.7 3.4" fill="#f2eaea" fill-rule="evenodd" stroke="none"/>
    <path d="M10.35 -4.0 Q9.75 -1.8 9.8 2.8 L9.95 7.7 9.35 7.85 -1.95 11.3 Q-8.65 13.3 -11.4 13.55 L-9.4 3.15 -8.35 0.0 -16.9 8.9 -18.75 8.2 -22.55 6.65 -11.0 -5.7 10.35 -4.0 M19.25 -3.85 L19.0 -3.9 19.25 -3.9 19.25 -3.85 M-17.55 -8.25 L-17.75 -7.7 -17.8 -8.25 -17.55 -8.25 M-8.35 0.0 L-8.2 -0.15 -8.2 -0.4 -8.35 0.0" fill="#c29c9c" fill-rule="evenodd" stroke="none"/>
    <path d="M9.95 7.7 L14.8 6.0 18.65 4.0 19.7 3.4 M26.1 -6.7 L25.15 -8.45 Q23.4 -11.5 21.65 -13.55 L4.95 -12.6 -12.95 -12.45 -16.75 -12.45 -19.6 -9.1 -20.85 -7.55 M26.1 -6.7 L28.75 -1.75 19.7 3.4 M9.95 7.7 L9.35 7.85 -1.95 11.3 Q-8.65 13.3 -11.4 13.55 L-9.4 3.15 -8.35 0.0 -16.9 8.9 -18.75 8.2 -22.55 6.65 -24.75 5.65 -25.45 5.3 Q-28.05 3.85 -28.7 2.3 L-28.6 2.2 -20.85 -7.55 M-8.35 0.0 L-8.2 -0.4 -8.2 -0.15 -8.35 0.0" fill="none" stroke="#a36a6a" stroke-linecap="round" stroke-linejoin="round" stroke-opacity="0.4" stroke-width="0.05"/>
  </g>
</svg>
