<?xml version="1.0" encoding="UTF-8" standalone="no"?>
<svg xmlns:xlink="http://www.w3.org/1999/xlink" height="27.5px" width="37.25px" xmlns="http://www.w3.org/2000/svg">
  <g transform="matrix(1.0, 0.0, 0.0, 1.0, -4.05, -9.75)">
    <path d="M23.25 22.5 Q23.25 23.2 22.65 24.05 21.9 25.1 20.9 25.1 17.85 25.1 15.2 22.35 12.5 18.95 10.95 17.6 9.75 18.6 8.6 20.95 7.35 23.45 7.35 25.35 7.35 26.5 8.1 28.0 8.85 29.5 8.85 30.3 8.85 31.3 8.25 31.85 L8.85 33.15 9.15 34.65 Q9.15 35.95 8.85 36.5 8.45 37.25 7.4 37.25 6.05 37.25 5.3 34.65 L5.5 34.55 Q5.85 34.35 5.85 33.8 L5.45 31.9 4.8 29.45 Q4.05 26.1 4.05 23.15 4.05 20.1 4.4 18.75 4.8 17.35 6.6 13.7 7.5 11.85 11.4 10.75 14.85 9.75 19.2 9.75 41.3 9.75 41.3 24.5 41.3 26.55 40.25 31.4 L40.1 31.4 Q39.9 24.6 35.1 18.65 30.7 21.65 26.9 21.65 L24.25 21.75 23.0 21.5 22.95 21.45 22.7 20.95 Q22.6 21.35 22.95 21.5 L23.0 21.5 23.25 22.5" fill="#000000" fill-opacity="0.16078432" fill-rule="evenodd" stroke="none"/>
  </g>
</svg>
