<?xml version="1.0" encoding="UTF-8" standalone="no"?>
<svg xmlns:xlink="http://www.w3.org/1999/xlink" height="81.2px" width="151.9px" xmlns="http://www.w3.org/2000/svg">
  <g transform="matrix(1.0, 0.0, 0.0, 1.0, 0.0, 52.9)">
    <path d="M8.2 -52.9 L8.25 -52.9 8.2 -52.65 8.2 -52.9" fill="#8f7b65" fill-rule="evenodd" stroke="none"/>
    <path d="M2.0 28.3 L0.0 28.3 0.0 4.55 Q0.0 -5.45 10.0 -5.45 L141.9 -5.45 Q151.9 -5.45 151.9 4.55 L151.9 28.3 149.9 28.3 149.9 4.55 Q149.9 -3.45 141.9 -3.45 L10.0 -3.45 Q2.0 -3.45 2.0 4.55 L2.0 28.3" fill="#1a1612" fill-rule="evenodd" stroke="none"/>
    <path d="M2.0 28.3 L2.0 4.55 Q2.0 -3.45 10.0 -3.45 L141.9 -3.45 Q149.9 -3.45 149.9 4.55 L149.9 28.3 147.9 28.3 147.9 4.55 Q147.9 -1.45 141.9 -1.45 L10.0 -1.45 Q4.0 -1.45 4.0 4.55 L4.0 28.3 2.0 28.3 M143.9 28.3 L8.0 28.3 8.0 4.55 Q8.0 2.55 10.0 2.55 L141.9 2.55 Q143.9 2.55 143.9 4.55 L143.9 28.3" fill="#8f7b65" fill-rule="evenodd" stroke="none"/>
    <path d="M147.9 28.3 L143.9 28.3 143.9 4.55 Q143.9 2.55 141.9 2.55 L10.0 2.55 Q8.0 2.55 8.0 4.55 L8.0 28.3 4.0 28.3 4.0 4.55 Q4.0 -1.45 10.0 -1.45 L141.9 -1.45 Q147.9 -1.45 147.9 4.55 L147.9 28.3" fill="#675949" fill-rule="evenodd" stroke="none"/>
  </g>
</svg>
