<?xml version="1.0" encoding="UTF-8" standalone="no"?>
<svg xmlns:xlink="http://www.w3.org/1999/xlink" height="201.7px" width="218.55px" xmlns="http://www.w3.org/2000/svg">
  <g transform="matrix(1.0, 0.0, 0.0, 1.0, 264.0, 293.85)">
    <path d="M-163.95 -177.45 L-172.65 -176.45 Q-177.6 -176.15 -180.25 -176.3 L-181.65 -176.35 -175.35 -175.05 -169.1 -174.7 -161.95 -175.45 -161.9 -174.45 -161.1 -172.55 -161.1 -172.5 Q-161.05 -172.55 -160.95 -172.4 L-160.9 -172.3 -161.0 -172.35 -161.15 -172.4 -161.3 -172.5 Q-162.25 -173.05 -163.4 -173.35 L-162.6 -172.45 -162.3 -172.6 -162.25 -172.1 -162.25 -171.9 -162.2 -171.8 -161.7 -171.1 Q-160.7 -169.35 -160.6 -168.8 L-166.5 -168.45 -174.35 -168.35 Q-182.8 -167.8 -186.2 -163.45 L-187.1 -163.2 -187.7 -163.05 -187.65 -162.95 -188.25 -162.55 -186.25 -159.85 -185.1 -157.8 -182.85 -156.0 -182.8 -156.0 -183.05 -156.55 -183.45 -157.6 Q-178.85 -156.1 -170.45 -156.55 L-168.2 -156.75 Q-167.0 -156.85 -166.2 -157.4 L-165.95 -157.45 -166.0 -157.3 -166.1 -157.25 -166.95 -156.5 -167.6 -156.1 -167.8 -155.8 -168.0 -153.85 -168.0 -153.7 Q-170.1 -150.75 -170.2 -149.45 -169.4 -149.45 -166.6 -150.9 L-163.4 -152.7 -165.7 -142.45 Q-166.1 -140.6 -166.7 -139.1 L-167.0 -138.8 -168.1 -137.75 Q-170.25 -135.7 -170.95 -134.2 L-170.15 -134.7 -168.9 -135.15 Q-166.0 -136.5 -165.05 -137.05 -165.35 -136.8 -165.7 -135.2 L-166.0 -133.05 Q-165.85 -130.8 -163.85 -130.4 L-161.35 -130.15 -159.5 -130.05 -159.25 -130.05 -157.4 -129.55 -156.15 -128.85 -155.35 -128.15 -157.8 -128.75 -162.25 -129.6 Q-165.1 -128.4 -169.0 -128.3 L-173.1 -128.15 -171.55 -129.85 -170.35 -131.15 -173.0 -130.3 -173.15 -130.2 -173.3 -130.15 -174.35 -129.8 -175.05 -129.6 -175.15 -129.55 -176.4 -129.1 -176.45 -129.25 -177.7 -128.7 -176.5 -127.75 -173.9 -128.15 -173.4 -128.0 -173.3 -127.95 -169.6 -127.5 -162.1 -127.3 -154.6 -125.75 -149.25 -125.0 -148.2 -125.0 -147.15 -125.35 -146.95 -125.4 -133.0 -130.0 -133.0 -129.95 -132.85 -129.95 -132.3 -129.9 -132.8 -130.05 -125.4 -132.45 -132.25 -131.65 -138.7 -130.5 -139.45 -130.3 -140.8 -129.85 -145.7 -128.4 Q-145.35 -130.1 -141.15 -130.95 -136.35 -131.85 -136.5 -134.8 -136.55 -135.8 -137.1 -137.5 L-133.1 -138.1 -132.1 -138.4 -131.2 -138.2 -131.8 -138.5 -136.1 -141.0 -141.85 -147.4 Q-141.9 -147.95 -140.35 -149.95 -138.65 -152.1 -138.1 -153.3 L-135.35 -152.7 Q-132.9 -152.15 -132.3 -151.4 -133.75 -154.3 -134.95 -156.1 -133.65 -155.45 -132.4 -155.25 L-132.4 -155.55 -135.0 -158.4 Q-126.3 -159.25 -120.25 -162.55 L-122.6 -156.6 Q-118.95 -159.6 -117.3 -166.85 L-118.2 -167.2 -117.8 -168.3 -117.65 -168.6 -116.45 -167.7 -115.4 -170.15 -115.25 -170.6 Q-115.15 -171.05 -115.2 -172.25 -115.2 -172.65 -116.1 -174.45 -117.05 -176.3 -117.1 -177.15 L-117.05 -178.1 -116.65 -181.7 -116.55 -182.05 -111.45 -181.3 -112.6 -178.55 -112.85 -178.3 -113.3 -177.65 -114.25 -176.0 -112.55 -175.3 -112.35 -173.55 Q-112.15 -170.25 -112.95 -165.2 L-113.5 -162.3 -114.95 -154.95 -115.05 -154.3 -115.0 -153.25 Q-114.45 -153.1 -113.95 -153.95 L-113.7 -153.9 Q-113.7 -153.05 -114.65 -150.4 L-113.3 -151.1 Q-112.05 -151.7 -110.85 -153.0 -111.35 -149.65 -111.75 -148.25 L-112.35 -144.6 Q-112.7 -141.15 -112.5 -136.1 -112.05 -125.3 -112.3 -121.7 L-112.4 -120.95 -112.45 -120.45 Q-118.4 -109.45 -124.05 -103.3 -128.85 -98.1 -135.65 -93.85 L-137.95 -93.3 Q-142.55 -92.2 -144.2 -92.2 L-154.8 -92.85 -158.35 -93.65 -160.1 -94.5 -165.85 -97.75 Q-169.35 -99.95 -172.25 -102.65 -177.9 -107.5 -184.05 -116.25 L-185.2 -117.85 -185.85 -118.8 -186.15 -120.95 -186.7 -126.95 -187.25 -134.1 -187.5 -137.75 -187.8 -140.1 -188.7 -144.25 -188.7 -144.3 -188.55 -144.3 -186.05 -142.3 Q-186.0 -145.05 -186.8 -148.2 -187.5 -151.4 -188.8 -155.0 L-190.7 -160.5 Q-191.8 -164.4 -191.95 -167.3 L-191.6 -171.9 -191.4 -174.2 -191.3 -175.8 -192.55 -178.9 -188.15 -178.25 -188.15 -177.95 -188.45 -174.35 -188.85 -172.2 Q-189.55 -168.0 -189.5 -166.45 -189.45 -165.9 -187.8 -163.95 L-187.45 -164.35 -185.2 -166.7 -185.9 -167.65 Q-186.4 -168.25 -186.45 -169.05 L-186.15 -170.8 -185.8 -172.6 -186.2 -174.45 -187.4 -178.2 Q-183.0 -177.95 -177.6 -178.2 -171.25 -178.55 -164.7 -179.8 L-162.25 -180.35 -160.35 -180.7 -161.65 -179.55 Q-162.35 -178.85 -162.95 -178.4 L-163.95 -177.45 M-131.2 -138.2 L-131.0 -138.1 -130.8 -138.1 -131.2 -138.2 M-170.95 -134.2 L-171.25 -134.1 -171.05 -134.1 -170.95 -134.2 M-158.45 -176.05 L-152.1 -177.3 -148.25 -178.2 -143.75 -179.25 -132.65 -181.35 -139.65 -181.25 -141.55 -181.1 -146.9 -180.45 -147.45 -180.35 -144.95 -182.3 -144.95 -182.55 -144.8 -182.55 -144.5 -182.45 -143.3 -182.5 -139.7 -182.5 -126.6 -182.75 -117.4 -182.15 -119.2 -178.0 -119.6 -177.0 Q-119.55 -176.0 -118.9 -174.8 -118.15 -173.55 -118.15 -173.15 L-119.0 -170.5 -129.05 -169.3 -144.7 -165.7 -145.4 -165.7 -145.4 -168.95 -145.35 -169.2 -145.3 -169.15 -144.15 -172.9 -144.25 -172.95 Q-148.2 -167.5 -149.1 -165.0 -150.15 -162.1 -149.85 -156.55 L-149.3 -153.6 -148.8 -150.8 Q-148.75 -149.7 -147.35 -146.3 L-147.3 -145.85 -147.2 -145.35 Q-146.75 -142.7 -146.65 -141.35 L-146.6 -140.75 -146.3 -139.35 -146.1 -138.2 -145.95 -139.15 -145.95 -139.9 -145.95 -140.1 -144.95 -140.8 Q-143.6 -138.4 -143.5 -136.85 -143.45 -135.95 -144.65 -134.75 L-145.35 -133.95 -146.7 -133.4 -146.6 -133.75 -145.85 -135.7 -146.1 -135.8 -146.95 -135.35 Q-148.0 -134.8 -148.05 -134.8 -149.5 -134.05 -150.35 -134.05 L-152.2 -134.35 -153.15 -134.85 Q-154.75 -135.85 -154.8 -137.45 L-154.8 -137.75 Q-154.8 -139.85 -153.4 -151.3 L-151.9 -163.8 Q-152.0 -166.25 -153.35 -168.65 L-153.4 -168.8 -154.65 -170.7 -155.35 -171.6 -156.95 -173.8 -157.3 -174.4 -158.25 -175.7 -158.35 -175.95 -158.45 -176.05 M-158.9 -164.25 L-158.75 -164.3 -158.75 -164.25 -158.9 -164.25 M-184.25 -157.7 L-184.05 -157.75 -184.0 -157.6 -184.25 -157.7 M-159.95 -134.25 L-160.0 -134.35 Q-161.4 -135.5 -161.45 -136.3 L-160.9 -137.75 -160.3 -138.75 Q-159.05 -140.7 -158.2 -140.75 -157.45 -140.8 -157.0 -139.75 L-157.0 -140.0 -157.0 -140.15 -157.05 -141.85 -157.15 -142.15 -157.1 -142.1 -157.05 -141.85 -157.0 -141.3 -156.8 -140.15 -156.75 -139.75 -156.6 -137.9 -156.7 -137.9 Q-156.75 -138.55 -157.45 -139.6 L-158.55 -137.75 -158.6 -137.7 Q-159.15 -136.6 -159.05 -135.3 -159.05 -134.65 -158.15 -133.6 L-159.75 -134.25 -159.95 -134.25 M-163.45 -135.05 L-163.4 -135.05 -163.5 -134.35 -163.6 -134.8 -163.45 -135.05 M-163.55 -124.8 Q-163.55 -126.9 -165.3 -126.2 -167.1 -125.5 -167.1 -124.2 -167.1 -123.6 -166.7 -123.15 -166.35 -122.75 -165.8 -122.75 -164.85 -122.75 -164.15 -123.6 -163.55 -124.3 -163.55 -124.8 M-182.3 -139.2 L-182.45 -137.75 -183.0 -134.65 -182.95 -133.85 -182.7 -133.25 -182.45 -128.9 -180.25 -121.2 -180.1 -120.95 -178.1 -118.25 -177.4 -117.6 -177.4 -118.05 -177.45 -118.25 -178.35 -120.95 -178.6 -121.55 -179.85 -124.8 Q-181.3 -131.2 -181.5 -134.5 L-181.55 -137.75 Q-181.65 -141.7 -181.85 -142.6 L-182.3 -139.2 M-161.3 -123.95 Q-161.3 -125.1 -162.5 -124.9 -163.7 -124.65 -163.7 -123.6 L-163.65 -122.75 -163.35 -122.5 -162.75 -122.4 Q-162.0 -122.4 -161.6 -123.0 -161.3 -123.45 -161.3 -123.95 M-172.6 -114.1 L-173.65 -116.25 -174.15 -117.25 -174.5 -116.25 -175.95 -109.35 Q-175.9 -107.65 -171.4 -104.45 -169.25 -102.85 -167.7 -102.0 L-167.7 -102.05 -167.95 -102.9 -166.65 -101.45 -165.75 -100.25 -166.15 -101.15 -169.05 -107.0 Q-171.6 -111.95 -172.25 -113.8 L-172.25 -113.9 -172.35 -114.2 -172.5 -114.7 -172.6 -114.1 M-133.5 -125.1 L-133.55 -125.15 Q-136.5 -123.35 -142.1 -121.85 L-146.2 -120.95 -146.95 -120.8 -153.35 -120.25 -155.1 -120.35 -155.7 -120.25 -157.85 -120.4 -159.3 -120.75 -159.3 -120.7 Q-155.4 -118.95 -152.85 -116.25 L-152.35 -115.65 Q-151.0 -114.0 -145.25 -114.0 -141.05 -114.0 -139.8 -114.6 L-137.05 -116.65 -134.1 -119.25 -132.35 -120.95 -131.7 -121.75 Q-131.7 -122.6 -132.6 -123.9 L-133.5 -125.1 M-139.45 -162.5 L-139.25 -162.5 -139.3 -162.45 -139.3 -162.35 -139.45 -162.5 M-138.05 -153.4 L-138.1 -153.3 -138.4 -153.4 -138.05 -153.4 M-116.6 -140.0 L-116.9 -134.05 -117.0 -129.6 Q-117.15 -124.95 -118.55 -121.35 L-118.7 -120.95 -118.8 -120.7 -118.75 -120.65 -118.6 -120.95 -118.45 -121.35 -117.05 -124.05 -116.45 -125.3 -115.65 -126.85 -115.45 -127.85 -115.0 -129.85 Q-114.85 -131.45 -115.0 -132.15 L-115.0 -132.35 -115.7 -136.55 -116.6 -140.0 M-126.35 -134.75 L-126.6 -134.55 -127.2 -134.3 -126.3 -133.8 -124.45 -132.75 -118.65 -134.4 -123.2 -135.1 -128.8 -135.75 Q-128.2 -135.75 -127.35 -135.35 L-126.35 -134.75 M-128.1 -126.7 Q-127.65 -127.4 -127.65 -128.15 -127.65 -130.2 -129.8 -130.2 -131.7 -130.2 -131.95 -128.6 L-132.2 -128.7 Q-133.5 -129.0 -133.5 -127.5 -133.2 -126.2 -132.3 -126.2 -132.05 -126.2 -131.55 -126.55 -131.0 -125.85 -129.8 -125.85 -128.75 -125.85 -128.1 -126.7 M-143.45 -133.15 L-143.6 -133.1 -143.65 -133.15 -143.45 -133.15 M-138.05 -135.6 L-138.25 -135.6 -138.05 -135.75 -138.05 -135.6 M-126.4 -105.6 Q-123.05 -108.0 -121.7 -110.05 -120.3 -112.4 -120.5 -115.7 L-121.65 -120.95 -122.0 -120.95 Q-122.0 -118.3 -122.55 -116.5 L-122.5 -116.4 -123.1 -114.75 -123.6 -113.15 -123.8 -112.8 -124.25 -111.5 Q-125.3 -108.25 -126.45 -105.6 L-126.4 -105.6" fill="#977849" fill-rule="evenodd" stroke="none"/>
    <path d="M-161.95 -175.45 L-169.1 -174.7 -175.35 -175.05 -181.65 -176.35 -180.25 -176.3 Q-177.6 -176.15 -172.65 -176.45 L-163.95 -177.45 -162.05 -177.75 -156.1 -178.85 -147.45 -180.35 -146.9 -180.45 -141.55 -181.1 -139.65 -181.25 -132.65 -181.35 -143.75 -179.25 -148.25 -178.2 -152.1 -177.3 -158.45 -176.05 -158.85 -176.0 -159.75 -175.85 -161.95 -175.45 M-188.7 -144.3 L-188.7 -144.25 -187.8 -140.1 -191.5 -139.9 Q-193.25 -140.65 -193.3 -141.8 L-192.9 -144.25 -192.4 -146.55 -193.65 -148.35 -197.05 -152.95 Q-201.6 -159.05 -201.85 -163.9 -202.0 -167.1 -201.35 -169.6 L-200.55 -171.9 -199.45 -173.75 Q-198.25 -175.15 -196.65 -175.2 -195.85 -175.25 -194.55 -174.25 L-194.6 -174.0 Q-194.8 -172.7 -194.2 -173.95 L-194.4 -172.2 Q-196.45 -172.1 -197.7 -169.55 -199.15 -166.95 -199.0 -164.4 L-198.9 -163.1 -198.6 -161.75 Q-197.9 -158.45 -195.85 -155.8 -194.1 -153.7 -190.7 -151.15 L-189.95 -148.3 -189.2 -146.1 -188.8 -144.7 -188.75 -144.5 -188.7 -144.3 M-112.35 -144.6 L-111.75 -148.25 Q-111.35 -149.65 -110.85 -153.0 L-110.5 -155.7 -110.25 -157.5 -109.45 -158.35 Q-107.2 -160.3 -106.4 -161.95 -104.9 -165.2 -104.75 -167.45 L-104.95 -172.25 Q-105.0 -173.15 -105.7 -174.5 L-105.9 -174.9 -105.9 -174.95 Q-106.6 -176.15 -107.2 -176.1 -107.8 -176.05 -108.8 -174.95 L-108.8 -174.9 -109.9 -178.35 -109.8 -178.45 Q-108.45 -179.85 -107.6 -179.9 -105.95 -180.0 -104.7 -178.75 L-103.3 -177.0 Q-102.35 -175.4 -101.8 -173.4 -101.35 -171.5 -101.25 -169.2 -101.0 -164.35 -104.9 -157.75 L-105.5 -156.7 -108.8 -150.95 -108.1 -148.7 -107.45 -146.3 Q-107.4 -145.15 -109.0 -144.2 -110.5 -143.35 -112.35 -144.6 M-118.2 -167.2 L-117.3 -166.85 Q-118.95 -159.6 -122.6 -156.6 L-120.25 -162.55 Q-126.3 -159.25 -135.0 -158.4 L-132.4 -155.55 -132.4 -155.25 Q-133.65 -155.45 -134.95 -156.1 L-135.65 -156.4 -137.6 -157.45 Q-140.6 -159.35 -142.45 -159.75 L-142.45 -160.05 Q-141.4 -160.1 -140.65 -160.95 L-139.3 -162.35 -139.3 -162.45 -139.25 -162.5 -139.45 -162.5 Q-143.5 -162.5 -145.25 -163.5 -143.75 -163.65 -135.45 -166.0 L-137.55 -164.85 -139.35 -164.2 -139.35 -163.85 -137.35 -163.4 -137.6 -162.6 Q-137.9 -161.6 -138.7 -160.45 L-138.65 -160.0 Q-135.15 -159.8 -132.95 -159.9 -128.85 -160.15 -125.45 -161.6 -124.2 -162.25 -120.3 -164.6 L-120.15 -164.9 Q-120.05 -165.05 -120.1 -165.15 L-119.4 -166.75 -119.25 -166.95 -119.15 -167.25 -119.05 -167.45 -119.5 -167.45 -121.65 -168.15 -122.95 -168.4 -119.5 -167.65 -118.55 -167.3 -118.2 -167.2 M-132.1 -138.4 L-133.1 -138.1 -137.1 -137.5 Q-136.55 -135.8 -136.5 -134.8 -136.35 -131.85 -141.15 -130.95 -145.35 -130.1 -145.7 -128.4 L-145.75 -128.25 -146.95 -127.95 -148.25 -127.7 -149.4 -127.45 -149.45 -127.5 -155.35 -128.15 -156.15 -128.85 -157.4 -129.55 -159.25 -130.05 -159.5 -130.05 -161.35 -130.15 -163.85 -130.4 Q-165.85 -130.8 -166.0 -133.05 L-165.7 -135.2 Q-165.35 -136.8 -165.05 -137.05 -166.0 -136.5 -168.9 -135.15 L-170.15 -134.7 -168.5 -135.7 -166.55 -137.0 -165.4 -137.75 -163.1 -139.05 -162.35 -139.35 -162.55 -138.95 -162.75 -138.3 -162.9 -137.75 -163.45 -135.05 -163.6 -134.8 -163.5 -134.35 Q-163.15 -132.7 -161.05 -132.55 L-160.9 -132.5 -160.0 -132.4 -158.1 -132.35 -157.05 -132.35 -156.85 -132.3 -155.15 -131.35 -154.3 -130.8 -154.05 -130.7 Q-152.5 -129.8 -150.9 -129.9 L-150.75 -129.9 -150.6 -129.9 Q-149.0 -130.0 -147.5 -131.0 L-147.4 -131.2 -146.95 -131.55 -144.7 -133.0 -143.65 -133.15 -143.6 -133.1 -143.45 -133.15 -141.05 -133.55 -140.85 -133.6 -140.8 -133.65 Q-138.7 -134.0 -138.5 -135.7 L-138.5 -136.1 -140.05 -140.15 -140.15 -140.5 -140.1 -140.5 -134.05 -138.9 -132.1 -138.4 M-173.9 -128.15 L-176.5 -127.75 -177.7 -128.7 -176.45 -129.25 -176.4 -129.1 -175.15 -129.55 -175.05 -129.6 -174.35 -129.8 -173.3 -130.15 -173.15 -130.2 -173.0 -130.3 -170.35 -131.15 -171.55 -129.85 -173.1 -128.15 -173.9 -128.15 M-168.0 -153.7 L-168.0 -153.85 -167.8 -155.8 -167.6 -156.1 -166.95 -156.5 -166.1 -157.25 -166.0 -157.3 -165.95 -157.45 -166.2 -157.4 Q-167.0 -156.85 -168.2 -156.75 L-170.45 -156.55 Q-178.85 -156.1 -183.45 -157.6 L-183.05 -156.55 -182.8 -156.0 -182.85 -156.0 -185.1 -157.8 -186.25 -159.85 -188.25 -162.55 -187.65 -162.95 -187.7 -163.05 -187.1 -163.2 -186.2 -163.45 -184.0 -164.0 -183.75 -164.05 -185.35 -163.2 -186.3 -163.1 -186.05 -162.8 -185.05 -161.0 -185.05 -160.95 -184.9 -160.8 -184.75 -160.45 -179.35 -158.25 Q-175.8 -157.25 -171.75 -157.6 L-166.0 -158.6 -166.05 -159.05 -166.7 -159.9 -166.85 -160.1 -167.15 -160.55 -167.7 -161.7 -167.1 -161.9 -165.35 -162.45 Q-164.75 -162.6 -164.65 -162.7 L-167.4 -163.6 -169.95 -164.5 -168.6 -164.45 Q-162.4 -164.2 -158.9 -164.25 L-161.55 -162.6 -164.5 -161.0 Q-162.75 -159.5 -162.7 -159.0 L-162.4 -158.7 -162.05 -158.7 Q-163.0 -158.35 -165.4 -155.2 L-168.15 -151.5 -168.3 -151.5 -168.0 -153.7 M-181.7 -163.6 L-181.4 -163.7 -181.4 -163.65 -181.7 -163.6 M-184.25 -157.7 L-184.0 -157.6 -184.05 -157.75 -184.25 -157.7 M-158.7 -163.3 L-158.3 -151.25 -158.2 -149.5 -157.95 -146.3 -157.25 -142.35 -157.65 -142.5 -158.4 -142.85 -158.55 -142.8 -159.7 -144.75 Q-161.8 -148.05 -161.85 -148.75 -161.9 -149.55 -160.15 -157.35 L-159.95 -158.25 -158.7 -163.3 M-167.95 -102.9 L-168.0 -102.95 -168.05 -103.0 -168.4 -103.45 -170.75 -106.2 Q-173.1 -108.9 -173.1 -109.6 L-172.85 -112.55 -172.7 -113.9 -172.5 -113.85 -172.45 -113.7 -172.25 -113.8 Q-171.6 -111.95 -169.05 -107.0 L-166.15 -101.15 -166.65 -101.45 -167.95 -102.9 M-133.5 -125.1 L-132.6 -123.9 Q-131.7 -122.6 -131.7 -121.75 L-132.35 -120.95 -134.1 -119.25 -137.05 -116.65 -139.8 -114.6 Q-141.05 -114.0 -145.25 -114.0 -151.0 -114.0 -152.35 -115.65 L-152.85 -116.25 Q-155.4 -118.95 -159.3 -120.7 L-159.3 -120.75 -157.85 -120.4 -155.7 -120.25 -153.2 -119.45 Q-151.05 -118.8 -149.7 -118.8 L-146.95 -118.95 Q-143.6 -119.3 -140.8 -120.5 L-139.8 -120.95 Q-136.95 -122.35 -133.5 -125.1 M-144.5 -143.55 L-145.65 -142.95 -145.35 -147.0 -145.45 -150.75 -145.5 -151.95 -145.45 -162.2 -145.0 -159.9 Q-143.0 -152.5 -142.95 -151.8 -142.9 -150.6 -144.5 -143.55 M-126.2 -134.2 L-126.3 -134.25 -126.25 -134.0 -126.15 -134.15 -126.2 -134.2 M-126.35 -134.75 L-127.35 -135.35 Q-128.2 -135.75 -128.8 -135.75 L-123.2 -135.1 -118.65 -134.4 -124.45 -132.75 -126.3 -133.8 -127.2 -134.3 -126.6 -134.55 -126.35 -134.75 M-138.05 -135.6 L-138.05 -135.75 -138.25 -135.6 -138.05 -135.6 M-126.4 -105.6 L-126.45 -105.6 Q-125.3 -108.25 -124.25 -111.5 L-123.8 -112.8 -123.6 -113.15 -123.1 -114.75 -122.5 -116.4 -121.8 -115.0 -120.95 -113.25 -123.25 -110.2 -126.4 -105.6" fill="#856941" fill-rule="evenodd" stroke="none"/>
    <path d="M-163.95 -177.45 L-162.95 -178.4 Q-162.35 -178.85 -161.65 -179.55 L-160.35 -180.7 -162.25 -180.35 -164.7 -179.8 Q-171.25 -178.55 -177.6 -178.2 -183.0 -177.95 -187.4 -178.2 L-187.45 -178.3 -189.05 -183.0 -188.7 -181.3 -188.15 -178.25 -192.55 -178.9 -193.3 -180.75 -194.05 -183.0 Q-193.85 -183.0 -193.9 -183.25 L-192.75 -183.35 -191.9 -183.55 -191.95 -184.4 -192.3 -185.1 -194.45 -188.7 Q-184.95 -187.05 -175.2 -186.0 L-160.2 -184.85 -155.1 -184.6 -152.35 -184.5 -138.25 -185.25 -136.55 -185.45 -135.6 -185.55 -126.75 -187.05 -126.45 -187.15 Q-119.4 -188.65 -112.2 -190.9 L-112.2 -190.6 Q-111.55 -189.75 -110.75 -189.8 -109.7 -189.85 -109.25 -190.3 L-108.4 -190.35 -110.7 -183.55 -111.1 -182.35 -111.45 -181.3 -116.55 -182.05 -116.3 -183.55 -116.0 -185.15 -116.75 -183.55 -117.4 -182.15 -126.6 -182.75 -139.7 -182.5 -143.3 -182.5 -144.5 -182.45 -144.8 -182.55 -144.95 -182.55 -144.95 -182.3 -147.45 -180.35 -156.1 -178.85 -162.05 -177.75 -163.95 -177.45 M-117.65 -168.6 L-117.8 -168.3 -118.2 -167.2 -118.55 -167.3 -119.5 -167.65 -122.95 -168.4 -123.5 -168.4 -123.5 -168.45 -125.7 -168.6 Q-129.35 -168.6 -132.4 -167.45 L-135.3 -166.1 -135.3 -166.05 -135.45 -166.0 Q-143.75 -163.65 -145.25 -163.5 -143.5 -162.5 -139.45 -162.5 L-139.3 -162.35 -140.65 -160.95 Q-141.4 -160.1 -142.45 -160.05 L-142.45 -159.75 Q-140.6 -159.35 -137.6 -157.45 L-135.65 -156.4 -134.95 -156.1 Q-133.75 -154.3 -132.3 -151.4 -132.9 -152.15 -135.35 -152.7 L-138.1 -153.3 Q-138.65 -152.1 -140.35 -149.95 -141.9 -147.95 -141.85 -147.4 L-136.1 -141.0 -141.05 -143.9 -141.4 -143.85 -141.15 -143.75 -140.85 -143.2 -140.5 -142.55 -140.6 -142.45 -141.0 -142.05 Q-142.25 -144.05 -143.2 -144.0 L-144.5 -143.55 Q-142.9 -150.6 -142.95 -151.8 -143.0 -152.5 -145.0 -159.9 L-145.45 -162.2 -145.4 -165.7 -144.7 -165.7 -129.05 -169.3 -119.0 -170.5 -119.35 -169.7 -117.65 -168.6 M-166.7 -139.1 Q-166.1 -140.6 -165.7 -142.45 L-163.4 -152.7 -166.6 -150.9 Q-169.4 -149.45 -170.2 -149.45 -170.1 -150.75 -168.0 -153.7 L-168.3 -151.5 -168.15 -151.5 -165.4 -155.2 Q-163.0 -158.35 -162.05 -158.7 L-162.4 -158.7 -162.7 -159.0 Q-162.75 -159.5 -164.5 -161.0 L-161.55 -162.6 -158.9 -164.25 Q-162.4 -164.2 -168.6 -164.45 L-169.95 -164.5 -170.55 -164.7 -173.85 -165.3 -178.2 -165.7 Q-179.7 -165.7 -182.15 -164.75 L-183.75 -164.05 -184.0 -164.0 -186.2 -163.45 Q-182.8 -167.8 -174.35 -168.35 L-166.5 -168.45 -160.6 -168.8 -160.6 -168.75 -159.95 -166.95 -158.75 -164.3 -158.9 -164.25 -158.75 -164.25 -158.7 -163.3 -159.95 -158.25 -160.15 -157.35 Q-161.9 -149.55 -161.85 -148.75 -161.8 -148.05 -159.7 -144.75 L-158.55 -142.8 -159.75 -143.1 Q-160.65 -143.05 -161.5 -141.35 L-162.8 -142.75 -163.8 -141.8 -166.7 -139.1 M-160.9 -172.3 L-160.95 -172.4 Q-161.05 -172.55 -161.1 -172.5 L-161.1 -172.55 -161.9 -174.45 -161.95 -175.45 -159.75 -175.85 -158.85 -176.0 -158.45 -176.05 -158.35 -175.95 -158.25 -175.7 -157.3 -174.4 -156.95 -173.8 -155.35 -171.6 -154.65 -170.7 -153.4 -168.8 -153.35 -168.65 Q-152.0 -166.25 -151.9 -163.8 L-153.4 -151.3 Q-154.8 -139.85 -154.8 -137.75 L-154.8 -137.45 Q-154.75 -135.85 -153.15 -134.85 L-152.2 -134.35 -150.35 -134.05 Q-149.5 -134.05 -148.05 -134.8 -148.0 -134.8 -146.95 -135.35 L-146.1 -135.8 -145.85 -135.7 -146.6 -133.75 -146.7 -133.4 -146.95 -133.35 -147.95 -133.0 Q-150.15 -132.2 -151.55 -132.1 L-154.3 -132.2 Q-155.8 -132.5 -157.1 -133.1 -157.6 -133.4 -158.15 -133.55 L-158.15 -133.6 Q-159.05 -134.65 -159.05 -135.3 -159.15 -136.6 -158.6 -137.7 L-158.55 -137.75 -157.45 -139.6 Q-156.75 -138.55 -156.7 -137.9 L-156.6 -137.9 -156.6 -137.75 -156.6 -137.6 -156.3 -136.85 -156.2 -137.75 -156.05 -141.25 Q-156.4 -148.6 -156.05 -151.65 -155.6 -155.6 -155.5 -165.05 L-155.55 -165.6 -155.55 -166.1 -155.75 -166.6 -155.85 -166.65 -157.65 -169.45 Q-159.1 -171.25 -160.9 -172.3 M-167.95 -102.9 L-167.7 -102.05 -167.7 -102.0 Q-169.25 -102.85 -171.4 -104.45 -175.9 -107.65 -175.95 -109.35 L-174.5 -116.25 -174.15 -117.25 -173.65 -116.25 -172.6 -114.1 -172.7 -113.9 -172.85 -112.55 -173.1 -109.6 Q-173.1 -108.9 -170.75 -106.2 L-168.4 -103.45 -168.05 -103.0 -168.0 -102.95 -167.95 -102.9 M-138.05 -153.4 L-138.4 -153.4 -138.1 -153.3 -138.05 -153.4 M-122.5 -116.4 L-122.55 -116.5 Q-122.0 -118.3 -122.0 -120.95 L-121.65 -120.95 -120.5 -115.7 Q-120.3 -112.4 -121.7 -110.05 -123.05 -108.0 -126.4 -105.6 L-123.25 -110.2 -120.95 -113.25 -121.8 -115.0 -122.5 -116.4" fill="#8f7146" fill-rule="evenodd" stroke="none"/>
    <path d="M-187.4 -178.2 L-186.2 -174.45 -185.8 -172.6 -186.15 -170.8 -186.45 -169.05 Q-186.4 -168.25 -185.9 -167.65 L-185.2 -166.7 -187.45 -164.35 -187.8 -163.95 Q-189.45 -165.9 -189.5 -166.45 -189.55 -168.0 -188.85 -172.2 L-188.45 -174.35 -188.15 -177.95 -188.15 -178.25 -188.7 -181.3 -189.05 -183.0 -187.45 -178.3 -187.4 -178.2 M-116.55 -182.05 L-116.65 -181.7 -117.05 -178.1 -117.1 -177.15 Q-117.05 -176.3 -116.1 -174.45 -115.2 -172.65 -115.2 -172.25 -115.15 -171.05 -115.25 -170.6 L-115.4 -170.15 -116.45 -167.7 -117.65 -168.6 -119.35 -169.7 -119.0 -170.5 -118.15 -173.15 Q-118.15 -173.55 -118.9 -174.8 -119.55 -176.0 -119.6 -177.0 L-119.2 -178.0 -117.4 -182.15 -116.75 -183.55 -116.0 -185.15 -116.3 -183.55 -116.55 -182.05 M-160.6 -168.8 Q-160.7 -169.35 -161.7 -171.1 L-162.2 -171.8 -162.25 -171.9 -162.25 -172.1 -162.3 -172.6 -162.6 -172.45 -163.4 -173.35 Q-162.25 -173.05 -161.3 -172.5 L-161.15 -172.4 -161.0 -172.35 -160.9 -172.3 Q-159.1 -171.25 -157.65 -169.45 L-155.85 -166.65 -155.75 -166.6 -155.55 -166.1 -155.55 -165.6 -155.5 -165.05 Q-155.6 -155.6 -156.05 -151.65 -156.4 -148.6 -156.05 -141.25 L-156.2 -137.75 -156.3 -136.85 -156.6 -137.6 -156.6 -137.75 -156.6 -137.9 -156.75 -139.75 -156.8 -140.15 -157.0 -141.3 -157.05 -141.85 -157.1 -142.1 -157.15 -142.15 -157.05 -141.85 -157.0 -140.15 -157.0 -140.0 -157.0 -139.75 Q-157.45 -140.8 -158.2 -140.75 -159.05 -140.7 -160.3 -138.75 L-160.9 -137.75 -161.45 -136.3 Q-161.4 -135.5 -160.0 -134.35 L-159.95 -134.25 -160.75 -134.5 -162.45 -134.9 -162.65 -135.35 -161.85 -136.75 -161.35 -137.75 -160.8 -138.9 -158.95 -142.35 -157.65 -142.5 -157.25 -142.35 -157.15 -142.15 -157.1 -142.15 -156.7 -151.15 Q-156.2 -158.7 -156.45 -163.25 L-156.55 -164.0 Q-156.85 -164.8 -157.5 -166.0 L-157.75 -166.6 -158.65 -168.4 -159.3 -169.55 -159.4 -169.65 -159.65 -170.05 -159.4 -169.05 -159.25 -167.8 -159.05 -166.4 -159.0 -166.1 -158.8 -165.7 -158.75 -164.3 -159.95 -166.95 -160.6 -168.75 -160.6 -168.8 M-145.35 -133.95 L-144.65 -134.75 Q-143.45 -135.95 -143.5 -136.85 -143.6 -138.4 -144.95 -140.8 L-145.95 -140.1 -145.75 -141.8 -145.75 -142.05 -145.5 -142.15 -145.35 -142.2 -144.75 -142.4 -144.1 -142.55 Q-143.45 -142.55 -142.0 -139.75 -140.55 -137.05 -140.5 -136.25 L-140.8 -135.6 -141.8 -135.3 -144.85 -134.15 -145.35 -133.95 M-147.35 -146.3 Q-148.75 -149.7 -148.8 -150.8 L-149.3 -153.6 -149.85 -156.55 Q-150.15 -162.1 -149.1 -165.0 -148.2 -167.5 -144.25 -172.95 L-144.15 -172.9 -145.3 -169.15 -145.35 -169.2 -145.4 -168.95 Q-145.8 -167.65 -146.25 -167.35 L-146.35 -167.1 -146.55 -166.65 -146.8 -166.05 -146.95 -165.95 -147.05 -165.6 -147.4 -164.95 Q-148.7 -161.75 -148.3 -159.75 -147.8 -156.75 -147.9 -149.7 L-147.35 -146.3 M-163.55 -124.8 Q-163.55 -124.3 -164.15 -123.6 -164.85 -122.75 -165.8 -122.75 -166.35 -122.75 -166.7 -123.15 -167.1 -123.6 -167.1 -124.2 -167.1 -125.5 -165.3 -126.2 -163.55 -126.9 -163.55 -124.8 M-161.3 -123.95 Q-161.3 -123.45 -161.6 -123.0 -162.0 -122.4 -162.75 -122.4 L-163.35 -122.5 -163.65 -122.75 -163.7 -123.6 Q-163.7 -124.65 -162.5 -124.9 -161.3 -125.1 -161.3 -123.95 M-182.3 -139.2 L-181.85 -142.6 Q-181.65 -141.7 -181.55 -137.75 L-181.5 -134.5 Q-181.3 -131.2 -179.85 -124.8 L-178.6 -121.55 -178.35 -120.95 -177.45 -118.25 -177.4 -118.05 -177.4 -117.6 -178.1 -118.25 -180.1 -120.95 -180.25 -121.2 -182.45 -128.9 -182.7 -133.25 -182.95 -133.85 -183.0 -134.65 -182.45 -137.75 -182.3 -139.2 M-116.6 -140.0 L-115.7 -136.55 -115.0 -132.35 -115.0 -132.15 Q-114.85 -131.45 -115.0 -129.85 L-115.45 -127.85 -115.65 -126.85 -116.45 -125.3 -117.05 -124.05 -118.45 -121.35 -118.6 -120.95 -118.75 -120.65 -118.8 -120.7 -118.7 -120.95 -118.55 -121.35 Q-117.15 -124.95 -117.0 -129.6 L-116.9 -134.05 -116.6 -140.0 M-128.1 -126.7 Q-128.75 -125.85 -129.8 -125.85 -131.0 -125.85 -131.55 -126.55 -132.05 -126.2 -132.3 -126.2 -133.2 -126.2 -133.5 -127.5 -133.5 -129.0 -132.2 -128.7 L-131.95 -128.6 Q-131.7 -130.2 -129.8 -130.2 -127.65 -130.2 -127.65 -128.15 -127.65 -127.4 -128.1 -126.7" fill="#a68451" fill-rule="evenodd" stroke="none"/>
    <path d="M-192.55 -178.9 L-191.3 -175.8 -191.4 -174.2 -191.6 -171.9 -191.95 -167.3 Q-191.8 -164.4 -190.7 -160.5 L-188.8 -155.0 Q-187.5 -151.4 -186.8 -148.2 -186.0 -145.05 -186.05 -142.3 L-188.55 -144.3 -188.6 -144.45 -188.8 -144.7 -189.2 -146.1 -189.95 -148.3 -190.7 -151.15 -192.0 -156.45 -192.35 -157.85 -192.85 -160.2 Q-194.7 -168.25 -194.4 -172.2 L-194.2 -173.95 -194.3 -174.05 -194.55 -174.25 Q-195.85 -175.25 -196.65 -175.2 -198.25 -175.15 -199.45 -173.75 L-200.55 -171.9 -201.35 -169.6 Q-202.0 -169.95 -202.25 -170.85 L-202.4 -172.0 -202.85 -171.8 Q-202.9 -171.0 -203.65 -170.3 L-205.15 -168.65 -205.2 -169.2 -208.25 -165.45 -208.25 -166.0 -207.05 -169.55 -205.55 -173.45 -204.4 -176.4 -204.4 -176.5 -204.6 -176.5 -206.0 -173.4 -209.35 -166.9 -209.6 -171.0 Q-209.65 -172.15 -210.15 -172.8 L-210.35 -173.2 Q-210.7 -173.85 -210.75 -175.0 -210.85 -177.15 -210.0 -179.8 -209.2 -182.25 -208.35 -182.8 L-218.4 -176.5 -218.6 -176.35 -218.4 -176.6 Q-216.05 -178.9 -213.15 -183.55 L-211.35 -186.65 -211.35 -186.7 -211.55 -186.65 -213.45 -184.95 -213.6 -185.25 -212.8 -185.9 -216.85 -184.6 -218.8 -183.8 -219.4 -183.55 -222.45 -182.4 -224.45 -182.3 -222.45 -183.55 -218.9 -186.35 -216.25 -188.65 -212.5 -192.15 -209.05 -191.65 -194.45 -188.7 -192.3 -185.1 -191.95 -184.4 -191.9 -183.55 -192.75 -183.35 -193.9 -183.25 Q-193.85 -183.0 -194.05 -183.0 L-193.3 -180.75 -192.55 -178.9 M-110.85 -153.0 Q-112.05 -151.7 -113.3 -151.1 L-114.65 -150.4 Q-113.7 -153.05 -113.7 -153.9 L-113.75 -153.95 -113.95 -153.95 Q-114.45 -153.1 -115.0 -153.25 L-115.05 -154.3 -114.95 -154.95 -113.5 -162.3 -112.95 -165.2 Q-112.15 -170.25 -112.35 -173.55 L-112.55 -175.3 -114.25 -176.0 -113.3 -177.65 -112.85 -178.3 -112.6 -178.55 -111.45 -181.3 -111.1 -182.35 -110.7 -183.55 -108.4 -190.35 -109.25 -190.3 Q-109.7 -189.85 -110.75 -189.8 -111.55 -189.75 -112.2 -190.6 L-112.1 -190.7 -111.75 -191.1 Q-106.6 -192.8 -101.45 -194.9 L-99.2 -195.85 -93.9 -197.95 -93.5 -197.55 -89.05 -193.35 -83.3 -187.1 -87.15 -188.6 Q-87.15 -188.3 -86.65 -187.95 -86.6 -187.55 -87.25 -187.55 -88.15 -187.5 -89.9 -188.35 -92.0 -189.35 -93.15 -190.9 L-93.35 -190.85 -93.3 -190.0 -90.1 -184.4 -89.65 -183.55 Q-87.75 -180.05 -87.5 -179.0 -88.0 -178.7 -88.8 -179.0 L-89.3 -179.25 -89.65 -178.9 -91.7 -181.2 -93.45 -183.55 -94.4 -184.95 -94.3 -183.55 -94.25 -182.65 Q-93.95 -180.6 -93.65 -180.1 L-93.7 -180.0 Q-94.4 -181.1 -96.15 -183.0 L-96.7 -183.55 -98.7 -185.9 -99.25 -186.6 -99.5 -186.6 -99.45 -185.3 -99.2 -183.55 -98.45 -176.6 -98.25 -175.05 Q-97.85 -173.7 -97.05 -172.55 L-100.95 -176.3 -101.1 -176.25 -101.1 -176.2 -100.9 -174.9 Q-100.85 -174.1 -101.8 -173.4 -102.35 -175.4 -103.3 -177.0 L-104.7 -178.75 Q-105.95 -180.0 -107.6 -179.9 -108.45 -179.85 -109.8 -178.45 L-109.9 -178.35 -108.8 -174.9 -108.45 -173.6 -108.8 -169.75 -108.9 -169.1 -109.65 -162.7 -109.85 -161.15 -110.25 -157.5 -110.5 -155.7 -110.85 -153.0" fill="#382d1d" fill-rule="evenodd" stroke="none"/>
    <path d="M-169.8 -161.5 L-171.05 -160.6 -170.7 -160.6 Q-171.55 -160.05 -172.25 -159.9 L-172.65 -159.85 -174.95 -159.65 -178.1 -160.0 -178.85 -160.4 -179.0 -160.45 -179.25 -160.6 -180.85 -161.4 -180.6 -161.4 -181.25 -162.0 -179.45 -162.5 -179.5 -162.3 -179.2 -161.7 Q-178.75 -161.2 -177.9 -161.2 -177.45 -161.2 -177.15 -161.6 L-176.85 -161.45 -177.0 -160.95 Q-177.0 -160.45 -176.5 -160.45 -176.1 -160.45 -175.85 -160.8 L-175.7 -161.05 -175.15 -161.0 Q-174.35 -161.0 -173.65 -161.75 L-173.1 -162.45 -170.0 -161.6 -169.8 -161.5 M-132.7 -164.6 L-132.65 -164.5 -132.25 -164.15 -131.5 -163.75 -131.55 -163.6 Q-131.65 -162.95 -130.85 -162.95 -130.2 -162.95 -130.1 -163.55 L-129.55 -163.65 Q-129.45 -163.3 -128.95 -163.2 -130.55 -162.4 -132.1 -162.3 L-134.0 -162.6 -134.95 -163.1 -135.15 -163.25 -134.5 -163.4 -132.7 -164.6 M-132.95 -163.8 L-132.8 -163.9 -133.0 -163.9 -132.95 -163.8" fill="#e0c1a1" fill-rule="evenodd" stroke="none"/>
    <path d="M-168.55 -161.1 Q-168.65 -160.7 -168.9 -160.35 -169.7 -159.35 -172.1 -159.15 -177.55 -158.6 -179.85 -159.7 L-182.65 -161.3 -183.0 -161.5 -181.25 -162.0 -180.6 -161.4 -180.85 -161.4 -179.25 -160.6 -179.0 -160.45 -178.85 -160.4 -178.1 -160.0 -174.95 -159.65 -172.65 -159.85 -172.25 -159.9 Q-171.55 -160.05 -170.7 -160.6 L-171.05 -160.6 -169.8 -161.5 -168.55 -161.1 M-122.7 -164.95 L-125.1 -163.2 Q-127.2 -161.75 -132.65 -161.5 -135.85 -161.3 -136.35 -162.95 L-135.55 -163.15 -135.15 -163.25 -134.95 -163.1 -134.0 -162.6 -132.1 -162.3 Q-130.55 -162.4 -128.95 -163.2 L-128.65 -163.2 Q-127.65 -163.2 -127.15 -163.7 -126.8 -164.0 -126.8 -164.4 L-126.8 -164.5 -126.45 -164.55 Q-125.95 -164.75 -125.9 -164.95 L-124.75 -165.0 -122.7 -164.95" fill="#c4a98d" fill-rule="evenodd" stroke="none"/>
    <path d="M-181.7 -163.6 L-181.4 -163.65 -181.4 -163.7 -177.85 -164.2 -178.2 -163.85 -178.3 -163.5 -178.3 -163.25 Q-179.35 -163.15 -179.45 -162.5 L-181.25 -162.0 -183.0 -161.5 -184.45 -162.65 -183.8 -162.95 -181.7 -163.6 M-173.15 -163.8 L-172.7 -163.7 -171.55 -163.4 Q-169.85 -162.9 -168.85 -162.4 L-168.75 -162.3 -168.6 -162.3 -168.6 -162.2 -168.55 -161.65 -168.55 -161.1 -169.8 -161.5 -170.0 -161.6 -173.1 -162.45 -172.95 -163.15 -173.15 -163.8 M-127.95 -167.05 L-124.8 -167.2 -124.05 -167.2 Q-122.2 -167.2 -121.25 -166.55 L-120.9 -166.6 -121.05 -166.4 -122.7 -164.95 -124.75 -165.0 -125.9 -164.95 -125.9 -165.0 -126.0 -165.25 -127.05 -165.1 -127.8 -165.35 -127.75 -165.5 Q-127.5 -165.5 -127.3 -165.65 L-127.05 -165.95 Q-127.05 -166.4 -127.6 -166.4 L-127.7 -166.4 -127.85 -166.85 -127.95 -167.05 M-136.35 -162.95 L-136.45 -163.45 -136.4 -164.05 -136.35 -164.2 -136.1 -164.3 Q-134.8 -165.35 -133.0 -166.0 L-132.9 -166.05 -133.05 -165.55 -132.95 -165.05 -132.7 -164.6 -134.5 -163.4 -135.15 -163.25 -135.55 -163.15 -136.35 -162.95" fill="#a38c75" fill-rule="evenodd" stroke="none"/>
    <path d="M-136.1 -141.0 L-131.8 -138.5 -131.2 -138.2 -132.1 -138.4 -134.05 -138.9 -140.1 -140.5 -140.15 -140.5 -141.0 -142.05 -140.6 -142.45 -140.5 -142.55 -140.85 -143.2 -141.15 -143.75 -141.05 -143.9 -136.1 -141.0 M-170.15 -134.7 L-170.95 -134.2 Q-170.25 -135.7 -168.1 -137.75 L-167.0 -138.8 -166.7 -139.1 -163.8 -141.8 -162.8 -142.75 -161.5 -141.35 -162.35 -139.35 -163.1 -139.05 -165.4 -137.75 -166.55 -137.0 -168.5 -135.7 -170.15 -134.7 M-146.7 -133.4 L-145.35 -133.95 -144.85 -134.15 -141.8 -135.3 -140.8 -135.6 -138.5 -135.7 Q-138.7 -134.0 -140.8 -133.65 L-139.75 -134.85 -139.75 -135.3 -142.35 -134.0 -143.65 -133.15 -144.7 -133.0 -146.95 -131.55 -147.4 -131.2 -147.5 -131.0 Q-149.0 -130.0 -150.6 -129.9 L-150.75 -129.9 -150.9 -129.9 Q-152.5 -129.8 -154.05 -130.7 L-154.3 -130.8 -155.15 -131.35 -156.85 -132.3 -157.05 -132.35 -158.1 -132.35 -160.25 -133.4 -162.25 -134.1 -162.25 -133.65 -161.0 -132.55 -161.05 -132.55 Q-163.15 -132.7 -163.5 -134.35 L-163.4 -135.05 -162.45 -134.9 -160.75 -134.5 -159.95 -134.25 -159.75 -134.25 -158.15 -133.6 -158.15 -133.55 Q-157.6 -133.4 -157.1 -133.1 -155.8 -132.5 -154.3 -132.2 L-151.55 -132.1 Q-150.15 -132.2 -147.95 -133.0 L-146.95 -133.35 -146.7 -133.4 M-181.4 -163.7 L-181.7 -163.6 -183.8 -162.95 -184.45 -162.65 -183.0 -161.5 -182.65 -161.3 -179.85 -159.7 Q-177.55 -158.6 -172.1 -159.15 -169.7 -159.35 -168.9 -160.35 -168.65 -160.7 -168.55 -161.1 L-168.55 -161.65 -168.6 -162.2 -168.6 -162.3 -168.75 -162.3 -168.85 -162.4 Q-169.85 -162.9 -171.55 -163.4 L-172.7 -163.7 -173.15 -163.8 -173.3 -163.85 -176.5 -164.25 -177.65 -164.2 -177.85 -164.2 -181.4 -163.7 M-183.75 -164.05 L-182.15 -164.75 Q-179.7 -165.7 -178.2 -165.7 L-173.85 -165.3 -170.55 -164.7 -169.95 -164.5 -167.4 -163.6 -164.65 -162.7 Q-164.75 -162.6 -165.35 -162.45 L-167.1 -161.9 -167.7 -161.7 -167.15 -160.55 -166.85 -160.1 -166.7 -159.9 -166.05 -159.05 -166.0 -158.6 -171.75 -157.6 Q-175.8 -157.25 -179.35 -158.25 L-184.75 -160.45 -184.9 -160.8 -185.05 -160.95 -185.05 -161.0 -186.05 -162.8 -186.3 -163.1 -185.35 -163.2 -183.75 -164.05 M-172.7 -113.9 L-172.6 -114.1 -172.5 -114.7 -172.35 -114.2 -172.25 -113.9 -172.25 -113.8 -172.45 -113.7 -172.5 -113.85 -172.7 -113.9 M-166.15 -101.15 L-165.75 -100.25 -166.65 -101.45 -166.15 -101.15 M-155.7 -120.25 L-155.1 -120.35 -153.35 -120.25 -146.95 -120.8 -146.2 -120.95 -142.1 -121.85 Q-136.5 -123.35 -133.55 -125.15 L-133.5 -125.1 Q-136.95 -122.35 -139.8 -120.95 L-140.8 -120.5 Q-143.6 -119.3 -146.95 -118.95 L-149.7 -118.8 Q-151.05 -118.8 -153.2 -119.45 L-155.7 -120.25 M-135.45 -166.0 L-135.3 -166.05 -135.3 -166.1 -132.4 -167.45 Q-129.35 -168.6 -125.7 -168.6 L-123.5 -168.45 -123.5 -168.4 -122.95 -168.4 -121.65 -168.15 -119.5 -167.45 -119.05 -167.45 -119.15 -167.25 -119.25 -166.95 -119.4 -166.75 -120.1 -165.15 Q-120.05 -165.05 -120.15 -164.9 L-120.3 -164.6 Q-124.2 -162.25 -125.45 -161.6 -128.85 -160.15 -132.95 -159.9 -135.15 -159.8 -138.65 -160.0 L-138.7 -160.45 Q-137.9 -161.6 -137.6 -162.6 L-137.35 -163.4 -139.35 -163.85 -139.35 -164.2 -137.55 -164.85 -135.45 -166.0 M-127.95 -167.05 L-130.05 -166.8 -132.35 -166.25 -132.9 -166.05 -133.0 -166.0 Q-134.8 -165.35 -136.1 -164.3 L-136.35 -164.2 -136.4 -164.05 -136.45 -163.45 -136.35 -162.95 Q-135.85 -161.3 -132.65 -161.5 -127.2 -161.75 -125.1 -163.2 L-122.7 -164.95 -121.05 -166.4 -120.9 -166.6 -121.25 -166.55 Q-122.2 -167.2 -124.05 -167.2 L-124.8 -167.2 -127.95 -167.05 M-126.2 -134.2 L-126.15 -134.15 -126.25 -134.0 -126.2 -134.2" fill="#755d39" fill-rule="evenodd" stroke="none"/>
    <path d="M-177.85 -164.2 L-177.65 -164.2 -176.5 -164.25 -173.3 -163.85 -173.15 -163.8 -172.95 -163.15 -173.1 -162.45 -173.65 -161.75 Q-174.35 -161.0 -175.15 -161.0 L-175.7 -161.05 -175.7 -161.25 Q-175.7 -161.75 -176.1 -161.75 L-176.85 -161.45 -177.15 -161.6 -177.1 -161.65 -176.85 -162.25 -177.0 -162.8 -177.8 -163.3 -178.3 -163.25 -178.3 -163.5 -178.2 -163.85 -177.85 -164.2 M-132.9 -166.05 L-132.35 -166.25 -130.05 -166.8 -127.95 -167.05 -127.85 -166.85 -127.7 -166.4 -128.2 -166.0 Q-128.05 -165.5 -127.75 -165.5 L-127.8 -165.35 -128.2 -165.35 Q-129.65 -165.15 -129.65 -164.05 L-129.55 -163.65 -130.1 -163.55 -130.1 -163.8 Q-130.1 -164.75 -130.8 -164.4 -131.45 -164.15 -131.5 -163.75 L-132.25 -164.15 -132.65 -164.5 -132.7 -164.6 -132.95 -165.05 -133.05 -165.55 -132.9 -166.05" fill="#332211" fill-rule="evenodd" stroke="none"/>
    <path d="M-175.7 -161.05 L-175.85 -160.8 Q-176.1 -160.45 -176.5 -160.45 -177.0 -160.45 -177.0 -160.95 L-176.85 -161.45 -176.1 -161.75 Q-175.7 -161.75 -175.7 -161.25 L-175.7 -161.05 M-177.15 -161.6 Q-177.45 -161.2 -177.9 -161.2 -178.75 -161.2 -179.2 -161.7 L-179.5 -162.3 -179.45 -162.5 Q-179.35 -163.15 -178.3 -163.25 L-177.8 -163.3 -177.0 -162.8 -176.85 -162.25 -177.1 -161.65 -177.15 -161.6 M-131.5 -163.75 Q-131.45 -164.15 -130.8 -164.4 -130.1 -164.75 -130.1 -163.8 L-130.1 -163.55 Q-130.2 -162.95 -130.85 -162.95 -131.65 -162.95 -131.55 -163.6 L-131.5 -163.75 M-129.55 -163.65 L-129.65 -164.05 Q-129.65 -165.15 -128.2 -165.35 L-127.8 -165.35 -127.05 -165.1 -126.0 -165.25 -125.9 -165.0 -125.9 -164.95 Q-125.95 -164.75 -126.45 -164.55 L-126.8 -164.5 -126.8 -164.4 Q-126.8 -164.0 -127.15 -163.7 -127.65 -163.2 -128.65 -163.2 L-128.95 -163.2 Q-129.45 -163.3 -129.55 -163.65 M-127.75 -165.5 Q-128.05 -165.5 -128.2 -166.0 L-127.7 -166.4 -127.6 -166.4 Q-127.05 -166.4 -127.05 -165.95 L-127.3 -165.65 Q-127.5 -165.5 -127.75 -165.5" fill="#ffdcb8" fill-rule="evenodd" stroke="none"/>
    <path d="M-194.4 -172.2 Q-194.7 -168.25 -192.85 -160.2 L-192.35 -157.85 -192.0 -156.45 -192.5 -156.65 -192.85 -156.8 Q-193.65 -157.25 -193.7 -157.65 L-194.55 -159.95 Q-195.55 -162.25 -195.6 -163.25 -195.65 -164.55 -195.2 -165.65 L-194.5 -167.2 Q-195.95 -167.1 -197.25 -165.75 -198.5 -164.6 -198.9 -163.1 L-199.0 -164.4 Q-199.15 -166.95 -197.7 -169.55 -196.45 -172.1 -194.4 -172.2 M-108.8 -174.9 L-108.8 -174.95 Q-107.8 -176.05 -107.2 -176.1 -106.6 -176.15 -105.9 -174.95 L-105.9 -174.9 -107.35 -172.8 Q-108.45 -171.0 -108.8 -169.75 L-108.45 -173.6 -108.8 -174.9 M-108.9 -169.1 L-107.9 -168.45 Q-107.0 -167.65 -107.0 -167.1 -106.9 -165.1 -108.6 -162.75 L-109.85 -161.15 -109.65 -162.7 -108.9 -169.1" fill="#59452b" fill-rule="evenodd" stroke="none"/>
    <path d="M-192.0 -156.45 L-190.7 -151.15 Q-194.1 -153.7 -195.85 -155.8 -197.9 -158.45 -198.6 -161.75 L-198.9 -163.1 Q-198.5 -164.6 -197.25 -165.75 -195.95 -167.1 -194.5 -167.2 L-195.2 -165.65 Q-195.65 -164.55 -195.6 -163.25 -195.55 -162.25 -194.55 -159.95 L-193.7 -157.65 Q-193.65 -157.25 -192.85 -156.8 L-192.5 -156.65 -192.0 -156.45 M-105.9 -174.9 L-105.7 -174.5 Q-105.0 -173.15 -104.95 -172.25 L-104.75 -167.45 Q-104.9 -165.2 -106.4 -161.95 -107.2 -160.3 -109.45 -158.35 L-110.25 -157.5 -109.85 -161.15 -108.6 -162.75 Q-106.9 -165.1 -107.0 -167.1 -107.0 -167.65 -107.9 -168.45 L-108.9 -169.1 -108.8 -169.75 Q-108.45 -171.0 -107.35 -172.8 L-105.9 -174.9" fill="#705736" fill-rule="evenodd" stroke="none"/>
    <path d="M-145.95 -140.1 L-145.95 -139.9 -145.95 -139.15 -146.1 -138.2 -146.3 -139.35 -146.6 -140.75 -146.65 -141.35 Q-146.75 -142.7 -147.2 -145.35 L-147.3 -145.85 -147.35 -146.3 -147.9 -149.7 Q-147.8 -156.75 -148.3 -159.75 -148.7 -161.75 -147.4 -164.95 L-147.05 -165.6 -146.95 -165.95 -146.8 -166.05 -146.55 -166.65 -146.35 -167.1 -146.25 -167.35 Q-145.8 -167.65 -145.4 -168.95 L-145.4 -165.7 -145.45 -162.2 -145.5 -151.95 -145.45 -150.75 -145.35 -147.0 -145.65 -142.95 -144.5 -143.55 -143.2 -144.0 Q-142.25 -144.05 -141.0 -142.05 L-140.15 -140.5 -140.05 -140.15 -138.5 -136.1 -138.5 -135.7 -140.8 -135.6 -140.5 -136.25 Q-140.55 -137.05 -142.0 -139.75 -143.45 -142.55 -144.1 -142.55 L-144.75 -142.4 -145.35 -142.2 -145.5 -142.15 -145.75 -142.05 -145.75 -141.8 -145.95 -140.1 M-158.75 -164.3 L-158.8 -165.7 -159.0 -166.1 -159.05 -166.4 -159.25 -167.8 -159.4 -169.05 -159.65 -170.05 -159.4 -169.65 -159.3 -169.55 -158.65 -168.4 -157.75 -166.6 -157.5 -166.0 Q-156.85 -164.8 -156.55 -164.0 L-156.45 -163.25 Q-156.2 -158.7 -156.7 -151.15 L-157.1 -142.15 -157.15 -142.15 -157.25 -142.35 -157.95 -146.3 -158.2 -149.5 -158.3 -151.25 -158.7 -163.3 -158.75 -164.25 -158.75 -164.3 M-157.65 -142.5 L-158.95 -142.35 -160.8 -138.9 -161.35 -137.75 -161.85 -136.75 -162.65 -135.35 -162.45 -134.9 -163.4 -135.05 -163.45 -135.05 -162.9 -137.75 -162.75 -138.3 -162.55 -138.95 -162.35 -139.35 -161.5 -141.35 Q-160.65 -143.05 -159.75 -143.1 L-158.55 -142.8 -158.4 -142.85 -157.65 -142.5" fill="#b59058" fill-rule="evenodd" stroke="none"/>
    <path d="M-145.7 -128.4 L-140.8 -129.85 -139.45 -130.3 -138.7 -130.5 -132.25 -131.65 -125.4 -132.45 -132.8 -130.05 -132.85 -130.1 -133.0 -130.1 -133.0 -130.0 -146.95 -125.4 -147.15 -125.35 -148.2 -125.0 -149.25 -125.0 -154.6 -125.75 -162.1 -127.3 -169.6 -127.5 -173.3 -127.95 -173.4 -128.0 -173.9 -128.15 -173.1 -128.15 -169.0 -128.3 Q-165.1 -128.4 -162.25 -129.6 L-157.8 -128.75 -155.35 -128.15 -149.45 -127.5 -149.4 -127.45 -148.25 -127.7 -146.95 -127.95 -145.75 -128.25 -145.7 -128.4" fill="#695333" fill-rule="evenodd" stroke="none"/>
    <path d="M-158.1 -132.35 L-160.0 -132.4 -160.9 -132.5 -161.0 -132.55 -162.25 -133.65 -162.25 -134.1 -160.25 -133.4 -158.1 -132.35 M-140.8 -133.65 L-140.85 -133.6 -141.05 -133.55 -143.45 -133.15 -143.65 -133.15 -142.35 -134.0 -139.75 -135.3 -139.75 -134.85 -140.8 -133.65" fill="#493a25" fill-rule="evenodd" stroke="none"/>
    <path d="M-132.95 -163.8 L-133.0 -163.9 -132.8 -163.9 -132.95 -163.8" fill="#c2a78b" fill-rule="evenodd" stroke="none"/>
    <path d="M-115.05 -171.5 L-115.2 -171.25 -117.6 -171.75 -121.0 -171.75 Q-124.55 -171.45 -128.35 -170.25 -131.45 -169.3 -142.95 -163.6 L-143.1 -163.65 -143.2 -163.6 Q-143.55 -164.85 -144.65 -167.1 L-145.85 -170.25 -144.7 -169.9 -143.0 -169.45 -142.35 -169.8 -128.4 -176.75 -122.6 -174.85 Q-116.05 -172.5 -115.05 -171.5" fill="#382d1d" fill-rule="evenodd" stroke="none"/>
    <path d="M-162.15 -168.05 L-161.5 -167.85 Q-160.85 -168.0 -159.85 -168.45 L-159.0 -168.65 -158.65 -168.85 -158.8 -168.15 -159.6 -165.6 -160.6 -162.0 -160.7 -162.0 -160.85 -161.85 Q-172.85 -166.45 -175.95 -167.15 L-183.4 -167.95 Q-186.9 -167.9 -188.95 -166.85 L-189.15 -167.15 Q-188.3 -168.25 -182.05 -171.2 L-176.6 -173.65 -162.15 -168.05" fill="#382d1d" fill-rule="evenodd" stroke="none"/>
    <path d="M-144.1 -287.8 Q-132.75 -293.8 -130.2 -293.85 -122.65 -294.0 -118.4 -284.7 -115.2 -277.9 -114.75 -268.95 -114.5 -264.35 -114.55 -247.9 L-114.65 -234.55 -114.6 -230.2 -114.7 -224.85 Q-117.2 -226.25 -120.4 -227.65 L-120.55 -227.75 -120.5 -243.5 Q-120.15 -259.4 -120.35 -262.85 -121.0 -275.55 -124.1 -281.8 -128.15 -290.15 -137.1 -289.7 -138.4 -289.65 -143.95 -287.55 L-144.1 -287.8 M-194.45 -221.15 L-195.25 -226.0 -198.2 -243.55 Q-200.0 -254.9 -200.15 -257.7 -200.6 -266.2 -190.55 -274.95 -182.4 -282.05 -174.6 -283.3 -186.0 -277.7 -190.05 -273.35 -193.95 -269.1 -193.6 -262.85 -193.25 -256.15 -190.15 -241.25 -188.3 -232.2 -187.4 -225.9 L-192.0 -223.0 -194.25 -221.2 -194.45 -221.15 M-171.35 -206.05 L-165.35 -206.75 -152.65 -207.5 -147.05 -207.5 -145.85 -207.45 -143.25 -206.15 -144.5 -206.05 -148.25 -205.65 -157.9 -204.5 -162.95 -203.55 -172.0 -202.2 -168.2 -203.5 -164.05 -204.65 -164.25 -204.65 -166.5 -204.8 -182.4 -203.5 -182.4 -203.7 Q-181.75 -203.8 -181.0 -204.2 L-180.0 -204.75 -178.5 -205.05 -171.35 -206.05" fill="#694d45" fill-rule="evenodd" stroke="none"/>
    <path d="M-144.1 -287.8 L-143.95 -287.55 -144.4 -287.35 -146.65 -286.45 -144.5 -287.55 -144.1 -287.8 M-194.45 -221.05 L-194.45 -221.15 -194.25 -221.2 -194.45 -221.05 M-174.6 -283.3 L-173.8 -283.4 -174.45 -283.15 -174.6 -283.3 M-166.2 -282.85 L-165.05 -282.6 -163.95 -282.4 -163.55 -282.3 -158.7 -281.75 -158.7 -281.3 Q-155.35 -281.4 -150.6 -282.9 -138.85 -286.35 -136.9 -286.45 -134.7 -286.55 -131.55 -276.55 -128.7 -267.8 -128.55 -264.25 -128.4 -261.8 -130.95 -246.85 -132.45 -238.2 -132.95 -232.25 L-139.8 -234.2 -139.9 -245.2 -140.6 -261.8 Q-140.7 -264.15 -143.45 -265.6 -146.15 -266.65 -146.2 -266.95 L-146.2 -267.55 -147.0 -267.35 Q-152.7 -267.05 -163.45 -261.15 -175.7 -254.45 -175.4 -248.55 L-174.55 -243.55 Q-173.75 -239.55 -173.65 -237.0 -173.55 -234.9 -172.55 -231.7 L-172.5 -231.55 -173.7 -231.25 -179.5 -229.4 -179.85 -230.6 -180.9 -234.6 Q-181.05 -237.5 -183.05 -246.15 -185.1 -254.7 -185.2 -256.8 L-186.45 -268.25 Q-186.8 -274.55 -179.5 -278.5 -175.45 -280.6 -166.2 -282.85" fill="#523c36" fill-rule="evenodd" stroke="none"/>
    <path d="M-143.95 -287.55 Q-138.4 -289.65 -137.1 -289.7 -128.15 -290.15 -124.1 -281.8 -121.0 -275.55 -120.35 -262.85 -120.15 -259.4 -120.5 -243.5 L-120.55 -227.75 -125.35 -229.65 -128.0 -230.6 -130.6 -231.55 -132.95 -232.25 Q-132.45 -238.2 -130.95 -246.85 -128.4 -261.8 -128.55 -264.25 -128.7 -267.8 -131.55 -276.55 -134.7 -286.55 -136.9 -286.45 -138.85 -286.35 -150.6 -282.9 -155.35 -281.4 -158.7 -281.3 L-158.7 -281.75 Q-156.45 -281.8 -150.1 -284.75 L-146.65 -286.45 -144.4 -287.35 -143.95 -287.55 M-173.8 -283.4 L-173.75 -283.4 -171.75 -283.55 -171.35 -283.55 -166.2 -282.85 Q-175.45 -280.6 -179.5 -278.5 -186.8 -274.55 -186.45 -268.25 L-185.2 -256.8 Q-185.1 -254.7 -183.05 -246.15 -181.05 -237.5 -180.9 -234.6 L-179.85 -230.6 -179.5 -229.4 Q-183.15 -228.1 -186.3 -226.45 L-187.4 -225.9 Q-188.3 -232.2 -190.15 -241.25 -193.25 -256.15 -193.6 -262.85 -193.95 -269.1 -190.05 -273.35 -186.0 -277.7 -174.6 -283.3 L-174.45 -283.15 -173.8 -283.4" fill="#5c433c" fill-rule="evenodd" stroke="none"/>
    <path d="M-172.5 -231.55 L-172.55 -231.7 Q-173.55 -234.9 -173.65 -237.0 -173.75 -239.55 -174.55 -243.55 L-175.4 -248.55 Q-175.7 -254.45 -163.45 -261.15 -152.7 -267.05 -147.0 -267.35 L-146.2 -267.55 -146.2 -266.95 Q-146.15 -266.65 -143.45 -265.6 -140.7 -264.15 -140.6 -261.8 L-139.9 -245.2 -139.8 -234.2 -144.5 -234.8 Q-160.9 -234.45 -172.5 -231.55" fill="#45322d" fill-rule="evenodd" stroke="none"/>
    <path d="M-132.95 -232.25 L-130.6 -231.55 -127.75 -228.05 Q-124.8 -224.3 -124.7 -222.85 L-126.45 -213.85 -127.75 -206.6 -135.4 -207.0 -139.5 -207.25 Q-138.75 -211.55 -137.05 -216.25 -135.0 -221.75 -135.05 -223.4 -135.15 -224.7 -136.1 -225.25 L-139.95 -226.8 -140.8 -227.15 Q-145.1 -228.8 -150.3 -230.1 L-155.7 -231.05 Q-156.95 -231.0 -162.3 -227.5 -167.85 -223.95 -168.65 -222.4 L-172.2 -216.9 Q-175.45 -211.45 -176.1 -208.0 L-172.95 -206.6 -171.35 -206.05 -178.5 -205.05 -180.0 -204.75 -181.95 -204.45 -182.45 -204.35 -183.3 -204.2 -183.85 -206.05 -184.25 -207.35 -184.25 -207.45 Q-184.35 -209.25 -185.1 -211.15 L-185.25 -211.6 Q-185.9 -213.3 -185.95 -214.75 L-185.95 -214.85 Q-186.0 -215.6 -186.4 -216.9 L-186.8 -218.2 -187.65 -221.05 -186.95 -222.3 Q-185.2 -224.1 -179.05 -227.75 L-172.5 -231.55 Q-160.9 -234.45 -144.5 -234.8 L-139.8 -234.2 -132.95 -232.25" fill="#380a08" fill-rule="evenodd" stroke="none"/>
    <path d="M-120.55 -227.75 L-120.4 -227.65 -117.95 -225.25 Q-117.05 -224.35 -117.05 -223.7 -116.95 -222.45 -118.25 -217.95 -119.15 -213.25 -119.55 -206.15 L-122.1 -206.25 -122.5 -206.3 -122.8 -206.3 -123.8 -206.3 -127.75 -206.6 -126.45 -213.85 -124.7 -222.85 Q-124.8 -224.3 -127.75 -228.05 L-130.6 -231.55 -128.0 -230.6 -125.35 -229.65 -120.55 -227.75 M-187.4 -225.9 L-186.3 -226.45 Q-183.15 -228.1 -179.5 -229.4 L-173.7 -231.25 -172.5 -231.55 -179.05 -227.75 Q-185.2 -224.1 -186.95 -222.3 L-187.65 -221.05 -186.8 -218.2 -186.4 -216.9 Q-186.0 -215.6 -185.95 -214.85 L-185.95 -214.75 Q-185.9 -213.3 -185.25 -211.6 L-185.1 -211.15 Q-184.35 -209.25 -184.25 -207.45 L-184.25 -207.35 -183.85 -206.05 -183.3 -204.2 -183.4 -204.2 -187.9 -203.4 -189.5 -210.75 -191.9 -222.1 -192.0 -223.0 -187.4 -225.9" fill="#4a0c0a" fill-rule="evenodd" stroke="none"/>
    <path d="M-120.4 -227.65 Q-117.2 -226.25 -114.7 -224.85 L-114.65 -224.85 -112.6 -223.6 -113.95 -211.8 -114.4 -205.8 -114.75 -205.8 -119.55 -206.15 Q-119.15 -213.25 -118.25 -217.95 -116.95 -222.45 -117.05 -223.7 -117.05 -224.35 -117.95 -225.25 L-120.4 -227.65 M-194.25 -221.2 L-192.0 -223.0 -191.9 -222.1 -189.5 -210.75 -187.9 -203.4 -190.65 -202.85 -192.0 -202.8 -193.2 -207.8 -195.5 -218.45 Q-195.5 -218.95 -194.5 -220.85 L-194.25 -221.2 M-191.4 -203.35 L-191.3 -203.45 -191.55 -203.9 -191.4 -203.35" fill="#5c0f0c" fill-rule="evenodd" stroke="none"/>
    <path d="M-171.35 -206.05 L-172.95 -206.6 -176.1 -208.0 Q-175.45 -211.45 -172.2 -216.9 L-168.65 -222.4 Q-167.85 -223.95 -162.3 -227.5 -156.95 -231.0 -155.7 -231.05 L-150.3 -230.1 Q-145.1 -228.8 -140.8 -227.15 L-139.95 -226.8 -136.1 -225.25 Q-135.15 -224.7 -135.05 -223.4 -135.0 -221.75 -137.05 -216.25 -138.75 -211.55 -139.5 -207.25 L-145.85 -207.45 -147.05 -207.5 -145.85 -209.35 Q-142.45 -214.5 -142.15 -215.65 L-142.2 -216.8 -143.45 -216.9 -151.4 -216.7 -153.75 -216.55 -161.2 -214.2 -167.2 -211.5 -169.6 -210.2 Q-169.4 -209.3 -167.0 -207.75 L-165.35 -206.75 -171.35 -206.05" fill="#381211" fill-rule="evenodd" stroke="none"/>
    <path d="M-165.35 -206.75 L-167.0 -207.75 Q-169.4 -209.3 -169.6 -210.2 L-167.2 -211.5 -161.2 -214.2 -153.75 -216.55 -151.4 -216.7 -143.45 -216.9 -142.2 -216.8 -142.15 -215.65 Q-142.45 -214.5 -145.85 -209.35 L-147.05 -207.5 -152.65 -207.5 -165.35 -206.75" fill="#381a19" fill-rule="evenodd" stroke="none"/>
    <path d="M-162.95 -203.55 L-157.9 -204.5 -148.25 -205.65 -144.5 -206.05 -143.25 -206.15 -142.45 -205.75 -139.95 -204.45 -138.45 -203.7 -133.2 -201.35 Q-129.0 -199.4 -128.95 -198.25 -128.85 -196.5 -137.5 -190.95 -142.45 -187.85 -146.0 -186.1 -151.25 -185.9 -156.55 -186.0 L-170.3 -186.8 Q-173.4 -188.1 -176.9 -191.2 -175.95 -193.1 -170.75 -197.35 L-162.95 -203.55" fill="#73544b" fill-rule="evenodd" stroke="none"/>
    <path d="M-145.85 -207.45 L-139.5 -207.25 -135.4 -207.0 -127.75 -206.6 -123.8 -206.3 -122.8 -206.0 -119.7 -204.0 -117.2 -202.6 -114.7 -201.2 -111.4 -199.1 -113.55 -197.3 -114.8 -196.4 Q-116.9 -195.2 -119.4 -194.2 L-129.6 -190.4 -139.4 -186.45 -146.0 -186.1 Q-142.45 -187.85 -137.5 -190.95 -128.85 -196.5 -128.95 -198.25 -129.0 -199.4 -133.2 -201.35 L-138.45 -203.7 -139.95 -204.45 -142.45 -205.75 -143.25 -206.15 -145.85 -207.45 M-162.95 -203.55 L-170.75 -197.35 Q-175.95 -193.1 -176.9 -191.2 -173.4 -188.1 -170.3 -186.8 L-175.65 -187.2 -185.55 -188.35 -189.3 -190.1 -193.85 -193.1 -196.45 -195.05 Q-196.5 -195.8 -192.15 -198.5 L-191.05 -199.2 -187.45 -201.4 -183.3 -203.85 -183.2 -203.9 -182.45 -204.35 -181.95 -204.45 -180.0 -204.75 -181.0 -204.2 Q-181.75 -203.8 -182.4 -203.7 L-182.4 -203.5 -166.5 -204.8 -164.25 -204.65 -164.05 -204.65 -168.2 -203.5 -172.0 -202.2 -162.95 -203.55" fill="#7a5950" fill-rule="evenodd" stroke="none"/>
    <path d="M-62.85 -206.0 L-62.5 -205.9 -62.85 -205.9 -62.85 -206.0 M-123.8 -206.3 L-122.8 -206.3 -122.8 -206.0 -123.8 -206.3 M-122.8 -206.0 L-119.6 -205.2 -114.55 -204.15 Q-103.25 -202.25 -85.95 -202.75 -86.1 -201.95 -87.2 -201.2 L-89.05 -199.95 -92.1 -199.0 Q-97.15 -197.35 -102.15 -195.5 L-114.95 -191.25 Q-125.05 -188.0 -135.5 -186.75 L-139.4 -186.45 -129.6 -190.4 -119.4 -194.2 Q-116.9 -195.2 -114.8 -196.4 L-113.55 -197.3 -111.4 -199.1 -114.7 -201.2 -117.2 -202.6 -119.7 -204.0 -122.8 -206.0 M-183.4 -204.2 L-183.3 -204.2 -182.45 -204.35 -183.2 -203.9 -183.3 -203.85 -187.45 -201.4 -191.05 -199.2 -192.15 -198.5 Q-196.5 -195.8 -196.45 -195.05 L-193.85 -193.1 -189.3 -190.1 -185.55 -188.35 -196.65 -189.8 -206.65 -191.7 -207.95 -193.3 -209.75 -195.3 Q-207.45 -195.6 -203.9 -196.9 L-197.85 -198.95 -191.55 -201.15 -187.65 -202.55 -185.95 -203.25 -183.4 -204.2" fill="#856c65" fill-rule="evenodd" stroke="none"/>
    <path d="M-112.75 -205.75 Q-97.7 -204.95 -90.25 -205.1 L-87.15 -205.35 -78.55 -205.9 -73.55 -206.1 -68.85 -206.25 -65.5 -206.2 -62.9 -206.0 -62.85 -206.0 -62.85 -205.9 -64.65 -205.9 -68.8 -205.15 -71.65 -204.5 Q-80.5 -202.65 -89.05 -199.95 L-87.2 -201.2 Q-86.1 -201.95 -85.95 -202.75 -103.25 -202.25 -114.55 -204.15 L-119.6 -205.2 -122.8 -206.0 -122.8 -206.3 -122.5 -206.3 -122.1 -206.25 -119.55 -206.15 -114.75 -205.8 -114.4 -205.8 -112.75 -205.75 M-234.55 -195.45 L-227.85 -196.85 -218.05 -198.35 -214.1 -198.9 Q-200.65 -200.7 -193.3 -202.75 L-192.95 -202.8 -192.0 -202.8 -190.65 -202.85 -187.9 -203.4 -183.4 -204.2 -185.95 -203.25 -187.65 -202.55 -191.55 -201.15 -197.85 -198.95 -203.9 -196.9 Q-207.45 -195.6 -209.75 -195.3 L-207.95 -193.3 -206.65 -191.7 -214.85 -193.5 -217.8 -194.15 -227.75 -195.35 -234.55 -195.45" fill="#947870" fill-rule="evenodd" stroke="none"/>
    <path d="M-112.6 -223.6 L-110.75 -222.25 -111.6 -214.6 -112.75 -205.75 -114.4 -205.8 -113.95 -211.8 -112.6 -223.6 M-192.95 -202.8 L-192.95 -202.85 -193.2 -203.45 -194.95 -209.45 Q-196.65 -215.45 -197.0 -218.7 L-195.0 -220.65 -194.45 -221.05 -194.25 -221.2 -194.5 -220.85 Q-195.5 -218.95 -195.5 -218.45 L-193.2 -207.8 -192.0 -202.8 -192.95 -202.8" fill="#73110e" fill-rule="evenodd" stroke="none"/>
    <path d="M-62.5 -205.9 Q-59.55 -205.45 -56.85 -204.6 L-54.3 -203.7 -53.75 -203.3 -53.55 -203.1 -53.6 -202.55 Q-51.4 -200.75 -49.65 -198.75 L-47.5 -196.55 Q-46.8 -195.8 -46.55 -195.05 L-46.0 -193.6 -45.45 -192.3 -45.7 -191.9 -46.0 -191.75 Q-47.8 -194.5 -50.45 -196.65 L-52.45 -198.1 Q-53.5 -198.7 -54.9 -200.35 -56.35 -202.0 -59.75 -202.85 -63.2 -203.85 -64.9 -203.7 L-68.0 -203.7 -68.7 -203.65 Q-72.35 -203.6 -75.7 -202.65 L-82.35 -200.7 -86.85 -199.25 -94.35 -196.5 Q-94.6 -196.35 -94.8 -196.3 L-100.85 -193.8 Q-126.75 -183.2 -151.7 -183.45 -167.1 -183.9 -181.85 -185.75 -195.35 -187.5 -208.45 -190.55 L-217.75 -191.7 -227.6 -192.0 Q-243.45 -191.55 -252.6 -184.3 L-253.2 -183.9 Q-266.5 -173.0 -260.55 -164.65 L-260.65 -164.55 -262.85 -166.4 -263.25 -166.8 Q-265.9 -175.3 -259.1 -182.7 L-258.65 -183.15 -244.35 -192.65 -242.0 -193.5 -240.4 -194.0 -236.0 -195.1 -234.7 -195.45 -234.55 -195.45 -227.75 -195.35 -217.8 -194.15 -214.85 -193.5 -206.65 -191.7 -196.65 -189.8 -185.55 -188.35 -175.65 -187.2 -170.3 -186.8 -156.55 -186.0 Q-151.25 -185.9 -146.0 -186.1 L-139.4 -186.45 -135.5 -186.75 Q-125.05 -188.0 -114.95 -191.25 L-102.15 -195.5 Q-97.15 -197.35 -92.1 -199.0 L-89.05 -199.95 Q-80.5 -202.65 -71.65 -204.5 L-68.8 -205.15 -64.65 -205.9 -62.85 -205.9 -62.5 -205.9" fill="#5e443d" fill-rule="evenodd" stroke="none"/>
  </g>
</svg>
