<?xml version="1.0" encoding="UTF-8" standalone="no"?>
<svg xmlns:xlink="http://www.w3.org/1999/xlink" height="33.75px" width="151.9px" xmlns="http://www.w3.org/2000/svg">
  <g transform="matrix(1.0, 0.0, 0.0, 1.0, 0.0, 23.0)">
    <path d="M149.9 -23.0 L151.9 -23.0 151.9 0.75 Q151.9 10.75 141.9 10.75 L10.0 10.75 Q0.0 10.75 0.0 0.75 L0.0 -23.0 2.0 -23.0 2.0 0.75 Q2.0 8.75 10.0 8.75 L141.9 8.75 Q149.9 8.75 149.9 0.75 L149.9 -23.0" fill="#1a1612" fill-rule="evenodd" stroke="none"/>
    <path d="M149.9 -23.0 L149.9 0.75 Q149.9 8.75 141.9 8.75 L10.0 8.75 Q2.0 8.75 2.0 0.75 L2.0 -23.0 4.0 -23.0 4.0 0.75 Q4.0 6.75 10.0 6.75 L141.9 6.75 Q147.9 6.75 147.9 0.75 L147.9 -23.0 149.9 -23.0 M8.0 -23.0 L143.9 -23.0 143.9 0.75 Q143.9 2.75 141.9 2.75 L10.0 2.75 Q8.0 2.75 8.0 0.75 L8.0 -23.0" fill="#8f7b65" fill-rule="evenodd" stroke="none"/>
    <path d="M4.0 -23.0 L8.0 -23.0 8.0 0.75 Q8.0 2.75 10.0 2.75 L141.9 2.75 Q143.9 2.75 143.9 0.75 L143.9 -23.0 147.9 -23.0 147.9 0.75 Q147.9 6.75 141.9 6.75 L10.0 6.75 Q4.0 6.75 4.0 0.75 L4.0 -23.0" fill="#675949" fill-rule="evenodd" stroke="none"/>
  </g>
</svg>
