<?xml version="1.0" encoding="UTF-8" standalone="no"?>
<svg xmlns:xlink="http://www.w3.org/1999/xlink" height="2.5px" width="2.7px" xmlns="http://www.w3.org/2000/svg">
  <g transform="matrix(1.0, 0.0, 0.0, 1.0, 1.35, 0.5)">
    <path d="M1.35 -0.5 L1.35 2.0 -1.35 2.0 -1.35 -0.5 1.35 -0.5" fill="#ffcc00" fill-rule="evenodd" stroke="none"/>
  </g>
</svg>
