<?xml version="1.0" encoding="UTF-8" standalone="no"?>
<svg xmlns:xlink="http://www.w3.org/1999/xlink" height="17.9px" width="37.6px" xmlns="http://www.w3.org/2000/svg">
  <g transform="matrix(1.0, 0.0, 0.0, 1.0, 19.95, 6.7)">
    <path d="M-7.7 11.05 L-11.5 10.65 -13.1 10.45 -13.2 7.9 -13.2 7.8 Q-13.2 6.7 -11.95 5.1 L-9.8 2.0 -8.6 7.0 -7.7 11.05" fill="#a36a6a" fill-rule="evenodd" stroke="none"/>
    <path d="M12.25 -5.8 L15.7 -6.7 16.4 -1.55 17.65 6.0 14.8 7.6 13.45 2.6 12.75 -1.8 12.25 -5.8 M2.05 10.85 L-4.5 11.2 -5.75 11.2 -6.6 6.35 -6.85 4.6 -7.7 -3.8 -5.55 -3.75 -1.25 -3.8 0.35 3.35 0.55 4.35 2.05 10.85 M-14.1 10.35 L-17.75 9.8 -17.75 9.4 Q-17.75 6.05 -18.4 2.5 L-19.95 -4.4 -17.1 -4.15 Q-16.0 0.25 -14.55 8.0 L-14.5 8.2 -14.1 10.35" fill="#c29c9c" fill-rule="evenodd" stroke="none"/>
    <path d="M10.15 -5.3 L12.25 -5.8 12.75 -1.8 13.45 2.6 14.8 7.6 Q11.95 8.95 8.2 9.8 L2.05 10.85 0.55 4.35 0.35 3.35 -1.25 -3.8 1.05 -3.95 Q1.4 -1.4 2.55 2.2 L2.65 2.6 3.15 4.05 Q3.55 4.85 4.25 5.0 L7.35 5.4 8.65 5.1 10.45 5.2 10.65 3.9 10.5 -1.3 10.2 -4.8 10.15 -5.3" fill="#d2b6b6" fill-rule="evenodd" stroke="none"/>
    <path d="M-5.75 11.2 L-7.7 11.05 -8.6 7.0 -9.8 2.0 -11.95 5.1 Q-13.2 6.7 -13.2 7.8 L-13.2 7.9 -13.1 10.45 -14.1 10.35 -14.5 8.2 -14.55 8.0 Q-16.0 0.25 -17.1 -4.15 L-7.7 -3.8 -6.85 4.6 -6.6 6.35 -5.75 11.2" fill="#b38484" fill-rule="evenodd" stroke="none"/>
    <path d="M1.05 -3.95 L5.9 -4.5 6.1 -1.35 Q6.2 -0.45 6.6 0.25 7.25 1.45 8.85 2.0 L9.25 2.0 9.05 -5.1 10.15 -5.3 10.2 -4.8 10.5 -1.3 10.65 3.9 10.45 5.2 8.65 5.1 7.35 5.4 4.25 5.0 Q3.55 4.85 3.15 4.05 L2.65 2.6 2.55 2.2 Q1.4 -1.4 1.05 -3.95" fill="#e0cdcd" fill-rule="evenodd" stroke="none"/>
    <path d="M5.9 -4.5 L9.05 -5.1 9.25 2.0 8.85 2.0 Q7.25 1.45 6.6 0.25 6.2 -0.45 6.1 -1.35 L5.9 -4.5" fill="#f2eaea" fill-rule="evenodd" stroke="none"/>
    <path d="M1.05 -3.95 L5.9 -4.5 9.05 -5.1 10.15 -5.3 12.25 -5.8 15.7 -6.7 16.4 -1.55 17.65 6.0 14.8 7.6 Q11.95 8.95 8.2 9.8 L2.05 10.85 -4.5 11.2 -5.75 11.2 -7.7 11.05 -11.5 10.65 -13.1 10.45 -14.1 10.35 -17.75 9.8 -17.75 9.4 Q-17.75 6.05 -18.4 2.5 L-19.95 -4.4 -17.1 -4.15 -7.7 -3.8 -5.55 -3.75 -1.25 -3.8 1.05 -3.95 Z" fill="none" stroke="#a36a6a" stroke-linecap="round" stroke-linejoin="round" stroke-opacity="0.4" stroke-width="0.05"/>
  </g>
</svg>
