<?xml version="1.0" encoding="UTF-8" standalone="no"?>
<svg xmlns:xlink="http://www.w3.org/1999/xlink" height="32.0px" width="208.0px" xmlns="http://www.w3.org/2000/svg">
  <g transform="matrix(1.0, 0.0, 0.0, 1.0, -0.05, 0.0)">
    <path d="M21.1 11.0 L21.1 21.0 11.1 21.0 11.1 11.0 21.1 11.0" fill="#ffb521" fill-rule="evenodd" stroke="none"/>
    <path d="M10.05 22.0 L10.05 32.0 0.05 32.0 0.05 22.0 10.05 22.0" fill="#84ab27" fill-rule="evenodd" stroke="none"/>
    <path d="M0.05 10.0 L0.05 0.0 10.05 0.0 10.05 10.0 0.05 10.0" fill="#edd6c9" fill-rule="evenodd" stroke="none"/>
    <path d="M21.05 0.0 L21.05 10.0 11.05 10.0 11.05 0.0 21.05 0.0" fill="#edc5af" fill-rule="evenodd" stroke="none"/>
    <path d="M43.05 10.0 L33.05 10.0 33.05 0.0 43.05 0.0 43.05 10.0" fill="#edd2af" fill-rule="evenodd" stroke="none"/>
    <path d="M98.05 10.0 L88.05 10.0 88.05 0.0 98.05 0.0 98.05 10.0" fill="#ada593" fill-rule="evenodd" stroke="none"/>
    <path d="M98.1 11.0 L98.1 21.0 88.1 21.0 88.1 11.0 98.1 11.0" fill="#a3d3b0" fill-rule="evenodd" stroke="none"/>
    <path d="M76.05 10.0 L66.05 10.0 66.05 0.0 76.05 0.0 76.05 10.0" fill="#e89f68" fill-rule="evenodd" stroke="none"/>
    <path d="M87.05 0.0 L87.05 10.0 77.05 10.0 77.05 0.0 87.05 0.0 M32.05 10.0 L22.05 10.0 22.05 0.0 32.05 0.0 32.05 10.0" fill="#cfa382" fill-rule="evenodd" stroke="none"/>
    <path d="M44.1 21.0 L44.1 11.0 54.1 11.0 54.1 21.0 44.1 21.0" fill="#827769" fill-rule="evenodd" stroke="none"/>
    <path d="M32.1 11.0 L32.1 21.0 22.1 21.0 22.1 11.0 32.1 11.0" fill="#ab9d98" fill-rule="evenodd" stroke="none"/>
    <path d="M87.1 11.0 L87.1 21.0 77.1 21.0 77.1 11.0 87.1 11.0" fill="#f78139" fill-rule="evenodd" stroke="none"/>
    <path d="M109.05 10.0 L99.0 10.0 99.0 0.0 109.05 0.0 109.05 10.0" fill="#91a8ab" fill-rule="evenodd" stroke="none"/>
    <path d="M54.05 10.0 L44.05 10.0 44.05 0.0 54.05 0.0 54.05 10.0" fill="#d3bc89" fill-rule="evenodd" stroke="none"/>
    <path d="M65.05 10.0 L55.05 10.0 55.05 0.0 65.05 0.0 65.05 10.0" fill="#d99a61" fill-rule="evenodd" stroke="none"/>
    <path d="M120.05 10.0 L110.0 10.0 110.0 0.0 120.05 0.0 120.05 10.0" fill="#98ab91" fill-rule="evenodd" stroke="none"/>
    <path d="M43.05 32.0 L33.05 32.0 33.05 22.0 43.05 22.0 43.05 32.0" fill="#ba954c" fill-rule="evenodd" stroke="none"/>
    <path d="M76.05 22.0 L76.05 32.0 66.05 32.0 66.05 22.0 76.05 22.0" fill="#a50acf" fill-rule="evenodd" stroke="none"/>
    <path d="M54.05 22.0 L54.05 32.0 44.05 32.0 44.05 22.0 54.05 22.0" fill="#7b6340" fill-rule="evenodd" stroke="none"/>
    <path d="M32.05 22.0 L32.05 32.0 22.05 32.0 22.05 22.0 32.05 22.0" fill="#017db1" fill-rule="evenodd" stroke="none"/>
    <path d="M21.05 32.0 L11.05 32.0 11.05 22.0 21.05 22.0 21.05 32.0" fill="#62addb" fill-rule="evenodd" stroke="none"/>
    <path d="M65.05 22.0 L65.05 32.0 55.05 32.0 55.05 22.0 65.05 22.0" fill="#d44214" fill-rule="evenodd" stroke="none"/>
    <path d="M43.1 21.0 L33.1 21.0 33.1 11.0 43.1 11.0 43.1 21.0" fill="#a69659" fill-rule="evenodd" stroke="none"/>
    <path d="M10.1 11.0 L10.1 21.0 0.1 21.0 0.1 11.0 10.1 11.0" fill="#e4ba92" fill-rule="evenodd" stroke="none"/>
    <path d="M65.1 21.0 L55.1 21.0 55.1 11.0 65.1 11.0 65.1 21.0" fill="#9695a6" fill-rule="evenodd" stroke="none"/>
    <path d="M109.1 21.0 L99.05 21.0 99.05 11.0 109.1 11.0 109.1 21.0" fill="#636bb5" fill-rule="evenodd" stroke="none"/>
    <path d="M66.1 21.0 L66.1 11.0 76.1 11.0 76.1 21.0 66.1 21.0" fill="#eeeeee" fill-rule="evenodd" stroke="none"/>
    <path d="M208.05 32.0 L198.0 32.0 198.0 22.0 208.05 22.0 208.05 32.0 M208.05 10.0 L198.0 10.0 198.0 0.0 208.05 0.0 208.05 10.0 M208.05 21.0 L198.0 21.0 198.0 11.0 208.05 11.0 208.05 21.0 M197.05 10.0 L187.0 10.0 187.0 0.0 197.05 0.0 197.05 10.0 M186.05 10.0 L176.0 10.0 176.0 0.0 186.05 0.0 186.05 10.0 M186.05 21.0 L176.0 21.0 176.0 11.0 186.05 11.0 186.05 21.0 M197.05 22.0 L197.05 32.0 187.0 32.0 187.0 22.0 197.05 22.0 M197.05 21.0 L187.0 21.0 187.0 11.0 197.05 11.0 197.05 21.0 M175.05 10.0 L165.0 10.0 165.0 0.0 175.05 0.0 175.05 10.0 M164.05 10.0 L154.0 10.0 154.0 0.0 164.05 0.0 164.05 10.0 M175.05 22.0 L175.05 32.0 165.0 32.0 165.0 22.0 175.05 22.0 M165.0 21.0 L165.0 11.0 175.05 11.0 175.05 21.0 165.0 21.0 M164.05 21.0 L154.0 21.0 154.0 11.0 164.05 11.0 164.05 21.0 M164.05 32.0 L154.0 32.0 154.0 22.0 164.05 22.0 164.05 32.0 M186.05 22.0 L186.05 32.0 176.0 32.0 176.0 22.0 186.05 22.0 M153.05 10.0 L143.0 10.0 143.0 0.0 153.05 0.0 153.05 10.0 M142.05 10.0 L132.0 10.0 132.0 0.0 142.05 0.0 142.05 10.0 M142.05 21.0 L132.0 21.0 132.0 11.0 142.05 11.0 142.05 21.0 M153.05 22.0 L153.05 32.0 143.0 32.0 143.0 22.0 153.05 22.0 M153.05 21.0 L143.0 21.0 143.0 11.0 153.05 11.0 153.05 21.0 M131.05 21.0 L121.0 21.0 121.0 11.0 131.05 11.0 131.05 21.0 M131.05 10.0 L121.0 10.0 121.0 0.0 131.05 0.0 131.05 10.0 M131.05 32.0 L121.0 32.0 121.0 22.0 131.05 22.0 131.05 32.0 M132.0 32.0 L132.0 22.0 142.05 22.0 142.05 32.0 132.0 32.0 M120.05 10.0 L110.0 10.0 110.0 0.0 120.05 0.0 120.05 10.0 M109.05 10.0 L99.0 10.0 99.0 0.0 109.05 0.0 109.05 10.0 M109.1 21.0 L99.05 21.0 99.05 11.0 109.1 11.0 109.1 21.0 M120.05 22.0 L120.05 32.0 110.0 32.0 110.0 22.0 120.05 22.0 M120.05 21.0 L110.0 21.0 110.0 11.0 120.05 11.0 120.05 21.0 M98.05 10.0 L88.05 10.0 88.05 0.0 98.05 0.0 98.05 10.0 M87.05 0.0 L77.05 0.0 77.05 10.0 87.05 10.0 87.05 0.0 M87.1 11.0 L77.1 11.0 77.1 21.0 87.1 21.0 87.1 11.0 M98.1 11.0 L98.1 21.0 88.1 21.0 88.1 11.0 98.1 11.0 M98.05 22.0 L98.05 32.0 88.05 32.0 88.05 22.0 98.05 22.0 M87.05 22.0 L77.05 22.0 77.05 32.0 87.05 32.0 87.05 22.0 M109.05 32.0 L99.0 32.0 99.0 22.0 109.05 22.0 109.05 32.0 M76.05 10.0 L66.05 10.0 66.05 0.0 76.05 0.0 76.05 10.0 M65.05 10.0 L55.05 10.0 55.05 0.0 65.05 0.0 65.05 10.0 M66.1 21.0 L76.1 21.0 76.1 11.0 66.1 11.0 66.1 21.0 M65.1 21.0 L55.1 21.0 55.1 11.0 65.1 11.0 65.1 21.0 M76.05 22.0 L76.05 32.0 66.05 32.0 66.05 22.0 76.05 22.0 M54.05 10.0 L44.05 10.0 44.05 0.0 54.05 0.0 54.05 10.0 M43.05 10.0 L33.05 10.0 33.05 0.0 43.05 0.0 43.05 10.0 M44.1 21.0 L44.1 11.0 54.1 11.0 54.1 21.0 44.1 21.0 M43.1 21.0 L33.1 21.0 33.1 11.0 43.1 11.0 43.1 21.0 M54.05 22.0 L54.05 32.0 44.05 32.0 44.05 22.0 54.05 22.0 M65.05 22.0 L65.05 32.0 55.05 32.0 55.05 22.0 65.05 22.0 M43.05 32.0 L33.05 32.0 33.05 22.0 43.05 22.0 43.05 32.0 M32.05 10.0 L22.05 10.0 22.05 0.0 32.05 0.0 32.05 10.0 M21.05 0.0 L11.05 0.0 11.05 10.0 21.05 10.0 21.05 0.0 M21.1 11.0 L11.1 11.0 11.1 21.0 21.1 21.0 21.1 11.0 M32.1 11.0 L32.1 21.0 22.1 21.0 22.1 11.0 32.1 11.0 M32.05 22.0 L32.05 32.0 22.05 32.0 22.05 22.0 32.05 22.0 M10.1 11.0 L10.1 21.0 0.1 21.0 0.1 11.0 10.1 11.0 M0.05 10.0 L0.05 0.0 10.05 0.0 10.05 10.0 0.05 10.0 M10.05 22.0 L10.05 32.0 0.05 32.0 0.05 22.0 10.05 22.0 M21.05 32.0 L21.05 22.0 11.05 22.0 11.05 32.0 21.05 32.0" fill="none" stroke="#000000" stroke-linecap="round" stroke-linejoin="round" stroke-opacity="0.2" stroke-width="0.05"/>
  </g>
</svg>
