<?xml version="1.0" encoding="UTF-8" standalone="no"?>
<svg xmlns:xlink="http://www.w3.org/1999/xlink" height="8.7px" width="39.35px" xmlns="http://www.w3.org/2000/svg">
  <g transform="matrix(1.0, 0.0, 0.0, 1.0, 44.6, -9.9)">
    <path d="M-5.8 10.7 L-5.25 11.45 -8.8 13.5 Q-12.4 15.15 -14.1 15.45 -14.65 15.55 -19.3 17.1 -24.5 18.6 -28.6 18.6 -40.25 18.6 -42.55 16.6 L-43.45 15.4 -44.2 14.8 -44.6 14.2 -44.55 13.75 -43.8 13.55 Q-42.7 13.55 -42.35 14.0 L-41.55 15.05 Q-39.8 16.55 -30.95 16.55 -25.35 16.55 -19.5 15.0 L-13.65 13.1 -7.85 10.45 -6.4 9.9 -5.8 10.7" fill="#000000" fill-opacity="0.17254902" fill-rule="evenodd" stroke="none"/>
  </g>
</svg>
