<?xml version="1.0" encoding="UTF-8" standalone="no"?>
<svg xmlns:xlink="http://www.w3.org/1999/xlink" height="6.3px" width="26.35px" xmlns="http://www.w3.org/2000/svg">
  <g transform="matrix(1.0, 0.0, 0.0, 1.0, 13.5, 6.3)">
    <path d="M-11.2 -4.15 Q-9.35 -2.95 -7.35 -2.1 L-6.35 -1.55 -5.2 -1.15 -2.9 -0.6 -0.65 -0.45 1.75 -0.65 3.9 -1.1 5.45 -1.65 Q7.4 -2.45 9.0 -3.75 L9.7 -4.3 10.75 -4.85 11.45 -5.1 7.5 -2.4 Q5.5 -0.95 3.35 -0.35 L-1.2 0.0 -5.15 -0.5 Q-7.05 -1.0 -9.1 -2.35 -11.15 -3.7 -13.5 -4.1 L-13.1 -4.45 -11.2 -4.15 M12.75 -6.05 L12.85 -5.35 12.6 -5.35 11.55 -5.75 11.1 -5.85 12.0 -6.2 Q12.55 -6.4 12.75 -6.05" fill="#a36a6a" fill-rule="evenodd" stroke="none"/>
    <path d="M-13.1 -4.45 L-12.8 -4.65 -12.4 -4.95 -12.4 -5.0 -12.2 -5.15 -11.85 -5.4 -11.3 -5.95 -10.5 -6.3 Q-9.25 -4.95 -6.75 -4.0 -4.5 -3.15 -3.15 -2.95 L-3.65 -2.95 -4.5 -3.0 -5.2 -3.05 -5.25 -3.05 -6.8 -3.3 -6.95 -3.45 -6.95 -3.35 -7.15 -3.4 -11.1 -4.15 -11.2 -4.15 -13.1 -4.45" fill="url(#gradient0)" fill-rule="evenodd" stroke="none"/>
  </g>
  <defs>
    <linearGradient gradientTransform="matrix(-5.0E-4, 0.0017, -0.0039, -0.0011, -11.25, -5.25)" gradientUnits="userSpaceOnUse" id="gradient0" spreadMethod="pad" x1="-819.2" x2="819.2">
      <stop offset="0.0" stop-color="#f2eaea" stop-opacity="0.0"/>
      <stop offset="1.0" stop-color="#f2eaea"/>
    </linearGradient>
  </defs>
</svg>
