<?xml version="1.0" encoding="UTF-8" standalone="no"?>
<svg xmlns:xlink="http://www.w3.org/1999/xlink" height="3.05px" width="10.55px" xmlns="http://www.w3.org/2000/svg">
  <g transform="matrix(1.0, 0.0, 0.0, 1.0, 4.45, 0.8)">
    <path d="M6.1 2.25 Q4.35 0.95 3.15 0.55 L-0.1 0.15 Q-1.3 0.15 -2.6 0.6 -3.85 1.0 -4.45 1.55 -4.0 0.4 -2.45 -0.25 -0.9 -0.9 0.5 -0.8 1.85 -0.7 3.7 0.4 L6.1 2.25" fill="#e0cbcb" fill-rule="evenodd" stroke="none"/>
    <path d="M6.1 2.25 Q4.35 0.95 3.15 0.55 L-0.1 0.15 Q-1.3 0.15 -2.6 0.6 -3.85 1.0 -4.45 1.55" fill="none" stroke="#a36a6a" stroke-linecap="round" stroke-linejoin="round" stroke-opacity="0.29803923" stroke-width="0.05"/>
  </g>
</svg>
