<?xml version="1.0" encoding="UTF-8" standalone="no"?>
<svg xmlns:xlink="http://www.w3.org/1999/xlink" height="241.15px" width="160.2px" xmlns="http://www.w3.org/2000/svg">
  <g transform="matrix(1.0, 0.0, 0.0, 1.0, 74.85, 102.45)">
    <path d="M6.0 -56.45 L6.0 -56.1 5.7 -55.9 6.4 -54.95 Q7.7 -52.65 7.95 -49.85 L7.75 -49.7 7.45 -49.35 8.05 -48.15 8.05 -47.8 7.75 -45.45 Q6.75 -39.85 3.15 -37.75 2.3 -37.25 1.35 -37.0 L1.1 -37.15 0.3 -37.85 -0.05 -37.2 Q-0.25 -37.0 -1.3 -36.75 L-1.45 -36.75 -2.2 -36.8 Q-5.55 -37.0 -7.85 -35.7 L-9.45 -34.05 -10.55 -32.8 -9.85 -32.1 -10.0 -30.65 -9.7 -30.3 -8.1 -29.7 -7.75 -29.95 -5.8 -30.3 -5.15 -30.75 Q-1.55 -32.8 2.35 -32.65 L5.95 -32.25 8.1 -31.95 8.25 -31.95 8.75 -31.15 9.2 -30.35 9.45 -30.9 10.15 -31.6 10.2 -31.65 10.95 -31.8 12.95 -30.35 16.6 -27.95 Q18.45 -26.6 19.65 -25.85 20.0 -26.65 19.4 -28.45 L18.75 -27.85 18.4 -27.8 18.2 -28.25 18.35 -28.5 18.6 -28.65 19.25 -28.9 19.05 -29.45 18.1 -29.8 Q17.4 -30.2 17.15 -30.7 L17.0 -31.15 Q17.55 -31.2 18.2 -30.65 L18.9 -29.9 18.8 -30.9 18.1 -31.85 17.55 -32.85 Q17.4 -33.4 17.85 -33.75 18.7 -33.05 19.45 -31.2 L20.2 -30.95 20.1 -31.4 Q20.05 -31.9 20.5 -32.15 L20.85 -32.25 21.1 -32.0 21.0 -31.2 20.8 -30.5 21.2 -30.05 23.1 -27.6 Q24.2 -25.75 24.2 -24.05 24.25 -22.4 23.25 -21.55 L23.05 -21.7 22.45 -21.1 21.5 -21.0 Q20.55 -21.2 19.25 -21.85 17.8 -22.6 14.45 -24.8 L12.2 -26.0 Q10.0 -26.65 9.85 -26.85 L9.7 -26.9 9.45 -27.25 9.25 -27.65 9.2 -27.9 8.8 -27.65 8.2 -27.25 7.2 -27.35 Q4.65 -27.45 2.35 -26.15 L1.35 -25.55 1.45 -25.4 1.85 -24.45 1.85 -24.4 2.8 -23.75 3.15 -23.95 Q4.5 -24.75 7.05 -22.75 10.5 -22.25 13.9 -20.35 16.95 -18.75 19.2 -16.3 L19.55 -15.95 21.3 -12.6 21.85 -11.2 21.85 -11.15 22.85 -11.05 23.0 -11.0 25.65 -3.85 28.6 4.1 28.9 5.15 29.0 5.7 29.9 5.8 30.0 5.85 30.55 6.4 32.1 7.55 33.55 8.3 33.7 8.45 33.6 8.35 33.6 8.3 33.6 5.95 Q33.7 4.75 34.85 4.05 L36.45 4.15 36.05 4.85 35.3 5.35 35.3 5.4 35.25 5.45 Q35.75 5.7 37.25 4.85 38.7 4.05 39.4 4.45 L38.75 5.15 37.85 5.5 37.05 5.8 36.7 6.1 36.85 6.4 Q38.65 5.4 39.05 6.2 39.25 6.4 39.1 6.55 L38.85 6.7 38.25 6.8 37.7 6.7 37.3 6.95 37.4 7.3 38.2 7.65 Q38.95 8.0 39.05 8.2 39.3 8.6 39.05 8.75 L38.25 8.7 37.5 8.55 37.85 9.9 Q38.05 11.6 36.05 12.4 L35.7 12.45 35.65 12.5 Q33.8 13.0 31.4 11.3 L28.2 8.7 28.15 8.45 28.1 7.8 26.95 7.2 26.6 6.95 Q35.95 33.45 20.15 42.7 3.95 52.0 -14.7 29.55 L-15.25 28.9 -14.5 30.3 -14.4 31.1 Q-14.35 31.95 -14.45 32.35 L-13.9 32.75 -13.7 32.95 -13.05 37.0 Q-12.8 39.85 -14.2 41.3 L-14.25 41.3 -14.45 41.55 Q-16.2 42.9 -17.5 41.85 L-18.5 40.85 -18.8 41.6 -19.15 42.3 Q-19.4 42.5 -19.65 42.1 L-19.65 41.05 -19.55 40.2 -19.75 39.9 -20.2 40.15 -20.35 40.65 -20.75 41.1 -21.05 41.3 -21.4 41.05 Q-21.85 40.3 -20.1 39.3 L-20.25 39.0 -20.65 39.1 -21.3 39.65 -22.1 40.25 -23.0 40.45 Q-23.05 39.75 -21.55 38.85 -20.15 37.95 -20.1 37.4 L-20.15 37.4 -20.2 37.35 -21.0 37.75 -21.8 37.75 Q-21.85 36.8 -21.1 36.4 L-18.85 36.2 Q-18.2 36.45 -16.7 37.35 L-16.7 35.7 -16.95 33.8 -17.1 33.05 -17.1 32.95 -16.75 32.1 -17.2 31.75 -17.95 30.95 -23.35 24.4 -28.15 18.55 -28.15 18.4 -27.75 17.5 -28.7 16.3 -30.85 13.1 -30.85 13.05 -30.95 12.65 Q-31.9 9.45 -31.8 6.0 -31.7 2.15 -30.4 -1.15 -30.9 -4.3 -29.5 -5.1 L-28.65 -5.45 -28.65 -6.25 -29.25 -6.45 -29.9 -7.25 -29.95 -7.4 -30.95 -6.9 Q-33.25 -5.55 -34.45 -3.3 L-34.85 -2.4 -35.5 -2.05 Q-35.75 -1.9 -35.95 -1.85 L-35.7 -1.65 -35.55 -1.35 -35.35 -0.9 -35.3 -0.75 -35.75 1.7 -35.8 4.25 -35.75 9.9 Q-35.75 11.35 -36.15 12.25 L-36.65 13.0 -37.0 13.25 -40.15 13.1 Q-41.55 12.2 -42.65 10.35 L-43.85 7.5 -44.0 6.9 -44.7 6.75 -45.4 6.45 -45.45 6.4 -45.55 6.1 -45.4 5.95 -45.25 5.8 Q-44.85 5.6 -44.45 5.8 L-44.05 6.1 -43.95 5.4 Q-45.15 3.8 -45.3 2.75 -44.8 2.55 -44.4 2.95 L-43.8 3.85 -43.3 5.0 Q-43.0 5.05 -42.55 5.55 L-42.85 4.55 Q-43.0 3.75 -42.65 3.25 L-42.35 3.6 Q-42.05 4.15 -42.05 4.95 L-42.25 5.95 -41.85 6.4 -41.8 6.4 -41.25 5.95 -41.0 5.8 -40.65 5.8 -40.4 6.2 -40.65 6.4 -41.5 6.7 Q-40.2 8.1 -39.35 8.25 L-39.65 4.55 -40.0 0.2 -40.2 -2.3 -39.7 -2.85 -39.65 -2.9 -38.6 -3.15 -38.0 -3.1 -38.55 -3.9 -38.9 -4.75 -38.85 -4.8 -38.1 -6.8 -36.65 -10.1 Q-34.8 -13.65 -31.25 -15.7 L-30.55 -16.05 Q-30.1 -17.05 -29.3 -17.55 L-28.4 -17.75 -28.2 -18.9 -28.55 -19.35 -28.75 -19.8 -30.05 -20.45 -30.35 -21.35 -31.9 -21.05 -34.15 -20.55 Q-36.4 -19.2 -38.0 -16.15 L-38.3 -15.5 -38.35 -15.4 -39.3 -14.5 Q-39.55 -14.35 -40.15 -14.5 -39.8 -14.1 -39.85 -13.5 L-39.95 -13.15 Q-40.6 -12.45 -41.45 -12.0 -43.2 -11.0 -45.4 -10.9 L-48.95 -11.4 -50.4 -11.85 Q-51.6 -12.3 -52.55 -12.85 L-52.8 -13.0 -53.65 -14.1 -54.1 -14.0 -54.35 -13.9 Q-56.65 -15.5 -57.95 -17.8 L-58.45 -18.85 -58.75 -18.75 -59.1 -18.9 -59.2 -19.1 -58.95 -19.3 -58.8 -19.4 -58.65 -19.35 -58.6 -19.35 -58.65 -19.4 -58.75 -20.0 -59.1 -20.15 -59.5 -20.55 -59.6 -21.05 -59.05 -20.95 -58.7 -20.75 -58.4 -21.2 -58.7 -21.8 Q-59.05 -22.4 -58.65 -22.65 L-58.25 -22.2 -58.05 -21.6 -57.95 -21.35 -57.25 -21.0 -57.35 -21.6 Q-57.45 -22.0 -57.15 -22.25 L-57.05 -22.2 -57.05 -22.25 -56.8 -21.85 -56.75 -21.3 Q-56.7 -20.95 -56.9 -20.8 L-56.45 -20.4 -56.2 -20.15 -56.15 -20.15 Q-55.65 -20.05 -55.6 -20.55 L-55.45 -21.45 -55.25 -21.4 -55.0 -21.2 Q-54.65 -20.6 -54.95 -20.05 L-55.5 -19.55 -53.7 -18.1 -53.6 -17.7 -53.4 -17.2 -53.35 -17.1 -53.1 -17.35 -52.55 -17.35 Q-50.75 -16.35 -48.95 -16.2 -47.2 -16.1 -45.4 -16.7 L-43.25 -17.7 -43.1 -17.7 -42.55 -17.55 -42.45 -17.75 -42.15 -18.45 -41.55 -19.05 -41.25 -19.45 -39.6 -21.6 Q-37.4 -24.7 -34.6 -26.3 L-32.1 -27.15 -31.5 -27.25 -31.4 -27.25 -31.3 -27.4 -31.05 -28.2 -32.55 -30.55 -33.3 -31.9 Q-34.1 -31.5 -34.8 -31.4 L-35.55 -31.4 Q-36.3 -31.5 -37.45 -32.2 -38.7 -32.95 -39.3 -33.1 -40.4 -33.35 -41.55 -32.7 L-44.4 -30.3 -45.4 -29.3 -45.85 -28.95 -46.5 -29.4 Q-46.8 -29.05 -47.2 -29.0 L-47.35 -29.0 -47.45 -28.55 Q-47.75 -27.85 -48.95 -27.15 L-49.3 -26.95 Q-52.2 -25.9 -54.95 -26.85 -57.55 -27.65 -59.5 -30.05 L-60.0 -31.8 -60.15 -31.75 Q-60.5 -31.75 -60.9 -32.05 L-60.9 -32.1 -61.0 -32.35 Q-62.1 -34.2 -62.55 -36.2 L-62.6 -36.5 -62.7 -36.5 -62.9 -36.8 -63.0 -37.0 -62.85 -37.25 -62.75 -37.2 -62.75 -37.25 -62.8 -37.85 -63.2 -38.0 -63.6 -38.7 -63.5 -38.8 -62.75 -38.6 -62.35 -39.55 -62.55 -39.8 -63.05 -40.6 -62.9 -40.65 -62.25 -40.3 -61.9 -39.95 -61.8 -40.05 Q-61.45 -40.25 -61.05 -40.05 L-61.25 -40.7 -61.2 -41.65 -60.65 -41.05 Q-60.2 -40.25 -60.3 -39.6 L-60.15 -39.4 -59.35 -38.2 -59.45 -39.15 Q-59.55 -39.95 -59.25 -40.1 L-58.75 -39.45 -58.35 -37.65 -58.25 -36.0 -58.3 -36.05 -58.25 -35.85 -58.2 -35.4 Q-58.1 -35.0 -58.35 -34.75 L-57.95 -34.45 -57.05 -33.35 Q-55.65 -30.95 -52.2 -30.85 -50.55 -30.8 -48.95 -31.3 L-48.05 -31.55 -47.7 -31.05 -47.8 -31.0 -47.7 -31.0 -47.5 -31.1 -46.95 -30.85 -46.9 -30.85 -46.9 -30.9 -46.8 -32.1 -46.7 -32.15 -45.95 -32.55 -45.4 -32.9 -43.3 -34.55 -41.25 -36.2 Q-39.5 -37.2 -36.75 -36.9 L-35.45 -36.65 Q-34.1 -36.3 -33.7 -35.6 L-33.1 -36.05 -31.8 -36.35 -31.0 -36.05 -30.65 -35.95 -31.5 -36.95 -31.6 -37.15 -32.15 -38.55 Q-32.75 -38.15 -33.75 -38.7 L-34.85 -39.7 Q-35.15 -40.25 -35.05 -41.25 -34.9 -42.3 -34.35 -42.6 -33.8 -42.9 -32.7 -42.6 -31.65 -42.35 -31.3 -41.9 L-30.4 -42.8 -30.35 -42.85 -30.2 -42.95 -30.05 -43.0 -30.0 -43.05 -29.85 -43.1 -29.7 -43.2 -29.55 -43.25 -29.25 -43.45 -29.25 -43.5 -29.0 -43.6 -27.85 -43.9 Q-28.05 -44.45 -27.75 -45.5 -27.45 -46.6 -26.9 -46.95 L-25.4 -46.8 Q-24.45 -46.45 -24.15 -45.9 -23.85 -45.4 -23.8 -44.45 -23.8 -43.3 -24.5 -42.95 L-23.55 -41.8 -23.0 -40.4 -23.0 -40.35 -22.95 -40.45 -22.75 -41.55 -21.85 -42.55 -21.15 -42.85 Q-21.55 -43.5 -21.2 -44.85 L-21.05 -45.0 -21.15 -45.0 -20.75 -46.1 Q-19.65 -48.7 -17.9 -49.7 L-15.45 -50.6 Q-13.6 -51.2 -12.4 -51.9 L-11.65 -52.4 -11.55 -52.45 -10.45 -51.95 -10.4 -51.95 -10.35 -52.5 -10.2 -52.65 -10.5 -53.2 Q-8.8 -54.65 -7.8 -56.5 -6.15 -59.5 -7.55 -61.95 L-8.05 -63.25 -8.1 -63.8 -8.75 -63.95 -9.1 -64.25 -9.25 -64.35 -9.2 -64.35 -10.6 -65.25 -11.0 -65.55 -11.95 -66.5 -12.25 -67.2 Q-12.0 -67.4 -11.4 -66.9 L-10.6 -66.35 -11.25 -67.9 Q-11.95 -68.1 -12.4 -68.9 L-12.65 -69.65 Q-12.25 -69.65 -11.85 -69.25 L-11.4 -68.7 -10.9 -69.4 -10.8 -69.45 -10.95 -69.9 -10.95 -70.65 -10.8 -70.75 -10.3 -69.95 -10.3 -69.65 -9.25 -69.5 -9.1 -70.2 -8.95 -70.25 -8.55 -69.6 -8.6 -69.15 -8.05 -68.85 -8.0 -68.95 -7.75 -68.9 -7.55 -68.7 -7.45 -68.4 -7.45 -68.35 -7.25 -68.15 -5.1 -65.55 -4.65 -64.85 -4.55 -64.65 -4.55 -64.6 -4.5 -64.25 -4.7 -63.75 -3.5 -62.35 Q-2.45 -59.5 -2.9 -56.85 -3.5 -54.0 -5.9 -52.0 -7.25 -51.15 -8.2 -51.25 -8.4 -51.25 -8.6 -51.4 L-8.7 -51.2 Q-8.9 -50.95 -9.4 -50.8 L-9.35 -50.05 -11.2 -49.45 Q-13.75 -48.75 -14.7 -48.15 -15.9 -47.5 -16.2 -46.4 L-16.35 -44.4 Q-16.3 -43.1 -16.65 -42.3 L-16.95 -41.75 Q-17.4 -41.1 -18.15 -40.65 L-17.4 -39.3 -16.1 -36.85 -15.25 -36.7 -15.05 -36.65 -15.0 -36.8 -14.6 -37.25 -12.65 -39.0 Q-9.9 -40.6 -6.05 -40.95 L-3.4 -41.25 -2.9 -41.35 -2.1 -41.55 -1.3 -41.5 -1.1 -41.45 -0.95 -42.05 -0.85 -42.15 Q3.95 -45.0 4.05 -50.0 L4.35 -50.45 4.7 -50.6 4.6 -50.75 4.3 -51.15 4.0 -51.4 3.6 -53.65 2.95 -53.5 Q2.3 -53.5 1.95 -54.05 L1.95 -54.35 1.95 -54.6 2.75 -54.25 Q3.3 -54.05 3.45 -54.55 L3.5 -54.55 3.4 -55.0 3.3 -55.5 2.75 -55.65 2.25 -55.95 2.0 -56.35 2.05 -56.35 2.05 -56.45 2.85 -56.3 3.25 -55.95 Q3.2 -56.45 3.3 -56.7 L3.15 -56.9 2.75 -57.4 2.55 -58.05 Q2.9 -58.2 3.35 -57.6 L3.65 -57.05 4.2 -57.05 4.2 -57.45 4.4 -58.0 4.8 -57.7 4.9 -57.1 4.85 -56.75 5.3 -56.3 5.4 -56.25 5.4 -56.45 5.6 -56.55 5.9 -56.65 6.0 -56.45 M19.4 -8.0 L19.0 -8.1 Q21.25 -4.85 23.15 -1.15 L22.45 -3.1 20.6 -6.35 20.5 -6.9 20.5 -7.85 20.7 -7.85 20.75 -8.0 20.65 -8.15 20.5 -7.85 19.4 -8.0 M0.45 -38.7 L0.4 -38.45 0.55 -38.45 0.45 -38.7 M28.45 7.9 L28.55 7.8 28.4 7.85 28.45 7.9 M28.1 7.8 L28.4 7.85 28.1 7.7 28.1 7.8 M-13.1 -36.7 L-13.25 -36.55 -13.25 -36.5 -13.1 -36.7 M-0.55 -41.3 L-0.45 -41.45 -0.65 -41.35 -0.55 -41.3 M-42.85 -17.0 L-42.65 -16.95 -42.65 -17.15 -42.7 -17.15 -42.85 -17.0 M-24.5 -42.95 L-24.65 -43.1 -24.6 -42.95 -24.5 -42.95 M-32.15 -38.55 L-32.1 -38.6 -32.15 -38.8 -32.15 -38.55 M-23.95 -34.8 L-24.35 -34.6 -24.65 -34.35 -25.0 -34.2 -25.35 -33.95 -24.65 -34.35 -23.95 -34.8 M-32.4 -25.55 L-32.2 -25.55 -32.2 -25.65 -32.4 -25.55 M-24.45 18.05 L-24.4 18.15 -24.25 17.95 -24.55 17.95 -24.45 18.05 M-24.25 17.95 L-23.35 18.45 -22.95 18.75 Q-22.15 20.6 -21.0 22.0 L-17.3 26.3 -17.2 26.4 Q-21.25 20.95 -23.8 15.1 L-23.65 16.4 -23.8 16.95 Q-23.95 17.55 -24.25 17.95 M-14.55 32.35 L-14.6 32.65 -14.45 32.35 -14.55 32.35 M-14.55 32.7 L-14.6 32.65 -14.7 32.75 -14.55 32.7 M-16.7 37.35 L-16.7 37.4 -16.75 37.55 -16.7 37.35" fill="#3d4724" fill-opacity="0.49803922" fill-rule="evenodd" stroke="none"/>
    <path d="M3.75 -54.1 L3.65 -54.25 3.35 -54.65 3.05 -54.9 2.65 -57.15 2.0 -57.0 Q1.35 -57.0 1.0 -57.55 L1.0 -57.85 1.0 -58.1 1.85 -57.75 Q2.35 -57.55 2.5 -58.05 L2.55 -58.05 2.45 -58.5 2.35 -59.0 1.8 -59.15 1.3 -59.45 1.05 -59.85 1.1 -59.85 1.1 -59.95 1.9 -59.8 2.3 -59.45 Q2.25 -59.95 2.35 -60.2 L2.2 -60.4 1.8 -60.9 1.6 -61.55 2.4 -61.1 2.7 -60.55 3.25 -60.55 3.25 -60.95 3.45 -61.5 3.85 -61.2 3.95 -60.6 3.9 -60.25 4.35 -59.8 4.45 -59.75 4.45 -59.95 4.65 -60.05 4.95 -60.15 5.05 -59.95 5.05 -59.6 4.75 -59.4 5.45 -58.45 Q6.75 -56.15 7.0 -53.35 L6.8 -53.2 6.5 -52.85 5.7 -53.75 5.65 -53.8 5.8 -54.1 5.65 -54.9 Q5.25 -55.6 4.45 -55.15 4.15 -55.0 4.3 -54.25 L3.75 -54.1 M-11.5 -36.3 L-10.8 -35.6 -10.95 -34.15 -10.65 -33.8 -12.55 -34.35 Q-18.7 -35.85 -22.7 -33.55 -26.75 -31.2 -28.5 -25.1 L-29.15 -22.4 -29.5 -22.85 -29.7 -23.3 -31.0 -23.95 -31.3 -24.85 -32.45 -26.7 -33.0 -27.8 -33.15 -29.05 -33.15 -29.15 Q-33.05 -29.95 -32.45 -30.75 L-32.35 -30.75 -32.25 -30.9 -32.0 -31.7 -31.65 -31.15 -31.45 -30.75 -29.8 -27.9 -29.65 -27.5 -29.5 -27.2 -29.0 -28.75 -28.5 -30.55 Q-28.2 -32.2 -28.3 -34.65 -28.05 -36.35 -26.3 -37.45 L-25.6 -37.85 -24.9 -38.3 Q-23.0 -39.25 -21.5 -38.6 -19.35 -37.35 -17.85 -36.7 L-16.0 -36.25 -14.55 -35.95 -14.4 -35.95 -14.6 -36.2 -14.8 -36.55 -16.5 -39.45 -16.7 -39.85 -17.05 -40.35 -16.2 -40.2 -16.0 -40.15 -15.95 -40.3 -14.2 -40.05 -14.2 -40.0 -13.2 -39.3 -12.45 -38.25 -11.5 -36.3 M-9.05 -33.2 L-8.7 -33.45 -6.75 -33.8 -4.65 -33.2 -3.55 -32.6 -2.25 -31.75 Q-0.45 -30.45 0.4 -29.05 L0.5 -28.9 0.9 -27.9 Q-4.45 -31.4 -9.05 -33.2 M18.7 -29.35 Q19.05 -30.15 18.45 -31.95 L17.8 -31.35 17.45 -31.3 17.25 -31.75 17.4 -32.0 17.65 -32.15 18.3 -32.4 18.1 -32.95 Q17.8 -32.9 17.15 -33.3 16.45 -33.7 16.2 -34.2 16.05 -34.45 16.05 -34.65 16.6 -34.7 17.25 -34.15 L17.95 -33.4 17.85 -34.4 17.15 -35.35 16.65 -36.35 Q16.45 -36.9 16.9 -37.25 17.75 -36.55 18.5 -34.7 L19.25 -34.45 19.15 -34.9 Q19.1 -35.4 19.55 -35.65 L19.9 -35.75 20.15 -35.5 20.05 -34.7 19.85 -34.0 20.3 -33.55 22.15 -31.1 Q23.25 -29.25 23.25 -27.55 23.3 -25.9 22.3 -25.05 L22.1 -25.2 22.5 -26.1 Q22.7 -26.9 22.4 -27.6 L22.55 -28.15 22.55 -28.95 22.2 -29.2 21.65 -29.35 21.3 -28.95 20.9 -29.1 19.4 -29.05 19.25 -28.95 18.7 -29.35 M1.85 -27.25 L2.2 -27.45 Q3.55 -28.25 6.1 -26.25 L6.7 -25.7 8.4 -24.1 10.4 -21.35 10.95 -20.0 6.75 -23.65 5.7 -24.5 1.85 -27.25 M32.75 4.95 L32.65 4.85 32.65 4.8 32.65 2.45 Q32.75 1.25 33.9 0.55 L35.5 0.65 35.1 1.35 34.35 1.85 34.35 1.9 34.3 1.95 Q34.8 2.2 36.3 1.35 37.75 0.55 38.45 0.95 L37.8 1.65 36.9 2.0 36.1 2.3 35.75 2.6 35.9 2.9 Q37.7 1.9 38.1 2.7 38.3 2.9 38.15 3.05 L37.9 3.2 37.3 3.3 36.75 3.2 36.35 3.45 36.45 3.8 37.25 4.15 38.1 4.75 Q38.35 5.1 38.1 5.25 L37.3 5.2 36.55 5.05 36.9 6.4 Q37.1 8.1 35.1 8.9 L34.75 8.95 35.35 7.55 Q35.7 6.65 35.35 6.05 35.05 5.45 34.4 5.15 L34.0 4.95 Q33.3 4.75 32.8 4.95 L32.75 4.95 M-15.2 37.8 L-15.4 38.05 Q-17.15 39.4 -18.45 38.35 L-19.45 37.4 -19.75 38.1 Q-19.85 38.7 -20.05 38.8 -20.35 39.0 -20.6 38.6 L-20.6 37.55 -20.5 36.7 -20.7 36.4 -21.15 36.65 -21.3 37.15 -21.7 37.6 -22.0 37.8 -22.35 37.6 Q-22.8 36.8 -21.05 35.8 L-21.2 35.5 -21.6 35.6 -22.25 36.15 -23.05 36.75 -23.95 36.95 Q-24.0 36.25 -22.5 35.35 -21.1 34.45 -21.05 33.9 L-21.1 33.9 -21.15 33.85 Q-21.55 34.2 -21.95 34.25 L-22.75 34.25 Q-22.8 33.3 -22.05 32.9 L-19.8 32.7 Q-19.15 32.95 -17.65 33.85 L-17.65 33.9 -17.7 34.05 Q-18.15 34.4 -18.3 35.15 L-18.35 35.55 -18.05 36.85 Q-17.65 37.45 -16.75 37.6 L-15.2 37.8 M-31.35 -4.65 Q-31.85 -7.8 -30.45 -8.6 L-29.6 -8.95 -29.1 -4.45 -28.95 -3.05 Q-28.5 0.25 -27.65 3.4 L-27.9 3.15 -28.2 2.85 -29.3 1.6 -30.6 -1.55 -31.2 -3.8 -31.35 -4.65 M-29.6 -9.75 L-30.2 -9.95 -30.8 -10.75 -30.9 -10.9 Q-31.7 -12.4 -31.9 -14.6 L-32.0 -16.15 -31.95 -17.4 Q-31.9 -18.65 -31.5 -19.55 -31.05 -20.55 -30.25 -21.05 L-29.35 -21.25 Q-30.1 -16.3 -29.6 -9.75 M-37.6 9.5 L-37.95 9.75 -41.1 9.6 Q-42.5 8.7 -43.6 6.85 L-44.8 4.0 -44.95 3.4 -45.6 3.25 -46.35 2.95 -46.4 2.9 -46.5 2.6 -46.35 2.45 -46.2 2.3 Q-45.8 2.1 -45.4 2.3 L-45.0 2.6 -44.9 1.9 Q-46.1 0.3 -46.25 -0.75 -45.75 -0.95 -45.35 -0.55 L-44.75 0.35 -44.25 1.5 Q-43.95 1.55 -43.5 2.05 L-43.8 1.1 Q-43.95 0.25 -43.6 -0.25 L-43.3 0.1 Q-43.0 0.65 -43.0 1.45 L-43.2 2.45 -42.8 2.9 -42.75 2.9 -42.2 2.45 -41.95 2.3 -41.6 2.3 -41.35 2.7 -41.6 2.9 -42.45 3.2 Q-41.15 4.6 -40.3 4.75 L-40.25 5.35 -40.4 5.45 Q-41.05 5.85 -41.2 6.75 L-41.25 7.15 -41.75 7.25 Q-41.95 7.35 -41.95 7.85 L-41.9 8.3 -41.3 8.7 -40.75 8.8 -39.4 9.6 -37.6 9.5 M-54.6 -17.6 L-55.05 -17.5 -55.3 -17.4 Q-57.6 -19.0 -58.9 -21.3 L-59.4 -22.35 -59.55 -22.85 -59.6 -22.9 -59.7 -23.5 -59.65 -24.25 -59.35 -24.7 -59.65 -25.3 Q-60.0 -25.9 -59.6 -26.15 L-59.2 -25.7 -59.0 -25.1 -58.9 -24.85 -58.2 -24.5 -58.3 -25.1 Q-58.4 -25.5 -58.1 -25.75 L-58.0 -25.7 -58.0 -25.75 -57.75 -25.35 -57.7 -24.8 Q-57.65 -24.45 -57.85 -24.25 L-57.4 -23.9 -57.15 -23.65 -57.1 -23.65 Q-56.55 -23.55 -56.55 -24.05 L-56.35 -24.95 -56.15 -24.9 -55.95 -24.7 Q-55.6 -24.1 -55.9 -23.55 L-56.45 -23.05 -54.65 -21.6 -54.55 -21.2 -54.35 -20.7 -54.3 -20.6 -54.7 -20.2 Q-55.3 -20.65 -55.55 -20.5 -56.35 -20.05 -55.95 -19.35 -55.7 -18.9 -55.3 -18.8 L-55.0 -18.8 -54.95 -18.7 -54.6 -17.6 M-60.95 -35.3 L-61.1 -35.25 Q-61.45 -35.25 -61.85 -35.55 L-61.85 -35.6 -61.95 -35.85 Q-63.05 -37.7 -63.5 -39.7 L-63.55 -40.0 -63.65 -40.0 -63.85 -40.3 -63.95 -40.5 -63.8 -40.75 -63.7 -40.7 -63.7 -40.75 -63.75 -41.35 -64.15 -41.5 -64.55 -42.2 -64.45 -42.3 -63.65 -42.1 -63.3 -43.05 -63.5 -43.3 -64.0 -44.1 -63.85 -44.15 -63.2 -43.8 -62.85 -43.45 -62.75 -43.55 Q-62.4 -43.75 -62.0 -43.55 L-62.2 -44.2 -62.15 -45.15 -61.6 -44.55 Q-61.15 -43.75 -61.25 -43.1 L-61.1 -42.9 -60.3 -41.7 Q-60.2 -41.9 -60.4 -42.65 -60.5 -43.45 -60.2 -43.6 L-59.7 -42.95 Q-59.4 -42.4 -59.3 -41.15 L-59.2 -39.5 -59.25 -39.55 -59.2 -39.35 -59.15 -38.9 Q-59.05 -38.5 -59.3 -38.25 L-59.95 -38.5 -60.15 -39.05 -60.8 -39.85 -61.1 -39.75 Q-61.45 -39.55 -61.4 -38.95 L-61.15 -37.85 -61.1 -37.75 -61.05 -37.65 -61.1 -37.3 -61.1 -35.9 -61.05 -35.45 -60.95 -35.3 M-9.05 -67.3 L-9.7 -67.45 -10.05 -67.75 -10.15 -67.8 -10.2 -67.85 -10.15 -67.85 Q-10.55 -68.05 -11.55 -68.75 L-11.95 -69.05 -12.9 -70.0 -13.2 -70.7 Q-12.95 -70.9 -12.35 -70.4 L-11.55 -69.85 -12.2 -71.4 Q-12.9 -71.6 -13.35 -72.4 L-13.6 -73.15 Q-13.2 -73.15 -12.75 -72.75 L-12.35 -72.2 -11.85 -72.9 -11.75 -72.95 -11.9 -73.4 -11.9 -74.15 -11.75 -74.25 -11.25 -73.45 -11.25 -73.15 -10.2 -73.0 -10.05 -73.7 -9.9 -73.75 -9.5 -73.1 -9.55 -72.65 -9.0 -72.35 -8.95 -72.45 -8.7 -72.4 -8.5 -72.2 -8.4 -71.9 -8.4 -71.85 -8.2 -71.65 -6.05 -69.05 -5.6 -68.35 -5.45 -68.15 -5.45 -68.1 -5.45 -67.75 -5.65 -67.25 -5.8 -67.35 -6.3 -67.75 Q-7.05 -68.3 -7.7 -68.45 L-7.75 -68.7 -8.0 -69.05 -8.55 -69.45 -9.7 -69.35 -9.6 -69.05 -9.35 -68.4 -8.95 -67.95 -9.05 -67.75 -9.05 -67.3" fill="#1b1c0f" fill-rule="evenodd" stroke="none"/>
    <path d="M6.5 -52.85 L7.1 -51.65 7.1 -51.3 6.8 -48.95 Q5.8 -43.35 2.2 -41.25 1.35 -40.75 0.4 -40.5 L0.15 -40.65 -0.65 -41.35 -0.55 -41.95 -0.4 -41.95 Q-0.25 -41.95 -0.15 -42.05 0.45 -42.35 0.65 -42.95 0.8 -43.55 0.45 -44.15 L-0.35 -44.9 -1.4 -44.95 -1.6 -44.85 -2.05 -44.95 -1.9 -45.55 -1.8 -45.65 Q3.0 -48.5 3.1 -53.5 L3.4 -53.95 3.75 -54.1 4.3 -54.25 Q4.95 -54.3 5.65 -53.8 L5.7 -53.75 6.5 -52.85 M8.25 -33.85 L8.5 -34.4 9.2 -35.1 9.25 -35.15 10.0 -35.3 12.0 -33.85 15.65 -31.45 18.7 -29.35 19.25 -28.95 19.4 -29.05 20.9 -29.1 21.3 -28.95 22.25 -28.0 22.4 -27.6 Q22.7 -26.9 22.5 -26.1 L22.1 -25.2 21.5 -24.6 20.55 -24.5 18.3 -25.35 Q16.85 -26.1 13.5 -28.3 L11.25 -29.5 Q9.05 -30.15 8.9 -30.35 L8.75 -30.4 8.5 -30.75 8.3 -31.15 8.25 -31.4 8.5 -31.75 9.05 -31.4 9.45 -31.35 Q9.85 -31.55 9.95 -32.15 L9.75 -33.05 Q9.5 -33.55 9.05 -33.6 L8.4 -33.4 8.25 -33.85 M20.9 -14.65 L21.9 -14.55 22.05 -14.5 24.7 -7.35 Q27.05 -0.6 27.65 0.6 L27.95 1.65 28.05 2.2 28.15 2.9 28.15 3.15 Q28.1 4.0 27.6 4.3 L27.45 4.35 27.15 4.2 27.15 4.3 Q26.75 4.2 26.0 3.7 L25.65 3.45 25.3 2.45 Q23.95 -1.3 22.2 -4.65 L21.5 -6.6 19.65 -9.85 19.55 -10.4 19.55 -11.35 19.75 -11.35 20.25 -11.5 Q20.45 -10.65 20.8 -10.1 L21.7 -9.05 Q22.2 -9.8 21.95 -10.9 21.75 -11.9 21.15 -12.55 L21.2 -12.85 Q21.25 -13.55 20.9 -14.65 M-16.2 25.4 L-15.45 26.8 -15.35 27.6 Q-15.3 28.45 -15.4 28.85 L-15.5 28.85 -15.55 29.15 -15.65 29.25 -16.9 29.15 -17.15 29.05 -17.7 28.6 -18.15 28.25 -18.9 27.45 Q-19.6 26.35 -24.3 20.9 L-29.1 15.05 -29.1 14.9 -28.7 14.0 -27.35 15.15 -27.05 15.25 -26.05 16.8 Q-25.15 17.55 -24.25 17.5 L-24.7 16.15 -25.6 15.0 -25.55 15.0 -25.35 14.65 -25.2 14.45 -24.3 14.95 -23.9 15.25 Q-23.1 17.1 -21.95 18.5 L-18.25 22.8 -18.15 22.9 -16.2 25.4 M-36.9 -5.35 L-36.65 -5.15 -36.5 -4.85 -36.3 -4.4 -36.25 -4.25 -36.7 -1.8 -36.75 0.75 -36.7 6.4 Q-36.7 7.85 -37.1 8.75 L-37.6 9.5 -39.4 9.6 -40.75 8.8 -40.95 8.5 -41.25 7.15 -41.2 6.75 Q-41.05 5.85 -40.4 5.45 L-40.25 5.35 -40.3 4.75 -40.6 1.05 -40.95 -3.3 -41.15 -5.8 -40.65 -6.35 -40.6 -6.4 -39.55 -6.65 -38.95 -6.6 -38.75 -6.2 -39.15 -5.75 -39.1 -4.9 Q-38.8 -4.45 -38.3 -4.3 -37.85 -4.05 -37.45 -4.3 L-37.3 -4.6 -37.3 -5.3 -36.9 -5.35 M-41.1 -18.0 Q-40.75 -17.6 -40.8 -16.95 L-40.9 -16.65 Q-41.55 -15.95 -42.4 -15.5 -44.15 -14.5 -46.35 -14.4 L-49.9 -14.9 -51.35 -15.35 -53.5 -16.35 -53.75 -16.5 -54.6 -17.6 -54.95 -18.7 -55.0 -18.8 Q-55.1 -19.65 -54.7 -20.2 L-54.3 -20.6 -54.05 -20.8 -53.5 -20.8 Q-51.7 -19.85 -49.9 -19.7 -48.15 -19.6 -46.35 -20.2 -45.25 -20.6 -44.2 -21.2 L-44.05 -21.2 -43.5 -21.05 -43.6 -20.6 -43.65 -20.6 -43.8 -20.5 Q-44.25 -20.25 -44.25 -19.55 -44.3 -18.95 -44.0 -18.45 -43.7 -17.9 -43.1 -17.7 L-41.95 -17.9 -41.6 -18.2 -41.1 -18.0 M-32.0 -31.7 L-33.5 -34.05 -34.25 -35.4 -34.9 -37.15 Q-35.2 -38.05 -34.9 -38.65 L-34.7 -39.0 -34.65 -39.1 -34.05 -39.55 -32.75 -39.85 -31.95 -39.55 -31.2 -39.25 -29.6 -38.85 Q-26.15 -38.85 -24.8 -41.15 -24.15 -42.25 -23.95 -43.9 L-23.95 -43.85 -23.9 -43.95 -23.7 -45.05 Q-23.5 -45.65 -22.8 -46.05 L-22.1 -46.35 -21.95 -46.35 -21.55 -46.35 Q-20.9 -46.3 -20.3 -45.6 L-19.1 -44.15 -18.35 -42.8 -17.05 -40.35 -16.7 -39.85 -16.5 -39.45 -14.8 -36.55 -14.6 -36.2 -14.4 -35.95 -14.55 -35.95 -16.0 -36.25 -17.85 -36.7 Q-19.35 -37.35 -21.5 -38.6 -23.0 -39.25 -24.9 -38.3 L-25.3 -38.1 -25.6 -37.85 -25.95 -37.7 -26.3 -37.45 Q-28.05 -36.35 -28.3 -34.65 -28.2 -32.2 -28.5 -30.55 L-29.0 -28.75 -29.5 -27.2 -29.65 -27.5 -29.8 -27.9 -31.45 -30.75 -31.65 -31.15 -32.0 -31.7 M-48.3 -32.5 L-48.4 -32.05 Q-48.7 -31.35 -49.9 -30.65 L-50.25 -30.45 Q-53.15 -29.4 -55.9 -30.35 -58.5 -31.15 -60.45 -33.55 L-60.95 -35.3 -61.05 -35.45 -61.1 -35.9 -61.1 -37.3 -61.05 -37.65 -60.3 -38.45 -59.95 -38.5 -59.3 -38.25 -58.9 -37.95 -58.0 -36.85 Q-56.6 -34.45 -53.15 -34.35 L-49.9 -34.8 -49.0 -35.05 -48.65 -34.55 -48.75 -34.5 Q-49.1 -34.25 -49.05 -33.6 L-48.95 -32.95 -48.3 -32.5 M-11.15 -56.15 L-11.45 -56.7 Q-9.75 -58.15 -8.75 -60.0 -7.1 -63.0 -8.5 -65.45 L-9.0 -66.75 -9.05 -67.3 -9.05 -67.75 -8.95 -67.95 -8.7 -68.25 -7.7 -68.45 Q-7.05 -68.3 -6.3 -67.75 L-5.8 -67.35 -5.65 -67.25 -4.45 -65.85 Q-3.4 -63.0 -3.85 -60.35 -4.45 -57.5 -6.85 -55.5 -8.2 -54.65 -9.1 -54.75 L-9.55 -54.9 Q-9.4 -55.2 -9.65 -55.65 L-10.15 -56.1 -11.05 -56.25 -11.15 -56.15" fill="#404724" fill-rule="evenodd" stroke="none"/>
    <path d="M-59.4 -22.35 L-59.7 -22.25 Q-59.9 -22.2 -60.0 -22.4 L-60.15 -22.6 -59.9 -22.8 -59.75 -22.9 -59.6 -22.85 -59.55 -22.85 -59.4 -22.35 M-59.7 -23.5 L-60.0 -23.65 -60.45 -24.05 -60.55 -24.55 -60.0 -24.45 -59.65 -24.25 -59.7 -23.5 M-34.25 -35.4 Q-35.05 -35.0 -35.75 -34.9 -36.6 -35.65 -37.05 -37.4 -37.55 -39.5 -36.55 -40.1 L-36.4 -40.15 Q-35.05 -39.8 -34.65 -39.1 L-34.7 -39.0 -34.9 -38.65 Q-35.2 -38.05 -34.9 -37.15 L-34.25 -35.4 M-47.45 -32.9 Q-47.75 -32.55 -48.15 -32.5 L-48.3 -32.5 -48.95 -32.95 -49.05 -33.6 Q-49.1 -34.25 -48.75 -34.5 L-48.65 -34.5 -48.45 -34.6 -47.9 -34.35 -47.85 -34.35 -47.9 -34.3 -47.75 -33.35 -47.45 -32.9 M-33.1 -42.05 L-34.7 -42.2 -35.8 -43.2 Q-36.1 -43.75 -36.0 -44.75 -35.85 -45.8 -35.3 -46.1 -34.75 -46.4 -33.65 -46.1 -32.6 -45.85 -32.25 -45.4 -32.8 -44.75 -33.0 -43.95 L-33.1 -42.3 -33.1 -42.05 M-28.8 -47.4 Q-29.0 -47.95 -28.7 -49.0 -28.4 -50.1 -27.85 -50.45 L-26.35 -50.3 Q-25.4 -49.95 -25.1 -49.4 -24.8 -48.9 -24.75 -47.95 -24.75 -46.8 -25.45 -46.45 L-25.6 -46.6 Q-26.25 -47.1 -27.1 -47.3 L-28.8 -47.4 M-22.1 -46.35 Q-22.5 -47.0 -22.15 -48.35 L-22.0 -48.5 Q-21.0 -49.05 -19.45 -47.6 -18.2 -46.35 -17.9 -45.25 -18.35 -44.6 -19.1 -44.15 L-20.3 -45.6 Q-20.9 -46.3 -21.55 -46.35 L-21.95 -46.35 -22.1 -46.35 M-11.35 -55.45 L-11.3 -56.0 -11.15 -56.15 -11.05 -56.25 -10.15 -56.1 -9.65 -55.65 Q-9.4 -55.2 -9.55 -54.9 L-9.65 -54.7 -10.35 -54.3 -10.55 -54.85 -11.35 -55.4 -11.35 -55.45 M4.3 -54.25 Q4.15 -55.0 4.45 -55.15 5.25 -55.6 5.65 -54.9 L5.8 -54.1 5.65 -53.8 Q4.95 -54.3 4.3 -54.25 M22.4 -27.6 L22.25 -28.0 21.3 -28.95 21.65 -29.35 22.2 -29.2 22.55 -28.95 22.55 -28.15 22.4 -27.6 M-1.4 -44.95 L-0.35 -44.9 0.45 -44.15 Q0.8 -43.55 0.65 -42.95 0.45 -42.35 -0.15 -42.05 -0.25 -41.95 -0.4 -41.95 L-0.5 -42.2 Q-0.4 -43.55 -0.75 -44.15 L-1.5 -44.8 -1.4 -44.95 M8.4 -33.4 L9.05 -33.6 Q9.5 -33.55 9.75 -33.05 L9.95 -32.15 Q9.85 -31.55 9.45 -31.35 L9.05 -31.4 8.5 -31.75 8.65 -32.6 8.4 -33.4 M8.4 -24.1 L10.55 -23.25 Q12.15 -22.35 13.0 -20.85 L13.2 -20.0 12.95 -19.35 11.6 -19.45 11.4 -19.6 10.95 -20.0 10.4 -21.35 8.4 -24.1 M20.25 -11.5 L20.6 -11.65 Q21.1 -11.9 21.15 -12.55 21.75 -11.9 21.95 -10.9 22.2 -9.8 21.7 -9.05 L20.8 -10.1 Q20.45 -10.65 20.25 -11.5 M28.15 3.15 L28.75 4.05 Q29.35 4.95 28.8 5.25 28.4 5.5 28.05 5.05 L27.5 4.4 27.6 4.3 Q28.1 4.0 28.15 3.15 M-8.95 -67.95 L-9.35 -68.4 -9.6 -69.05 -9.7 -69.35 -8.55 -69.45 -8.0 -69.05 -7.75 -68.7 -7.7 -68.45 -8.7 -68.25 -8.95 -67.95 M-59.95 -38.5 L-60.3 -38.45 -61.05 -37.65 -61.1 -37.75 -61.15 -37.85 -61.4 -38.95 Q-61.45 -39.55 -61.1 -39.75 L-60.8 -39.85 -60.15 -39.05 -59.95 -38.5 M-43.8 -20.5 L-43.6 -20.45 -43.4 -19.5 Q-43.1 -18.95 -41.85 -18.35 L-41.6 -18.2 -41.95 -17.9 -43.1 -17.7 Q-43.7 -17.9 -44.0 -18.45 -44.3 -18.95 -44.25 -19.55 -44.25 -20.25 -43.8 -20.5 M-55.0 -18.8 L-55.3 -18.8 Q-55.7 -18.9 -55.95 -19.35 -56.35 -20.05 -55.55 -20.5 -55.3 -20.65 -54.7 -20.2 -55.1 -19.65 -55.0 -18.8 M-14.2 -40.0 L-14.05 -40.2 -13.05 -40.25 -12.25 -39.75 Q-12.05 -39.45 -12.35 -38.65 L-12.45 -38.25 -13.2 -39.3 -14.2 -40.0 M-2.25 -31.75 L-3.55 -32.6 -4.65 -33.2 -4.0 -33.7 -3.1 -34.0 -1.85 -34.2 Q-1.0 -34.15 -0.7 -33.6 -0.5 -33.25 -1.5 -32.4 L-2.25 -31.75 M-33.35 -29.05 L-33.15 -29.05 -33.0 -27.8 -32.45 -26.7 -32.9 -26.8 Q-33.7 -26.9 -33.9 -27.25 -34.1 -27.6 -33.9 -28.2 L-33.35 -29.05 M-31.9 -14.6 L-32.95 -14.3 -34.35 -14.2 Q-34.65 -14.75 -34.25 -15.55 -33.95 -16.25 -33.45 -16.55 L-32.8 -17.1 -31.95 -17.4 -32.0 -16.15 -31.9 -14.6 M-38.75 -6.2 L-38.1 -5.6 -37.3 -5.3 -37.3 -4.6 -37.45 -4.3 Q-37.85 -4.05 -38.3 -4.3 -38.8 -4.45 -39.1 -4.9 L-39.15 -5.75 -38.75 -6.2 M-30.6 -1.55 L-29.3 1.6 -28.2 2.85 -28.2 3.55 Q-28.2 4.4 -28.8 4.75 L-29.45 4.6 -30.15 4.1 Q-31.0 2.6 -31.0 0.7 -31.0 -0.55 -30.6 -1.55 M-25.6 15.0 L-24.7 16.15 -24.25 17.5 Q-25.15 17.55 -26.05 16.8 L-27.05 15.25 Q-26.45 15.5 -26.0 15.25 L-25.6 15.0 M-41.25 7.15 L-40.95 8.5 -40.75 8.8 -41.3 8.7 -41.9 8.3 -41.95 7.85 Q-41.95 7.35 -41.75 7.25 L-41.25 7.15 M-15.5 29.2 L-15.2 30.0 Q-15.0 30.6 -15.45 30.85 -15.95 31.1 -16.45 30.1 L-16.9 29.15 -15.65 29.25 -15.5 29.2" fill="#292d17" fill-rule="evenodd" stroke="none"/>
    <path d="M-0.65 -41.35 Q-0.75 -40.8 -1.0 -40.7 -1.2 -40.5 -2.25 -40.25 L-2.4 -40.25 -3.15 -40.3 Q-6.5 -40.5 -8.8 -39.2 L-10.4 -37.55 -11.5 -36.3 -12.45 -38.25 -12.35 -38.65 Q-12.05 -39.45 -12.25 -39.75 L-13.05 -40.25 -14.05 -40.2 -14.2 -40.05 -15.95 -40.3 -15.55 -40.75 -13.6 -42.5 Q-10.85 -44.1 -7.0 -44.45 L-4.35 -44.75 -3.85 -44.85 -3.05 -45.05 -2.25 -45.0 -2.05 -44.95 -1.6 -44.85 -1.5 -44.8 -0.75 -44.15 Q-0.4 -43.55 -0.5 -42.2 L-0.55 -41.95 -0.65 -41.35 M-6.75 -33.8 L-6.1 -34.25 Q-2.5 -36.3 1.4 -36.15 L5.0 -35.75 7.15 -35.4 7.3 -35.4 7.8 -34.65 8.25 -33.85 8.4 -33.4 8.65 -32.6 8.5 -31.75 8.25 -31.4 7.85 -31.15 7.25 -30.75 6.25 -30.85 Q3.7 -30.95 1.4 -29.65 L0.4 -29.05 Q-0.45 -30.45 -2.25 -31.75 L-1.5 -32.4 Q-0.5 -33.25 -0.7 -33.6 -1.0 -34.15 -1.85 -34.2 L-3.1 -34.0 -4.0 -33.7 -4.65 -33.2 -6.75 -33.8 M6.1 -26.25 Q9.55 -25.75 13.0 -23.85 16.0 -22.25 18.25 -19.8 L18.6 -19.45 20.35 -16.1 20.9 -14.7 20.9 -14.65 Q21.25 -13.55 21.2 -12.85 L21.15 -12.55 Q21.1 -11.9 20.6 -11.65 L20.25 -11.5 19.75 -11.35 19.8 -11.5 19.7 -11.65 19.55 -11.35 18.45 -11.5 18.05 -11.6 Q15.1 -15.95 11.4 -19.6 L11.6 -19.45 12.95 -19.35 13.2 -20.0 13.0 -20.85 Q12.15 -22.35 10.55 -23.25 L8.4 -24.1 6.7 -25.7 6.1 -26.25 M28.05 2.2 L28.95 2.3 29.05 2.35 29.6 2.9 31.15 4.05 32.6 4.8 32.75 4.95 32.8 4.95 Q33.3 4.75 34.0 4.95 L34.4 5.15 Q35.05 5.45 35.35 6.05 35.7 6.65 35.35 7.55 L34.75 8.95 34.7 9.0 Q32.85 9.5 30.45 7.8 28.6 6.5 27.25 5.2 L27.2 4.95 27.15 4.3 27.45 4.35 27.5 4.4 28.05 5.05 Q28.4 5.5 28.8 5.25 29.35 4.95 28.75 4.05 L28.15 3.15 28.15 2.9 28.05 2.2 M-15.4 28.85 L-14.85 29.25 -14.65 29.45 -14.0 33.5 Q-13.75 36.35 -15.15 37.8 L-15.2 37.8 -16.75 37.6 Q-17.65 37.45 -18.05 36.85 L-18.35 35.55 -18.3 35.15 Q-18.15 34.4 -17.7 34.05 L-17.65 33.85 -17.65 32.2 -17.9 30.3 -18.05 29.55 -18.05 29.45 -17.7 28.6 -17.15 29.05 -16.9 29.15 -16.45 30.1 Q-15.95 31.1 -15.45 30.85 -15.0 30.6 -15.2 30.0 L-15.5 29.2 -15.55 29.15 -15.4 28.85 M-28.7 14.0 L-29.65 12.8 -31.8 9.6 -31.8 9.55 -31.9 9.15 Q-32.85 5.95 -32.75 2.5 -32.65 -1.35 -31.35 -4.65 L-31.2 -3.8 -30.6 -1.55 Q-31.0 -0.55 -31.0 0.7 -31.0 2.6 -30.15 4.1 L-29.45 4.6 -28.8 4.75 Q-28.2 4.4 -28.2 3.55 L-28.2 2.85 -27.9 3.15 -27.65 3.4 Q-26.55 7.6 -24.75 11.6 L-24.6 12.9 -24.75 13.45 Q-24.9 14.05 -25.2 14.45 L-25.5 14.45 -25.4 14.55 -25.35 14.65 -25.55 15.0 -25.6 15.0 -26.0 15.25 Q-26.45 15.5 -27.05 15.25 L-27.35 15.15 -28.7 14.0 M-30.9 -10.9 L-31.9 -10.4 Q-34.2 -9.05 -35.4 -6.8 L-35.8 -5.9 -36.45 -5.55 -36.9 -5.35 -37.3 -5.3 -38.1 -5.6 -38.75 -6.2 -38.95 -6.6 -39.5 -7.4 -39.85 -8.25 -39.8 -8.3 -39.05 -10.3 -37.6 -13.6 Q-35.75 -17.15 -32.2 -19.2 L-31.5 -19.55 Q-31.9 -18.65 -31.95 -17.4 L-32.8 -17.1 -33.45 -16.55 Q-33.95 -16.25 -34.25 -15.55 -34.65 -14.75 -34.35 -14.2 L-32.95 -14.3 -31.9 -14.6 Q-31.7 -12.4 -30.9 -10.9 M-31.3 -24.85 L-32.85 -24.55 -35.1 -24.05 Q-37.35 -22.7 -38.95 -19.65 L-39.25 -19.0 -39.3 -18.9 -40.25 -18.0 Q-40.5 -17.85 -41.1 -18.0 L-41.6 -18.2 -41.85 -18.35 Q-43.1 -18.95 -43.4 -19.5 L-43.6 -20.45 -43.6 -20.6 -43.5 -21.05 -43.4 -21.25 -43.1 -21.95 -42.5 -22.55 -42.2 -22.95 -40.55 -25.1 Q-38.3 -28.2 -35.55 -29.8 -34.65 -30.35 -33.05 -30.65 L-32.45 -30.75 Q-33.05 -29.95 -33.15 -29.15 L-33.35 -29.05 -33.9 -28.2 Q-34.1 -27.6 -33.9 -27.25 -33.7 -26.9 -32.9 -26.8 L-32.45 -26.7 -31.3 -24.85 M-35.75 -34.9 L-36.5 -34.9 Q-37.25 -35.0 -38.4 -35.7 -39.65 -36.45 -40.25 -36.6 -41.35 -36.85 -42.5 -36.2 L-45.35 -33.8 -46.35 -32.8 -46.8 -32.45 -47.45 -32.9 -47.75 -33.35 -47.9 -34.3 -47.85 -34.35 -47.85 -34.4 -47.75 -35.6 -47.65 -35.65 -46.9 -36.05 -46.35 -36.4 -44.25 -38.05 -42.2 -39.7 Q-40.45 -40.7 -37.7 -40.4 L-36.4 -40.15 -36.55 -40.1 Q-37.55 -39.5 -37.05 -37.4 -36.6 -35.65 -35.75 -34.9 M-31.95 -39.55 L-31.6 -39.45 -32.45 -40.45 -32.55 -40.65 -33.1 -42.05 -33.05 -42.1 -33.1 -42.3 -33.0 -43.95 Q-32.8 -44.75 -32.25 -45.4 L-31.35 -46.3 -31.3 -46.35 -31.15 -46.45 -31.0 -46.5 -30.95 -46.55 -30.8 -46.6 -30.65 -46.7 -30.5 -46.75 -30.2 -46.95 -30.2 -47.0 Q-30.1 -47.0 -29.95 -47.1 L-28.8 -47.4 -27.1 -47.3 Q-26.25 -47.1 -25.6 -46.6 L-25.55 -46.45 -25.45 -46.45 -24.5 -45.3 -23.95 -43.9 Q-24.15 -42.25 -24.8 -41.15 -26.15 -38.85 -29.6 -38.85 L-31.2 -39.25 -31.95 -39.55 M-22.0 -48.5 L-22.1 -48.5 -21.7 -49.6 Q-20.6 -52.2 -18.85 -53.2 L-16.4 -54.1 Q-14.55 -54.7 -13.35 -55.4 L-12.6 -55.9 -12.5 -55.95 -11.4 -55.45 -11.35 -55.45 -11.35 -55.4 -10.55 -54.85 -10.35 -54.3 -10.3 -53.55 -12.15 -52.95 Q-14.7 -52.25 -15.65 -51.65 -16.85 -51.0 -17.15 -49.9 L-17.3 -47.9 Q-17.25 -46.6 -17.6 -45.8 L-17.9 -45.25 Q-18.2 -46.35 -19.45 -47.6 -21.0 -49.05 -22.0 -48.5" fill="#515c2e" fill-rule="evenodd" stroke="none"/>
    <path d="M-10.65 -33.8 L-9.05 -33.2 Q-4.45 -31.4 0.9 -27.9 L1.85 -27.25 5.7 -24.5 6.75 -23.65 10.95 -20.0 11.4 -19.6 Q15.1 -15.95 18.05 -11.6 20.3 -8.35 22.2 -4.65 23.95 -1.3 25.3 2.45 L25.65 3.45 Q35.0 29.95 19.2 39.2 3.0 48.5 -15.65 26.05 L-16.2 25.4 -18.15 22.9 Q-22.2 17.45 -24.75 11.6 -26.55 7.6 -27.65 3.4 -28.5 0.25 -28.95 -3.05 L-29.1 -4.45 -29.6 -8.95 -29.6 -9.75 Q-30.1 -16.3 -29.35 -21.25 L-29.15 -22.4 -28.5 -25.1 Q-26.75 -31.2 -22.7 -33.55 -18.7 -35.85 -12.55 -34.35 L-10.65 -33.8 M20.9 -0.05 L20.25 -1.55 Q16.65 -9.45 10.55 -16.45 4.45 -23.45 -2.4 -27.5 -9.6 -31.85 -15.9 -31.85 L-20.15 -31.15 -22.7 -30.05 -23.0 -29.9 Q-24.3 -27.6 -25.65 -22.6 L-25.7 -22.55 -25.75 -22.3 -26.1 -21.25 Q-27.15 -17.45 -27.6 -14.7 L-27.95 -11.15 Q-27.95 -4.0 -24.95 4.5 -21.9 13.05 -16.7 20.45 -5.0 37.0 9.3 37.75 11.55 39.7 13.8 39.7 14.6 39.7 18.2 37.55 21.85 35.35 22.75 34.25 24.85 31.8 25.6 29.5 26.55 26.65 25.95 23.0 L25.95 22.7 Q25.95 3.25 20.9 -0.05" fill="#657d02" fill-rule="evenodd" stroke="none"/>
    <path d="M-25.65 -22.6 Q-24.3 -27.6 -23.0 -29.9 L-22.7 -30.05 -20.15 -31.15 -15.9 -31.85 Q-9.6 -31.85 -2.4 -27.5 4.45 -23.45 10.55 -16.45 16.65 -9.45 20.25 -1.55 L20.9 -0.05 Q19.85 -0.75 18.6 -0.75 17.05 -0.75 16.0 0.3 L15.2 0.25 Q11.55 0.25 10.3 3.55 9.3 6.15 9.95 9.55 10.35 11.75 9.75 15.5 8.95 20.2 8.95 22.05 8.95 23.9 9.65 25.8 6.4 29.85 6.4 32.15 6.4 35.05 8.95 37.45 L9.3 37.75 Q-5.0 37.0 -16.7 20.45 -21.9 13.05 -24.95 4.5 -27.95 -4.0 -27.95 -11.15 L-27.6 -14.7 -27.6 -13.75 Q-27.6 -6.75 -23.75 3.1 -19.25 14.65 -13.8 14.65 L-13.5 14.65 -10.5 19.6 Q-5.5 27.2 -1.95 27.2 -0.2 27.2 0.3 26.55 0.6 26.15 0.6 24.8 0.6 22.55 -1.3 18.6 L-2.25 16.75 -1.0 15.3 Q1.6 12.3 1.6 10.0 1.6 6.35 -1.6 -2.75 -4.85 -11.85 -4.85 -14.2 -4.85 -15.9 -4.2 -17.8 L-3.55 -20.0 Q-3.55 -22.65 -5.8 -24.45 L-6.8 -25.15 -6.75 -25.9 Q-6.75 -27.5 -7.55 -28.4 -8.05 -28.95 -8.9 -29.25 L-9.75 -29.15 -10.6 -29.3 Q-11.55 -29.3 -11.9 -28.95 L-12.2 -28.0 -11.05 -26.0 -12.55 -25.4 -13.35 -24.85 -14.9 -26.5 -15.7 -26.95 -16.0 -27.05 -16.95 -27.3 -18.8 -27.7 Q-23.15 -27.7 -25.65 -22.6" fill="#a9d202" fill-rule="evenodd" stroke="none"/>
    <path d="M-25.65 -22.6 Q-23.15 -27.7 -18.8 -27.7 L-16.95 -27.3 -16.0 -27.05 -15.7 -26.95 -14.9 -26.5 -13.35 -24.85 -13.2 -24.7 Q-11.25 -21.85 -11.25 -18.55 -11.25 -17.05 -11.9 -15.15 -12.55 -13.3 -12.55 -11.95 -12.55 -8.9 -11.1 -6.0 L-7.9 -0.9 Q-3.25 6.0 -3.25 12.9 L-3.35 15.0 Q-3.55 16.85 -4.25 17.8 -5.0 18.85 -6.3 18.85 -7.95 18.85 -9.55 16.3 -11.15 13.7 -11.9 13.7 -12.35 13.7 -12.65 14.2 -12.9 14.6 -13.5 14.65 L-13.8 14.65 Q-19.25 14.65 -23.75 3.1 -27.6 -6.75 -27.6 -13.75 L-27.6 -14.7 Q-27.15 -17.45 -26.1 -21.25 L-25.75 -22.3 -25.7 -22.55 -25.65 -22.6 M-11.05 -26.0 L-12.2 -28.0 -11.9 -28.95 Q-11.55 -29.3 -10.6 -29.3 L-9.75 -29.15 -8.9 -29.25 Q-8.05 -28.95 -7.55 -28.4 -6.75 -27.5 -6.75 -25.9 L-6.8 -25.15 Q-7.1 -23.85 -8.35 -23.85 -9.6 -23.85 -11.05 -26.0 M9.3 37.75 L8.95 37.45 Q6.4 35.05 6.4 32.15 6.4 29.85 9.65 25.8 L10.35 24.85 Q14.25 20.15 14.1 16.6 13.7 8.25 13.9 6.35 14.3 1.95 16.0 0.3 17.05 -0.75 18.6 -0.75 19.85 -0.75 20.9 -0.05 24.05 7.55 24.05 14.35 24.05 20.9 22.8 25.8 21.55 25.2 20.0 25.4 15.45 26.0 15.45 31.05 15.45 32.25 15.8 32.7 16.55 33.85 18.95 34.0 15.7 37.8 10.55 37.8 L9.3 37.75 M-10.5 -26.1 L-10.45 -25.85 -10.35 -25.85 -9.15 -25.6 -8.45 -25.85 -8.3 -26.0 Q-7.9 -26.4 -7.9 -26.95 L-7.95 -27.5 -8.05 -27.7 -9.95 -27.55 Q-10.55 -27.1 -10.55 -26.35 L-10.5 -26.1 M-15.8 -24.9 Q-17.15 -26.1 -19.15 -25.9 -21.1 -25.7 -22.5 -24.25 -24.0 -22.7 -24.0 -20.6 L-23.45 -17.35 Q-22.45 -13.8 -20.25 -13.8 -17.5 -13.8 -15.65 -16.85 -14.3 -19.15 -14.3 -20.6 -14.3 -23.45 -15.8 -24.9 M-20.5 -11.3 Q-24.0 -12.1 -24.0 -8.65 -24.0 -7.35 -23.45 -6.25 -22.4 -4.2 -19.75 -4.2 -18.0 -4.2 -17.35 -5.2 -16.95 -5.9 -16.95 -7.15 -16.95 -10.5 -20.5 -11.3" fill="#d2fd24" fill-rule="evenodd" stroke="none"/>
    <path d="M-13.35 -24.85 L-12.55 -25.4 -11.05 -26.0 Q-9.6 -23.85 -8.35 -23.85 -7.1 -23.85 -6.8 -25.15 L-5.8 -24.45 Q-3.55 -22.65 -3.55 -20.0 L-4.2 -17.8 Q-4.85 -15.9 -4.85 -14.2 -4.85 -11.85 -1.6 -2.75 1.6 6.35 1.6 10.0 1.6 12.3 -1.0 15.3 L-2.25 16.75 -1.3 18.6 Q0.6 22.55 0.6 24.8 0.6 26.15 0.3 26.55 -0.2 27.2 -1.95 27.2 -5.5 27.2 -10.5 19.6 L-13.5 14.65 Q-12.9 14.6 -12.65 14.2 -12.35 13.7 -11.9 13.7 -11.15 13.7 -9.55 16.3 -7.95 18.85 -6.3 18.85 -5.0 18.85 -4.25 17.8 -3.55 16.85 -3.35 15.0 L-3.25 12.9 Q-3.25 6.0 -7.9 -0.9 L-11.1 -6.0 Q-12.55 -8.9 -12.55 -11.95 -12.55 -13.3 -11.9 -15.15 -11.25 -17.05 -11.25 -18.55 -11.25 -21.85 -13.2 -24.7 L-13.35 -24.85 M9.65 25.8 Q8.95 23.9 8.95 22.05 8.95 20.2 9.75 15.5 10.35 11.75 9.95 9.55 9.3 6.15 10.3 3.55 11.55 0.25 15.2 0.25 L16.0 0.3 Q14.3 1.95 13.9 6.35 13.7 8.25 14.1 16.6 14.25 20.15 10.35 24.85 L9.65 25.8 M20.9 -0.05 Q25.95 3.25 25.95 22.7 L25.95 23.0 Q26.55 26.65 25.6 29.5 24.85 31.8 22.75 34.25 21.85 35.35 18.2 37.55 14.6 39.7 13.8 39.7 11.55 39.7 9.3 37.75 L10.55 37.8 Q15.7 37.8 18.95 34.0 L19.55 34.0 Q21.6 34.0 23.25 31.45 24.55 29.35 24.55 28.2 24.55 26.75 23.1 25.95 L22.8 25.8 Q24.05 20.9 24.05 14.35 24.05 7.55 20.9 -0.05" fill="#87a703" fill-rule="evenodd" stroke="none"/>
    <path d="M18.95 34.0 Q16.55 33.85 15.8 32.7 15.45 32.25 15.45 31.05 15.45 26.0 20.0 25.4 21.55 25.2 22.8 25.8 L23.1 25.95 Q24.55 26.75 24.55 28.2 24.55 29.35 23.25 31.45 21.6 34.0 19.55 34.0 L18.95 34.0 M-15.8 -24.9 Q-14.3 -23.45 -14.3 -20.6 -14.3 -19.15 -15.65 -16.85 -17.5 -13.8 -20.25 -13.8 -22.45 -13.8 -23.45 -17.35 L-24.0 -20.6 Q-24.0 -22.7 -22.5 -24.25 -21.1 -25.7 -19.15 -25.9 -17.15 -26.1 -15.8 -24.9 M-10.5 -26.1 L-10.55 -26.35 Q-10.55 -27.1 -9.95 -27.55 L-8.05 -27.7 -7.95 -27.5 -7.9 -26.95 Q-7.9 -26.4 -8.3 -26.0 L-8.45 -25.85 -9.15 -25.6 -10.35 -25.85 -10.45 -25.85 -10.5 -26.1 M-20.5 -11.3 Q-16.95 -10.5 -16.95 -7.15 -16.95 -5.9 -17.35 -5.2 -18.0 -4.2 -19.75 -4.2 -22.4 -4.2 -23.45 -6.25 -24.0 -7.35 -24.0 -8.65 -24.0 -12.1 -20.5 -11.3" fill="#ebfe9a" fill-rule="evenodd" stroke="none"/>
    <path d="M22.0 -11.65 Q32.35 -4.85 40.2 4.75 48.6 14.85 49.45 27.8 49.8 34.65 46.65 39.0 45.85 40.0 37.95 44.1 30.6 47.9 8.9 12.05 L6.35 7.8 4.85 5.35 Q-1.45 -5.55 -8.15 -16.2 -14.6 -26.45 -21.35 -36.5 L-22.05 -37.45 0.9 -24.6 Q11.65 -18.45 22.0 -11.65 M21.1 -10.3 Q10.8 -17.1 0.1 -23.2 L-17.05 -32.85 -6.8 -17.05 Q-0.05 -6.4 6.3 4.5 L7.7 6.95 7.8 7.15 10.15 11.1 10.25 11.2 Q21.0 29.0 28.2 36.95 34.45 43.8 37.3 42.65 L37.25 42.65 Q44.6 38.85 45.4 38.0 L45.45 37.95 Q48.15 34.0 47.85 27.9 L47.85 27.85 Q47.0 15.45 38.95 5.75 31.25 -3.65 21.1 -10.3 M13.45 58.25 Q6.05 63.05 4.7 63.2 -0.6 63.75 -6.3 59.95 -17.15 52.8 -21.75 40.5 -26.1 28.9 -26.8 16.5 -27.55 4.15 -27.45 -8.25 L-27.1 -34.6 -26.6 -33.45 Q-21.3 -22.6 -15.65 -11.9 -9.75 -0.75 -3.5 10.15 L-2.05 12.7 0.3 17.05 Q20.5 53.7 13.45 58.25 M4.6 61.6 Q5.9 61.2 12.55 56.85 L12.55 56.9 Q18.25 52.9 -1.1 17.8 L-3.35 13.65 -3.45 13.5 -4.9 10.95 Q-11.15 0.05 -17.05 -11.1 L-25.6 -27.8 -25.85 -8.25 Q-25.95 4.1 -25.2 16.45 -24.55 28.6 -20.3 39.95 -15.8 51.75 -5.45 58.65 -0.3 62.1 4.55 61.6 L4.6 61.6" fill="#000000" fill-opacity="0.7137255" fill-rule="evenodd" stroke="none"/>
    <path d="M21.1 -10.3 Q31.25 -3.65 38.95 5.75 47.0 15.45 47.85 27.85 L47.85 27.9 Q48.15 34.0 45.45 37.95 L45.4 38.0 Q44.6 38.85 37.25 42.65 L37.3 42.65 Q34.45 43.8 28.2 36.95 21.0 29.0 10.25 11.2 L10.15 11.1 7.8 7.15 7.7 6.95 6.3 4.5 Q-0.05 -6.4 -6.8 -17.05 L-17.05 -32.85 0.1 -23.2 Q10.8 -17.1 21.1 -10.3 M45.4 28.05 L45.4 28.0 Q44.6 16.35 37.1 7.25 29.6 -1.85 19.8 -8.3 9.55 -15.05 -1.1 -21.1 L-9.65 -26.0 -4.75 -18.35 Q2.0 -7.65 8.35 3.3 L8.5 3.5 9.75 5.7 9.75 5.75 9.95 5.95 12.25 9.85 12.35 10.05 Q22.9 27.5 30.0 35.35 34.65 40.45 36.45 40.4 L43.65 36.35 Q45.7 33.05 45.4 28.05 M4.6 61.6 L4.55 61.6 Q-0.3 62.1 -5.45 58.65 -15.8 51.75 -20.3 39.95 -24.55 28.6 -25.2 16.45 -25.95 4.1 -25.85 -8.25 L-25.6 -27.8 -17.05 -11.1 Q-11.15 0.05 -4.9 10.95 L-3.45 13.5 -3.35 13.65 -1.1 17.8 Q18.25 52.9 12.55 56.9 L12.55 56.85 Q5.9 61.2 4.6 61.6 M4.05 59.25 Q5.6 58.55 11.25 54.85 14.6 51.2 -3.25 18.95 L-5.45 14.85 -5.55 14.65 -6.9 12.3 -7.0 12.15 Q-13.3 1.25 -19.2 -10.0 L-23.35 -18.0 -23.45 -8.25 Q-23.5 4.05 -22.8 16.3 L-22.8 16.35 Q-22.1 28.1 -18.05 39.1 -13.85 50.2 -4.1 56.65 0.15 59.45 4.05 59.25" fill="#000000" fill-opacity="0.6" fill-rule="evenodd" stroke="none"/>
    <path d="M45.4 28.05 Q45.7 33.05 43.65 36.35 L36.45 40.4 Q34.65 40.45 30.0 35.35 22.9 27.5 12.35 10.05 L12.25 9.85 9.95 5.95 9.75 5.75 9.75 5.7 8.5 3.5 8.35 3.3 Q2.0 -7.65 -4.75 -18.35 L-9.65 -26.0 -1.1 -21.1 Q9.55 -15.05 19.8 -8.3 29.6 -1.85 37.1 7.25 44.6 16.35 45.4 28.0 L45.4 28.05 M4.05 59.25 Q0.15 59.45 -4.1 56.65 -13.85 50.2 -18.05 39.1 -22.1 28.1 -22.8 16.35 L-22.8 16.3 Q-23.5 4.05 -23.45 -8.25 L-23.35 -18.0 -19.2 -10.0 Q-13.3 1.25 -7.0 12.15 L-6.9 12.3 -5.55 14.65 -5.45 14.85 -3.25 18.95 Q14.6 51.2 11.25 54.85 5.6 58.55 4.05 59.25" fill="#000000" fill-opacity="0.4" fill-rule="evenodd" stroke="none"/>
    <path d="M18.25 -65.95 L17.5 -62.55 Q17.05 -60.5 18.1 -58.85 18.75 -57.8 19.7 -57.25 L19.75 -55.2 Q22.6 -56.65 26.05 -56.6 41.75 -55.55 53.9 -45.85 64.45 -37.5 70.8 -25.5 76.65 -14.45 80.05 -2.35 82.2 5.2 83.65 13.0 85.85 23.15 85.2 33.5 84.55 44.35 81.6 54.6 78.65 65.1 72.25 73.95 65.95 82.6 58.1 89.75 52.05 95.25 44.25 96.6 L41.7 96.9 19.35 95.65 14.65 95.4 Q3.8 95.65 -6.9 93.75 -17.75 91.7 -26.85 85.7 -28.2 84.7 -29.4 83.5 -37.2 75.3 -40.45 64.6 -41.8 60.3 -43.7 56.1 -46.25 50.5 -47.85 44.35 -50.6 33.85 -48.65 23.25 L-47.3 15.05 -51.6 9.1 Q-54.95 4.6 -51.65 -0.05 -50.3 -2.05 -49.3 -4.25 -48.75 -5.35 -49.05 -6.45 L-49.55 -8.6 Q-59.7 -7.75 -65.0 -16.9 -66.65 -19.75 -67.0 -23.0 -67.25 -25.35 -66.5 -27.55 -65.85 -29.45 -67.0 -31.3 -70.9 -37.65 -69.65 -45.1 -68.5 -51.65 -62.1 -52.8 -58.15 -53.5 -54.75 -51.35 -51.1 -49.15 -48.05 -46.2 L-46.95 -45.5 -44.9 -45.95 Q-43.5 -54.7 -35.25 -58.75 -28.2 -62.3 -20.55 -64.5 L-21.2 -77.1 Q-21.3 -80.35 -19.55 -83.05 -16.45 -88.1 -10.75 -89.15 -8.6 -89.5 -6.75 -88.45 -0.4 -84.65 3.35 -78.15 4.95 -75.4 7.1 -73.05 8.0 -72.15 9.3 -71.55 12.75 -70.05 16.0 -68.15 17.35 -67.3 18.25 -65.95 M19.9 -35.9 Q10.8 -38.35 1.4 -39.2 L-8.85 -39.9 Q-19.75 -40.15 -26.75 -31.9 -31.95 -25.6 -34.05 -17.65 -36.7 -7.6 -37.05 2.75 -37.45 13.5 -36.85 24.2 -36.2 35.15 -30.35 44.35 -24.85 53.0 -16.15 58.6 -8.0 63.85 1.3 66.5 11.85 69.5 22.6 69.4 33.45 68.9 43.45 64.65 53.45 60.4 59.85 51.6 66.4 42.5 68.25 31.4 70.05 20.55 67.65 9.7 67.0 6.55 65.85 3.4 62.5 -6.0 56.15 -13.65 48.95 -22.25 39.15 -27.85 29.95 -33.2 19.9 -35.9" fill="#befc23" fill-opacity="0.08235294" fill-rule="evenodd" stroke="none"/>
    <path d="M19.9 -35.9 Q29.95 -33.2 39.15 -27.85 48.95 -22.25 56.15 -13.65 62.5 -6.0 65.85 3.4 67.0 6.55 67.65 9.7 70.05 20.55 68.25 31.4 66.4 42.5 59.85 51.6 53.45 60.4 43.45 64.65 33.45 68.9 22.6 69.4 11.85 69.5 1.3 66.5 -8.0 63.85 -16.15 58.6 -24.85 53.0 -30.35 44.35 -36.2 35.15 -36.85 24.2 -37.45 13.5 -37.05 2.75 -36.7 -7.6 -34.05 -17.65 -31.95 -25.6 -26.75 -31.9 -19.75 -40.15 -8.85 -39.9 L1.4 -39.2 Q10.8 -38.35 19.9 -35.9" fill="#befc23" fill-opacity="0.14509805" fill-rule="evenodd" stroke="none"/>
    <path d="M2.25 -100.55 Q6.95 -99.35 11.45 -97.35 16.3 -95.15 20.8 -91.95 L26.4 -87.55 29.15 -85.0 25.35 -80.9 22.9 -83.2 17.3 -87.6 Q13.0 -90.6 8.25 -92.65 3.75 -94.55 -1.05 -95.6 L2.25 -100.55 M-39.55 -97.0 Q-33.15 -100.0 -26.0 -101.35 L-22.45 -101.95 -25.55 -95.8 -29.25 -94.9 Q-37.15 -92.7 -44.05 -88.1 L-39.55 -97.0 M-52.3 -1.3 L-50.2 0.6 -54.0 4.7 -55.8 3.1 -56.1 2.8 -57.0 1.9 -61.15 -2.55 -61.6 -3.1 -62.6 -4.4 -59.3 -9.35 -58.75 -8.7 Q-56.2 -5.25 -53.05 -2.05 L-52.9 -1.95 -52.3 -1.3 M-69.25 -37.75 L-69.15 -36.1 Q-68.5 -28.5 -65.95 -21.7 L-64.85 -18.95 -68.0 -12.75 -69.25 -15.2 Q-71.35 -19.6 -72.65 -24.4 L-73.75 -28.85 -69.25 -37.75" fill="#a1b8cf" fill-rule="evenodd" stroke="none"/>
    <path d="M47.2 -36.05 L47.4 -30.8 Q47.4 -19.05 43.5 -8.8 41.0 -2.15 36.85 3.75 L35.7 -5.1 35.8 -5.3 Q40.7 -11.95 43.5 -19.45 46.5 -27.25 47.2 -36.05 M-59.4 9.95 L-60.25 8.95 -60.4 8.8 Q-62.8 6.05 -64.8 3.1 L-66.2 0.95 Q-68.8 -3.25 -70.6 -7.75 L-71.6 -10.4 -72.65 -13.85 Q-74.4 -20.05 -74.75 -26.75 L-74.85 -30.8 -74.7 -35.9 Q-74.4 -32.3 -73.75 -28.85 L-72.65 -24.4 Q-71.35 -19.6 -69.25 -15.2 L-68.0 -12.75 Q-66.0 -9.0 -63.4 -5.45 L-62.6 -4.4 -61.6 -3.1 -61.15 -2.55 -59.4 9.95 M-1.05 -95.6 Q3.75 -94.55 8.25 -92.65 13.0 -90.6 17.3 -87.6 L22.9 -83.2 25.35 -80.9 25.6 -80.7 30.9 -74.65 Q33.9 -70.75 36.05 -66.45 41.0 -56.85 41.7 -45.5 L41.8 -41.35 41.75 -38.25 41.5 -41.35 41.0 -45.05 Q39.65 -53.05 36.05 -60.15 32.95 -66.25 28.1 -71.65 L25.6 -74.35 22.2 -77.5 19.85 -79.45 Q16.95 -81.65 13.95 -83.45 9.6 -86.0 4.9 -87.6 0.15 -89.25 -4.85 -90.0 L-13.75 -90.65 -16.85 -90.55 Q-23.35 -90.2 -29.25 -88.55 L-33.05 -87.35 Q-41.75 -84.15 -49.15 -77.9 L-49.95 -77.25 -53.05 -74.35 -55.95 -71.2 Q-60.6 -65.9 -63.6 -60.0 -68.0 -51.35 -69.0 -41.35 L-69.25 -38.25 -69.4 -41.35 Q-69.4 -55.05 -63.6 -66.35 -60.6 -72.25 -55.95 -77.55 L-53.05 -80.7 -49.95 -83.55 -44.05 -88.1 Q-37.15 -92.7 -29.25 -94.9 L-25.55 -95.8 Q-19.9 -97.0 -13.75 -97.0 L-13.55 -97.0 Q-7.05 -97.0 -1.05 -95.6" fill="#4e6073" fill-rule="evenodd" stroke="none"/>
    <path d="M29.15 -85.0 L29.5 -84.6 Q32.3 -81.8 34.7 -78.8 40.4 -71.6 43.5 -63.35 46.1 -56.55 46.95 -49.05 L41.7 -45.5 Q41.0 -56.85 36.05 -66.45 33.9 -70.75 30.9 -74.65 L25.6 -80.7 25.35 -80.9 29.15 -85.0 M-74.7 -35.9 L-74.85 -41.35 Q-74.85 -45.1 -74.5 -48.6 L-52.45 -88.75 Q-46.35 -93.8 -39.55 -97.0 L-44.05 -88.1 -49.95 -83.55 -53.05 -80.7 -55.95 -77.55 Q-60.6 -72.25 -63.6 -66.35 -69.4 -55.05 -69.4 -41.35 L-69.25 -38.25 -69.25 -37.75 -73.75 -28.85 Q-74.4 -32.3 -74.7 -35.9 M-22.45 -101.95 L-13.75 -102.45 -10.8 -102.4 Q-4.0 -102.15 2.25 -100.55 L-1.05 -95.6 Q-7.05 -97.0 -13.55 -97.0 L-13.75 -97.0 Q-19.9 -97.0 -25.55 -95.8 L-22.45 -101.95 M-50.2 0.6 L-46.8 3.4 -43.65 5.6 -43.55 5.65 -41.1 7.15 -38.3 8.7 -43.55 12.25 -47.45 9.85 -50.3 7.8 -54.0 4.7 -50.2 0.6 M-68.0 -12.75 L-64.85 -18.95 -62.85 -14.95 -62.35 -14.1 -59.3 -9.35 -62.6 -4.4 -63.4 -5.45 Q-66.0 -9.0 -68.0 -12.75" fill="#7e9dbc" fill-rule="evenodd" stroke="none"/>
    <path d="M-69.25 -38.25 L-69.0 -41.35 Q-68.0 -51.35 -63.6 -60.0 -60.6 -65.9 -55.95 -71.2 L-53.05 -74.35 -49.95 -77.25 -49.15 -77.9 Q-41.75 -84.15 -33.05 -87.35 L-29.25 -88.55 Q-23.35 -90.2 -16.85 -90.55 L-13.75 -90.65 -4.85 -90.0 Q0.15 -89.25 4.9 -87.6 9.6 -86.0 13.95 -83.45 16.95 -81.65 19.85 -79.45 L22.2 -77.5 25.6 -74.35 28.1 -71.65 Q32.95 -66.25 36.05 -60.15 39.65 -53.05 41.0 -45.05 L41.5 -41.35 41.75 -38.25 41.65 -36.15 41.4 -38.25 40.25 -44.5 Q36.85 -58.6 26.15 -69.55 L25.6 -70.1 19.95 -75.1 17.7 -76.8 11.6 -80.55 Q7.25 -82.75 2.55 -84.15 -2.3 -85.6 -7.5 -86.15 L-13.75 -86.45 -19.1 -86.2 Q-25.75 -85.65 -31.8 -83.6 L-35.7 -82.1 Q-43.35 -78.8 -49.95 -73.0 L-53.05 -70.1 -55.95 -67.0 Q-66.9 -54.55 -68.9 -38.45 L-68.9 -38.2 -69.15 -36.1 -69.25 -37.75 -69.25 -38.25" fill="#8b9eaf" fill-rule="evenodd" stroke="none"/>
    <path d="M17.7 -76.8 L19.95 -75.1 25.6 -70.1 26.15 -69.55 -43.55 5.65 -43.65 5.6 -46.8 3.4 17.7 -76.8 M2.55 -84.15 Q7.25 -82.75 11.6 -80.55 L-52.3 -1.3 -52.9 -1.95 2.55 -84.15 M-35.7 -82.1 L-31.8 -83.6 Q-25.75 -85.65 -19.1 -86.2 L-58.75 -8.7 -59.3 -9.35 -62.35 -14.1 -62.85 -14.95 -64.85 -18.95 -65.95 -21.7 -35.7 -82.1" fill="#e5e9ed" fill-opacity="0.5647059" fill-rule="evenodd" stroke="none"/>
    <path d="M11.6 -80.55 L17.7 -76.8 -46.8 3.4 -50.2 0.6 -52.3 -1.3 11.6 -80.55" fill="#f7fbff" fill-opacity="0.62352943" fill-rule="evenodd" stroke="none"/>
    <path d="M46.95 -49.05 Q47.4 -45.25 47.4 -41.35 L47.2 -36.05 Q46.5 -27.25 43.5 -19.45 40.7 -11.95 35.8 -5.3 L35.7 -5.1 32.75 -1.5 29.5 1.9 26.1 5.15 Q9.2 19.75 -13.7 19.75 L-13.95 19.75 Q-21.7 19.75 -28.7 18.05 L-30.7 17.55 Q-36.9 15.85 -42.5 12.85 L-43.55 12.25 -38.3 8.7 Q-34.1 10.8 -29.6 12.1 -22.6 14.1 -14.9 14.2 L-13.75 14.2 Q7.1 14.2 22.4 0.85 L25.6 -2.05 28.45 -5.15 Q31.95 -9.15 34.55 -13.55 40.55 -23.85 41.65 -36.15 L41.75 -38.25 41.8 -41.35 41.7 -45.5 46.95 -49.05 M-74.5 -48.6 Q-72.5 -67.0 -60.2 -81.15 L-56.95 -84.6 -53.55 -87.8 -52.45 -88.75 -74.5 -48.6" fill="#6f89a6" fill-rule="evenodd" stroke="none"/>
    <path d="M26.15 -69.55 Q36.85 -58.6 40.25 -44.5 L41.4 -38.25 41.65 -36.15 Q40.55 -23.85 34.55 -13.55 31.95 -9.15 28.45 -5.15 L25.6 -2.05 22.4 0.85 Q7.1 14.2 -13.75 14.2 L-14.9 14.2 Q-22.6 14.1 -29.6 12.1 -34.1 10.8 -38.3 8.7 L-41.1 7.15 -43.55 5.65 26.15 -69.55 M-19.1 -86.2 L-13.75 -86.45 -7.5 -86.15 Q-2.3 -85.6 2.55 -84.15 L-52.9 -1.95 -53.05 -2.05 Q-56.2 -5.25 -58.75 -8.7 L-19.1 -86.2 M-69.15 -36.1 L-68.9 -38.2 -68.9 -38.45 Q-66.9 -54.55 -55.95 -67.0 L-53.05 -70.1 -49.95 -73.0 Q-43.35 -78.8 -35.7 -82.1 L-65.95 -21.7 Q-68.5 -28.5 -69.15 -36.1" fill="#bbc6d1" fill-opacity="0.29803923" fill-rule="evenodd" stroke="none"/>
    <path d="M36.85 3.75 L32.75 9.05 29.5 12.4 26.1 15.7 Q12.1 27.75 -5.95 29.85 L-12.1 30.35 -13.95 19.75 -13.7 19.75 Q9.2 19.75 26.1 5.15 L29.5 1.9 32.75 -1.5 35.7 -5.1 36.85 3.75 M-27.1 29.0 L-30.7 28.1 Q-35.85 26.65 -40.6 24.35 L-42.5 12.85 Q-36.9 15.85 -30.7 17.55 L-28.7 18.05 -27.1 29.0" fill="#374352" fill-rule="evenodd" stroke="none"/>
    <path d="M-12.1 30.35 L-13.7 30.35 -19.5 30.1 -27.1 29.0 -28.7 18.05 Q-21.7 19.75 -13.95 19.75 L-12.1 30.35 M-40.6 24.35 Q-46.25 21.55 -51.35 17.55 L-53.15 16.05 -55.4 14.05 -57.0 12.45 -59.1 10.25 -59.4 9.95 -61.15 -2.55 -57.0 1.9 -56.1 2.8 -55.8 3.1 -54.0 4.7 -50.3 7.8 -47.45 9.85 -43.55 12.25 -42.5 12.85 -40.6 24.35" fill="#252e38" fill-rule="evenodd" stroke="none"/>
    <path d="M10.95 33.85 L7.1 25.4 Q6.05 22.95 7.1 20.5 8.15 17.95 10.75 16.8 L15.9 16.6 Q18.5 17.5 19.6 19.95 L23.35 28.3 20.75 28.35 17.8 29.15 16.5 29.6 Q14.85 30.4 13.55 31.3 12.0 32.4 10.95 33.85 M71.5 127.25 L71.55 127.3 Q72.6 129.7 70.6 132.6 L68.9 134.55 67.05 136.0 65.05 137.1 64.6 137.3 Q60.7 139.1 57.15 138.6 53.65 138.15 52.6 135.8 L52.45 135.55 Q51.5 133.25 53.5 130.4 L55.4 128.35 Q57.05 126.8 59.45 125.7 60.8 125.1 62.1 124.8 L65.5 124.35 66.9 124.45 Q70.35 124.9 71.5 127.25 M60.7 128.6 L60.55 128.65 Q58.35 129.65 56.9 131.15 L55.75 132.5 Q54.65 134.1 54.95 135.35 L54.95 135.45 54.95 135.5 55.0 135.5 55.05 135.6 Q55.75 136.85 57.85 137.05 L60.25 137.1 Q62.0 136.9 63.95 136.05 L64.05 135.95 64.1 135.95 64.4 135.8 66.45 134.65 68.35 133.0 69.1 132.1 Q70.25 130.4 69.85 129.1 L69.85 128.95 Q69.05 127.75 67.05 127.45 L66.55 127.4 63.4 127.7 Q62.1 128.0 60.85 128.55 L60.7 128.6" fill="#0f151c" fill-rule="evenodd" stroke="none"/>
    <path d="M10.95 33.85 Q12.0 32.4 13.55 31.3 L35.95 86.6 Q45.7 110.05 55.4 128.35 L53.5 130.4 Q51.5 133.25 52.45 135.55 L9.6 39.65 Q8.5 37.25 10.55 34.3 L10.95 33.85 M24.5 28.45 Q27.55 29.0 28.6 31.3 L71.5 127.25 Q70.35 124.9 66.9 124.45 L65.5 124.35 Q55.95 96.0 46.9 75.7 40.05 60.3 24.5 28.45" fill="#7e542c" fill-rule="evenodd" stroke="none"/>
    <path d="M13.55 31.3 Q14.85 30.4 16.5 29.6 L17.8 29.15 Q27.2 50.7 42.4 87.75 49.65 105.4 59.45 125.7 57.05 126.8 55.4 128.35 45.7 110.05 35.95 86.6 L13.55 31.3" fill="#aa733c" fill-rule="evenodd" stroke="none"/>
    <path d="M20.75 28.35 L23.35 28.3 24.0 28.35 24.5 28.45 Q40.05 60.3 46.9 75.7 55.95 96.0 65.5 124.35 L62.1 124.8 54.0 106.75 Q48.65 94.95 44.85 84.4 40.65 72.7 35.1 60.25 L20.75 28.35" fill="#593a1f" fill-rule="evenodd" stroke="none"/>
    <path d="M17.8 29.15 L20.75 28.35 35.1 60.25 Q40.65 72.7 44.85 84.4 48.65 94.95 54.0 106.75 L62.1 124.8 Q60.8 125.1 59.45 125.7 49.65 105.4 42.4 87.75 27.2 50.7 17.8 29.15" fill="#452e18" fill-rule="evenodd" stroke="none"/>
    <path d="M60.7 128.6 L60.85 128.55 Q62.1 128.0 63.4 127.7 L66.55 127.4 67.05 127.45 Q69.05 127.75 69.85 128.95 L69.85 129.1 Q70.25 130.4 69.1 132.1 L68.35 133.0 66.45 134.65 64.4 135.8 64.1 135.95 64.05 135.95 63.95 136.05 Q62.0 136.9 60.25 137.1 L57.85 137.05 Q55.75 136.85 55.05 135.6 L55.0 135.5 54.95 135.5 54.95 135.45 54.95 135.35 Q54.65 134.1 55.75 132.5 L56.9 131.15 Q58.35 129.65 60.55 128.65 L60.7 128.6" fill="#664437" fill-rule="evenodd" stroke="none"/>
  </g>
</svg>
