<?xml version="1.0" encoding="UTF-8" standalone="no"?>
<svg xmlns:xlink="http://www.w3.org/1999/xlink" height="61.55px" width="52.3px" xmlns="http://www.w3.org/2000/svg">
  <g transform="matrix(1.0, 0.0, 0.0, 1.0, 26.15, 61.55)">
    <path d="M-7.8 -12.45 L-6.65 -12.15 Q-3.85 -11.4 -0.85 -11.4 L0.25 -11.4 1.2 -11.4 3.95 -11.55 Q6.7 -11.9 9.35 -12.9 L8.9 -3.6 Q7.65 -1.45 5.2 -0.65 L0.4 0.0 Q-2.5 0.05 -5.05 -1.1 -7.55 -2.3 -7.65 -5.0 L-7.8 -10.45 -7.8 -12.45" fill="url(#gradient0)" fill-rule="evenodd" stroke="none"/>
    <path d="M-7.8 -12.45 L-9.3 -12.9 -11.45 -13.7 -12.75 -14.2 -15.3 -15.6 -17.9 -17.2 -20.15 -18.6 Q-23.55 -21.35 -24.8 -25.45 -26.15 -29.8 -26.15 -34.4 -26.15 -38.85 -25.1 -43.15 -23.45 -49.35 -18.45 -54.25 -11.2 -61.15 -1.15 -61.5 L-0.3 -61.55 0.0 -61.55 1.15 -61.5 Q11.2 -61.15 18.45 -54.25 23.45 -49.35 25.1 -43.15 26.15 -38.85 26.15 -34.4 26.15 -29.8 24.8 -25.45 23.55 -21.35 20.15 -18.6 L17.9 -17.2 15.3 -15.6 14.65 -15.2 Q12.45 -14.0 9.95 -13.1 L9.35 -12.9 Q6.7 -11.9 3.95 -11.55 L1.2 -11.4 1.15 -11.45 -0.85 -11.4 Q-3.85 -11.4 -6.65 -12.15 L-7.8 -12.45" fill="url(#gradient1)" fill-rule="evenodd" stroke="none"/>
    <path d="M9.35 -12.9 L9.95 -13.1 Q12.45 -14.0 14.65 -15.2 L15.3 -15.6 17.9 -17.2 20.15 -18.6 Q23.55 -21.35 24.8 -25.45 26.15 -29.8 26.15 -34.4 26.15 -38.85 25.1 -43.15 23.45 -49.35 18.45 -54.25 11.2 -61.15 1.15 -61.5 L0.0 -61.55 -0.3 -61.55 -1.15 -61.5 Q-11.2 -61.15 -18.45 -54.25 -23.45 -49.35 -25.1 -43.15 -26.15 -38.85 -26.15 -34.4 -26.15 -29.8 -24.8 -25.45 -23.55 -21.35 -20.15 -18.6 L-17.9 -17.2 -15.3 -15.6 -12.75 -14.2 -11.45 -13.7 -9.3 -12.9 -7.8 -12.45 -6.65 -12.15 Q-3.85 -11.4 -0.85 -11.4 L1.15 -11.45 1.2 -11.4 3.95 -11.55 Q6.7 -11.9 9.35 -12.9 L8.9 -3.6 Q7.65 -1.45 5.2 -0.65 L0.4 0.0 Q-2.5 0.05 -5.05 -1.1 -7.55 -2.3 -7.65 -5.0 L-7.8 -10.45 -7.8 -12.45 M1.2 -11.4 L0.25 -11.4 -0.85 -11.4" fill="none" stroke="#a36a6a" stroke-linecap="round" stroke-linejoin="round" stroke-opacity="0.69411767" stroke-width="0.05"/>
  </g>
  <defs>
    <radialGradient cx="0" cy="0" gradientTransform="matrix(0.0, -0.0372, 0.0294, 0.0, 0.9, -9.85)" gradientUnits="userSpaceOnUse" id="gradient0" r="819.2" spreadMethod="pad">
      <stop offset="0.00784313725490196" stop-color="#a36a6a"/>
      <stop offset="0.8470588235294118" stop-color="#e0cbcb"/>
    </radialGradient>
    <radialGradient cx="0" cy="0" gradientTransform="matrix(0.0385, 0.0, 0.0, 0.0363, -0.1, -39.65)" gradientUnits="userSpaceOnUse" id="gradient1" r="819.2" spreadMethod="pad">
      <stop offset="0.0" stop-color="#ffffff"/>
      <stop offset="0.3137254901960784" stop-color="#f2eaea"/>
      <stop offset="0.6823529411764706" stop-color="#e0cbcb"/>
      <stop offset="1.0" stop-color="#a36a6a"/>
    </radialGradient>
  </defs>
</svg>
