<?xml version="1.0" encoding="UTF-8" standalone="no"?>
<svg xmlns:xlink="http://www.w3.org/1999/xlink" height="202.35px" width="113.55px" xmlns="http://www.w3.org/2000/svg">
  <g transform="matrix(1.0, 0.0, 0.0, 1.0, 44.95, 319.35)">
    <path d="M30.85 -264.35 L30.85 -117.0 19.05 -117.0 19.05 -267.85 Q25.75 -267.45 30.85 -264.35 M41.6 -117.0 L41.6 -251.75 44.1 -245.75 Q44.9 -246.55 46.05 -246.55 48.15 -246.55 49.75 -244.45 L49.75 -117.0 41.6 -117.0 M5.45 -117.0 L-4.25 -117.0 -4.25 -262.3 -0.55 -264.25 Q2.35 -265.6 5.45 -266.4 L5.45 -117.0 M-16.85 -117.0 L-20.75 -117.0 -19.1 -137.7 Q-17.85 -153.65 -17.95 -162.5 L-18.05 -164.3 -18.05 -181.9 -19.65 -181.75 Q-23.65 -181.75 -26.3 -184.5 L-26.3 -226.55 -22.9 -232.95 Q-18.75 -240.3 -17.6 -243.15 L-16.85 -245.05 -16.85 -117.0" fill="#36384d" fill-rule="evenodd" stroke="none"/>
    <path d="M30.85 -264.35 Q33.65 -262.75 35.95 -260.3 39.1 -256.95 41.6 -251.75 L41.6 -117.0 30.85 -117.0 30.85 -264.35 M49.75 -244.45 Q52.1 -241.4 53.4 -233.95 54.65 -226.7 54.65 -218.8 54.65 -213.65 53.95 -208.0 L52.55 -200.15 52.45 -199.55 52.65 -199.5 53.15 -188.55 Q53.7 -177.7 53.7 -171.1 53.7 -167.05 52.85 -158.95 L51.6 -146.55 Q51.45 -144.35 51.45 -141.9 L51.35 -138.05 51.3 -134.35 51.35 -132.4 Q51.5 -128.55 51.25 -123.75 L50.8 -117.0 49.75 -117.0 49.75 -244.45 M5.45 -266.4 Q10.9 -267.9 17.05 -267.9 L19.05 -267.85 19.05 -117.0 5.45 -117.0 5.45 -266.4 M12.7 -179.2 L12.75 -179.2 13.3 -178.75 12.8 -179.2 12.75 -179.25 12.7 -179.2 M-4.25 -117.0 L-16.85 -117.0 -16.85 -245.05 Q-16.15 -247.15 -15.95 -248.85 L-15.9 -249.6 Q-11.85 -257.75 -4.25 -262.3 L-4.25 -117.0 M-26.3 -184.5 Q-28.8 -187.1 -30.15 -192.25 -31.05 -196.0 -31.45 -201.65 -31.65 -203.55 -31.3 -208.0 L-31.2 -209.15 -30.6 -215.25 -28.55 -221.6 -26.3 -226.55 -26.3 -184.5" fill="#232532" fill-rule="evenodd" stroke="none"/>
    <path d="M-32.35 -273.9 Q-32.4 -269.05 -25.6 -265.9 L-27.3 -264.8 Q-33.7 -268.35 -32.35 -273.9 M-33.6 -254.7 L-33.6 -252.9 Q-32.65 -244.0 -25.95 -241.2 -21.65 -239.35 -14.9 -240.1 L-15.25 -238.3 Q-24.55 -237.3 -29.15 -241.2 -33.1 -244.45 -33.85 -251.1 -34.0 -253.0 -33.6 -254.7 M-15.35 -237.0 Q-16.35 -225.1 -2.9 -221.5 5.25 -219.25 12.85 -224.5 17.85 -227.95 20.3 -232.8 L21.6 -236.05 Q33.25 -228.25 45.2 -237.45 50.35 -241.45 51.35 -245.95 51.1 -240.4 44.95 -235.65 33.0 -226.4 21.35 -234.2 20.85 -232.5 20.05 -230.95 17.6 -226.15 12.6 -222.7 5.05 -217.45 -3.15 -219.7 -17.55 -223.6 -15.35 -237.0 M51.3 -250.8 L50.75 -252.45 Q65.6 -255.75 68.3 -267.9 L68.35 -268.05 68.1 -266.1 Q65.4 -254.25 51.3 -250.8 M35.5 -268.2 Q36.2 -267.5 35.95 -265.65 35.6 -262.95 33.35 -261.75 30.25 -260.1 29.5 -258.95 L25.0 -252.15 Q20.65 -245.75 15.55 -242.45 L13.4 -241.2 Q10.0 -239.5 6.7 -239.5 3.85 -239.5 2.6 -241.2 1.95 -241.95 1.7 -243.05 L1.35 -246.05 0.9 -248.75 Q0.45 -250.1 -1.9 -254.1 L-3.95 -258.0 -3.75 -258.3 -3.0 -258.6 Q-2.5 -258.6 -1.95 -258.0 L-1.3 -257.25 Q-0.05 -260.65 8.9 -264.45 17.95 -268.35 27.1 -269.25 33.7 -269.85 35.5 -268.2" fill="#a8b7bd" fill-rule="evenodd" stroke="none"/>
    <path d="M-32.35 -273.9 Q-32.3 -277.75 -28.05 -282.65 -22.05 -289.6 -13.05 -289.25 -9.55 -303.3 6.8 -302.55 13.75 -302.1 16.8 -296.85 29.05 -306.4 41.85 -301.15 55.05 -295.7 53.6 -283.0 60.35 -281.8 65.15 -277.65 69.55 -273.8 68.35 -268.1 L68.35 -268.05 68.3 -267.9 Q65.6 -255.75 50.75 -252.45 L51.3 -250.8 Q51.85 -248.3 51.35 -245.95 50.35 -241.45 45.2 -237.45 33.25 -228.25 21.6 -236.05 L20.3 -232.8 Q17.85 -227.95 12.85 -224.5 5.25 -219.25 -2.9 -221.5 -16.35 -225.1 -15.35 -237.0 L-15.25 -238.3 -14.9 -240.1 Q-21.65 -239.35 -25.95 -241.2 -32.65 -244.0 -33.6 -252.9 L-33.6 -254.7 Q-33.4 -259.55 -29.05 -263.35 L-27.3 -264.8 -25.6 -265.9 Q-32.4 -269.05 -32.35 -273.9 M35.5 -268.2 Q33.7 -269.85 27.1 -269.25 17.95 -268.35 8.9 -264.45 -0.05 -260.65 -1.3 -257.25 L-1.95 -258.0 Q-2.5 -258.6 -3.0 -258.6 L-3.75 -258.3 -3.95 -258.0 -1.9 -254.1 Q0.45 -250.1 0.9 -248.75 L1.35 -246.05 1.7 -243.05 Q1.95 -241.95 2.6 -241.2 3.85 -239.5 6.7 -239.5 10.0 -239.5 13.4 -241.2 L15.55 -242.45 Q20.65 -245.75 25.0 -252.15 L29.5 -258.95 Q30.25 -260.1 33.35 -261.75 35.6 -262.95 35.95 -265.65 36.2 -267.5 35.5 -268.2" fill="#cdd5d9" fill-rule="evenodd" stroke="none"/>
    <path d="M8.3 -317.25 L11.15 -318.45 Q13.9 -319.35 18.1 -319.35 L18.25 -319.3 Q23.35 -319.3 26.05 -318.25 L28.3 -316.95 7.05 -307.1 6.1 -308.05 Q5.25 -308.95 4.95 -309.95 4.5 -311.35 4.95 -313.1 L5.05 -313.4 Q5.7 -315.4 7.5 -316.7 L8.3 -317.25" fill="#b5c1fc" fill-rule="evenodd" stroke="none"/>
    <path d="M35.0 -309.85 L36.1 -308.9 36.75 -308.05 Q41.35 -301.55 42.35 -293.95 L42.5 -292.2 42.6 -289.55 42.5 -287.35 42.25 -284.95 42.15 -284.55 Q41.75 -281.9 40.95 -279.35 L40.6 -278.3 38.6 -273.4 38.5 -273.25 42.75 -272.85 43.4 -272.65 Q44.8 -272.0 45.6 -270.6 L46.15 -269.35 46.3 -268.75 Q46.75 -266.9 46.2 -265.3 45.3 -262.55 42.35 -260.9 L41.1 -260.3 39.25 -259.75 38.05 -259.75 36.55 -259.5 35.45 -260.0 Q34.65 -260.25 33.7 -259.7 32.85 -259.15 32.3 -259.35 31.8 -259.55 30.85 -260.4 L32.55 -261.45 33.4 -261.5 37.0 -261.15 39.7 -261.15 Q40.95 -261.35 41.8 -261.85 42.7 -262.3 43.1 -263.15 L42.25 -262.95 41.5 -262.95 Q41.9 -263.75 42.1 -265.25 42.35 -266.7 42.2 -267.6 L42.9 -266.6 42.95 -266.65 43.1 -266.15 43.1 -265.15 43.05 -264.7 42.9 -264.1 43.45 -264.95 43.75 -266.1 43.8 -266.45 43.85 -267.35 43.95 -267.35 43.85 -268.85 43.65 -269.65 42.75 -270.8 41.55 -271.55 Q39.6 -272.1 37.8 -271.5 36.85 -271.2 36.0 -270.55 34.65 -269.55 32.3 -266.45 L32.35 -266.4 Q33.1 -266.65 33.85 -267.05 L33.95 -266.9 33.7 -266.35 33.7 -266.25 33.75 -266.35 34.3 -266.3 35.0 -265.75 35.1 -265.1 Q34.85 -264.35 32.9 -262.85 L31.9 -262.15 Q31.15 -262.0 30.7 -261.65 L30.35 -261.25 30.15 -260.8 29.55 -260.3 29.25 -259.85 29.05 -259.3 29.0 -258.75 Q26.5 -255.95 23.65 -253.5 L18.25 -249.2 Q10.2 -243.45 1.0 -242.3 -2.65 -241.9 -6.5 -242.2 -8.75 -242.4 -10.1 -243.25 L-10.2 -243.3 -10.65 -243.7 -10.7 -243.8 -10.65 -243.75 -8.25 -251.75 -7.9 -252.45 Q-7.25 -251.3 -4.45 -249.0 -1.5 -246.55 0.65 -245.6 L2.65 -244.85 Q3.5 -244.85 4.05 -246.25 5.05 -248.4 3.25 -250.6 1.85 -252.35 -0.35 -253.3 L-2.45 -253.85 -4.6 -254.45 -4.9 -254.75 -3.75 -255.95 -3.65 -255.9 -3.55 -255.85 -3.3 -255.7 -3.3 -255.8 -2.8 -255.7 -2.1 -255.75 -1.8 -255.9 -1.75 -255.9 0.75 -256.65 0.8 -257.1 0.95 -258.15 Q1.05 -258.65 1.5 -258.65 2.75 -258.5 2.55 -257.05 2.5 -256.55 2.6 -256.15 2.65 -255.7 3.65 -255.0 L5.55 -254.85 7.35 -255.95 Q8.1 -256.4 8.35 -257.15 L8.5 -257.4 8.5 -257.85 8.05 -259.05 7.95 -258.5 7.55 -257.45 Q7.05 -256.5 5.95 -256.15 L5.05 -255.95 Q4.45 -255.85 4.2 -256.4 L3.8 -257.8 Q3.75 -258.6 3.25 -259.25 2.5 -260.2 1.35 -260.0 0.4 -259.85 0.05 -258.95 L-0.65 -257.55 Q-1.25 -256.75 -2.2 -256.9 -3.6 -257.05 -4.3 -258.1 L-4.8 -259.15 -4.7 -260.5 -4.4 -261.6 -4.0 -262.3 -2.9 -263.8 -2.35 -264.45 Q-2.3 -266.85 -2.7 -269.2 L-2.9 -270.15 -3.6 -274.2 -3.75 -275.25 -4.05 -277.05 -4.05 -277.7 -4.4 -280.05 -4.4 -280.15 -4.45 -280.5 -4.45 -281.25 -4.55 -281.6 -4.55 -281.45 -4.55 -281.15 -4.7 -281.2 -5.25 -281.0 -5.8 -280.95 -7.15 -282.35 -8.95 -283.85 Q-10.45 -284.4 -10.85 -285.5 L-11.35 -286.7 Q-12.25 -287.1 -14.25 -283.8 -15.5 -280.9 -15.15 -276.35 -14.7 -271.5 -12.4 -270.5 L-11.0 -270.15 -10.45 -269.9 -11.1 -268.1 Q-11.5 -266.85 -10.75 -266.55 -8.75 -265.65 -6.15 -268.65 -5.2 -269.7 -4.4 -270.95 L-4.4 -270.6 -4.05 -268.3 -3.45 -265.5 Q-3.4 -265.05 -3.5 -264.65 -3.95 -263.5 -4.65 -262.6 L-4.85 -262.3 Q-6.25 -260.75 -5.8 -258.85 L-5.7 -258.55 -5.7 -258.5 -5.3 -257.45 -5.3 -257.4 -11.35 -253.3 -12.3 -254.3 -12.35 -254.75 -12.4 -256.15 -12.45 -256.2 -11.5 -257.8 Q-10.65 -260.4 -11.8 -262.55 -12.4 -263.7 -14.15 -265.3 L-14.2 -265.6 -14.45 -266.4 -14.6 -267.1 -16.05 -274.3 -16.25 -275.7 Q-16.55 -278.9 -16.4 -282.05 L-16.3 -284.2 -16.2 -284.2 -16.25 -284.25 -15.95 -287.1 -15.9 -287.1 -15.75 -288.15 -15.75 -288.25 -15.7 -288.6 Q-15.05 -292.2 -13.85 -295.75 L-13.55 -296.8 -11.25 -301.6 -11.05 -302.0 -9.75 -304.0 -8.9 -305.35 Q-7.0 -308.0 -4.6 -310.1 L-2.55 -311.85 0.9 -314.05 3.1 -315.1 1.35 -313.95 Q-0.45 -312.55 -1.4 -311.35 L-2.25 -309.75 -2.35 -309.4 -2.35 -309.1 -2.45 -308.65 Q-2.95 -307.1 -2.85 -305.8 -2.8 -304.7 -2.4 -303.75 L-0.95 -301.25 0.55 -299.15 Q0.95 -298.45 1.7 -297.9 L2.95 -297.1 4.75 -296.15 Q6.3 -295.4 8.7 -294.6 L10.4 -294.05 Q13.7 -293.0 16.7 -292.65 L17.4 -292.6 14.9 -284.8 16.3 -285.65 15.8 -284.25 15.25 -282.15 Q17.8 -283.3 18.1 -284.3 L19.3 -282.25 20.25 -280.4 21.8 -284.85 23.0 -289.45 23.3 -290.55 23.35 -290.95 24.0 -293.1 24.3 -293.15 25.0 -293.35 Q27.45 -294.05 29.3 -295.3 L31.4 -297.05 Q33.35 -299.1 34.25 -302.05 L34.65 -303.25 35.0 -305.65 34.95 -305.7 34.9 -305.9 35.0 -306.0 Q35.45 -307.65 35.2 -309.15 L35.0 -309.85 M21.0 -272.1 L21.1 -271.9 21.55 -273.05 Q22.0 -276.2 19.8 -278.55 18.6 -279.85 15.15 -282.0 L14.8 -282.25 Q11.15 -284.45 9.9 -285.9 7.75 -288.35 8.3 -291.55 L8.1 -291.6 Q7.6 -289.8 7.8 -288.1 L6.8 -289.4 Q6.9 -286.4 8.35 -283.85 9.65 -281.55 11.75 -279.95 11.45 -279.25 8.65 -278.25 5.9 -277.25 5.3 -277.5 L4.7 -278.05 4.05 -278.9 3.85 -279.0 Q3.45 -276.6 3.95 -273.95 4.5 -270.95 4.45 -269.55 L3.9 -267.1 Q3.45 -265.45 3.65 -264.85 4.25 -263.15 4.65 -262.65 5.15 -262.0 6.45 -261.45 8.5 -260.55 11.3 -261.1 14.2 -261.65 15.55 -263.35 L16.65 -265.3 17.8 -267.35 18.9 -268.2 19.05 -268.05 19.8 -267.45 21.35 -267.15 Q22.6 -267.1 22.75 -267.5 22.95 -267.95 21.95 -268.75 L20.6 -269.55 21.6 -269.45 22.9 -269.7 22.6 -270.25 20.7 -270.05 21.0 -272.1 M4.65 -281.2 L4.75 -281.1 4.75 -281.15 4.65 -281.2 M-0.35 -252.2 L-0.35 -252.15 -0.4 -252.2 -0.35 -252.2 M-2.9 -253.1 L-2.95 -253.05 -3.05 -253.15 -2.95 -253.1 -2.9 -253.1 M18.9 -257.4 Q18.9 -257.95 18.15 -258.4 16.25 -258.1 14.3 -256.6 L14.2 -256.5 Q11.85 -254.55 11.0 -251.9 L10.7 -249.7 Q12.1 -249.55 13.3 -251.1 L15.1 -253.55 Q15.45 -253.9 16.95 -254.75 L17.75 -255.35 18.65 -256.75 18.9 -257.4 M37.85 -267.5 L38.2 -267.35 Q38.9 -266.8 38.7 -266.25 L38.05 -265.55 Q37.3 -265.05 36.75 -265.2 36.15 -265.35 35.8 -267.25 L37.2 -267.5 37.85 -267.5 M26.45 -270.7 L26.45 -270.8 25.7 -270.95 26.45 -270.7 M-13.25 -288.95 L-13.5 -288.75 -8.2 -288.6 Q-5.1 -289.3 -3.95 -291.4 L-5.15 -292.0 Q-4.4 -292.8 -3.95 -293.85 L-3.75 -294.4 Q-4.95 -293.15 -9.45 -291.45 -13.15 -290.0 -14.85 -288.55 L-13.25 -288.95 M-4.55 -281.6 L-4.5 -281.6 -4.5 -281.7 -4.55 -281.6 M-14.65 -285.25 L-14.7 -285.3 -14.9 -285.25 -14.65 -285.25 M-2.1 -263.55 L-2.55 -263.45 -2.6 -263.4 -2.95 -263.05 -3.05 -262.95 -3.45 -262.4 -3.5 -262.15 -3.5 -261.7 -3.0 -261.35 -1.75 -261.5 -1.65 -261.6 -1.15 -262.15 Q-1.05 -262.6 -1.45 -263.05 L-2.1 -263.55 M-4.3 -256.15 L-4.35 -256.25 -4.3 -256.2 -4.3 -256.15 M-5.15 -253.8 L-5.15 -253.85 -5.0 -253.8 -5.05 -253.75 -5.15 -253.8" fill="url(#gradient0)" fill-rule="evenodd" stroke="none"/>
    <path d="M8.3 -317.25 L7.5 -316.7 Q5.7 -315.4 5.05 -313.4 L4.95 -313.1 -2.35 -309.4 -2.25 -309.75 -1.4 -311.35 Q-0.45 -312.55 1.35 -313.95 L3.1 -315.1 4.4 -315.65 8.3 -317.25 M4.95 -309.95 Q5.25 -308.95 6.1 -308.05 L7.05 -307.1 Q8.7 -305.95 11.3 -305.1 L13.15 -304.65 9.55 -296.4 Q5.8 -297.75 2.65 -300.1 L1.65 -300.95 Q-1.5 -303.5 -2.3 -306.1 L4.95 -309.95 M28.65 -316.6 L29.8 -315.6 34.65 -310.65 35.0 -309.85 35.2 -309.15 Q35.45 -307.65 35.0 -306.0 L34.9 -305.9 30.1 -311.95 Q30.3 -313.2 30.0 -314.3 L29.7 -315.1 29.4 -315.7 28.65 -316.6" fill="#8189b3" fill-rule="evenodd" stroke="none"/>
    <path d="M4.95 -313.1 Q4.5 -311.35 4.95 -309.95 L-2.3 -306.1 Q-2.65 -307.4 -2.45 -308.65 L-2.35 -309.1 -2.35 -309.4 4.95 -313.1" fill="#8b92c2" fill-rule="evenodd" stroke="none"/>
    <path d="M36.55 -259.5 L34.7 -258.25 34.55 -258.15 Q33.1 -256.8 31.2 -257.4 29.6 -257.95 29.3 -259.2 L29.0 -258.75 29.05 -259.3 29.25 -259.85 29.55 -260.3 30.15 -260.8 Q29.9 -260.35 29.9 -259.6 L29.9 -259.3 30.1 -259.55 30.85 -260.4 Q31.8 -259.55 32.3 -259.35 32.85 -259.15 33.7 -259.7 34.65 -260.25 35.45 -260.0 L36.55 -259.5 M-11.55 -244.75 Q-12.0 -245.5 -12.1 -246.55 L-12.2 -247.15 -12.25 -248.15 Q-12.1 -251.25 -12.3 -254.3 L-11.35 -253.3 -5.3 -257.4 -4.9 -256.85 -4.75 -256.7 -4.65 -256.55 -4.45 -256.35 -4.35 -256.25 -4.5 -256.3 -5.35 -255.35 -6.15 -254.15 -5.55 -253.85 -5.15 -253.8 -5.0 -252.85 -4.45 -252.25 Q-3.85 -252.0 -3.45 -252.45 L-2.95 -253.05 -2.9 -253.1 -0.4 -252.2 -0.35 -252.15 -1.05 -251.25 -1.25 -250.15 -0.45 -249.35 Q0.1 -249.1 0.75 -249.7 L1.65 -250.8 2.5 -249.7 Q3.5 -248.05 3.0 -246.45 L1.5 -247.0 Q-0.3 -247.75 -3.6 -250.15 -7.0 -252.7 -8.25 -254.2 L-8.9 -252.8 -11.25 -245.15 -11.55 -244.75 M-12.45 -256.2 Q-12.95 -260.8 -14.15 -265.3 -12.4 -263.7 -11.8 -262.55 -10.65 -260.4 -11.5 -257.8 L-12.45 -256.2 M17.4 -292.6 L16.7 -292.65 Q13.7 -293.0 10.4 -294.05 L8.7 -294.6 Q6.3 -295.4 4.75 -296.15 L2.95 -297.1 1.7 -297.9 Q0.95 -298.45 0.55 -299.15 L-0.95 -301.25 -2.4 -303.75 Q-2.8 -304.7 -2.85 -305.8 -2.95 -307.1 -2.45 -308.65 -2.65 -307.4 -2.3 -306.1 -1.5 -303.5 1.65 -300.95 L2.65 -300.1 Q5.8 -297.75 9.55 -296.4 L10.65 -296.0 Q14.4 -294.8 18.15 -294.95 L17.85 -293.95 17.4 -292.6 M34.15 -303.85 L34.9 -305.7 35.0 -305.65 34.65 -303.25 34.25 -302.05 Q33.35 -299.1 31.4 -297.05 L29.3 -295.3 Q27.45 -294.05 25.0 -293.35 L24.3 -293.15 24.0 -293.1 23.35 -290.95 23.3 -290.55 23.0 -289.45 21.8 -284.85 20.25 -280.4 19.3 -282.25 18.1 -284.3 Q17.8 -283.3 15.25 -282.15 L15.8 -284.25 16.3 -285.65 19.1 -287.3 20.3 -283.75 23.65 -294.2 24.15 -295.9 24.8 -296.1 26.3 -296.65 29.0 -298.05 Q32.5 -300.3 34.15 -303.85 M43.85 -267.35 Q43.2 -268.7 42.35 -269.55 L41.25 -270.45 40.2 -270.7 Q38.25 -271.05 35.8 -269.2 34.7 -268.3 34.05 -267.15 L33.85 -267.05 Q33.1 -266.65 32.35 -266.4 L32.3 -266.45 Q34.65 -269.55 36.0 -270.55 36.85 -271.2 37.8 -271.5 39.6 -272.1 41.55 -271.55 L42.75 -270.8 43.65 -269.65 43.85 -268.85 43.95 -267.35 43.85 -267.35 M33.75 -266.35 L35.45 -267.95 Q37.0 -269.1 39.1 -269.45 41.7 -264.55 36.55 -263.05 L32.3 -262.25 31.9 -262.15 32.9 -262.85 Q34.85 -264.35 35.1 -265.1 L35.0 -265.75 34.3 -266.3 33.75 -266.35 M33.4 -261.7 L36.0 -261.75 Q37.25 -261.55 38.5 -262.2 41.55 -263.85 40.85 -267.5 40.65 -268.55 40.0 -269.35 41.2 -269.0 41.95 -268.3 42.75 -267.7 42.95 -266.65 L42.9 -266.6 42.2 -267.6 Q42.35 -266.7 42.1 -265.25 41.9 -263.75 41.5 -262.95 L42.25 -262.95 43.1 -263.15 Q42.7 -262.3 41.8 -261.85 40.95 -261.35 39.7 -261.15 L37.0 -261.15 33.4 -261.5 33.4 -261.7 M7.8 -288.1 Q8.05 -286.7 8.75 -285.4 9.35 -284.2 10.75 -282.75 L12.8 -280.9 17.85 -276.8 Q20.4 -274.5 21.0 -272.1 L20.7 -270.05 22.6 -270.25 22.9 -269.7 21.6 -269.45 20.6 -269.55 21.95 -268.75 Q22.95 -267.95 22.75 -267.5 22.6 -267.1 21.35 -267.15 L19.8 -267.45 19.05 -268.05 18.9 -268.2 17.8 -267.35 16.65 -265.3 15.55 -263.35 Q14.2 -261.65 11.3 -261.1 8.5 -260.55 6.45 -261.45 5.15 -262.0 4.65 -262.65 4.25 -263.15 3.65 -264.85 3.45 -265.45 3.9 -267.1 L4.45 -269.55 Q4.5 -270.95 3.95 -273.95 3.45 -276.6 3.85 -279.0 L4.05 -278.9 4.7 -278.05 5.3 -277.5 Q5.9 -277.25 8.65 -278.25 11.45 -279.25 11.75 -279.95 9.65 -281.55 8.35 -283.85 6.9 -286.4 6.8 -289.4 L7.8 -288.1 M4.65 -281.2 L4.75 -281.15 4.75 -281.1 4.65 -281.2 M6.55 -274.45 L5.65 -273.1 5.55 -272.9 5.45 -272.7 5.45 -272.65 5.15 -269.75 4.75 -265.5 4.85 -265.5 6.15 -268.55 Q7.05 -266.6 9.35 -265.6 14.15 -263.5 16.65 -269.2 L17.1 -270.35 17.75 -271.8 19.05 -271.1 Q19.4 -271.95 18.05 -274.25 16.65 -276.6 15.35 -277.15 L9.65 -276.95 Q7.8 -276.0 6.55 -274.45 M-3.3 -255.8 L-3.3 -255.7 -3.55 -255.85 -3.25 -255.85 -3.3 -255.8 M18.9 -257.4 L18.65 -256.75 17.75 -255.35 16.95 -254.75 Q15.45 -253.9 15.1 -253.55 L13.3 -251.1 Q12.1 -249.55 10.7 -249.7 L11.0 -251.9 Q11.85 -254.55 14.2 -256.5 L14.3 -256.6 Q16.25 -258.1 18.15 -258.4 18.9 -257.95 18.9 -257.4 M37.85 -267.5 L37.2 -267.5 35.8 -267.25 Q36.15 -265.35 36.75 -265.2 37.3 -265.05 38.05 -265.55 L38.7 -266.25 Q38.9 -266.8 38.2 -267.35 L37.85 -267.5 M-5.15 -292.0 L-3.95 -291.4 Q-5.1 -289.3 -8.2 -288.6 L-13.5 -288.75 -13.25 -288.95 -11.9 -289.25 -9.15 -289.75 Q-6.6 -290.45 -5.15 -292.0 M-4.4 -270.95 Q-5.2 -269.7 -6.15 -268.65 -8.75 -265.65 -10.75 -266.55 -11.5 -266.85 -11.1 -268.1 L-10.45 -269.9 -11.0 -270.15 -12.4 -270.5 Q-14.7 -271.5 -15.15 -276.35 -15.5 -280.9 -14.25 -283.8 -12.25 -287.1 -11.35 -286.7 L-10.85 -285.5 Q-10.45 -284.4 -8.95 -283.85 L-7.15 -282.35 -5.8 -280.95 -5.25 -281.0 -4.7 -281.2 -4.55 -281.15 -4.65 -280.4 -4.65 -280.25 -4.65 -280.05 -4.65 -279.75 -4.65 -278.05 -5.95 -280.5 Q-7.2 -282.4 -8.5 -282.95 L-11.6 -282.75 Q-13.5 -282.0 -14.0 -280.85 -14.75 -279.15 -13.65 -275.75 -12.55 -272.45 -11.2 -271.85 -9.55 -271.15 -7.2 -272.7 -6.55 -273.15 -6.05 -273.6 L-6.5 -272.9 -8.15 -270.05 -8.35 -269.55 Q-5.9 -272.25 -4.4 -274.5 L-4.4 -274.15 -4.4 -273.95 -4.45 -273.0 -4.5 -272.95 -4.5 -272.9 -4.4 -270.95 M-4.3 -256.15 L-4.2 -256.15 -4.3 -256.05 -4.3 -256.15" fill="#ab927c" fill-rule="evenodd" stroke="none"/>
    <path d="M7.05 -307.1 L28.3 -316.95 28.65 -316.6 29.4 -315.7 29.7 -315.1 30.0 -314.3 Q30.3 -313.2 30.1 -311.95 L29.8 -310.75 29.35 -309.65 Q27.55 -306.1 22.05 -304.8 L14.45 -304.4 13.15 -304.65 11.3 -305.1 Q8.7 -305.95 7.05 -307.1" fill="#a7b5e9" fill-rule="evenodd" stroke="none"/>
    <path d="M13.15 -304.65 L14.45 -304.4 22.05 -304.8 Q27.55 -306.1 29.35 -309.65 L34.15 -303.85 Q32.5 -300.3 29.0 -298.05 L26.3 -296.65 24.8 -296.1 24.15 -295.9 Q21.45 -295.1 18.7 -294.95 L18.15 -294.95 Q14.4 -294.8 10.65 -296.0 L9.55 -296.4 13.15 -304.65" fill="#6e7399" fill-rule="evenodd" stroke="none"/>
    <path d="M29.35 -309.65 L29.8 -310.75 30.1 -311.95 34.9 -305.9 34.9 -305.7 34.15 -303.85 29.35 -309.65" fill="#5d6282" fill-rule="evenodd" stroke="none"/>
    <path d="M34.9 -305.7 L34.95 -305.7 35.0 -305.65 34.9 -305.7 M32.55 -261.45 L33.4 -261.7 33.4 -261.5 32.55 -261.45" fill="#aab2b5" fill-rule="evenodd" stroke="none"/>
    <path d="M34.9 -305.7 L34.9 -305.9 34.95 -305.7 34.9 -305.7 M34.05 -267.15 L33.95 -266.9 33.85 -267.05 34.05 -267.15 M26.45 -270.7 L25.7 -270.95 26.45 -270.8 26.45 -270.7" fill="#d9c8b7" fill-rule="evenodd" stroke="none"/>
    <path d="M-10.7 -243.8 L-11.55 -244.75 -11.25 -245.15 -8.9 -252.8 -8.25 -254.2 Q-7.0 -252.7 -3.6 -250.15 -0.3 -247.75 1.5 -247.0 L3.0 -246.45 Q3.5 -248.05 2.5 -249.7 L1.65 -250.8 1.6 -250.85 -0.35 -252.2 -0.4 -252.2 -2.9 -253.1 -2.95 -253.1 -3.05 -253.15 -5.05 -253.75 -5.0 -253.8 -5.15 -253.85 -5.15 -253.8 -5.55 -253.85 -6.15 -254.15 -5.35 -255.35 -4.5 -256.3 -4.35 -256.25 -4.45 -256.35 -4.65 -256.55 -4.75 -256.7 -4.9 -256.85 -5.3 -257.4 -5.3 -257.45 -5.7 -258.5 -5.7 -258.55 -5.8 -258.85 Q-6.25 -260.75 -4.85 -262.3 L-4.65 -262.6 Q-3.95 -263.5 -3.5 -264.65 -3.4 -265.05 -3.45 -265.5 L-4.05 -268.3 -4.4 -270.6 -4.4 -270.95 -4.5 -272.9 -4.5 -272.95 -4.45 -273.0 -4.4 -273.95 -4.4 -274.15 -4.4 -274.5 -4.55 -275.95 -4.6 -276.5 -4.6 -276.7 -4.7 -276.75 -4.65 -277.2 -4.65 -277.3 -4.65 -277.35 -4.65 -277.55 -4.65 -277.6 -4.65 -277.75 -4.65 -278.05 -4.65 -279.75 -4.65 -280.05 -4.65 -280.25 -4.65 -280.4 -4.55 -281.15 -4.55 -281.45 -4.55 -281.6 -4.45 -281.25 -4.45 -280.5 -4.4 -280.15 -4.4 -280.05 -4.05 -277.7 -4.05 -277.05 -3.75 -275.25 -3.6 -274.2 -2.9 -270.15 -2.7 -269.2 Q-2.3 -266.85 -2.35 -264.45 L-2.9 -263.8 -4.0 -262.3 -4.4 -261.6 -4.7 -260.5 -4.8 -259.15 -4.3 -258.1 Q-3.6 -257.05 -2.2 -256.9 -1.25 -256.75 -0.65 -257.55 L0.05 -258.95 Q0.4 -259.85 1.35 -260.0 2.5 -260.2 3.25 -259.25 3.75 -258.6 3.8 -257.8 L4.2 -256.4 Q4.45 -255.85 5.05 -255.95 L5.95 -256.15 Q7.05 -256.5 7.55 -257.45 L7.95 -258.5 8.05 -259.05 8.5 -257.85 8.5 -257.4 8.35 -257.15 Q8.1 -256.4 7.35 -255.95 L5.55 -254.85 3.65 -255.0 Q2.65 -255.7 2.6 -256.15 2.5 -256.55 2.55 -257.05 2.75 -258.5 1.5 -258.65 1.05 -258.65 0.95 -258.15 L0.8 -257.1 0.75 -256.65 -1.75 -255.9 -1.8 -255.9 -2.1 -255.75 -2.8 -255.7 -3.3 -255.8 -3.25 -255.85 -3.55 -255.85 -3.65 -255.9 -3.75 -255.95 -4.9 -254.75 -4.6 -254.45 -2.45 -253.85 -0.35 -253.3 Q1.85 -252.35 3.25 -250.6 5.05 -248.4 4.05 -246.25 3.5 -244.85 2.65 -244.85 L0.65 -245.6 Q-1.5 -246.55 -4.45 -249.0 -7.25 -251.3 -7.9 -252.45 L-8.25 -251.75 -10.65 -243.75 -10.7 -243.8 M-16.25 -275.7 L-17.8 -276.8 -18.9 -278.45 -19.35 -279.4 -19.9 -281.45 Q-20.25 -283.15 -19.8 -284.55 -19.45 -285.75 -18.75 -286.55 -17.9 -287.65 -16.95 -287.45 L-15.9 -287.1 -15.95 -287.1 -16.25 -284.25 -16.3 -284.2 -16.4 -282.05 Q-16.55 -278.9 -16.25 -275.7 M34.05 -267.15 Q34.7 -268.3 35.8 -269.2 38.25 -271.05 40.2 -270.7 L41.25 -270.45 42.35 -269.55 Q43.2 -268.7 43.85 -267.35 L43.8 -266.45 43.75 -266.1 43.45 -264.95 42.9 -264.1 43.05 -264.7 43.1 -265.15 43.1 -266.15 42.95 -266.65 Q42.75 -267.7 41.95 -268.3 41.2 -269.0 40.0 -269.35 40.65 -268.55 40.85 -267.5 41.55 -263.85 38.5 -262.2 37.25 -261.55 36.0 -261.75 L33.4 -261.7 32.55 -261.45 30.85 -260.4 30.1 -259.55 29.9 -259.3 29.9 -259.6 Q29.9 -260.35 30.15 -260.8 L30.35 -261.25 30.7 -261.65 Q31.15 -262.0 31.9 -262.15 L32.3 -262.25 36.55 -263.05 Q41.7 -264.55 39.1 -269.45 37.0 -269.1 35.45 -267.95 L33.75 -266.35 33.7 -266.35 33.95 -266.9 34.05 -267.15 M-4.3 -256.15 L-4.3 -256.05 -4.2 -256.15 -4.3 -256.15 -4.3 -256.2 -4.35 -256.25 -4.3 -256.15" fill="#91725e" fill-rule="evenodd" stroke="none"/>
    <path d="M16.3 -285.65 L14.9 -284.8 17.4 -292.6 17.85 -293.95 21.6 -294.0 21.7 -294.0 23.65 -294.2 20.3 -283.75 19.1 -287.3 16.3 -285.65" fill="#a06767" fill-rule="evenodd" stroke="none"/>
    <path d="M17.85 -293.95 L18.15 -294.95 18.7 -294.95 Q21.45 -295.1 24.15 -295.9 L23.65 -294.2 21.7 -294.0 21.6 -294.0 17.85 -293.95" fill="#694141" fill-rule="evenodd" stroke="none"/>
    <path d="M7.8 -288.1 Q7.6 -289.8 8.1 -291.6 L8.3 -291.55 Q7.75 -288.35 9.9 -285.9 11.15 -284.45 14.8 -282.25 L15.15 -282.0 Q18.6 -279.85 19.8 -278.55 22.0 -276.2 21.55 -273.05 L21.1 -271.9 21.0 -272.1 Q20.4 -274.5 17.85 -276.8 L12.8 -280.9 10.75 -282.75 Q9.35 -284.2 8.75 -285.4 8.05 -286.7 7.8 -288.1 M-13.25 -288.95 L-14.85 -288.55 Q-13.15 -290.0 -9.45 -291.45 -4.95 -293.15 -3.75 -294.4 L-3.95 -293.85 Q-4.4 -292.8 -5.15 -292.0 -6.6 -290.45 -9.15 -289.75 L-11.9 -289.25 -13.25 -288.95" fill="#5e5955" fill-rule="evenodd" stroke="none"/>
    <path d="M6.55 -274.45 Q7.8 -276.0 9.65 -276.95 L15.35 -277.15 Q16.65 -276.6 18.05 -274.25 19.4 -271.95 19.05 -271.1 L17.75 -271.8 17.1 -270.35 16.65 -269.2 Q14.15 -263.5 9.35 -265.6 7.05 -266.6 6.15 -268.55 L4.85 -265.5 4.75 -265.5 5.15 -269.75 5.45 -272.65 5.45 -272.7 5.55 -272.9 5.65 -273.1 6.55 -274.45 M9.4 -276.15 Q8.05 -275.45 6.55 -273.7 6.5 -270.8 7.45 -269.15 8.3 -267.75 10.25 -266.85 12.45 -265.95 14.2 -267.2 15.65 -268.15 16.55 -270.2 16.9 -271.05 17.25 -273.6 L16.55 -274.75 Q15.85 -275.55 14.3 -276.15 11.65 -277.35 9.4 -276.15 M11.2 -271.15 Q11.65 -271.3 11.9 -271.65 12.25 -272.2 12.25 -272.85 L11.8 -273.5 Q12.45 -274.4 13.25 -274.65 14.45 -275.0 13.75 -273.35 L13.0 -271.8 Q12.25 -270.6 11.55 -270.9 L11.2 -271.15 M-4.4 -274.5 Q-5.9 -272.25 -8.35 -269.55 L-8.15 -270.05 -6.5 -272.9 -6.05 -273.6 Q-6.55 -273.15 -7.2 -272.7 -9.55 -271.15 -11.2 -271.85 -12.55 -272.45 -13.65 -275.75 -14.75 -279.15 -14.0 -280.85 -13.5 -282.0 -11.6 -282.75 L-8.5 -282.95 Q-7.2 -282.4 -5.95 -280.5 L-4.65 -278.05 -4.65 -277.75 -4.65 -277.6 -4.65 -277.55 -4.65 -277.35 -4.65 -277.3 -4.65 -277.2 -4.7 -276.75 Q-4.9 -278.0 -6.25 -279.5 -7.45 -280.85 -8.75 -281.4 -9.85 -281.9 -10.9 -281.8 -12.0 -281.65 -12.25 -281.05 -13.2 -278.85 -12.7 -276.3 -12.1 -273.6 -10.25 -272.8 -8.4 -272.0 -6.45 -273.95 -5.0 -275.45 -4.7 -276.75 L-4.6 -276.7 -4.6 -276.5 -4.55 -275.95 -4.4 -274.5 M-8.7 -278.85 Q-8.1 -279.7 -7.45 -279.55 -6.45 -279.35 -7.15 -277.7 L-7.85 -276.4 Q-8.6 -275.2 -9.25 -275.5 -9.75 -275.7 -9.6 -276.75 -9.0 -276.75 -8.7 -277.35 L-8.5 -278.2 -8.7 -278.8 -8.7 -278.85" fill="#43403d" fill-rule="evenodd" stroke="none"/>
    <path d="M9.4 -276.15 Q11.65 -277.35 14.3 -276.15 15.85 -275.55 16.55 -274.75 L17.25 -273.6 Q16.9 -271.05 16.55 -270.2 15.65 -268.15 14.2 -267.2 12.45 -265.95 10.25 -266.85 8.3 -267.75 7.45 -269.15 6.5 -270.8 6.55 -273.7 8.05 -275.45 9.4 -276.15 M11.8 -273.5 L10.45 -273.55 Q8.65 -273.3 8.65 -271.95 L8.75 -271.3 Q9.0 -270.9 10.05 -270.9 L11.2 -271.15 11.55 -270.9 Q12.25 -270.6 13.0 -271.8 L13.75 -273.35 Q14.45 -275.0 13.25 -274.65 12.45 -274.4 11.8 -273.5 M8.9 -270.0 Q8.9 -269.35 9.35 -269.35 L9.85 -269.55 10.05 -269.85 Q10.05 -270.45 9.5 -270.5 8.9 -270.5 8.9 -270.0 M1.65 -250.8 L0.75 -249.7 Q0.1 -249.1 -0.45 -249.35 L-1.25 -250.15 -1.05 -251.25 -0.35 -252.15 -0.35 -252.2 1.6 -250.85 1.65 -250.8 M-2.95 -253.05 L-3.45 -252.45 Q-3.85 -252.0 -4.45 -252.25 L-5.0 -252.85 -5.15 -253.8 -5.05 -253.75 -3.05 -253.15 -2.95 -253.05 M-12.25 -281.05 Q-12.0 -281.65 -10.9 -281.8 -9.85 -281.9 -8.75 -281.4 -7.45 -280.85 -6.25 -279.5 -4.9 -278.0 -4.7 -276.75 -5.0 -275.45 -6.45 -273.95 -8.4 -272.0 -10.25 -272.8 -12.1 -273.6 -12.7 -276.3 -13.2 -278.85 -12.25 -281.05 M-8.7 -278.85 Q-9.1 -279.35 -10.05 -279.35 -11.45 -279.35 -11.45 -278.1 L-11.25 -277.4 Q-10.8 -276.75 -9.7 -276.75 L-9.6 -276.75 Q-9.75 -275.7 -9.25 -275.5 -8.6 -275.2 -7.85 -276.4 L-7.15 -277.7 Q-6.45 -279.35 -7.45 -279.55 -8.1 -279.7 -8.7 -278.85 M-10.75 -275.9 Q-11.25 -275.9 -11.25 -275.45 -11.25 -274.9 -10.8 -274.9 -10.25 -274.9 -10.25 -275.45 -10.25 -275.95 -10.75 -275.9 M-2.1 -263.55 L-1.45 -263.05 Q-1.05 -262.6 -1.15 -262.15 L-1.65 -261.6 -1.75 -261.5 -3.0 -261.35 -3.5 -261.7 -3.5 -262.15 -3.45 -262.4 -3.05 -262.95 -2.95 -263.05 -2.6 -263.4 -2.55 -263.45 -2.1 -263.55" fill="#ede4de" fill-rule="evenodd" stroke="none"/>
    <path d="M11.8 -273.5 L12.25 -272.85 Q12.25 -272.2 11.9 -271.65 11.65 -271.3 11.2 -271.15 L10.05 -270.9 Q9.0 -270.9 8.75 -271.3 L8.65 -271.95 Q8.65 -273.3 10.45 -273.55 L11.8 -273.5 M8.9 -270.0 Q8.9 -270.5 9.5 -270.5 10.05 -270.45 10.05 -269.85 L9.85 -269.55 9.35 -269.35 Q8.9 -269.35 8.9 -270.0 M-10.75 -275.9 Q-10.25 -275.95 -10.25 -275.45 -10.25 -274.9 -10.8 -274.9 -11.25 -274.9 -11.25 -275.45 -11.25 -275.9 -10.75 -275.9 M-9.6 -276.75 L-9.7 -276.75 Q-10.8 -276.75 -11.25 -277.4 L-11.45 -278.1 Q-11.45 -279.35 -10.05 -279.35 -9.1 -279.35 -8.7 -278.85 L-8.7 -278.8 -8.5 -278.2 -8.7 -277.35 Q-9.0 -276.75 -9.6 -276.75" fill="#ffffff" fill-rule="evenodd" stroke="none"/>
    <path d="M33.7 -266.35 L33.75 -266.35 33.7 -266.25 33.7 -266.35" fill="#99a1a3" fill-rule="evenodd" stroke="none"/>
    <path d="M-14.65 -285.25 L-14.9 -285.25 -14.7 -285.3 -14.65 -285.25" fill="#a39e99" fill-rule="evenodd" stroke="none"/>
    <path d="M-4.55 -281.6 L-4.5 -281.7 -4.5 -281.6 -4.55 -281.6" fill="#94887d" fill-rule="evenodd" stroke="none"/>
    <path d="M1.4 -234.9 L1.6 -231.5 Q1.7 -227.75 2.0 -226.15 L2.15 -226.15 2.0 -230.0 2.1 -232.15 Q2.25 -233.65 2.7 -234.35 L2.75 -234.2 2.5 -233.65 2.3 -232.55 2.5 -231.5 3.35 -232.15 5.4 -223.15 6.4 -218.35 Q7.15 -214.9 7.85 -212.9 6.55 -211.65 5.55 -209.5 3.8 -205.55 4.3 -201.6 L0.65 -203.15 Q-1.5 -204.15 -2.45 -205.7 -3.5 -207.45 -3.95 -209.85 L-4.5 -214.0 -4.75 -218.35 -5.1 -222.45 -5.45 -231.05 -5.05 -234.05 -4.35 -236.3 -4.6 -236.75 -4.05 -237.6 -3.1 -236.75 -2.85 -236.6 -2.1 -231.6 Q-1.4 -227.6 -0.8 -226.55 L-0.8 -227.85 -1.3 -238.15 -1.3 -240.1 -1.1 -241.25 -0.7 -241.45 0.25 -240.7 -0.7 -240.95 -1.1 -240.1 -1.15 -239.15 -1.1 -238.2 -0.85 -237.85 -0.85 -237.3 -0.5 -237.25 Q0.25 -237.25 0.5 -238.45 L0.65 -239.75 0.9 -238.5 1.05 -236.55 1.25 -234.55 1.4 -234.9 M-4.3 -236.3 L-4.4 -236.0 -4.25 -234.35 -4.2 -233.5 -4.15 -233.45 -3.8 -233.3 Q-3.35 -233.3 -3.35 -233.85 L-3.25 -234.8 -3.25 -236.0 -4.3 -236.3" fill="url(#gradient1)" fill-rule="evenodd" stroke="none"/>
    <path d="M2.75 -234.2 L3.05 -234.35 3.7 -234.05 4.05 -233.7 3.65 -232.65 3.35 -232.15 2.5 -231.5 2.3 -232.55 2.5 -233.65 2.75 -234.2 M0.25 -240.7 L0.7 -240.6 0.7 -240.1 0.65 -239.75 0.5 -238.45 Q0.25 -237.25 -0.5 -237.25 L-0.85 -237.3 -0.85 -237.85 -1.1 -238.2 -1.15 -239.15 -1.1 -240.1 -0.7 -240.95 0.25 -240.7 M-4.3 -236.3 L-3.25 -236.0 -3.25 -234.8 -3.35 -233.85 Q-3.35 -233.3 -3.8 -233.3 L-4.15 -233.45 -4.2 -233.5 -4.25 -234.35 -4.4 -236.0 -4.3 -236.3" fill="#d6cec6" fill-rule="evenodd" stroke="none"/>
    <path d="M1.4 -234.9 L1.6 -235.25 2.35 -235.4 2.7 -234.35 Q2.25 -233.65 2.1 -232.15 L2.0 -230.0 2.15 -226.15 2.0 -226.15 Q1.7 -227.75 1.6 -231.5 L1.4 -234.9 M7.85 -212.9 L8.2 -211.85 7.75 -209.0 7.35 -204.8 7.5 -200.6 7.7 -199.2 Q6.8 -198.65 5.75 -198.5 L2.05 -198.3 -2.7 -198.6 Q-4.2 -198.9 -4.7 -199.9 L-4.95 -200.85 -5.2 -203.15 -5.4 -209.1 -5.7 -218.35 -5.7 -227.35 -5.6 -233.1 Q-5.35 -235.4 -4.6 -236.75 L-4.35 -236.3 -5.05 -234.05 -5.45 -231.05 -5.1 -222.45 -4.75 -218.35 -4.5 -214.0 -3.95 -209.85 Q-3.5 -207.45 -2.45 -205.7 -1.5 -204.15 0.65 -203.15 L4.3 -201.6 Q3.8 -205.55 5.55 -209.5 6.55 -211.65 7.85 -212.9 M-14.95 -203.95 L-15.05 -204.65 -11.75 -204.85 Q-10.6 -204.95 -10.05 -205.35 L-9.45 -206.0 Q-9.15 -206.35 -8.9 -207.85 L-8.7 -210.45 -8.9 -218.35 -9.0 -219.55 -8.65 -226.25 -7.85 -233.4 -7.5 -233.25 -7.45 -233.2 -7.1 -232.05 -7.1 -232.8 -7.2 -235.15 Q-7.05 -238.1 -5.75 -238.1 L-5.6 -238.05 -5.55 -238.05 -5.5 -238.05 -5.4 -238.0 -5.25 -237.9 Q-6.5 -232.0 -6.85 -223.55 L-6.9 -218.35 -6.95 -209.0 Q-6.95 -204.7 -7.4 -204.1 -8.05 -203.3 -11.9 -203.3 L-14.7 -203.9 -14.95 -203.95 M-2.85 -236.6 L-2.35 -236.2 Q-2.55 -238.0 -2.15 -239.45 -1.8 -240.75 -1.1 -241.25 L-1.3 -240.1 -1.3 -238.15 -0.8 -227.85 -0.8 -226.55 Q-1.4 -227.6 -2.1 -231.6 L-2.85 -236.6" fill="#ab927c" fill-rule="evenodd" stroke="none"/>
    <path d="M-15.05 -204.65 L-15.1 -205.1 Q-15.1 -206.1 -12.45 -215.95 L-11.8 -218.35 -8.9 -228.2 -9.1 -231.15 Q-9.1 -233.15 -8.4 -233.95 L-7.85 -233.45 -7.85 -233.4 -8.65 -226.25 -9.0 -219.55 -8.9 -218.35 -8.7 -210.45 -8.9 -207.85 Q-9.15 -206.35 -9.45 -206.0 L-10.05 -205.35 Q-10.6 -204.95 -11.75 -204.85 L-15.05 -204.65 M-7.5 -233.25 L-7.55 -233.4 -7.65 -234.95 -7.65 -235.15 Q-7.55 -236.1 -7.05 -237.05 -6.5 -238.15 -6.0 -238.15 L-5.6 -238.05 -5.75 -238.1 Q-7.05 -238.1 -7.2 -235.15 L-7.1 -232.8 -7.1 -232.05 -7.45 -233.2 -7.5 -233.25" fill="url(#gradient2)" fill-rule="evenodd" stroke="none"/>
    <path d="M-4.95 -200.85 L-6.35 -200.95 -7.65 -201.05 Q-11.35 -201.05 -12.9 -201.65 -14.6 -202.3 -14.95 -203.95 L-14.7 -203.9 -11.9 -203.3 Q-8.05 -203.3 -7.4 -204.1 -6.95 -204.7 -6.95 -209.0 L-6.9 -218.35 -6.85 -223.55 Q-6.5 -232.0 -5.25 -237.9 L-5.1 -237.65 -5.0 -237.55 -4.6 -236.75 Q-5.35 -235.4 -5.6 -233.1 L-5.7 -227.35 -5.7 -218.35 -5.4 -209.1 -5.2 -203.15 -4.95 -200.85" fill="#9b7964" fill-rule="evenodd" stroke="none"/>
    <path d="M-44.95 -273.25 L-44.4 -273.25" fill="none" stroke="#5c0101" stroke-linecap="round" stroke-linejoin="round" stroke-opacity="0.49803922" stroke-width="0.05"/>
    <path d="M19.0 -176.05 Q15.55 -177.25 12.5 -179.7 L12.75 -179.25 Q8.9 -182.95 7.15 -188.1 2.25 -202.65 9.75 -216.2 L14.75 -218.3 19.0 -218.7 Q15.3 -216.0 13.55 -211.05 11.95 -206.4 11.95 -199.0 11.95 -191.85 14.35 -185.45 15.9 -181.35 19.0 -176.05 M24.25 -218.85 L26.1 -218.8 28.55 -218.75 29.9 -218.85 Q36.05 -218.5 38.65 -212.4 40.9 -207.2 40.9 -196.6 40.9 -189.65 39.35 -184.35 38.55 -181.65 37.45 -179.4 32.95 -176.8 27.65 -175.35 L26.8 -175.15 28.45 -184.6 Q29.2 -188.85 29.2 -192.4 L28.85 -200.15 28.25 -208.05 27.7 -211.4 27.1 -214.95 Q26.9 -215.9 25.1 -217.9 L24.25 -218.85 M32.85 -219.5 L34.95 -220.3 Q36.5 -221.1 37.75 -222.0 39.3 -223.25 40.35 -224.75 L41.1 -225.3 Q44.2 -227.3 46.05 -227.3 49.8 -227.3 52.55 -223.65 54.0 -221.75 54.7 -219.5 54.8 -207.1 51.3 -194.85 L50.4 -192.4 50.8 -194.5 Q51.6 -199.5 51.6 -202.7 51.6 -210.95 48.15 -215.75 44.7 -220.5 38.9 -220.5 L35.35 -220.05 32.85 -219.5 M42.2 -229.15 Q42.75 -231.7 42.4 -234.8 47.8 -234.7 52.9 -236.6 L53.8 -231.5 53.0 -232.15 Q50.8 -233.7 48.15 -233.7 45.5 -233.7 44.0 -231.95 L42.2 -229.15" fill="#36384d" fill-rule="evenodd" stroke="none"/>
    <path d="M19.0 -176.05 Q15.9 -181.35 14.35 -185.45 11.95 -191.85 11.95 -199.0 11.95 -206.4 13.55 -211.05 15.3 -216.0 19.0 -218.7 L24.25 -218.85 25.1 -217.9 Q26.9 -215.9 27.1 -214.95 L27.7 -211.4 28.25 -208.05 28.85 -200.15 29.2 -192.4 Q29.2 -188.85 28.45 -184.6 L26.8 -175.15 25.35 -175.05 Q22.0 -175.05 19.0 -176.05 M29.9 -218.85 L32.3 -219.35 32.85 -219.5 35.35 -220.05 38.9 -220.5 Q44.7 -220.5 48.15 -215.75 51.6 -210.95 51.6 -202.7 51.6 -199.5 50.8 -194.5 L50.4 -192.4 Q49.65 -190.7 48.55 -189.3 43.85 -183.15 37.45 -179.4 38.55 -181.65 39.35 -184.35 40.9 -189.65 40.9 -196.6 40.9 -207.2 38.65 -212.4 36.05 -218.5 29.9 -218.85 M40.35 -224.75 Q41.55 -226.5 42.1 -228.55 L42.2 -229.15 44.0 -231.95 Q45.5 -233.7 48.15 -233.7 50.8 -233.7 53.0 -232.15 L53.8 -231.5 Q54.65 -225.5 54.7 -219.5 54.0 -221.75 52.55 -223.65 49.8 -227.3 46.05 -227.3 44.2 -227.3 41.1 -225.3 L40.35 -224.75" fill="#232532" fill-rule="evenodd" stroke="none"/>
  </g>
  <defs>
    <radialGradient cx="0" cy="0" gradientTransform="matrix(0.0738, 0.0236, -0.02, 0.0624, 6.2, -285.2)" gradientUnits="userSpaceOnUse" id="gradient0" r="819.2" spreadMethod="pad">
      <stop offset="0.0" stop-color="#d9c8b7"/>
      <stop offset="1.0" stop-color="#ab927c"/>
    </radialGradient>
    <radialGradient cx="0" cy="0" gradientTransform="matrix(0.0513, 0.0, 0.0, 0.0513, -2.1, -239.55)" gradientUnits="userSpaceOnUse" id="gradient1" r="819.2" spreadMethod="pad">
      <stop offset="0.0" stop-color="#d9c8b7"/>
      <stop offset="1.0" stop-color="#ab927c"/>
    </radialGradient>
    <radialGradient cx="0" cy="0" gradientTransform="matrix(0.0438, 0.0, 0.0, 0.0438, -7.25, -236.65)" gradientUnits="userSpaceOnUse" id="gradient2" r="819.2" spreadMethod="pad">
      <stop offset="0.0" stop-color="#d9c8b7"/>
      <stop offset="1.0" stop-color="#ab927c"/>
    </radialGradient>
  </defs>
</svg>
