<?xml version="1.0" encoding="UTF-8" standalone="no"?>
<svg xmlns:xlink="http://www.w3.org/1999/xlink" height="110.3px" width="64.4px" xmlns="http://www.w3.org/2000/svg">
  <g transform="matrix(1.0, 0.0, 0.0, 1.0, -2.5, -7.4)">
    <path d="M66.8 27.95 L66.85 28.7 64.1 27.1 61.0 24.9 Q58.6 25.25 56.5 26.0 L56.4 26.0 55.65 26.3 52.0 27.45 51.3 27.5 51.15 27.5 47.8 27.2 Q48.8 27.15 53.15 25.25 L56.4 23.8 56.5 23.75 58.4 22.9 57.8 22.3 56.5 20.8 56.4 20.7 55.7 20.1 Q53.65 18.55 52.8 15.85 L52.35 13.8 53.25 14.85 53.8 16.05 Q54.7 17.8 56.4 19.3 L56.5 19.4 59.45 22.25 59.5 22.3 62.45 24.7 66.8 27.95 M14.45 94.75 L16.75 96.3 17.05 96.5 19.4 98.1 Q20.05 99.2 20.05 101.35 20.05 104.2 19.5 105.0 18.75 106.0 18.45 110.45 18.35 111.55 17.2 111.9 L15.0 112.3 Q14.4 112.45 13.8 112.95 L12.8 113.85 11.65 114.8 10.9 114.95 10.85 114.95 10.3 109.8 9.75 102.35 9.75 101.75 Q9.75 99.5 6.15 96.55 L4.45 95.1 4.35 94.9 4.3 94.8 2.5 66.8 2.6 66.6 3.05 65.65 4.1 63.45 4.15 63.3 4.7 62.15 4.9 61.95 4.8 61.85 4.85 61.7 4.6 61.65 4.45 61.1 3.95 59.55 3.7 58.75 3.7 58.65 3.9 58.1 5.55 59.4 Q7.5 60.45 9.0 60.45 10.45 60.45 12.8 56.0 L13.45 54.7 Q15.0 51.5 15.0 49.9 15.0 48.85 14.15 47.7 L12.95 46.6 Q12.3 46.25 11.55 46.25 10.5 46.25 8.65 48.6 7.2 50.4 6.55 51.9 L7.35 49.7 7.6 48.9 8.05 46.15 Q8.05 43.85 7.45 42.5 L6.85 40.8 7.8 41.3 Q9.55 42.05 10.85 42.05 L12.4 41.85 Q14.5 41.25 16.7 39.05 L18.55 36.8 Q19.4 35.5 19.7 34.2 L19.8 33.0 Q19.8 29.55 15.3 29.55 13.95 29.55 11.5 30.75 11.2 30.9 10.3 31.4 L11.7 29.05 11.95 28.9 13.25 28.2 15.1 27.05 15.85 26.55 15.95 26.5 17.4 26.45 Q19.75 26.45 21.45 28.4 23.1 30.35 23.1 33.05 L23.05 34.2 22.65 36.8 Q22.05 38.95 20.7 40.65 18.25 43.7 13.95 44.3 L16.15 46.65 16.65 47.2 Q17.85 48.75 17.85 50.45 17.85 52.3 15.6 59.7 14.85 61.8 13.15 63.75 L12.4 64.65 11.8 65.65 11.7 66.05 12.1 68.7 12.5 71.65 Q12.5 74.45 11.95 80.05 11.4 85.6 11.4 88.2 11.4 91.75 13.15 93.7 L13.25 93.8 14.4 94.75 14.45 94.75 M18.75 24.4 L19.05 24.25 19.85 23.8 19.2 24.35 19.85 23.8 20.05 23.75 21.55 22.85 22.45 22.3 Q26.6 21.6 29.6 20.0 L33.35 17.85 Q35.0 16.65 35.35 15.15 L35.9 14.3 35.9 14.85 35.9 14.9 35.55 17.6 31.9 20.0 29.35 21.55 Q31.85 22.6 36.9 24.15 39.9 25.1 42.55 26.85 L38.55 25.7 34.8 25.0 34.1 24.9 29.65 24.15 25.35 23.7 23.5 23.8 21.7 23.9 19.2 24.35 18.9 24.45 18.8 24.5 18.75 24.4 M56.4 25.5 L54.65 26.2 52.0 27.45 54.65 26.2 56.4 25.5 M5.1 61.05 L4.85 61.7 5.1 61.05" fill="#c29c9c" fill-rule="evenodd" stroke="none"/>
    <path d="M4.15 111.0 L4.0 110.35 4.15 106.75 4.3 95.1 4.45 95.1 5.85 97.1 Q6.5 97.95 6.8 99.45 L6.95 100.25 7.2 102.45 8.6 111.35 9.1 114.15 Q8.1 113.4 7.5 113.3 4.85 112.8 4.15 111.0" fill="#e0cdcd" fill-rule="evenodd" stroke="none"/>
    <path d="M53.25 14.85 Q54.8 16.7 56.9 17.9 58.5 18.8 60.1 20.0 L64.2 22.8 66.15 24.4 66.2 24.45 66.25 24.55 66.55 26.1 66.8 27.95 62.45 24.7 59.5 22.3 59.45 22.25 56.5 19.4 56.4 19.3 Q54.7 17.8 53.8 16.05 L53.25 14.85 M4.3 95.1 L4.3 94.8 4.35 94.9 4.45 95.1 6.15 96.55 Q9.75 99.5 9.75 101.75 L9.75 102.35 10.3 109.8 10.85 114.95 Q10.1 114.95 9.15 114.2 L9.1 114.15 8.6 111.35 7.2 102.45 6.95 100.25 6.8 99.45 Q6.5 97.95 5.85 97.1 L4.45 95.1 4.3 95.1 M7.55 36.6 L8.6 34.2 9.35 32.85 9.95 31.95 Q11.65 31.2 12.35 31.2 14.75 31.2 14.75 32.85 L14.5 34.2 13.1 36.25 12.5 36.8 11.7 37.35 Q10.6 37.95 9.45 37.95 L8.1 37.65 Q7.7 37.4 7.6 36.8 L7.55 36.6 M24.35 21.15 Q26.45 20.1 29.2 19.05 33.55 17.35 35.35 15.15 35.0 16.65 33.35 17.85 L29.6 20.0 Q26.6 21.6 22.45 22.3 L23.75 21.5 24.35 21.15 M11.1 51.05 Q10.55 51.6 10.05 51.6 9.3 51.6 9.05 51.0 L8.9 50.4 Q8.9 49.05 10.25 48.9 11.6 48.75 11.6 50.05 11.6 50.55 11.1 51.05 M4.8 61.85 L4.9 61.95 4.7 62.15 4.8 61.85" fill="#d2b6b6" fill-rule="evenodd" stroke="none"/>
    <path d="M22.95 53.65 L22.5 54.65 20.55 58.25 Q18.05 62.6 17.45 65.65 L17.35 66.1 17.3 66.75 17.1 67.7 17.35 70.3 17.05 70.3 Q15.9 66.15 15.9 65.65 15.9 63.8 17.45 60.3 L19.5 55.8 Q21.55 49.7 21.15 44.3 L22.95 53.65 M19.4 98.1 L20.55 98.9 21.0 99.1 21.35 99.4 21.4 99.65 22.1 101.75 22.7 103.95 22.85 105.5 Q22.4 109.55 21.65 110.0 L20.55 110.2 19.4 110.35 19.55 112.4 19.55 112.65 19.0 113.4 17.9 113.95 16.5 114.3 Q15.9 114.45 14.9 115.7 L14.55 116.15 Q13.75 117.25 13.0 117.6 L12.4 117.7 11.35 117.55 10.0 116.8 9.5 116.4 7.7 115.1 5.65 113.95 4.65 112.9 4.35 111.95 4.15 111.0 Q4.85 112.8 7.5 113.3 8.1 113.4 9.1 114.15 L9.15 114.2 Q10.1 114.95 10.85 114.95 L10.9 114.95 11.65 114.8 12.8 113.85 13.8 112.95 Q14.4 112.45 15.0 112.3 L17.2 111.9 Q18.35 111.55 18.45 110.45 18.75 106.0 19.5 105.0 20.05 104.2 20.05 101.35 20.05 99.2 19.4 98.1 M52.2 19.1 L52.25 19.1 56.1 22.7 54.65 22.7 52.8 22.8 52.75 22.8 52.35 19.9 52.25 19.45 52.2 19.1 M50.25 13.75 L49.6 15.75 Q47.85 20.25 44.7 21.9 44.7 18.9 44.3 16.9 L43.0 16.9 Q42.75 17.15 42.45 18.5 L42.1 20.2 42.0 20.1 40.45 16.9 39.65 14.9 43.0 15.45 45.6 15.15 48.1 14.45 50.25 13.75 M39.25 13.35 L39.3 13.35 39.25 13.35 M35.05 20.55 Q35.8 20.15 36.4 19.95 L36.4 20.1 36.4 22.9 36.3 23.0 33.7 21.4 35.05 20.55" fill="#b38484" fill-rule="evenodd" stroke="none"/>
    <path d="M4.7 62.15 L4.65 61.9 4.6 61.65 4.85 61.7 4.8 61.85 4.7 62.15 M3.9 58.1 L4.9 55.65 5.9 53.4 6.35 52.4 6.55 51.9 Q7.2 50.4 8.65 48.6 10.5 46.25 11.55 46.25 12.3 46.25 12.95 46.6 L14.15 47.7 Q15.0 48.85 15.0 49.9 15.0 51.5 13.45 54.7 L12.8 56.0 Q10.45 60.45 9.0 60.45 7.5 60.45 5.55 59.4 L3.9 58.1 M6.85 40.8 L6.8 40.1 6.85 39.3 Q7.0 38.15 7.45 36.8 L7.55 36.6 7.6 36.8 Q7.7 37.4 8.1 37.65 L9.45 37.95 Q10.6 37.95 11.7 37.35 L12.5 36.8 13.1 36.25 14.5 34.2 14.75 32.85 Q14.75 31.2 12.35 31.2 11.65 31.2 9.95 31.95 L10.3 31.4 Q11.2 30.9 11.5 30.75 13.95 29.55 15.3 29.55 19.8 29.55 19.8 33.0 L19.7 34.2 Q19.4 35.5 18.55 36.8 L16.7 39.05 Q14.5 41.25 12.4 41.85 L10.85 42.05 Q9.55 42.05 7.8 41.3 L6.85 40.8 M11.1 51.05 Q11.6 50.55 11.6 50.05 11.6 48.75 10.25 48.9 8.9 49.05 8.9 50.4 L9.05 51.0 Q9.3 51.6 10.05 51.6 10.55 51.6 11.1 51.05" fill="#cca9a9" fill-rule="evenodd" stroke="none"/>
    <path d="M17.3 66.75 L17.3 67.55 17.1 67.7 17.3 66.75 M20.55 98.9 L20.7 98.8 21.0 99.1 20.55 98.9 M4.0 110.35 L4.0 110.2 3.9 109.6 4.0 108.7 4.15 106.75 4.0 110.35" fill="#e7a768" fill-rule="evenodd" stroke="none"/>
    <path d="M66.85 28.7 L66.9 30.65 Q66.9 37.25 65.25 42.7 L65.45 43.95 66.05 51.35 63.65 55.9 63.95 65.65 63.4 78.0 65.05 82.1 Q45.1 96.2 25.1 82.5 L27.15 77.75 28.0 69.3 27.0 59.25 23.2 53.05 22.95 53.65 21.15 44.3 Q21.55 49.7 19.5 55.8 L17.45 60.3 Q15.9 63.8 15.9 65.65 15.9 66.15 17.05 70.3 L17.35 70.3 17.85 75.9 14.45 94.75 14.4 94.75 13.25 93.8 13.15 93.7 Q11.4 91.75 11.4 88.2 11.4 85.6 11.95 80.05 12.5 74.45 12.5 71.65 L12.1 68.7 11.7 66.05 11.8 65.65 12.4 64.65 13.15 63.75 Q14.85 61.8 15.6 59.7 17.85 52.3 17.85 50.45 17.85 48.75 16.65 47.2 L16.15 46.65 13.95 44.3 Q18.25 43.7 20.7 40.65 22.05 38.95 22.65 36.8 L23.05 34.2 23.1 33.05 Q23.1 30.35 21.45 28.4 19.75 26.45 17.4 26.45 L15.95 26.5 16.55 26.1 16.55 25.85 17.35 25.35 18.5 24.6 18.75 24.4 18.8 24.5 18.9 24.45 19.2 24.35 21.7 23.9 23.5 23.8 25.35 23.7 29.65 24.15 34.1 24.9 34.8 25.0 38.55 25.7 42.55 26.85 Q39.9 25.1 36.9 24.15 31.85 22.6 29.35 21.55 L31.9 20.0 35.55 17.6 35.9 14.9 35.9 14.85 35.9 14.3 36.3 13.35 38.4 14.4 39.65 14.9 40.45 16.9 42.0 20.1 42.1 20.2 42.45 18.5 Q42.75 17.15 43.0 16.9 L44.3 16.9 Q44.7 18.9 44.7 21.9 47.85 20.25 49.6 15.75 L50.25 13.75 51.6 13.1 51.55 12.3 51.5 12.2 51.5 12.15 51.55 12.1 51.55 12.2 51.55 12.3 52.35 13.8 52.8 15.85 Q53.65 18.55 55.7 20.1 L56.4 20.7 56.5 20.8 57.8 22.3 58.4 22.9 56.5 23.75 56.4 23.8 53.15 25.25 Q48.8 27.15 47.8 27.2 L51.15 27.5 51.3 27.5 52.0 27.45 51.15 27.5 52.0 27.45 55.65 26.3 56.4 26.0 56.5 26.0 Q58.6 25.25 61.0 24.9 L64.1 27.1 66.85 28.7 M52.2 19.1 L52.2 19.05 51.7 14.25 51.6 13.1 51.7 14.25 52.2 19.05 52.2 19.1 52.25 19.45 52.35 19.9 52.75 22.8 52.8 22.8 54.65 22.7 56.1 22.7 52.25 19.1 52.2 19.1 M45.05 27.6 L43.7 27.2 42.75 26.95 42.6 26.9 39.15 26.05 34.8 25.0 39.15 26.05 42.6 26.9 42.75 26.95 43.7 27.2 45.05 27.6 M35.05 20.55 L33.7 21.4 36.3 23.0 36.4 22.9 36.4 20.1 36.4 19.95 Q35.8 20.15 35.05 20.55 M24.2 42.6 L23.8 40.1 23.6 39.5 23.45 38.95 23.6 39.5 23.8 40.1 24.2 42.6" fill="url(#gradient0)" fill-rule="evenodd" stroke="none"/>
    <path d="M36.3 13.35 L36.35 12.9 36.4 12.6 36.3 10.65 36.35 10.25 36.65 7.45 36.65 7.4 51.3 7.4 51.45 10.35 51.45 10.75 51.45 10.95 51.5 11.65 51.55 12.1 51.5 12.15 51.5 12.2 51.55 12.3 51.6 13.1 50.25 13.75 48.1 14.45 45.6 15.15 43.0 15.45 39.65 14.9 38.4 14.4 36.3 13.35 M39.25 13.35 L39.3 13.35 39.25 13.35" fill="#a36a6a" fill-rule="evenodd" stroke="none"/>
    <path d="M53.25 14.85 Q54.8 16.7 56.9 17.9 58.5 18.8 60.1 20.0 L64.2 22.8 66.15 24.4 66.2 24.45 M65.45 43.95 L66.05 51.35 63.65 55.9 63.95 65.65 63.4 78.0 65.05 82.1 Q45.1 96.2 25.1 82.5 L27.15 77.75 28.0 69.3 27.0 59.25 23.2 53.05 M22.5 54.65 L20.55 58.25 Q18.05 62.6 17.45 65.65 L17.35 66.1 M17.1 67.7 L17.35 70.3 17.85 75.9 14.45 94.75 16.75 96.3 M17.05 96.5 L19.4 98.1 20.55 98.9 M21.0 99.1 L21.35 99.4 21.4 99.65 22.1 101.75 22.7 103.95 22.85 105.5 Q22.4 109.55 21.65 110.0 L20.55 110.2 19.4 110.35 19.55 112.4 19.55 112.65 19.0 113.4 17.9 113.95 16.5 114.3 Q15.9 114.45 14.9 115.7 L14.55 116.15 Q13.75 117.25 13.0 117.6 L12.4 117.7 11.35 117.55 10.0 116.8 9.5 116.4 7.7 115.1 5.65 113.95 4.65 112.9 4.35 111.95 4.15 111.0 4.0 110.35 M4.15 106.75 L4.3 95.1 4.3 94.8 2.5 66.8 2.6 66.6 3.05 65.65 4.1 63.45 4.15 63.3 4.7 62.15 4.65 61.9 4.6 61.65 M4.45 61.1 L3.95 59.55 3.7 58.75 3.7 58.65 3.9 58.1 4.9 55.65 5.9 53.4 6.35 52.4 M6.55 51.9 L7.35 49.7 M7.6 48.9 L8.05 46.15 Q8.05 43.85 7.45 42.5 L6.85 40.8 6.8 40.1 6.85 39.3 Q7.0 38.15 7.45 36.8 L7.55 36.6 8.6 34.2 9.35 32.85 9.95 31.95 10.3 31.4 11.7 29.05 11.95 28.9 13.25 28.2 15.1 27.05 15.85 26.55 15.95 26.5 16.55 26.1 16.55 25.85 17.35 25.35 M18.5 24.6 L18.75 24.4 M19.85 23.8 Q21.45 22.5 24.35 21.15 26.45 20.1 29.2 19.05 33.55 17.35 35.35 15.15 L35.9 14.3 36.3 13.35 36.35 12.9 36.4 12.6 36.3 10.65 36.35 10.25 M36.65 7.45 L36.65 7.4 M51.3 7.4 L51.45 10.35 51.45 10.75 51.45 10.95 51.5 11.65 51.55 12.1 51.55 12.2 51.55 12.3 52.35 13.8 53.25 14.85 M51.5 12.15 L51.5 12.2 51.55 12.3 51.6 13.1 51.7 14.25 52.2 19.05 52.2 19.1 M52.8 22.8 L52.75 22.8 52.35 19.9 52.25 19.45 52.2 19.1 M52.0 27.45 L54.65 26.2 56.4 25.5 M51.15 27.5 L52.0 27.45 M34.8 25.0 L39.15 26.05 42.6 26.9 42.75 26.95 43.7 27.2 45.05 27.6 M23.75 21.5 L24.35 21.15 M19.2 24.35 L19.85 23.8 20.05 23.75 21.55 22.85 M23.45 38.95 L23.6 39.5 23.8 40.1 24.2 42.6 M24.35 64.45 L24.4 64.45 24.4 64.65 24.35 64.45 M4.8 61.85 L4.85 61.7 5.1 61.05 M4.7 62.15 L4.8 61.85 M17.1 67.7 L17.3 66.75 M25.8 76.65 L26.25 76.6 M4.15 106.75 L4.0 110.35 M21.0 99.1 L20.55 98.9" fill="none" stroke="#a36a6a" stroke-linecap="round" stroke-linejoin="round" stroke-opacity="0.4" stroke-width="0.05"/>
  </g>
  <defs>
    <radialGradient cx="0" cy="0" gradientTransform="matrix(0.0864, 0.0, 0.0, 0.0864, 25.95, 25.1)" gradientUnits="userSpaceOnUse" id="gradient0" r="819.2" spreadMethod="pad">
      <stop offset="0.0" stop-color="#b38484"/>
      <stop offset="1.0" stop-color="#c29c9c"/>
    </radialGradient>
  </defs>
</svg>
