<?xml version="1.0" encoding="UTF-8" standalone="no"?>
<svg xmlns:xlink="http://www.w3.org/1999/xlink" height="291.85px" width="242.75px" xmlns="http://www.w3.org/2000/svg">
  <g transform="matrix(1.0, 0.0, 0.0, 1.0, 121.35, 145.9)">
    <path d="M95.65 -106.4 L98.0 -106.55 Q102.15 -107.05 105.35 -108.8 L105.4 -108.85 105.5 -108.9 106.3 -109.45 108.6 -111.25 109.7 -112.4 Q112.45 -115.6 115.6 -121.2 L115.75 -121.2 115.8 -120.35 115.9 -119.7 115.95 -119.35 115.95 -119.2 116.0 -117.6 Q115.95 -113.65 113.55 -108.2 L111.9 -104.8 111.25 -103.7 109.9 -101.4 109.9 -101.35 Q107.7 -97.65 104.85 -94.0 L103.15 -91.85 102.3 -90.8 99.55 -87.7 96.75 -84.85 91.25 -79.7 90.95 -79.45 88.85 -77.8 Q85.3 -75.1 81.8 -73.2 77.25 -70.7 72.8 -69.65 L66.8 -68.95 65.25 -68.95 Q60.5 -69.45 56.15 -70.65 L47.25 -73.3 45.2 -73.95 44.6 -74.2 42.5 -74.9 41.6 -75.25 37.7 -76.6 35.9 -77.25 33.55 -78.1 31.6 -78.85 31.5 -78.9 27.6 -80.45 Q27.4 -79.1 26.7 -78.25 25.8 -77.1 24.1 -77.0 L24.4 -76.5 Q24.4 -76.15 23.5 -75.7 L24.05 -75.2 24.2 -74.8 Q24.2 -73.95 23.2 -73.95 L23.5 -73.6 23.55 -73.15 23.3 -72.8 22.85 -72.25 23.25 -71.35 23.15 -70.8 Q25.75 -70.7 27.75 -69.55 L28.35 -69.25 29.05 -68.65 29.7 -68.5 30.45 -68.25 Q33.7 -67.05 33.65 -64.3 L33.6 -63.7 33.1 -55.8 33.05 -55.2 32.8 -52.65 34.25 -52.1 Q39.95 -50.75 52.0 -44.4 L52.05 -44.35 Q53.8 -43.6 55.8 -42.45 L56.8 -41.95 58.2 -41.15 58.9 -40.75 60.05 -40.05 60.05 -40.3 61.1 -40.3 65.85 -38.45 67.45 -35.6 Q69.4 -32.55 71.2 -32.55 72.0 -32.55 74.85 -33.8 L75.4 -33.45 75.75 -33.3 75.9 -32.65 Q76.75 -29.45 78.5 -29.45 L79.05 -29.5 Q79.7 -30.55 80.05 -29.9 L81.6 -30.8 85.3 -29.1 Q86.45 -24.75 86.35 -20.65 L85.8 -14.8 Q88.15 -12.75 90.6 -9.2 L92.75 -5.85 Q95.15 -1.75 95.1 0.85 L95.1 1.3 102.05 12.9 114.7 34.1 117.45 39.5 118.0 40.85 Q121.5 49.15 121.4 55.2 L120.2 60.5 119.9 61.25 118.85 62.35 117.5 63.9 116.05 65.65 115.7 65.7 115.55 65.8 114.55 67.6 113.0 69.85 101.7 83.7 Q97.55 88.85 86.3 97.3 79.65 102.35 73.9 105.35 L66.85 105.65 65.75 106.5 Q64.75 108.0 63.45 108.3 L58.3 110.8 54.4 112.6 Q53.55 114.0 49.75 114.0 45.5 114.0 42.45 111.25 L41.55 110.3 40.55 110.6 37.2 111.05 36.2 116.0 36.8 116.4 38.5 116.1 Q42.25 116.1 53.3 139.25 L56.5 145.95 -58.9 145.95 Q-59.4 142.7 -57.4 134.3 -55.9 128.35 -53.9 122.9 -55.8 122.8 -56.35 121.9 L-60.15 120.5 -65.15 118.55 Q-66.4 118.35 -67.4 117.0 L-68.45 116.25 -75.25 116.7 Q-80.8 114.2 -87.3 109.9 -98.2 102.6 -102.2 97.95 L-113.2 85.3 -114.7 83.15 -115.7 81.5 -115.85 81.35 -116.2 81.35 -117.55 79.75 -118.85 78.35 -119.9 77.35 -120.2 76.65 -121.35 71.45 Q-121.45 65.4 -118.05 56.8 L-117.5 55.35 -114.85 49.7 -102.55 27.15 -95.8 14.8 -95.8 14.35 Q-95.85 11.8 -93.55 7.4 L-91.45 3.85 Q-88.75 -0.5 -86.2 -2.85 L-84.8 -6.3 -84.75 -6.35 -85.7 -8.5 Q-86.25 -12.25 -86.2 -14.65 -86.2 -16.9 -84.45 -24.7 L-83.4 -25.75 -81.95 -27.15 -81.45 -27.6 Q-80.65 -27.1 -79.8 -27.1 -79.05 -27.1 -76.45 -31.75 L-73.9 -33.5 -72.95 -34.2 -72.75 -34.35 -72.5 -34.2 Q-71.65 -33.6 -70.9 -33.6 L-69.85 -34.2 -69.45 -34.55 -65.55 -38.6 -65.0 -39.25 -64.35 -39.65 -59.8 -41.95 -56.95 -42.75 -56.85 -42.75 Q-55.8 -44.25 -55.1 -44.35 -54.5 -44.4 -54.3 -43.6 L-53.6 -44.0 -51.75 -44.45 -35.1 -54.85 -34.5 -55.2 -34.1 -55.45 -33.5 -55.8 -32.05 -55.95 -32.15 -56.45 -31.75 -57.85 -31.7 -57.9 -31.6 -59.15 -31.25 -61.05 -31.2 -61.3 -30.95 -61.95 -31.2 -63.3 -31.3 -63.7 -32.15 -68.25 -32.25 -69.25 -32.35 -69.75 Q-32.3 -72.0 -30.6 -71.85 L-29.5 -72.9 -29.0 -73.15 Q-26.85 -74.05 -22.75 -73.9 L-17.85 -73.25 -17.45 -73.9 -18.15 -74.8 -18.35 -75.65 -18.2 -76.0 -18.45 -75.9 -19.45 -75.65 Q-20.1 -75.65 -20.55 -75.9 L-21.8 -77.0 Q-22.7 -78.2 -22.7 -79.95 L-22.25 -81.95 -22.15 -82.4 -21.85 -83.75 -24.6 -82.7 -34.4 -78.9 -34.5 -78.85 -36.55 -78.1 -38.9 -77.25 -40.7 -76.6 -44.7 -75.25 -45.6 -74.9 -47.7 -74.2 -48.3 -73.95 -50.45 -73.3 -59.45 -70.65 Q-63.8 -69.45 -68.55 -68.95 L-70.1 -68.95 -76.1 -69.65 Q-80.55 -70.7 -85.0 -73.2 -88.4 -75.1 -91.85 -77.8 L-93.85 -79.45 -94.15 -79.7 -99.45 -84.85 -102.05 -87.7 -104.7 -90.8 -105.55 -91.85 -107.15 -94.0 Q-109.8 -97.65 -111.9 -101.35 L-111.9 -101.4 -113.15 -103.7 -113.7 -104.8 -115.25 -108.2 Q-117.35 -113.65 -117.3 -117.6 L-117.15 -119.2 -117.15 -119.35 -117.1 -119.7 -117.0 -120.35 -116.85 -121.2 -116.7 -121.2 Q-113.85 -115.6 -111.2 -112.4 L-110.1 -111.25 Q-109.1 -110.2 -107.9 -109.45 L-107.1 -108.9 -107.0 -108.85 -106.95 -108.8 Q-103.85 -107.05 -99.7 -106.55 L-97.35 -106.4 -96.75 -106.4 -94.6 -106.45 -91.2 -106.75 -89.25 -107.0 -78.65 -109.3 Q-76.1 -110.05 -73.35 -110.95 L-67.2 -113.2 -67.0 -113.25 -66.8 -113.35 -66.7 -113.4 -56.7 -117.45 -50.55 -120.05 -47.3 -121.45 -45.25 -122.3 -44.9 -122.5 -37.85 -125.45 -32.95 -127.4 -30.4 -128.4 -29.6 -128.7 -29.1 -129.65 -28.4 -130.75 -27.55 -131.85 -26.35 -133.2 -26.25 -133.2 -25.35 -134.2 -25.25 -134.35 -23.7 -135.8 -23.55 -135.9 -23.45 -135.95 -21.55 -137.55 -18.6 -139.65 Q-14.65 -142.25 -10.15 -143.8 -5.0 -145.55 0.85 -145.85 L1.4 -145.85 3.4 -145.9 Q15.8 -145.9 25.25 -139.65 L29.95 -135.9 30.65 -135.25 30.9 -135.1 31.15 -134.8 32.4 -133.4 Q34.2 -131.3 35.3 -128.35 L36.15 -125.75 36.95 -125.45 43.8 -122.5 44.15 -122.3 46.2 -121.45 49.35 -120.05 55.4 -117.45 Q61.15 -115.0 65.2 -113.4 L65.3 -113.35 65.5 -113.25 65.7 -113.2 71.75 -110.95 77.05 -109.3 Q82.65 -107.75 87.55 -107.0 L89.5 -106.75 92.9 -106.45 95.05 -106.4 95.65 -106.4 M56.3 41.25 L55.6 42.35 53.9 45.2 53.25 44.85 53.1 43.65 52.85 43.6 53.2 44.95 53.45 45.7 53.15 45.8 53.05 45.95 53.05 46.0 Q49.95 50.5 45.3 55.95 L39.85 61.8 Q39.1 64.1 39.1 65.25 L39.65 66.65 40.45 68.35 40.65 68.75 Q41.9 71.4 41.85 73.55 41.8 75.35 39.6 79.15 L40.3 79.85 40.35 79.9 40.55 80.05 41.8 81.25 42.55 82.1 Q44.6 80.95 47.65 79.7 L51.1 78.4 Q51.6 76.75 52.45 74.9 L52.85 74.15 Q54.35 71.25 56.8 67.75 63.5 58.25 70.4 55.35 68.15 53.2 68.15 51.45 68.25 48.55 72.9 47.3 L72.55 46.9 72.3 46.55 Q69.2 45.1 65.45 42.95 L61.85 40.75 60.1 39.5 58.4 38.15 57.1 40.1 56.3 41.25 M-61.85 49.4 L-63.6 50.85 -67.1 53.4 -73.7 57.75 -73.95 58.1 -74.3 58.5 Q-69.8 59.3 -69.7 62.15 -69.7 63.9 -71.9 66.3 -65.2 68.5 -58.7 77.3 -56.3 80.5 -54.85 83.25 L-54.5 84.0 Q-53.65 85.75 -53.15 87.35 L-49.85 88.3 -48.05 88.9 -47.6 85.15 -46.95 79.9 Q-46.9 78.2 -48.65 75.55 L-50.35 72.85 Q-50.3 72.45 -48.9 70.0 -47.95 68.25 -47.6 66.65 L-47.45 65.45 -47.45 65.4 Q-51.75 57.75 -56.15 51.7 L-58.3 48.8 -59.05 46.55 -61.85 49.4 M-61.05 41.8 L-60.4 43.55 -60.15 43.45 -60.5 42.4 -60.6 42.15 -61.05 41.8" fill="url(#gradient0)" fill-rule="evenodd" stroke="none"/>
  </g>
  <defs>
    <radialGradient cx="0" cy="0" fx="-1350.4" fy="0" gradientTransform="matrix(0.0, -0.1812, 0.1812, 0.0, 0.1, 41.85)" gradientUnits="userSpaceOnUse" id="gradient0" r="819.2" spreadMethod="pad">
      <stop offset="0.0" stop-color="#a30e0e" stop-opacity="0.5137255"/>
      <stop offset="0.5019607843137255" stop-color="#9d9da1" stop-opacity="0.16470589"/>
      <stop offset="1.0" stop-color="#494973" stop-opacity="0.0"/>
    </radialGradient>
  </defs>
</svg>
