<?xml version="1.0" encoding="UTF-8" standalone="no"?>
<svg xmlns:xlink="http://www.w3.org/1999/xlink" height="5.65px" width="73.35px" xmlns="http://www.w3.org/2000/svg">
  <g transform="matrix(1.0, 0.0, 0.0, 1.0, 0.2, 0.0)">
    <path d="M73.15 3.5 L73.15 5.65 -0.2 5.65 -0.2 3.5 73.15 3.5 M-0.2 0.35 L-0.2 0.0 73.15 0.0 73.15 0.35 -0.2 0.35" fill="#b04103" fill-rule="evenodd" stroke="none"/>
    <path d="M73.15 0.8 L-0.2 0.8 -0.2 0.35 73.15 0.35 73.15 0.8 M-0.2 1.8 L73.15 1.8 73.15 3.5 -0.2 3.5 -0.2 1.8" fill="#f29500" fill-rule="evenodd" stroke="none"/>
    <path d="M73.15 0.8 L73.15 1.8 -0.2 1.8 -0.2 0.8 73.15 0.8" fill="#ffc900" fill-rule="evenodd" stroke="none"/>
  </g>
</svg>
