<?xml version="1.0" encoding="UTF-8" standalone="no"?>
<svg xmlns:xlink="http://www.w3.org/1999/xlink" height="89.05px" width="177.95px" xmlns="http://www.w3.org/2000/svg">
  <g transform="matrix(1.0, 0.0, 0.0, 1.0, 88.95, 44.5)">
    <path d="M-41.15 -25.15 L-38.9 -26.7 Q-34.45 -29.8 -31.7 -34.4 L-30.8 -36.05 Q-29.75 -38.15 -27.7 -44.5 L-19.8 -44.5 -19.9 -44.3 Q-21.35 -40.4 -23.95 -34.4 L-25.0 -31.95 -21.65 -34.15 -20.8 -33.5 -19.9 -31.8 Q-19.2 -30.15 -18.95 -28.35 L-17.8 -28.3 Q-9.8 -26.2 -7.0 -19.4 -5.85 -16.6 -5.6 -13.05 L-3.65 -13.25 -2.15 -12.9 -0.25 -11.25 Q2.2 -8.75 7.6 -9.65 14.9 -10.85 18.2 -9.15 19.3 -8.6 19.85 -7.75 L21.55 -9.6 Q24.35 -12.6 26.3 -15.5 29.85 -20.7 30.6 -25.45 L30.7 -26.15 Q32.15 -26.3 32.95 -27.5 33.65 -28.55 33.65 -30.05 L33.75 -30.15 Q35.4 -28.05 37.55 -26.2 37.0 -24.9 37.0 -23.45 37.0 -17.5 40.5 -14.1 43.25 -11.5 48.95 -9.85 52.25 -8.9 59.15 -7.3 64.95 -5.6 67.85 -3.05 70.1 -1.05 72.95 5.25 L78.05 17.5 Q83.0 29.5 86.95 32.5 L85.6 38.35 73.45 38.35 73.45 36.7 Q73.45 29.45 65.7 17.7 L68.9 6.65 68.4 6.5 Q66.2 7.6 64.5 9.5 62.9 11.3 62.45 13.15 L59.15 8.8 Q54.75 3.25 49.15 -2.85 L44.55 -7.85 44.3 -7.55 46.6 -1.75 47.5 -0.45 Q52.55 6.55 55.9 12.05 L58.15 15.95 Q62.7 24.2 65.0 31.75 63.0 27.85 60.55 24.15 54.8 15.55 47.95 10.2 41.8 5.4 37.85 5.4 28.0 5.4 20.5 14.2 L11.25 14.5 3.65 14.85 -1.4 15.05 -7.0 15.6 -15.2 16.45 -16.1 16.5 -21.1 16.75 Q-22.95 14.5 -25.5 12.25 L-26.95 11.0 Q-33.3 5.9 -37.8 6.2 -40.85 6.4 -47.35 11.0 -51.9 14.25 -58.2 19.7 L-65.7 26.4 -63.05 20.1 Q-61.2 16.0 -58.45 11.3 L-58.25 11.0 Q-54.05 3.85 -49.85 -1.9 L-49.4 -2.55 -49.9 -1.9 -59.95 11.0 -67.2 20.25 Q-68.65 19.25 -71.0 18.35 -74.2 17.15 -75.7 17.15 L-75.7 19.45 Q-73.85 22.75 -71.75 28.25 -72.75 30.95 -73.05 33.9 L-73.15 34.65 Q-73.55 38.7 -72.9 43.15 L-80.85 43.65 -81.05 42.9 -81.35 43.4 Q-82.1 44.55 -83.45 44.55 -84.95 44.55 -86.1 41.8 -87.15 39.25 -87.9 34.5 L-88.2 31.7 Q-84.15 31.2 -81.8 27.25 -79.9 24.1 -78.35 16.8 L-77.05 11.0 -75.6 5.15 Q-73.55 -0.9 -70.0 -3.05 -67.95 -4.25 -61.75 -6.8 -55.4 -9.35 -52.15 -11.2 -42.7 -16.65 -41.15 -25.15 M14.25 27.55 L12.4 28.15 Q7.95 29.5 3.65 30.3 L-1.4 31.0 -7.0 31.6 -7.7 31.65 -13.35 31.95 Q-15.85 31.75 -16.75 30.0 L-7.0 26.85 -1.4 24.95 3.65 23.4 7.75 22.05 Q12.45 20.6 16.35 20.0 L22.1 19.45 24.05 19.7 24.35 19.75 24.65 20.05 Q25.65 20.9 28.4 22.0 19.55 25.85 14.25 27.55" fill="#3f5c29" fill-rule="evenodd" stroke="none"/>
    <path d="M37.55 -26.2 L37.7 -26.1 38.5 -25.45 39.45 -24.75 Q38.7 -23.0 38.7 -21.8 38.7 -17.8 42.85 -15.45 45.65 -13.85 52.5 -12.1 60.5 -10.1 63.35 -8.95 69.0 -6.65 71.15 -3.05 74.8 3.1 80.65 16.1 83.65 21.6 87.95 27.05 L86.95 32.5 Q83.0 29.5 78.05 17.5 L72.95 5.25 Q70.1 -1.05 67.85 -3.05 64.95 -5.6 59.15 -7.3 52.25 -8.9 48.95 -9.85 43.25 -11.5 40.5 -14.1 37.0 -17.5 37.0 -23.45 37.0 -24.9 37.55 -26.2 M-88.2 31.7 L-88.6 27.55 Q-86.1 26.0 -83.45 21.7 -80.45 16.8 -79.55 13.25 L-79.1 11.0 -77.3 3.0 Q-75.7 -2.9 -72.8 -4.7 -70.55 -6.1 -64.1 -8.8 -58.0 -11.4 -54.75 -13.6 -50.45 -16.5 -47.65 -20.85 L-41.15 -25.15 Q-42.7 -16.65 -52.15 -11.2 -55.4 -9.35 -61.75 -6.8 -67.95 -4.25 -70.0 -3.05 -73.55 -0.9 -75.6 5.15 L-77.05 11.0 -78.35 16.8 Q-79.9 24.1 -81.8 27.25 -84.15 31.2 -88.2 31.7" fill="#8f4701" fill-rule="evenodd" stroke="none"/>
    <path d="M39.45 -24.75 Q45.0 -20.7 56.8 -15.5 L59.25 -14.45 Q71.2 -9.35 79.25 -3.45 L83.9 9.55 88.6 22.3 87.95 27.05 Q83.65 21.6 80.65 16.1 74.8 3.1 71.15 -3.05 69.0 -6.65 63.35 -8.95 60.5 -10.1 52.5 -12.1 45.65 -13.85 42.85 -15.45 38.7 -17.8 38.7 -21.8 38.7 -23.0 39.45 -24.75 M-88.6 27.55 L-88.95 24.25 Q-88.95 19.5 -87.0 13.25 L-86.8 12.6 -84.5 8.45 -77.75 -3.55 -74.6 -5.6 Q-60.05 -12.95 -47.65 -20.85 -50.45 -16.5 -54.75 -13.6 -58.0 -11.4 -64.1 -8.8 -70.55 -6.1 -72.8 -4.7 -75.7 -2.9 -77.3 3.0 L-79.1 11.0 -79.55 13.25 Q-80.45 16.8 -83.45 21.7 -86.1 26.0 -88.6 27.55" fill="#d15c14" fill-rule="evenodd" stroke="none"/>
    <path d="M73.45 38.35 L66.6 38.35 Q66.05 35.1 65.0 31.75 62.7 24.2 58.15 15.95 L55.9 12.05 Q52.55 6.55 47.5 -0.45 L46.6 -1.75 44.3 -7.55 44.55 -7.85 49.15 -2.85 Q54.75 3.25 59.15 8.8 L62.45 13.15 Q62.9 11.3 64.5 9.5 66.2 7.6 68.4 6.5 L68.9 6.65 65.7 17.7 Q73.45 29.45 73.45 36.7 L73.45 38.35 M-65.0 42.6 L-72.9 43.15 Q-73.55 38.7 -73.15 34.65 L-73.05 33.9 Q-72.75 30.95 -71.75 28.25 -73.85 22.75 -75.7 19.45 L-75.7 17.15 Q-74.2 17.15 -71.0 18.35 -68.65 19.25 -67.2 20.25 L-59.95 11.0 -49.9 -1.9 -49.4 -2.55 -49.85 -1.9 Q-54.05 3.85 -58.25 11.0 L-58.45 11.3 Q-61.2 16.0 -63.05 20.1 L-65.7 26.4 Q-67.6 31.95 -67.6 36.05 -67.6 37.05 -66.05 40.5 L-65.0 42.6" fill="#2e451f" fill-rule="evenodd" stroke="none"/>
    <path d="M66.6 38.35 L-1.4 38.35 -65.0 42.6 -66.05 40.5 Q-67.6 37.05 -67.6 36.05 -67.6 31.95 -65.7 26.4 L-58.2 19.7 Q-51.9 14.25 -47.35 11.0 -40.85 6.4 -37.8 6.2 -33.3 5.9 -26.95 11.0 L-25.5 12.25 Q-22.95 14.5 -21.1 16.75 L-16.1 16.5 -15.2 16.45 -7.0 15.6 -1.4 15.05 3.65 14.85 11.25 14.5 20.5 14.2 Q28.0 5.4 37.85 5.4 41.8 5.4 47.95 10.2 54.8 15.55 60.55 24.15 63.0 27.85 65.0 31.75 66.05 35.1 66.6 38.35 M53.8 21.35 L54.3 21.6 54.4 22.15 54.4 21.6 54.3 21.6 54.25 21.3 53.8 21.35 M52.15 22.2 Q52.15 17.8 44.35 13.6 39.1 10.8 35.25 10.1 L33.0 9.9 33.0 13.35 36.45 18.35 39.95 23.1 Q44.2 27.85 48.75 27.85 50.75 27.85 51.6 25.6 52.15 24.15 52.15 22.2 M14.25 27.55 Q19.55 25.85 28.4 22.0 25.65 20.9 24.65 20.05 L24.35 19.75 24.05 19.7 22.1 19.45 16.35 20.0 Q12.45 20.6 7.75 22.05 L3.65 23.4 -1.4 24.95 -7.0 26.85 -16.75 30.0 Q-15.85 31.75 -13.35 31.95 L-7.7 31.65 -7.0 31.6 -1.4 31.0 3.65 30.3 Q7.95 29.5 12.4 28.15 L14.25 27.55 M-46.85 12.15 L-52.05 16.05 Q-57.85 20.6 -60.75 23.4 L-60.75 26.2 -58.5 26.35 -56.15 26.45 Q-32.25 24.85 -32.25 18.4 -32.25 15.25 -38.45 13.0 -43.4 11.2 -46.25 11.65 L-46.85 12.15" fill="#4e6e31" fill-rule="evenodd" stroke="none"/>
    <path d="M52.15 22.2 Q52.15 24.15 51.6 25.6 50.75 27.85 48.75 27.85 44.2 27.85 39.95 23.1 L36.45 18.35 33.0 13.35 33.0 9.9 35.25 10.1 Q39.1 10.8 44.35 13.6 52.15 17.8 52.15 22.2 M39.25 12.35 Q36.75 12.15 36.75 14.55 36.75 15.05 37.7 16.25 38.95 17.75 40.35 17.75 42.05 17.75 42.9 16.95 L43.45 16.1 Q41.9 12.5 39.25 12.35 M-46.85 12.15 L-46.25 11.65 Q-43.4 11.2 -38.45 13.0 -32.25 15.25 -32.25 18.4 -32.25 24.85 -56.15 26.45 L-58.5 26.35 -60.75 26.2 -60.75 23.4 Q-57.85 20.6 -52.05 16.05 L-46.85 12.15 M-42.65 19.0 Q-40.85 17.95 -40.85 16.4 -40.85 12.45 -46.1 13.35 -51.35 14.25 -51.35 18.2 L-51.2 19.45 Q-50.35 20.45 -47.1 20.25 -44.4 20.05 -42.65 19.0" fill="#63873d" fill-rule="evenodd" stroke="none"/>
    <path d="M39.25 12.35 Q41.9 12.5 43.45 16.1 L42.9 16.95 Q42.05 17.75 40.35 17.75 38.95 17.75 37.7 16.25 36.75 15.05 36.75 14.55 36.75 12.15 39.25 12.35 M-42.65 19.0 Q-44.4 20.05 -47.1 20.25 -50.35 20.45 -51.2 19.45 L-51.35 18.2 Q-51.35 14.25 -46.1 13.35 -40.85 12.45 -40.85 16.4 -40.85 17.95 -42.65 19.0" fill="#77a84b" fill-rule="evenodd" stroke="none"/>
    <path d="M79.25 -3.45 L84.05 0.4 Q90.35 6.0 88.6 22.3 L83.9 9.55 79.25 -3.45 M-86.8 12.6 L-86.55 11.9 -86.55 11.75 Q-86.55 9.4 -86.1 7.4 -85.4 4.15 -83.55 1.65 L-83.25 1.25 Q-81.4 -1.05 -77.75 -3.55 L-84.5 8.45 -86.8 12.6" fill="#f06a17" fill-rule="evenodd" stroke="none"/>
  </g>
</svg>
