<?xml version="1.0" encoding="UTF-8" standalone="no"?>
<svg xmlns:xlink="http://www.w3.org/1999/xlink" height="11.5px" width="78.05px" xmlns="http://www.w3.org/2000/svg">
  <g transform="matrix(1.0, 0.0, 0.0, 1.0, 35.5, 11.25)">
    <path d="M-35.5 -10.3 L-22.05 -1.9 29.75 0.25 42.55 -6.65 -35.5 -10.3" fill="url(#gradient0)" fill-rule="evenodd" stroke="none">
      <animate attributeName="d" dur="2s" repeatCount="indefinite" values="M-35.5 -10.3 L-22.05 -1.9 29.75 0.25 42.55 -6.65 -35.5 -10.3;M-32.85 -11.25 L-20.3 -1.9 28.0 -1.45 39.9 -10.05 -32.85 -11.25"/>
    </path>
    <path d="M-35.5 -10.3 L42.55 -6.65 29.75 0.25 -22.05 -1.9 -35.5 -10.3" fill="none" stroke="#000000" stroke-linecap="round" stroke-linejoin="round" stroke-opacity="0.0" stroke-width="1.0">
      <animate attributeName="stroke" dur="2s" repeatCount="indefinite" values="#000000;#000001"/>
      <animate attributeName="stroke-width" dur="2s" repeatCount="indefinite" values="0.0;0.0"/>
      <animate attributeName="fill-opacity" dur="2s" repeatCount="indefinite" values="0.0;0.0"/>
      <animate attributeName="d" dur="2s" repeatCount="indefinite" values="M-35.5 -10.3 L42.55 -6.65 29.75 0.25 -22.05 -1.9 -35.5 -10.3;M-32.85 -11.25 L39.9 -10.05 28.0 -1.45 -20.3 -1.9 -32.85 -11.25"/>
    </path>
  </g>
  <defs>
    <linearGradient gradientTransform="matrix(9.0E-4, 0.0092, -0.0452, 0.0032, 4.65, -5.7)" gradientUnits="userSpaceOnUse" id="gradient0" spreadMethod="pad" x1="-819.2" x2="819.2">
      <animateTransform additive="replace" attributeName="gradientTransform" dur="2s" from="1" repeatCount="indefinite" to="1" type="scale"/>
      <animateTransform additive="sum" attributeName="gradientTransform" dur="2s" from="4.65 -5.7" repeatCount="indefinite" to="4.6 -7.45" type="translate"/>
      <animateTransform additive="sum" attributeName="gradientTransform" dur="2s" from="84.5149" repeatCount="indefinite" to="85.6199" type="rotate"/>
      <animateTransform additive="sum" attributeName="gradientTransform" dur="2s" from="0.0093 0.0453" repeatCount="indefinite" to="0.0108 0.0424" type="scale"/>
      <animateTransform additive="sum" attributeName="gradientTransform" dur="2s" from="-7.0364" repeatCount="indefinite" to="11.9954" type="skewX"/>
      <stop offset="0.0" stop-color="#ab5428">
        <animate attributeName="offset" dur="2s" repeatCount="indefinite" values="0.0;0.0"/>
        <animate attributeName="stop-color" dur="2s" repeatCount="indefinite" values="#ab5428;#ab5429"/>
        <animate attributeName="stop-opacity" dur="2s" repeatCount="indefinite" values="1.0;1.0"/>
      </stop>
      <stop offset="0.5411764705882353" stop-color="#7d492b">
        <animate attributeName="offset" dur="2s" repeatCount="indefinite" values="0.5411764705882353;0.5411764705882353"/>
        <animate attributeName="stop-color" dur="2s" repeatCount="indefinite" values="#7d492b;#7d492c"/>
        <animate attributeName="stop-opacity" dur="2s" repeatCount="indefinite" values="1.0;1.0"/>
      </stop>
      <stop offset="1.0" stop-color="#7d685d">
        <animate attributeName="offset" dur="2s" repeatCount="indefinite" values="1.0;1.0"/>
        <animate attributeName="stop-color" dur="2s" repeatCount="indefinite" values="#7d685d;#7d685e"/>
        <animate attributeName="stop-opacity" dur="2s" repeatCount="indefinite" values="1.0;1.0"/>
      </stop>
    </linearGradient>
  </defs>
</svg>
