<?xml version="1.0" encoding="UTF-8" standalone="no"?>
<svg xmlns:xlink="http://www.w3.org/1999/xlink" height="288.25px" width="223.75px" xmlns="http://www.w3.org/2000/svg">
  <g transform="matrix(1.0, 0.0, 0.0, 1.0, 239.8, 296.45)">
    <path d="M-165.0 -77.5 L-164.6 -84.75 -164.5 -88.65 -164.4 -92.75 Q-164.5 -95.75 -162.5 -95.0 L-157.6 -93.2 -152.95 -90.75 Q-150.4 -89.55 -148.15 -89.0 L-145.75 -87.95 Q-144.1 -87.1 -143.4 -86.8 -141.7 -86.1 -141.1 -85.25 -140.7 -84.55 -140.7 -83.45 L-141.6 -79.25 Q-142.55 -75.05 -142.7 -73.1 L-142.8 -71.8 Q-144.7 -71.05 -145.95 -70.85 L-146.5 -70.85 Q-150.8 -70.85 -155.25 -72.4 -158.15 -73.45 -161.05 -75.05 L-161.55 -75.4 -162.05 -75.7 -165.0 -77.5" fill="#48484d" fill-rule="evenodd" stroke="none"/>
    <path d="M-148.6 -44.0 Q-149.15 -42.3 -150.15 -42.3 -151.45 -42.3 -155.35 -47.1 L-157.15 -49.15 -156.95 -50.5 Q-156.55 -55.25 -156.5 -59.65 L-155.7 -68.6 -155.25 -72.4 Q-150.8 -70.85 -146.5 -70.85 L-145.95 -70.85 -146.65 -69.55 -146.05 -68.1 Q-145.6 -66.75 -145.6 -65.7 -145.6 -64.9 -146.05 -63.95 L-146.45 -62.85 -146.05 -59.85 Q-146.1 -58.55 -146.65 -55.05 L-147.4 -50.75 -148.3 -45.25 -148.6 -44.0 M-161.45 -50.45 L-161.65 -47.0 Q-162.2 -39.15 -163.35 -39.15 -164.65 -39.15 -164.55 -42.3 L-164.1 -50.45 -164.05 -51.4 -164.3 -52.75 Q-164.3 -53.55 -163.9 -54.25 L-163.75 -56.45 -162.5 -72.05 -162.05 -75.7 -161.55 -75.4 -161.05 -75.05 -160.95 -74.65 -160.55 -72.25 Q-160.55 -68.6 -161.1 -61.5 L-161.7 -53.5 -161.7 -51.5 -161.45 -50.45" fill="#73737a" fill-rule="evenodd" stroke="none"/>
    <path d="M-157.15 -49.15 Q-157.85 -42.15 -159.35 -42.15 -160.5 -42.15 -160.3 -46.25 L-159.9 -49.6 -159.9 -49.7 -160.35 -49.6 Q-161.1 -49.6 -161.45 -50.45 L-161.7 -51.5 -161.7 -53.5 -161.1 -61.5 Q-160.55 -68.6 -160.55 -72.25 L-160.95 -74.65 -161.05 -75.05 Q-158.15 -73.45 -155.25 -72.4 L-155.7 -68.6 -156.5 -59.65 Q-156.55 -55.25 -156.95 -50.5 L-157.15 -49.15" fill="#67676d" fill-rule="evenodd" stroke="none"/>
    <path d="M-142.8 -71.8 L-143.25 -68.05 -143.9 -62.8 -144.7 -52.55 -144.95 -47.3 Q-144.8 -45.7 -144.95 -44.65 -145.15 -42.65 -146.7 -42.65 -146.9 -42.65 -148.6 -44.0 L-148.3 -45.25 -147.4 -50.75 -146.65 -55.05 Q-146.1 -58.55 -146.05 -59.85 L-146.45 -62.85 -146.05 -63.95 Q-145.6 -64.9 -145.6 -65.7 -145.6 -66.75 -146.05 -68.1 L-146.65 -69.55 -145.95 -70.85 Q-144.7 -71.05 -142.8 -71.8 M-164.1 -50.45 L-164.2 -50.35 -164.85 -49.75 Q-165.75 -49.75 -165.9 -53.1 L-165.5 -61.15 Q-165.15 -66.45 -165.15 -69.05 L-165.0 -77.5 -162.05 -75.7 -162.5 -72.05 -163.75 -56.45 -163.9 -54.25 Q-164.3 -53.55 -164.3 -52.75 L-164.05 -51.4 -164.1 -50.45" fill="#8e8e96" fill-rule="evenodd" stroke="none"/>
    <path d="M-164.35 -51.3 L-163.35 -51.5 -161.55 -51.75 -160.85 -51.3 Q-158.6 -49.9 -156.1 -48.8 L-155.95 -48.7 Q-154.4 -48.0 -153.1 -47.1 L-153.05 -46.7 -153.05 -45.3 -153.15 -43.5 Q-153.2 -42.8 -153.65 -41.95 L-154.3 -40.85 Q-154.6 -40.3 -154.5 -39.85 L-155.6 -29.7 -155.95 -29.8 -160.45 -30.85 -164.35 -30.55 -164.85 -30.5 -165.1 -30.45 -164.35 -51.3 M-143.2 -24.7 L-143.2 -24.65 -143.25 -24.7 -143.2 -24.7" fill="#463128" fill-rule="evenodd" stroke="none"/>
    <path d="M-143.2 -24.65 L-143.1 -24.0 -144.2 -24.0 -144.2 -24.35 Q-143.7 -24.45 -143.25 -24.7 L-143.2 -24.65 M-173.85 -25.0 L-173.8 -25.0 -173.85 -25.0 M-155.6 -29.7 L-155.35 -29.65 -155.65 -29.4 -155.85 -29.3 -160.65 -25.75 Q-161.25 -25.35 -162.3 -25.1 L-165.3 -24.8 -165.95 -24.8 -168.0 -24.8 Q-169.5 -24.95 -169.5 -25.65 -169.5 -26.5 -167.2 -28.55 L-165.1 -30.25 -164.85 -30.5 -164.35 -30.55 -160.45 -30.85 -155.95 -29.8 -155.6 -29.7" fill="#7a5445" fill-rule="evenodd" stroke="none"/>
    <path d="M-143.1 -24.0 L-142.2 -20.55 -141.8 -19.15 -144.4 -18.2 -144.2 -24.0 -143.1 -24.0 M-173.6 -15.95 L-174.7 -16.35 -175.2 -16.65 -176.55 -17.45 -176.5 -20.55 -176.4 -23.0 -175.65 -23.05 -175.15 -22.9 -173.7 -22.5 -173.65 -18.3 -173.6 -15.95" fill="#2e1f1a" fill-rule="evenodd" stroke="none"/>
    <path d="M-143.6 -31.6 Q-141.6 -31.05 -141.65 -28.3 -141.65 -27.1 -142.1 -26.1 -142.5 -25.15 -143.2 -24.7 L-143.25 -24.7 Q-143.7 -24.45 -144.2 -24.35 L-144.8 -24.3 -146.2 -24.5 Q-147.35 -24.85 -147.75 -25.9 -148.0 -26.55 -147.9 -27.3 L-147.9 -27.6 Q-147.85 -29.4 -147.2 -30.45 -146.7 -31.25 -145.8 -31.55 L-145.7 -31.6 -144.75 -31.75 -143.6 -31.6 M-144.15 -29.9 L-144.35 -29.8 -144.8 -29.2 Q-145.15 -28.55 -145.15 -27.45 -145.45 -26.35 -144.55 -26.25 L-144.2 -26.05 -143.7 -26.0 Q-142.5 -26.0 -142.5 -28.1 -142.45 -29.7 -143.7 -29.95 L-144.15 -29.9" fill="#201513" fill-rule="evenodd" stroke="none"/>
    <path d="M-144.15 -29.9 L-143.7 -29.95 Q-142.45 -29.7 -142.5 -28.1 -142.5 -26.0 -143.7 -26.0 L-144.2 -26.05 -144.55 -26.25 Q-145.45 -26.35 -145.15 -27.45 -145.15 -28.55 -144.8 -29.2 L-144.35 -29.8 -144.15 -29.9" fill="#b36a00" fill-rule="evenodd" stroke="none"/>
    <path d="M-162.5 -15.7 Q-170.75 -15.25 -173.6 -15.95 L-173.65 -18.3 -173.7 -22.5 -163.95 -21.55 -162.4 -21.55 -162.5 -15.7" fill="#0a0605" fill-rule="evenodd" stroke="none"/>
    <path d="M-158.35 -15.95 L-162.5 -15.7 -162.4 -21.55 -158.9 -21.6 -158.8 -21.6 -158.55 -18.45 -158.35 -15.95" fill="#1f1411" fill-rule="evenodd" stroke="none"/>
    <path d="M-144.4 -18.2 L-148.25 -16.65 -157.5 -16.0 -158.35 -15.95 -158.55 -18.45 -158.8 -21.6 -146.65 -22.75 -146.25 -23.15 Q-145.45 -23.9 -144.2 -24.0 L-144.4 -18.2" fill="#1a110e" fill-rule="evenodd" stroke="none"/>
    <path d="M-175.65 -23.05 L-175.15 -23.75 -173.85 -25.0 -173.8 -25.0 -171.8 -26.35 -167.15 -30.15 -165.1 -30.45 -164.85 -30.5 -165.1 -30.25 -167.2 -28.55 Q-169.5 -26.5 -169.5 -25.65 -169.5 -24.95 -168.0 -24.8 L-165.95 -24.8 -165.3 -24.8 -162.3 -25.1 Q-161.25 -25.35 -160.65 -25.75 L-155.85 -29.3 -155.65 -29.4 -155.35 -29.65 -150.25 -28.15 -154.65 -24.95 -158.9 -21.6 -162.4 -21.55 -163.95 -21.55 -173.7 -22.5 -175.15 -22.9 -175.65 -23.05" fill="#69473b" fill-rule="evenodd" stroke="none"/>
    <path d="M-150.25 -28.15 L-149.4 -27.85 -147.9 -27.3 Q-148.0 -26.55 -147.75 -25.9 -147.35 -24.85 -146.2 -24.5 L-144.8 -24.3 -144.2 -24.35 -144.2 -24.0 Q-145.45 -23.9 -146.25 -23.15 L-146.65 -22.75 -158.8 -21.6 -158.9 -21.6 -154.65 -24.95 -150.25 -28.15" fill="#4f342c" fill-rule="evenodd" stroke="none"/>
    <path d="M-166.7 -50.75 L-166.45 -54.65 Q-166.05 -55.65 -163.55 -55.95 L-160.25 -56.15 -155.2 -55.3 -152.95 -54.75 -147.5 -53.0 Q-144.5 -51.4 -142.0 -50.55 L-141.8 -50.35 -142.05 -49.25 -142.4 -44.9 -142.45 -44.35 Q-144.5 -45.7 -147.15 -47.05 L-148.15 -47.5 -150.35 -48.55 -153.2 -49.7 -155.9 -50.65 Q-159.3 -51.75 -161.55 -51.75 L-163.35 -51.5 -164.35 -51.3 -166.7 -50.75" fill="#211612" fill-rule="evenodd" stroke="none"/>
    <path d="M-166.7 -50.75 L-164.35 -51.3 -165.1 -30.45 -167.15 -30.15 -167.15 -32.5 -166.85 -44.8 -166.85 -44.9 -166.7 -50.75 M-147.15 -47.05 Q-144.5 -45.7 -142.45 -44.35 L-143.05 -37.65 -143.6 -31.6 -144.75 -31.75 -145.7 -31.6 -145.8 -31.55 -145.8 -32.0 Q-145.8 -35.35 -146.95 -37.35 L-148.15 -39.15 Q-148.15 -39.6 -147.35 -40.05 L-146.95 -40.3 -146.65 -40.8 -147.15 -47.05" fill="#5c3e33" fill-rule="evenodd" stroke="none"/>
    <path d="M-161.55 -51.75 Q-159.3 -51.75 -155.9 -50.65 L-153.2 -49.7 -150.35 -48.55 -148.15 -47.5 -147.15 -47.05 -146.65 -40.8 -146.95 -40.3 -147.35 -40.05 Q-148.15 -39.6 -148.15 -39.15 L-146.95 -37.35 Q-145.8 -35.35 -145.8 -32.0 L-145.8 -31.55 Q-146.7 -31.25 -147.2 -30.45 -147.85 -29.4 -147.9 -27.6 L-147.9 -27.3 -149.4 -27.85 -150.25 -28.15 -155.35 -29.65 -155.6 -29.7 -154.5 -39.85 Q-154.6 -40.3 -154.3 -40.85 L-153.65 -41.95 Q-153.2 -42.8 -153.15 -43.5 L-153.05 -45.3 -153.05 -46.7 -153.1 -47.1 Q-154.4 -48.0 -155.95 -48.7 L-156.1 -48.8 Q-158.6 -49.9 -160.85 -51.3 L-161.55 -51.75" fill="#36251e" fill-rule="evenodd" stroke="none"/>
    <path d="M-111.2 -101.6 L-111.55 -106.5 -112.0 -109.85 -112.5 -113.4 -112.2 -114.7 Q-111.65 -115.6 -110.4 -114.5 -109.9 -113.85 -109.7 -112.95 L-109.4 -111.4 -108.7 -105.25 -108.55 -102.9 -106.85 -103.65 Q-97.8 -107.1 -95.3 -103.55 -94.45 -102.3 -94.5 -97.6 L-93.65 -92.05 -93.6 -91.6 -96.15 -90.2 Q-99.55 -88.35 -103.45 -86.75 L-108.0 -84.95 -112.7 -83.5 -113.95 -83.15 -115.7 -82.85 -115.95 -84.75 -116.9 -92.0 Q-116.9 -93.85 -115.9 -94.2 L-115.85 -94.25 Q-115.4 -94.95 -114.45 -95.25 L-112.25 -95.9 Q-112.1 -97.0 -111.55 -97.3 L-110.75 -97.45 -111.05 -99.65 -111.2 -101.6 M-110.5 -87.7 L-110.2 -88.9 -110.25 -90.45 -110.55 -88.05 -110.5 -87.7" fill="#48484d" fill-rule="evenodd" stroke="none"/>
    <path d="M-93.6 -91.6 L-91.6 -77.3 -89.75 -62.45 -88.55 -51.1 Q-88.15 -48.65 -88.15 -46.65 -88.15 -45.35 -88.75 -44.25 L-88.7 -43.65 -88.55 -42.15 -88.65 -40.15 Q-88.85 -38.7 -89.6 -38.7 -90.45 -38.7 -91.0 -41.35 L-90.25 -42.75 Q-90.0 -43.55 -90.0 -46.25 -89.95 -50.45 -91.95 -56.25 -93.95 -62.1 -93.95 -62.9 L-93.7 -66.15 Q-93.45 -68.05 -93.75 -69.7 L-94.45 -76.4 -94.8 -83.05 -95.5 -86.5 -96.1 -89.75 -96.15 -90.2 -93.6 -91.6 M-104.35 -34.8 L-104.35 -34.7 Q-104.45 -34.5 -104.85 -34.5 -105.7 -34.5 -106.3 -36.05 L-107.2 -38.1 -108.0 -38.75 -108.7 -39.6 -110.65 -48.5 Q-111.6 -53.15 -112.95 -63.05 -114.1 -70.35 -114.85 -77.5 L-115.7 -82.85 -113.95 -83.15 -113.35 -81.3 -112.35 -78.4 Q-113.25 -74.5 -113.25 -71.75 L-111.9 -64.3 -110.05 -53.7 -108.6 -44.7 Q-108.15 -42.25 -106.3 -39.2 L-105.0 -37.5 -104.5 -35.45 -104.35 -34.8 M-115.85 -94.25 Q-115.75 -97.6 -113.95 -99.5 L-111.2 -101.6 -111.05 -99.65 -110.75 -97.45 -111.55 -97.3 Q-112.1 -97.0 -112.25 -95.9 L-114.45 -95.25 Q-115.4 -94.95 -115.85 -94.25" fill="#8e8e96" fill-rule="evenodd" stroke="none"/>
    <path d="M-91.0 -41.35 Q-92.0 -40.25 -93.9 -40.3 L-97.5 -38.05 Q-99.15 -36.95 -100.3 -36.4 L-101.0 -41.5 -102.6 -52.5 -104.05 -62.15 -105.25 -67.05 -106.4 -71.75 -105.95 -75.8 Q-105.95 -77.8 -107.0 -80.75 -108.0 -83.7 -108.0 -84.95 L-103.45 -86.75 Q-99.55 -88.35 -96.15 -90.2 L-96.1 -89.75 -95.5 -86.5 -94.8 -83.05 -94.45 -76.4 -93.75 -69.7 Q-93.45 -68.05 -93.7 -66.15 L-93.95 -62.9 Q-93.95 -62.1 -91.95 -56.25 -89.95 -50.45 -90.0 -46.25 -90.0 -43.55 -90.25 -42.75 L-91.0 -41.35 M-110.5 -87.7 L-110.55 -88.05 -110.25 -90.45 -110.2 -88.9 -110.5 -87.7 M-105.0 -37.5 L-106.3 -39.2 Q-108.15 -42.25 -108.6 -44.7 L-110.05 -53.7 -111.9 -64.3 -113.25 -71.75 Q-113.25 -74.5 -112.35 -78.4 L-113.35 -81.3 -113.95 -83.15 -112.7 -83.5 -110.85 -75.65 -111.6 -71.4 Q-111.6 -70.0 -110.65 -64.9 L-109.55 -59.6 -107.4 -47.4 -105.0 -37.5" fill="#73737a" fill-rule="evenodd" stroke="none"/>
    <path d="M-100.3 -36.4 Q-100.0 -33.85 -100.05 -33.3 -100.05 -32.65 -100.4 -32.0 L-100.45 -31.85 Q-99.3 -26.8 -99.3 -26.3 -99.35 -23.5 -100.85 -23.5 -102.0 -23.5 -102.3 -24.75 L-102.5 -26.45 -102.8 -27.8 -103.15 -29.4 -103.9 -32.3 -104.35 -34.8 -104.5 -35.45 -105.0 -37.5 -107.4 -47.4 -109.55 -59.6 -110.65 -64.9 Q-111.6 -70.0 -111.6 -71.4 L-110.85 -75.65 -112.7 -83.5 -108.0 -84.95 Q-108.0 -83.7 -107.0 -80.75 -105.95 -77.8 -105.95 -75.8 L-106.4 -71.75 -105.25 -67.05 -104.05 -62.15 -102.6 -52.5 -101.0 -41.5 -100.3 -36.4" fill="#67676d" fill-rule="evenodd" stroke="none"/>
    <path d="M-220.2 -186.15 Q-192.6 -183.1 -168.75 -197.65 -162.0 -201.7 -156.0 -206.3 L-155.15 -206.2 -159.05 -191.8 -167.8 -186.8 Q-192.35 -171.85 -218.8 -183.25 L-220.2 -186.15" fill="#3a4a13" fill-rule="evenodd" stroke="none"/>
    <path d="M-159.05 -191.8 L-162.95 -179.05 -173.05 -148.35 -175.75 -145.65 Q-180.0 -141.55 -183.55 -139.45 -187.25 -137.3 -190.2 -137.3 -194.05 -137.3 -197.7 -139.45 -201.25 -141.55 -204.7 -145.65 -207.5 -149.05 -210.25 -153.95 -215.4 -163.2 -219.25 -175.8 -218.15 -178.25 -218.15 -179.7 -218.15 -181.5 -218.8 -183.25 -192.35 -171.85 -167.8 -186.8 L-159.05 -191.8" fill="#26330d" fill-rule="evenodd" stroke="none"/>
    <path d="M-219.25 -175.8 L-219.85 -174.65 -221.75 -171.35 -224.45 -172.65 -225.35 -173.05 -225.35 -173.3 -225.35 -173.9 Q-225.35 -176.75 -226.0 -178.55 -226.55 -180.1 -228.1 -182.15 -226.25 -182.15 -226.25 -181.35 -224.85 -182.6 -223.55 -185.1 -222.55 -187.1 -221.9 -188.95 L-221.75 -188.8 -220.2 -186.15 -218.8 -183.25 Q-218.15 -181.5 -218.15 -179.7 -218.15 -178.25 -219.25 -175.8" fill="#9e846d" fill-rule="evenodd" stroke="none"/>
    <path d="M-225.35 -173.05 Q-225.55 -170.15 -227.2 -167.15 -233.5 -167.55 -237.3 -178.05 -239.2 -183.3 -239.8 -188.8 -239.8 -190.45 -238.85 -192.6 L-237.05 -196.25 Q-233.1 -197.25 -226.0 -192.2 L-221.9 -188.95 Q-222.55 -187.1 -223.55 -185.1 -224.85 -182.6 -226.25 -181.35 -226.25 -182.15 -228.1 -182.15 -226.55 -180.1 -226.0 -178.55 -225.35 -176.75 -225.35 -173.9 L-225.35 -173.3 -225.35 -173.05" fill="#b5987d" fill-rule="evenodd" stroke="none"/>
    <path d="M-91.25 -47.3 L-91.95 -46.8 Q-94.1 -45.25 -96.5 -43.95 L-96.7 -43.85 -99.4 -42.0 -99.45 -41.55 -99.25 -40.05 -98.9 -38.1 Q-98.75 -37.35 -98.2 -36.45 L-97.35 -35.25 Q-96.9 -34.65 -97.0 -34.2 L-94.5 -23.2 -94.15 -23.35 -89.6 -24.6 -85.45 -24.4 -84.95 -24.35 -84.65 -24.35 -88.25 -46.9 -89.3 -47.05 -91.25 -47.3 M-106.8 -17.4 L-106.8 -17.35 -106.75 -17.4 -106.8 -17.4" fill="#463128" fill-rule="evenodd" stroke="none"/>
    <path d="M-94.5 -23.2 L-94.8 -23.15 -94.4 -22.9 -94.2 -22.8 -88.75 -19.1 -86.9 -18.45 -83.7 -18.2 -83.05 -18.2 -80.9 -18.25 Q-79.4 -18.45 -79.45 -19.25 -79.6 -20.15 -82.3 -22.3 L-84.6 -24.1 -84.95 -24.35 -85.45 -24.4 -89.6 -24.6 -94.15 -23.35 -94.5 -23.2 M-74.9 -18.65 L-74.85 -18.65 -74.9 -18.65 M-105.7 -16.7 L-105.75 -17.05 Q-106.25 -17.15 -106.75 -17.4 L-106.8 -17.35 -106.85 -16.65 -105.7 -16.7" fill="#7a5445" fill-rule="evenodd" stroke="none"/>
    <path d="M-72.65 -16.6 L-73.2 -16.45 -74.6 -15.95 -74.15 -11.4 -73.85 -8.85 Q-73.15 -9.0 -72.8 -9.3 L-72.3 -9.65 -71.0 -10.55 -71.45 -13.9 -71.85 -16.55 -72.65 -16.6 M-106.85 -16.65 L-107.3 -12.85 -107.5 -11.35 -104.7 -10.4 -105.7 -16.7 -106.85 -16.65" fill="#2e1f1a" fill-rule="evenodd" stroke="none"/>
    <path d="M-102.25 -20.35 L-102.3 -20.7 Q-102.55 -22.65 -103.4 -23.8 L-105.0 -24.95 -105.1 -25.0 -106.1 -25.1 -107.3 -24.9 Q-109.35 -24.25 -108.95 -21.25 -108.8 -19.95 -108.15 -18.85 L-106.8 -17.4 -106.75 -17.4 Q-106.25 -17.15 -105.75 -17.05 L-105.1 -17.0 -103.6 -17.3 Q-102.45 -17.7 -102.2 -18.85 -102.0 -19.55 -102.25 -20.35 M-108.0 -21.1 Q-108.25 -22.8 -106.95 -23.1 L-106.5 -23.1 -106.25 -23.0 -105.7 -22.35 -105.1 -20.45 Q-104.65 -19.25 -105.6 -19.15 -105.75 -18.95 -106.0 -18.9 L-106.45 -18.8 Q-107.7 -18.8 -108.0 -21.1" fill="#201513" fill-rule="evenodd" stroke="none"/>
    <path d="M-108.0 -21.1 Q-107.7 -18.8 -106.45 -18.8 L-106.0 -18.9 Q-105.75 -18.95 -105.6 -19.15 -104.65 -19.25 -105.1 -20.45 L-105.7 -22.35 -106.25 -23.0 -106.5 -23.1 -106.95 -23.1 Q-108.25 -22.8 -108.0 -21.1" fill="#b36a00" fill-rule="evenodd" stroke="none"/>
    <path d="M-74.6 -15.95 Q-78.35 -14.95 -84.7 -14.65 L-86.3 -14.6 -85.45 -8.25 -73.85 -8.85 -74.15 -11.4 -74.6 -15.95" fill="#0a0605" fill-rule="evenodd" stroke="none"/>
    <path d="M-86.3 -14.6 L-89.95 -14.55 -90.1 -14.55 -89.9 -11.05 -89.8 -8.35 -85.45 -8.25 -86.3 -14.6" fill="#1f1411" fill-rule="evenodd" stroke="none"/>
    <path d="M-89.8 -8.35 L-89.9 -11.05 -90.1 -14.55 -102.9 -15.4 -103.4 -15.8 Q-104.35 -16.6 -105.7 -16.7 L-104.7 -10.4 -100.45 -8.8 -90.7 -8.4 -89.8 -8.35" fill="#1a110e" fill-rule="evenodd" stroke="none"/>
    <path d="M-94.8 -23.15 L-99.85 -21.35 -94.9 -18.0 -89.95 -14.55 -86.3 -14.6 -84.7 -14.65 Q-78.35 -14.95 -74.6 -15.95 L-73.2 -16.45 -72.65 -16.6 -73.3 -17.35 -74.85 -18.65 -74.9 -18.65 -77.15 -20.1 Q-79.3 -21.4 -82.5 -24.05 L-84.65 -24.35 -84.95 -24.35 -84.6 -24.1 -82.3 -22.3 Q-79.6 -20.15 -79.45 -19.25 -79.4 -18.45 -80.9 -18.25 L-83.05 -18.2 -83.7 -18.2 -86.9 -18.45 -88.75 -19.1 -94.2 -22.8 -94.4 -22.9 -94.8 -23.15" fill="#69473b" fill-rule="evenodd" stroke="none"/>
    <path d="M-99.85 -21.35 L-100.8 -21.0 -102.25 -20.35 Q-102.0 -19.55 -102.2 -18.85 -102.45 -17.7 -103.6 -17.3 L-105.1 -17.0 -105.75 -17.05 -105.7 -16.7 Q-104.35 -16.6 -103.4 -15.8 L-102.9 -15.4 -90.1 -14.55 -89.95 -14.55 -94.9 -18.0 -99.85 -21.35" fill="#4f342c" fill-rule="evenodd" stroke="none"/>
    <path d="M-105.6 -41.8 L-104.65 -42.3 -102.5 -43.5 -99.65 -44.8 -97.0 -45.95 Q-93.6 -47.25 -91.25 -47.3 L-89.3 -47.05 -88.25 -46.9 -85.7 -46.4 -86.45 -50.6 Q-87.0 -51.65 -89.7 -51.95 L-93.15 -52.05 Q-94.95 -52.0 -98.35 -51.0 L-100.65 -50.3 -106.1 -48.25 Q-108.95 -46.4 -111.5 -45.4 L-111.7 -45.15 -111.25 -44.05 -110.35 -39.3 -110.25 -38.7 -105.6 -41.8" fill="#211612" fill-rule="evenodd" stroke="none"/>
    <path d="M-105.0 -24.95 L-105.05 -25.4 Q-105.5 -29.05 -104.55 -31.2 L-103.55 -33.2 Q-103.6 -33.7 -104.5 -34.2 L-104.95 -34.4 -105.35 -34.95 -105.6 -41.8 -110.25 -38.7 -108.7 -31.45 -107.3 -24.9 -106.1 -25.1 -105.1 -25.0 -105.0 -24.95 M-88.25 -46.9 L-84.65 -24.35 -82.5 -24.05 -82.85 -26.6 -84.8 -39.95 -84.8 -40.05 -85.7 -46.4 -88.25 -46.9" fill="#5c3e33" fill-rule="evenodd" stroke="none"/>
    <path d="M-94.5 -23.2 L-97.0 -34.2 Q-96.9 -34.65 -97.35 -35.25 L-98.2 -36.45 Q-98.75 -37.35 -98.9 -38.1 L-99.25 -40.05 -99.45 -41.55 -99.4 -42.0 -96.7 -43.85 -96.5 -43.95 Q-94.1 -45.25 -91.95 -46.8 L-91.25 -47.3 Q-93.6 -47.25 -97.0 -45.95 L-99.65 -44.8 -102.5 -43.5 -104.65 -42.3 -105.6 -41.8 -105.35 -34.95 -104.95 -34.4 -104.5 -34.2 Q-103.6 -33.7 -103.55 -33.2 L-104.55 -31.2 Q-105.5 -29.05 -105.05 -25.4 L-105.0 -24.95 -103.4 -23.8 Q-102.55 -22.65 -102.3 -20.7 L-102.25 -20.35 -100.8 -21.0 -99.85 -21.35 -94.8 -23.15 -94.5 -23.2" fill="#36251e" fill-rule="evenodd" stroke="none"/>
    <path d="M-44.5 -272.2 Q-35.15 -262.65 -34.7 -251.55 L-34.8 -250.3 -34.75 -247.35 -34.9 -246.75 -35.0 -244.25 -35.85 -238.8 -37.0 -234.0 -37.05 -233.8 Q-39.65 -227.8 -42.6 -223.35 L-47.25 -216.0 -49.75 -211.5 -47.55 -226.85 -46.75 -233.6 -45.9 -234.15 -45.45 -234.45 -42.65 -236.7 -41.7 -238.8 -41.55 -239.25 -40.9 -240.75 Q-45.7 -238.25 -47.95 -238.25 L-65.7 -253.35 -65.75 -253.7 -67.55 -264.5 Q-68.5 -266.3 -69.1 -268.7 L-69.15 -268.7 Q-68.7 -264.7 -69.0 -260.3 L-68.95 -264.25 -69.0 -265.05 -69.1 -264.3 Q-69.95 -259.7 -71.15 -254.6 L-71.95 -250.85 Q-72.25 -253.95 -72.65 -256.3 L-74.9 -242.7 Q-75.7 -237.0 -76.5 -233.05 L-77.05 -230.8 -78.3 -227.25 -80.4 -222.0 -81.75 -219.95 -81.4 -219.55 -81.45 -219.45 -82.3 -219.25 Q-86.75 -213.65 -93.95 -212.4 L-90.55 -209.5 -87.4 -207.05 -90.05 -205.6 Q-91.95 -204.45 -92.85 -203.7 L-88.8 -200.85 -85.4 -198.3 -85.45 -185.5 Q-83.15 -170.35 -81.45 -163.15 L-79.8 -158.3 -78.05 -153.55 -77.95 -153.4 -77.0 -150.5 Q-75.3 -145.2 -75.35 -143.05 -75.35 -139.85 -76.75 -136.4 L-78.0 -133.85 -78.8 -132.25 -81.2 -130.9 -81.65 -130.7 -84.2 -129.5 Q-92.3 -125.9 -98.7 -123.55 -106.35 -120.8 -122.55 -119.5 -129.15 -119.0 -135.35 -119.4 -144.5 -120.0 -152.85 -122.7 -164.45 -126.6 -169.0 -132.55 L-170.25 -134.35 -171.0 -133.85 Q-172.45 -134.8 -173.7 -136.4 -175.2 -138.25 -176.05 -140.15 L-175.75 -143.6 -175.2 -146.85 -173.5 -153.4 -172.3 -158.0 -172.2 -158.3 -171.55 -160.45 -164.05 -184.75 -161.5 -193.5 -161.45 -193.7 -158.25 -206.2 -158.1 -206.8 -157.95 -207.65 -157.55 -208.9 -154.0 -206.2 -150.5 -205.65 -146.65 -204.95 -148.3 -203.45 -148.6 -203.15 -149.85 -201.9 -152.75 -199.05 -151.65 -199.75 -151.05 -200.15 Q-146.05 -203.25 -139.75 -206.45 L-134.55 -207.6 Q-126.55 -209.0 -118.35 -209.0 L-114.25 -208.8 -108.5 -208.35 -106.95 -208.35 -106.95 -208.7 Q-110.15 -209.2 -116.95 -211.05 -122.9 -212.6 -125.15 -213.45 L-120.4 -215.55 Q-106.35 -221.6 -91.9 -226.7 -89.45 -235.8 -73.75 -279.4 -69.9 -279.05 -63.45 -277.5 L-59.9 -276.6 -44.5 -272.2 M-116.1 -89.7 L-120.7 -88.25 Q-129.55 -85.5 -135.5 -84.05 -141.95 -82.55 -145.15 -82.5 L-148.2 -82.5 -151.65 -82.7 -154.35 -83.0 Q-161.0 -83.95 -165.85 -86.45 -168.35 -87.75 -171.45 -90.25 L-170.45 -116.25 -170.2 -116.45 -169.55 -115.65 -166.55 -111.95 -165.2 -110.25 Q-163.85 -108.65 -161.75 -107.25 -159.9 -106.15 -157.5 -105.15 L-151.5 -102.75 -149.8 -102.1 Q-148.7 -101.65 -146.8 -101.3 L-146.6 -101.25 -142.4 -100.65 -135.45 -100.55 -121.3 -101.75 -120.6 -101.85 -119.65 -99.45 -116.1 -89.7 M-166.0 -217.35 L-166.35 -221.2 -166.2 -221.5 -166.35 -224.8 Q-159.85 -219.35 -154.65 -215.95 -147.9 -211.5 -141.95 -209.65 L-143.05 -208.45 -143.6 -207.95 Q-147.8 -209.45 -154.35 -212.3 L-166.0 -217.35 M-166.5 -235.05 L-166.45 -235.45 Q-166.45 -244.2 -165.95 -252.9 -164.75 -269.45 -161.5 -285.6 L-161.5 -285.7 -161.45 -285.7 -156.95 -287.5 -150.55 -289.25 -141.1 -290.2 -134.25 -290.35 -131.15 -290.3 -123.8 -290.1 -114.35 -289.55 -105.65 -288.5 -97.15 -286.65 -96.4 -286.4 Q-92.5 -285.3 -89.05 -283.6 L-89.1 -283.55 Q-87.0 -282.9 -85.5 -281.2 L-84.7 -280.05 Q-86.15 -270.15 -89.85 -260.75 -92.15 -254.9 -95.05 -249.3 L-97.55 -244.6 -97.65 -244.35 -98.65 -242.65 -99.05 -241.95 -101.4 -238.15 Q-103.95 -233.8 -107.55 -230.6 -109.5 -228.85 -111.55 -227.35 -114.35 -225.4 -117.4 -223.85 L-119.0 -223.05 -122.75 -221.15 -132.8 -215.95 -134.75 -215.0 -138.55 -213.1 -140.45 -211.45 -141.15 -211.8 -141.3 -211.9 -144.05 -213.45 -147.1 -215.35 -153.05 -219.7 -155.95 -222.3 -166.5 -235.05 M-83.65 -232.05 L-83.75 -232.25 -83.85 -231.8 -83.65 -232.05 M-147.55 -193.2 L-147.7 -193.1 -147.8 -193.05 -147.65 -192.95 -147.65 -193.0 -147.55 -193.2 M-148.4 -146.25 L-148.35 -146.55 -148.7 -146.35 -148.4 -146.25" fill="#2d3d0f" fill-rule="evenodd" stroke="none"/>
    <path d="M-160.85 -288.55 Q-154.4 -290.5 -148.65 -291.3 L-134.3 -292.2 -129.35 -292.25 Q-112.3 -292.25 -79.05 -284.4 L-76.2 -283.7 Q-58.3 -279.3 -47.2 -274.8 L-46.15 -273.8 -44.5 -272.2 -59.9 -276.6 -63.45 -277.5 Q-69.9 -279.05 -73.75 -279.4 L-74.4 -279.45 -74.75 -279.15 -75.0 -278.95 Q-81.1 -269.3 -85.7 -256.25 -91.55 -239.5 -96.55 -232.0 -119.45 -219.0 -123.65 -216.75 L-134.8 -210.3 -142.15 -205.8 -149.1 -201.4 -151.05 -200.15 -151.65 -199.75 -152.75 -199.05 -149.85 -201.9 -148.6 -203.15 -148.3 -203.45 -146.65 -204.95 -144.35 -207.3 -143.6 -207.95 -143.05 -208.45 -141.95 -209.65 -141.8 -209.8 -138.55 -213.1 -134.75 -215.0 -132.8 -215.95 -122.75 -221.15 -119.0 -223.05 -117.4 -223.85 Q-114.35 -225.4 -111.55 -227.35 -109.5 -228.85 -107.55 -230.6 -103.95 -233.8 -101.4 -238.15 L-99.05 -241.95 -98.65 -242.65 -97.65 -244.35 -97.55 -244.6 -95.05 -249.3 Q-92.15 -254.9 -89.85 -260.75 -86.15 -270.15 -84.7 -280.05 L-85.5 -281.2 Q-87.0 -282.9 -89.1 -283.55 L-89.05 -283.6 Q-92.5 -285.3 -96.4 -286.4 L-97.15 -286.65 -105.65 -288.5 -114.35 -289.55 -123.8 -290.1 -131.15 -290.3 -134.25 -290.35 -141.1 -290.2 -150.55 -289.25 -156.95 -287.5 -161.45 -285.7 -160.85 -288.55 M-37.05 -233.8 Q-38.1 -229.65 -39.8 -225.35 -43.9 -214.6 -50.9 -204.2 L-51.3 -203.65 -51.45 -204.45 Q-52.05 -208.65 -52.35 -215.7 L-52.5 -220.3 -50.6 -210.2 -49.75 -211.5 -47.25 -216.0 -42.6 -223.35 Q-39.65 -227.8 -37.05 -233.8 M-53.05 -228.35 L-53.3 -228.4 -53.3 -228.7 -53.05 -228.35 M-53.6 -231.3 L-54.0 -231.8 -55.25 -233.1 -56.8 -234.1 -59.2 -235.55 -61.95 -237.15 -61.8 -237.25 -58.5 -235.75 Q-55.2 -234.3 -52.45 -234.3 -50.7 -234.3 -45.75 -236.85 L-41.55 -239.25 -41.7 -238.8 -42.65 -236.7 -45.45 -234.45 -45.7 -234.3 -45.9 -234.15 -46.75 -233.6 Q-50.5 -231.3 -53.35 -231.3 L-53.6 -231.3 M-71.55 -240.7 L-71.65 -240.65 -72.2 -236.85 -72.6 -235.0 -72.9 -233.5 -73.4 -230.85 -73.7 -229.15 Q-74.8 -223.85 -75.8 -220.75 L-75.95 -220.7 Q-76.15 -220.25 -76.65 -219.75 -77.65 -218.55 -79.65 -217.15 L-80.1 -216.9 -86.85 -212.15 Q-85.0 -210.9 -83.7 -207.45 L-83.8 -207.4 -87.8 -202.95 -86.85 -201.4 -85.35 -200.1 -84.7 -199.6 -84.3 -199.25 -84.45 -198.7 -84.35 -197.65 -84.35 -197.6 Q-83.9 -192.15 -79.35 -173.95 L-77.0 -165.1 -75.15 -158.3 -74.05 -154.2 -73.8 -153.4 -71.2 -141.5 -73.6 -137.25 -74.05 -136.4 -75.05 -134.9 -78.8 -132.25 -78.0 -133.85 -76.75 -136.4 Q-75.35 -139.85 -75.35 -143.05 -75.3 -145.2 -77.0 -150.5 L-77.95 -153.4 -78.05 -153.55 -79.8 -158.3 -81.45 -163.15 Q-83.15 -170.35 -85.45 -185.5 L-85.4 -198.3 -88.8 -200.85 -92.85 -203.7 Q-91.95 -204.45 -90.05 -205.6 L-87.4 -207.05 -90.55 -209.5 -93.95 -212.4 Q-86.75 -213.65 -82.3 -219.25 L-81.45 -219.45 -81.4 -219.55 -80.4 -222.0 Q-78.65 -225.1 -77.4 -229.2 L-77.05 -230.8 -76.5 -233.05 Q-75.7 -237.0 -74.9 -242.7 L-72.65 -256.3 Q-72.25 -253.95 -71.95 -250.85 L-71.65 -243.45 -71.55 -240.7 M-171.45 -90.25 L-174.65 -93.05 Q-177.45 -95.5 -180.45 -98.75 L-177.75 -102.8 -177.4 -103.45 -173.15 -110.05 -170.45 -116.25 -171.45 -90.25 M-83.65 -232.05 L-83.85 -231.8 -83.75 -232.25 -83.65 -232.05 M-147.55 -193.2 L-147.65 -193.0 -147.65 -192.95 -147.8 -193.05 -147.7 -193.1 -147.55 -193.2" fill="#4c661a" fill-rule="evenodd" stroke="none"/>
    <path d="M-160.85 -288.55 L-160.55 -289.9 -160.2 -290.75 Q-151.0 -293.6 -134.25 -294.0 L-129.0 -294.05 Q-112.0 -294.05 -97.1 -291.4 L-82.5 -288.1 -76.15 -286.85 -68.15 -285.15 -61.8 -283.15 -59.8 -282.4 -54.85 -280.55 -54.75 -280.5 Q-50.3 -277.5 -47.2 -274.8 -58.3 -279.3 -76.2 -283.7 L-79.05 -284.4 Q-112.3 -292.25 -129.35 -292.25 L-134.3 -292.2 -148.65 -291.3 Q-154.4 -290.5 -160.85 -288.55 M-83.35 -117.0 Q-82.8 -115.2 -81.25 -112.7 -79.5 -110.0 -76.55 -106.4 L-73.4 -102.8 -68.9 -97.8 -69.05 -97.55 Q-72.8 -98.95 -75.45 -99.15 L-78.2 -99.15 -81.0 -106.2 -81.65 -107.95 -83.6 -116.9 -83.35 -117.0 M-148.4 -146.25 L-148.7 -146.35 -148.35 -146.55 -148.4 -146.25" fill="#5b8020" fill-rule="evenodd" stroke="none"/>
    <path d="M-52.5 -220.3 L-52.6 -221.3 Q-52.85 -226.85 -53.05 -228.35 L-53.3 -228.7 -53.15 -229.35 -53.3 -230.4 -53.6 -231.3 -53.35 -231.3 Q-50.5 -231.3 -46.75 -233.6 L-47.55 -226.85 -49.75 -211.5 -50.6 -210.2 -52.5 -220.3 M-62.65 -237.65 L-64.35 -238.95 -66.75 -240.6 -67.85 -241.05 Q-69.55 -241.65 -71.05 -241.0 L-71.1 -241.0 -71.55 -240.7 -71.65 -243.45 -71.95 -250.85 -71.15 -254.6 Q-69.95 -259.7 -69.1 -264.3 L-69.0 -265.05 -68.95 -264.25 -69.0 -260.3 Q-68.7 -264.7 -69.15 -268.7 L-69.1 -268.7 Q-68.5 -266.3 -67.55 -264.5 L-65.75 -253.7 -65.7 -253.35 -47.95 -238.25 Q-45.7 -238.25 -40.9 -240.75 L-41.55 -239.25 -45.75 -236.85 Q-50.7 -234.3 -52.45 -234.3 -55.2 -234.3 -58.5 -235.75 L-61.8 -237.25 -62.65 -237.65 M-83.35 -117.1 L-83.35 -117.0 -83.6 -116.9 -83.35 -117.1 M-68.9 -97.8 L-68.45 -97.35 -69.1 -97.05 -69.05 -97.55 -68.9 -97.8 M-96.0 -95.95 L-112.6 -90.85 -116.1 -89.7 -119.65 -99.45 -120.6 -101.85 Q-115.85 -102.65 -111.35 -103.9 -102.75 -106.25 -96.6 -108.85 L-95.4 -109.4 Q-92.05 -110.9 -89.5 -112.45 L-85.95 -115.0 -84.7 -116.05 -83.6 -116.9 -81.65 -107.95 -81.0 -106.2 -78.2 -99.15 -79.65 -99.15 -79.9 -99.15 Q-83.4 -99.1 -90.8 -97.3 L-91.25 -97.15 -95.75 -96.0 -96.0 -95.95 M-170.45 -116.25 L-170.3 -116.55 -170.2 -116.45 -170.45 -116.25 M-161.75 -212.1 L-164.4 -213.55 -166.05 -215.25 -166.05 -215.35 -161.75 -212.1 M-166.35 -224.8 L-166.5 -235.05 -155.95 -222.3 -153.05 -219.7 -147.1 -215.35 -144.05 -213.45 -141.3 -211.9 -141.15 -211.8 -140.45 -211.45 -138.55 -213.1 -141.8 -209.8 -141.95 -209.65 Q-147.9 -211.5 -154.65 -215.95 -159.85 -219.35 -166.35 -224.8 M-80.4 -222.0 L-78.3 -227.25 -77.05 -230.8 -77.4 -229.2 Q-78.65 -225.1 -80.4 -222.0 M-45.45 -234.45 L-45.9 -234.15 -45.7 -234.3 -45.45 -234.45" fill="#3a4a13" fill-rule="evenodd" stroke="none"/>
    <path d="M-157.55 -208.9 L-157.5 -209.15 -158.65 -209.9 -160.85 -211.7 -161.75 -212.1 -166.05 -215.35 -166.05 -215.6 -166.0 -217.35 -154.35 -212.3 Q-147.8 -209.45 -143.6 -207.95 L-144.35 -207.3 -146.65 -204.95 -150.5 -205.65 -154.0 -206.2 -157.55 -208.9 M-151.05 -200.15 L-149.1 -201.4 -142.15 -205.8 -134.8 -210.3 -123.65 -216.75 Q-119.45 -219.0 -96.55 -232.0 -91.55 -239.5 -85.7 -256.25 -81.1 -269.3 -75.0 -278.95 L-74.75 -279.15 -74.4 -279.45 -73.75 -279.4 Q-89.45 -235.8 -91.9 -226.7 -106.35 -221.6 -120.4 -215.55 L-125.15 -213.45 Q-122.9 -212.6 -116.95 -211.05 -110.15 -209.2 -106.95 -208.7 L-106.95 -208.35 -108.5 -208.35 -114.25 -208.8 -118.35 -209.0 Q-126.55 -209.0 -134.55 -207.6 L-139.75 -206.45 Q-146.05 -203.25 -151.05 -200.15" fill="#22300c" fill-rule="evenodd" stroke="none"/>
    <path d="M-81.4 -219.55 L-81.75 -219.95 -80.4 -222.0 -81.4 -219.55" fill="#354a12" fill-rule="evenodd" stroke="none"/>
    <path d="M-61.95 -237.15 L-62.65 -237.65 -61.8 -237.25 -61.95 -237.15" fill="#435917" fill-rule="evenodd" stroke="none"/>
    <path d="M-169.0 -132.55 Q-164.45 -126.6 -152.85 -122.7 -144.5 -120.0 -135.35 -119.4 -129.15 -119.0 -122.55 -119.5 -106.35 -120.8 -98.7 -123.55 -92.3 -125.9 -84.2 -129.5 -83.45 -128.45 -82.9 -128.25 L-97.45 -118.75 -98.05 -118.5 -97.9 -118.5 -97.45 -118.75 Q-95.55 -119.65 -91.5 -120.9 L-84.65 -123.0 Q-88.95 -119.0 -95.3 -115.9 -102.1 -112.6 -108.9 -111.5 L-108.9 -111.3 -104.95 -110.85 Q-100.65 -110.85 -96.35 -112.8 L-87.25 -117.35 -88.45 -114.5 -89.5 -112.45 Q-92.05 -110.9 -95.4 -109.4 L-96.6 -108.85 Q-102.75 -106.25 -111.35 -103.9 -115.85 -102.65 -120.6 -101.85 L-121.3 -101.75 -135.45 -100.55 -142.4 -100.65 -146.6 -101.25 -146.8 -101.3 Q-148.7 -101.65 -149.8 -102.1 L-151.5 -102.75 -157.5 -105.15 Q-159.9 -106.15 -161.75 -107.25 -163.85 -108.65 -165.2 -110.25 L-166.55 -111.95 -167.7 -120.55 -167.75 -121.9 Q-166.35 -121.75 -165.25 -120.75 L-166.75 -122.15 -166.7 -122.2 Q-165.0 -121.15 -162.4 -120.35 L-156.05 -118.65 -155.8 -118.5 -155.65 -118.5 -156.05 -118.65 Q-160.3 -120.8 -164.2 -123.8 -169.5 -127.8 -171.35 -131.35 L-169.6 -132.25 -169.0 -132.55 M-156.7 -113.2 Q-152.35 -108.85 -150.6 -107.85 -147.1 -105.65 -140.65 -105.65 -135.85 -105.65 -127.65 -107.45 L-120.55 -109.35 -120.75 -109.35 -130.3 -108.35 Q-139.75 -108.35 -146.05 -109.55 -152.1 -110.75 -156.7 -113.2" fill="#0f1405" fill-rule="evenodd" stroke="none"/>
    <path d="M-81.2 -130.9 L-80.05 -129.5 Q-79.1 -128.2 -79.1 -127.9 L-80.05 -126.5 Q-81.15 -125.15 -81.75 -124.8 -80.6 -123.75 -80.65 -121.95 L-80.85 -119.35 -83.35 -117.1 -83.6 -116.9 -84.7 -116.05 -85.95 -115.0 -89.5 -112.45 -88.45 -114.5 -87.25 -117.35 -96.35 -112.8 Q-100.65 -110.85 -104.95 -110.85 L-108.9 -111.3 -108.9 -111.5 Q-102.1 -112.6 -95.3 -115.9 -88.95 -119.0 -84.65 -123.0 L-91.5 -120.9 Q-95.55 -119.65 -97.45 -118.75 L-97.9 -118.5 -98.05 -118.5 -97.45 -118.75 -82.9 -128.25 Q-83.45 -128.45 -84.2 -129.5 L-81.65 -130.7 -81.2 -130.9 M-170.3 -116.55 L-170.4 -116.7 Q-173.0 -120.25 -173.0 -120.95 L-172.55 -122.75 Q-172.1 -123.95 -172.1 -124.5 -172.05 -126.5 -174.8 -131.35 L-172.7 -132.75 -171.0 -133.85 -170.25 -134.35 -169.0 -132.55 -169.6 -132.25 -171.35 -131.35 Q-169.5 -127.8 -164.2 -123.8 -160.3 -120.8 -156.05 -118.65 L-155.65 -118.5 -155.8 -118.5 -156.05 -118.65 -162.4 -120.35 Q-165.0 -121.15 -166.7 -122.2 L-166.75 -122.15 -165.25 -120.75 Q-166.35 -121.75 -167.75 -121.9 L-167.7 -120.55 -166.55 -111.95 -169.55 -115.65 -170.2 -116.45 -170.3 -116.55 M-156.7 -113.2 Q-152.1 -110.75 -146.05 -109.55 -139.75 -108.35 -130.3 -108.35 L-120.75 -109.35 -120.55 -109.35 -127.65 -107.45 Q-135.85 -105.65 -140.65 -105.65 -147.1 -105.65 -150.6 -107.85 -152.35 -108.85 -156.7 -113.2" fill="#1b2209" fill-rule="evenodd" stroke="none"/>
    <path d="M-69.1 -97.05 Q-72.5 -95.75 -76.55 -94.85 L-78.6 -94.4 -78.75 -94.4 -84.6 -93.8 -90.55 -94.5 -90.85 -94.55 -92.05 -94.9 -95.75 -95.85 -96.0 -95.95 -95.75 -96.0 -91.25 -97.15 -90.8 -97.3 Q-83.4 -99.1 -79.9 -99.15 L-79.65 -99.15 -78.2 -99.15 -75.45 -99.15 Q-72.8 -98.95 -69.05 -97.55 L-69.1 -97.05" fill="#26330d" fill-rule="evenodd" stroke="none"/>
    <path d="M-76.55 -40.95 L-77.5 -40.95 -76.35 -41.1 -76.55 -40.95" fill="#463128" fill-rule="evenodd" stroke="none"/>
    <path d="M-143.45 -200.3 Q-140.65 -200.6 -140.65 -198.3 -140.65 -197.5 -141.15 -196.7 L-141.55 -196.15 -141.7 -192.85 -141.7 -186.6 -141.6 -177.5 -141.3 -177.2 Q-139.3 -175.1 -139.3 -173.9 -139.3 -173.55 -140.35 -172.15 L-141.55 -170.85 -141.75 -170.85 -141.85 -167.4 -141.55 -163.4 -141.55 -163.15 -143.35 -165.5 -143.95 -166.15 -145.3 -167.85 -145.35 -167.9 -145.3 -172.45 -145.55 -172.6 Q-147.15 -173.2 -147.5 -173.55 -147.8 -173.85 -147.8 -174.6 L-147.2 -177.15 Q-146.5 -179.35 -145.25 -179.45 L-145.2 -186.6 -145.1 -192.65 -145.1 -196.05 -145.85 -196.8 -146.3 -198.05 Q-146.3 -199.95 -143.75 -200.25 L-143.45 -200.3 M-136.8 -200.0 Q-136.75 -201.85 -134.5 -202.25 L-133.5 -202.35 Q-130.25 -202.45 -130.3 -199.85 -130.3 -198.8 -131.0 -198.1 -131.6 -197.5 -132.7 -197.25 L-132.7 -197.1 -132.8 -192.85 Q-132.7 -191.05 -132.75 -184.6 L-132.8 -175.45 Q-129.55 -176.9 -129.55 -171.4 -129.55 -170.1 -129.7 -169.8 -130.2 -168.9 -132.3 -168.9 L-132.8 -168.8 -132.85 -168.15 -132.85 -164.05 -134.35 -162.1 -134.75 -161.6 -136.15 -159.9 -135.9 -163.0 -135.9 -167.15 Q-136.95 -167.25 -137.65 -168.5 L-138.15 -169.9 Q-138.15 -170.45 -136.8 -172.1 L-135.85 -173.15 -135.8 -184.7 Q-135.7 -186.0 -135.75 -188.75 L-135.6 -192.95 Q-135.4 -194.4 -135.6 -197.5 L-136.4 -198.5 -136.8 -200.0" fill="#2d3d0f" fill-rule="evenodd" stroke="none"/>
    <path d="M-145.75 -168.15 L-147.05 -169.85 -147.1 -169.9 -147.1 -174.45 -145.7 -173.65 -145.75 -168.15 M-147.05 -181.45 L-147.0 -188.6 -146.85 -194.65 -146.9 -198.05 -146.9 -198.25 Q-146.75 -200.3 -145.55 -200.55 L-145.65 -181.1 -146.7 -181.45 -147.05 -181.45 M-136.55 -163.6 L-137.9 -161.9 -137.7 -165.0 -137.65 -169.15 -137.5 -169.15 -136.5 -169.8 -136.55 -163.6 M-137.65 -175.15 L-137.55 -186.7 -137.55 -190.75 -137.35 -194.95 Q-137.2 -196.4 -137.4 -199.5 L-137.45 -199.7 Q-137.35 -201.95 -136.3 -202.85 L-136.5 -176.2 -137.65 -175.15" fill="#463128" fill-rule="evenodd" stroke="none"/>
    <path d="M-143.4 -179.5 L-143.1 -179.2 Q-141.05 -177.1 -141.1 -175.9 -141.1 -175.55 -142.15 -174.15 L-143.35 -172.85 -143.55 -172.85 Q-144.55 -172.9 -145.55 -173.55 L-145.7 -173.65 -147.1 -174.45 -147.35 -174.6 Q-148.95 -175.2 -149.3 -175.55 -149.6 -175.85 -149.6 -176.6 L-149.0 -179.15 Q-148.3 -181.35 -147.05 -181.45 L-146.7 -181.45 -145.65 -181.1 Q-144.65 -180.65 -143.4 -179.5 M-134.55 -177.45 Q-131.3 -178.9 -131.35 -173.4 -131.35 -172.1 -131.5 -171.8 -132.0 -170.9 -134.1 -170.9 L-134.6 -170.8 Q-135.3 -170.6 -136.5 -169.8 L-137.5 -169.15 -137.65 -169.15 Q-138.7 -169.25 -139.4 -170.5 L-139.95 -171.9 Q-139.95 -172.45 -138.6 -174.1 L-137.65 -175.15 -136.5 -176.2 -135.65 -176.85 -134.55 -177.45 M-137.1 -173.95 Q-137.1 -174.55 -137.45 -174.55 -138.4 -174.55 -138.9 -171.65 -138.9 -171.1 -138.5 -171.1 -138.2 -171.1 -137.65 -172.4 -137.1 -173.6 -137.1 -173.95 M-132.7 -176.65 L-132.65 -177.1 Q-132.7 -177.45 -133.15 -177.45 -134.0 -177.45 -134.95 -176.1 L-136.0 -174.4 -136.8 -172.75 -137.3 -171.0 Q-137.3 -170.45 -136.8 -170.45 L-136.35 -170.75 -136.15 -171.15 -135.7 -171.9 -134.7 -173.5 -133.4 -174.95 Q-132.7 -175.85 -132.7 -176.65 M-148.7 -177.55 Q-148.5 -175.5 -147.85 -175.5 -147.55 -175.5 -147.55 -175.8 L-147.55 -176.25 Q-147.5 -177.15 -147.7 -177.5 L-147.85 -177.85 -148.2 -178.1 -148.7 -177.55 M-132.05 -173.5 Q-132.1 -173.75 -132.5 -173.75 L-133.2 -173.55 -133.7 -173.1 -134.05 -172.7 -134.15 -172.3 Q-134.15 -171.95 -133.7 -171.95 -133.1 -171.95 -132.5 -172.45 -132.05 -172.7 -132.05 -173.25 L-132.05 -173.5 M-146.65 -180.55 L-147.0 -180.5 -147.1 -180.4 -147.3 -180.3 -147.35 -180.35 -147.5 -180.3 -147.5 -179.95 -147.25 -178.45 -146.8 -177.1 Q-146.15 -174.65 -145.05 -174.65 L-144.7 -174.75 -144.65 -175.0 -145.05 -176.4 -145.85 -179.2 -146.05 -179.9 Q-146.3 -180.55 -146.65 -180.55 M-143.05 -177.5 L-143.45 -178.75 Q-143.95 -179.3 -144.2 -179.15 L-144.45 -178.55 -143.65 -175.2 -143.4 -174.65 -142.95 -174.15 Q-142.7 -174.15 -142.65 -174.3 L-142.65 -174.6 -142.85 -176.15 -143.05 -177.5" fill="#7a5445" fill-rule="evenodd" stroke="none"/>
    <path d="M-132.7 -176.65 Q-132.7 -175.85 -133.4 -174.95 L-134.7 -173.5 -135.7 -171.9 -136.15 -171.15 -136.35 -170.75 -136.8 -170.45 Q-137.3 -170.45 -137.3 -171.0 L-136.8 -172.75 -136.0 -174.4 -134.95 -176.1 Q-134.0 -177.45 -133.15 -177.45 -132.7 -177.45 -132.65 -177.1 L-132.7 -176.65 M-137.1 -173.95 Q-137.1 -173.6 -137.65 -172.4 -138.2 -171.1 -138.5 -171.1 -138.9 -171.1 -138.9 -171.65 -138.4 -174.55 -137.45 -174.55 -137.1 -174.55 -137.1 -173.95 M-132.05 -173.5 L-132.05 -173.25 Q-132.05 -172.7 -132.5 -172.45 -133.1 -171.95 -133.7 -171.95 -134.15 -171.95 -134.15 -172.3 L-134.05 -172.7 -133.7 -173.1 -133.2 -173.55 -132.5 -173.75 Q-132.1 -173.75 -132.05 -173.5 M-148.7 -177.55 L-148.2 -178.1 -147.85 -177.85 -147.7 -177.5 Q-147.5 -177.15 -147.55 -176.25 L-147.55 -175.8 Q-147.55 -175.5 -147.85 -175.5 -148.5 -175.5 -148.7 -177.55 M-146.65 -180.55 Q-146.3 -180.55 -146.05 -179.9 L-145.85 -179.2 -145.05 -176.4 -144.65 -175.0 -144.7 -174.75 -145.05 -174.65 Q-146.15 -174.65 -146.8 -177.1 L-147.25 -178.45 -147.5 -179.95 -147.5 -180.3 -147.35 -180.35 -147.3 -180.3 -147.1 -180.4 -147.0 -180.5 -146.65 -180.55 M-143.05 -177.5 L-142.85 -176.15 -142.65 -174.6 -142.65 -174.3 Q-142.7 -174.15 -142.95 -174.15 L-143.4 -174.65 -143.65 -175.2 -144.45 -178.55 -144.2 -179.15 Q-143.95 -179.3 -143.45 -178.75 L-143.05 -177.5" fill="#8f6351" fill-rule="evenodd" stroke="none"/>
    <path d="M-146.9 -198.05 L-147.65 -198.8 -148.1 -200.05 Q-148.05 -201.95 -145.5 -202.25 L-145.55 -200.55 Q-146.75 -200.3 -146.9 -198.25 L-146.9 -198.05 M-137.4 -199.5 L-138.2 -200.5 Q-138.55 -201.2 -138.55 -202.0 -138.55 -203.85 -136.3 -204.25 L-136.3 -202.85 Q-137.35 -201.95 -137.45 -199.7 L-137.4 -199.5" fill="#261a15" fill-rule="evenodd" stroke="none"/>
    <path d="M-143.35 -198.15 Q-143.65 -195.7 -143.45 -194.85 L-143.5 -188.6 -143.4 -179.5 Q-144.65 -180.65 -145.65 -181.1 L-145.55 -200.55 -145.2 -200.6 Q-143.35 -200.6 -143.35 -198.4 L-143.35 -198.15 M-143.55 -172.85 L-143.6 -169.4 Q-143.3 -166.75 -143.35 -165.4 L-143.35 -165.15 -145.15 -167.5 -145.75 -168.15 -145.7 -173.65 -145.55 -173.55 Q-144.55 -172.9 -143.55 -172.85 M-134.5 -199.25 L-134.5 -199.1 -134.55 -194.85 -134.5 -186.6 -134.55 -177.45 -135.65 -176.85 -136.5 -176.2 -136.3 -202.85 -135.9 -203.15 Q-134.6 -201.85 -134.5 -199.25 M-134.6 -170.8 L-134.6 -170.15 -134.65 -166.05 -136.15 -164.1 -136.55 -163.6 -136.5 -169.8 Q-135.3 -170.6 -134.6 -170.8" fill="#2e1f1a" fill-rule="evenodd" stroke="none"/>
    <path d="M-145.5 -202.25 L-145.2 -202.3 Q-142.4 -202.6 -142.45 -200.3 -142.45 -199.5 -142.95 -198.7 L-143.35 -198.15 -143.35 -198.4 Q-143.35 -200.6 -145.2 -200.6 L-145.55 -200.55 -145.5 -202.25 M-136.3 -204.25 L-135.3 -204.35 Q-132.05 -204.45 -132.05 -201.85 -132.1 -200.8 -132.8 -200.1 -133.4 -199.5 -134.5 -199.25 -134.6 -201.85 -135.9 -203.15 L-136.3 -202.85 -136.3 -204.25" fill="#170f0c" fill-rule="evenodd" stroke="none"/>
    <path d="M-159.65 -227.0 Q-160.3 -233.45 -160.25 -239.85 L-160.15 -242.6 -160.1 -244.6 -159.65 -254.35 Q-159.2 -261.2 -158.05 -267.85 L-156.9 -272.2 Q-155.35 -277.2 -152.0 -281.3 L-151.55 -281.85 Q-150.0 -283.5 -147.6 -284.2 -141.25 -286.15 -134.25 -286.75 L-134.0 -286.8 -120.8 -287.45 -107.45 -286.9 Q-100.15 -286.55 -93.1 -284.65 L-89.1 -283.55 -88.65 -283.4 -88.4 -283.3 Q-86.75 -282.6 -85.5 -281.2 L-84.7 -280.05 Q-86.15 -270.15 -89.85 -260.75 -92.15 -254.9 -95.05 -249.3 L-97.55 -244.6 -97.65 -244.35 -98.65 -242.65 -99.05 -241.95 -101.4 -238.15 Q-103.95 -233.8 -107.55 -230.6 -109.5 -228.85 -111.55 -227.35 L-111.65 -227.25 Q-114.45 -225.35 -117.4 -223.85 L-118.25 -223.4 -119.0 -223.05 -131.65 -221.5 -134.7 -221.2 -145.85 -220.7 -147.85 -220.75 Q-152.05 -220.9 -155.95 -222.3 L-159.65 -227.0" fill="#b5987d" fill-rule="evenodd" stroke="none"/>
    <path d="M-89.1 -283.55 L-93.1 -284.65 Q-100.15 -286.55 -107.45 -286.9 L-120.8 -287.45 -134.0 -286.8 -134.25 -286.75 Q-141.25 -286.15 -147.6 -284.2 -150.0 -283.5 -151.55 -281.85 L-152.0 -281.3 Q-155.35 -277.2 -156.9 -272.2 L-158.05 -267.85 Q-159.2 -261.2 -159.65 -254.35 L-160.1 -244.6 -160.15 -242.6 -160.25 -239.85 Q-160.3 -233.45 -159.65 -227.0 L-163.35 -233.55 -163.4 -236.0 -163.45 -242.6 -163.5 -244.6 -163.5 -245.4 -163.2 -254.55 -162.6 -262.55 -161.85 -269.35 -161.65 -270.8 -159.8 -279.1 -159.5 -280.35 -158.75 -283.1 -157.6 -287.3 -156.95 -287.5 -150.55 -289.25 -141.1 -290.2 -134.25 -290.35 -131.15 -290.3 -123.8 -290.1 -114.35 -289.55 -105.65 -288.5 -97.15 -286.65 -96.4 -286.4 Q-92.5 -285.3 -89.05 -283.6 L-89.1 -283.55 M-155.95 -222.3 Q-152.05 -220.9 -147.85 -220.75 L-145.85 -220.7 Q-145.15 -220.1 -144.85 -219.15 L-144.3 -217.3 -144.05 -213.45 -147.1 -215.35 -153.05 -219.7 -155.95 -222.3" fill="#26330d" fill-rule="evenodd" stroke="none"/>
    <path d="M-145.85 -220.7 L-134.7 -221.2 -131.65 -221.5 -119.0 -223.05 -122.75 -221.15 -132.8 -215.95 -132.75 -218.3 -134.7 -218.4 -138.6 -218.45 Q-142.05 -218.4 -144.1 -219.15 L-144.85 -219.15 Q-145.15 -220.1 -145.85 -220.7" fill="#6e513f" fill-rule="evenodd" stroke="none"/>
    <path d="M-144.05 -213.45 L-144.3 -217.3 -144.85 -219.15 -144.1 -219.15 Q-142.05 -218.4 -138.6 -218.45 L-134.7 -218.4 -132.75 -218.3 -132.8 -215.95 -134.75 -215.0 -138.55 -213.1 -140.45 -211.45 -141.15 -211.8 -141.3 -211.9 -144.05 -213.45" fill="#8c6851" fill-rule="evenodd" stroke="none"/>
    <path d="M-96.15 -286.4 L-95.6 -286.25 -91.45 -285.1 Q-95.75 -281.9 -95.7 -281.35 L-90.25 -283.8 -89.05 -284.25 -88.8 -284.15 Q-84.95 -282.6 -84.2 -280.9 L-84.25 -280.6 -85.0 -275.95 -88.8 -274.8 -89.7 -273.5 Q-92.85 -269.0 -94.0 -268.55 L-94.0 -270.85 -93.4 -273.15 -93.15 -274.75 Q-93.5 -274.25 -95.95 -272.6 -93.7 -278.15 -92.25 -280.6 L-92.6 -280.5 -94.25 -280.05 Q-98.35 -278.8 -101.7 -276.05 L-101.7 -276.1 -96.1 -281.55 -99.55 -279.75 Q-105.65 -276.05 -107.25 -275.2 L-111.75 -272.8 -111.85 -272.7 Q-111.45 -276.1 -110.3 -278.5 L-109.05 -280.5 Q-111.55 -277.75 -114.1 -276.05 L-118.25 -273.35 Q-119.65 -272.2 -120.2 -271.05 L-120.5 -269.95 -121.05 -272.45 -121.2 -274.8 Q-121.15 -277.45 -119.95 -280.55 L-118.7 -283.15 Q-124.85 -278.9 -131.1 -276.05 -135.7 -273.9 -138.25 -273.3 L-138.5 -273.3 -133.6 -277.15 -128.2 -281.35 Q-134.45 -279.9 -143.4 -274.25 -149.45 -270.4 -152.15 -268.0 L-148.7 -273.55 -141.9 -283.05 -140.85 -284.35 -143.15 -283.15 Q-156.95 -275.8 -165.7 -272.7 L-168.8 -271.7 -177.55 -269.4 -179.6 -268.95 -184.65 -268.15 Q-175.6 -273.4 -165.65 -277.75 L-160.85 -279.8 -159.65 -280.3 -159.45 -280.35 -155.25 -282.05 Q-157.1 -282.35 -158.75 -283.1 -161.9 -284.55 -165.3 -287.55 L-165.6 -287.8 Q-167.75 -289.9 -169.05 -294.3 L-169.2 -294.85 -169.25 -296.45 -168.6 -295.45 -168.2 -294.85 Q-166.35 -292.3 -163.95 -290.55 -162.9 -289.8 -161.75 -289.2 -159.55 -288.1 -156.95 -287.5 L-150.1 -286.8 -141.05 -287.5 -137.7 -287.95 -134.1 -288.4 -140.25 -281.85 Q-145.35 -275.9 -147.1 -273.05 L-141.05 -277.6 Q-134.45 -282.15 -128.9 -283.85 L-130.5 -282.8 -133.15 -281.1 Q-130.4 -281.65 -126.65 -283.2 -123.45 -284.5 -121.8 -285.5 L-123.2 -284.25 -125.85 -281.7 Q-127.35 -280.0 -128.95 -279.0 L-131.2 -277.7 Q-123.7 -280.05 -116.5 -286.75 L-114.3 -288.8 -109.7 -288.6 Q-113.9 -286.35 -116.7 -282.45 -119.35 -278.55 -119.7 -274.75 -117.8 -278.1 -113.35 -279.2 -110.7 -279.85 -107.7 -282.15 L-104.45 -284.85 -104.35 -284.85 -106.05 -281.65 -107.85 -278.0 -107.8 -278.0 -107.7 -278.0 Q-106.45 -278.55 -101.55 -282.25 L-96.15 -286.4 M-130.85 -288.75 L-125.5 -289.1 -126.25 -288.9 Q-130.75 -287.65 -133.65 -286.45 L-135.7 -285.6 -135.7 -285.75 -130.85 -288.75 M-107.9 -288.45 L-105.15 -288.1 -109.2 -286.25 -111.75 -284.75 -111.75 -285.2 -107.9 -288.45 M-99.1 -287.05 L-97.75 -286.75 -100.2 -285.1 -102.1 -283.9 -102.1 -284.0 -99.1 -287.05 M-150.5 -282.0 Q-154.2 -281.15 -158.5 -279.55 -162.15 -278.2 -165.65 -276.5 -170.8 -274.1 -175.6 -271.05 L-175.0 -271.2 Q-172.0 -271.8 -168.5 -273.1 L-165.7 -274.2 Q-160.05 -276.55 -152.65 -280.8 L-150.5 -282.0 M-152.4 -267.75 L-152.15 -268.0 -152.65 -267.1 -152.95 -266.5 -153.0 -266.5 -152.8 -267.0 -152.65 -267.35 -152.4 -267.75 M-154.05 -283.55 Q-155.1 -284.3 -156.0 -284.65 L-159.5 -286.0 -162.75 -287.8 -165.6 -290.4 -166.7 -291.55 -167.15 -292.0 -166.75 -291.2 -165.6 -289.1 Q-164.5 -287.35 -163.5 -286.6 -161.7 -285.35 -157.6 -284.3 L-154.05 -283.55" fill="#d15c14" fill-rule="evenodd" stroke="none"/>
    <path d="M-85.0 -275.95 L-85.7 -272.7 -87.0 -267.35 Q-87.7 -264.45 -90.4 -258.6 L-90.65 -258.05 -91.55 -259.55 -94.4 -264.15 Q-94.4 -264.7 -93.75 -264.85 L-93.8 -265.05 -94.55 -265.75 -94.8 -266.4 -94.4 -267.1 Q-97.05 -265.65 -97.8 -265.55 L-96.55 -267.75 -95.45 -269.4 -99.35 -267.1 Q-98.7 -269.95 -97.2 -273.3 L-97.05 -273.75 -95.15 -277.2 Q-99.9 -274.65 -107.75 -271.15 L-118.55 -266.55 -114.05 -273.45 -118.5 -269.15 -119.5 -268.15 -121.75 -265.9 -122.2 -269.25 Q-122.5 -273.0 -121.1 -277.2 L-120.95 -277.6 Q-124.55 -274.6 -131.1 -272.45 L-146.0 -267.5 Q-143.65 -269.45 -141.25 -271.55 L-136.65 -275.55 Q-137.9 -274.7 -146.25 -270.35 L-152.65 -267.1 -152.15 -268.0 -152.4 -267.75 -148.5 -273.95 -147.3 -275.65 Q-151.45 -273.9 -156.6 -272.3 L-156.95 -272.2 -158.4 -271.75 -160.85 -271.0 -161.6 -270.8 -165.7 -269.75 Q-174.85 -267.5 -180.7 -267.5 L-183.7 -267.75 -184.65 -268.15 -179.6 -268.95 -177.55 -269.4 -168.8 -271.7 -165.7 -272.7 Q-156.95 -275.8 -143.15 -283.15 L-140.85 -284.35 -141.9 -283.05 -148.7 -273.55 -152.15 -268.0 Q-149.45 -270.4 -143.4 -274.25 -134.45 -279.9 -128.2 -281.35 L-133.6 -277.15 -138.5 -273.3 -138.25 -273.3 Q-135.7 -273.9 -131.1 -276.05 -124.85 -278.9 -118.7 -283.15 L-119.95 -280.55 Q-121.15 -277.45 -121.2 -274.8 L-121.05 -272.45 -120.5 -269.95 -120.2 -271.05 Q-119.65 -272.2 -118.25 -273.35 L-114.1 -276.05 Q-111.55 -277.75 -109.05 -280.5 L-110.3 -278.5 Q-111.45 -276.1 -111.85 -272.7 L-111.75 -272.8 -107.25 -275.2 Q-105.65 -276.05 -99.55 -279.75 L-96.1 -281.55 -101.7 -276.1 -101.7 -276.05 Q-98.35 -278.8 -94.25 -280.05 L-92.6 -280.5 -92.25 -280.6 Q-93.7 -278.15 -95.95 -272.6 -93.5 -274.25 -93.15 -274.75 L-93.4 -273.15 -94.0 -270.85 -94.0 -268.55 Q-92.85 -269.0 -89.7 -273.5 L-88.8 -274.8 -85.0 -275.95 M-160.85 -279.8 Q-163.8 -282.25 -165.6 -284.8 L-166.25 -285.75 Q-168.9 -289.9 -169.2 -294.85 L-169.05 -294.3 Q-167.75 -289.9 -165.6 -287.8 L-165.3 -287.55 Q-161.9 -284.55 -158.75 -283.1 -157.1 -282.35 -155.25 -282.05 L-159.45 -280.35 -159.65 -280.3 -160.85 -279.8" fill="#b04d11" fill-rule="evenodd" stroke="none"/>
    <path d="M-91.45 -285.1 L-89.05 -284.25 -90.25 -283.8 -95.7 -281.35 Q-95.75 -281.9 -91.45 -285.1 M-134.1 -288.4 L-130.85 -288.75 -135.7 -285.75 -135.7 -285.6 -133.65 -286.45 Q-130.75 -287.65 -126.25 -288.9 L-125.5 -289.1 -125.2 -289.1 -119.95 -288.95 -114.7 -288.8 -114.3 -288.8 -116.5 -286.75 Q-123.7 -280.05 -131.2 -277.7 L-128.95 -279.0 Q-127.35 -280.0 -125.85 -281.7 L-123.2 -284.25 -121.8 -285.5 Q-123.45 -284.5 -126.65 -283.2 -130.4 -281.65 -133.15 -281.1 L-130.5 -282.8 -128.9 -283.85 Q-134.45 -282.15 -141.05 -277.6 L-147.1 -273.05 Q-145.35 -275.9 -140.25 -281.85 L-134.1 -288.4 M-109.7 -288.6 L-107.9 -288.45 -111.75 -285.2 -111.75 -284.75 -109.2 -286.25 -105.15 -288.1 -99.1 -287.05 -102.1 -284.0 -102.1 -283.9 -100.2 -285.1 -97.75 -286.75 -96.35 -286.4 -96.15 -286.4 -101.55 -282.25 Q-106.45 -278.55 -107.7 -278.0 L-107.8 -278.0 -107.85 -278.0 -106.05 -281.65 -104.35 -284.85 -104.45 -284.85 -107.7 -282.15 Q-110.7 -279.85 -113.35 -279.2 -117.8 -278.1 -119.7 -274.75 -119.35 -278.55 -116.7 -282.45 -113.9 -286.35 -109.7 -288.6 M-150.5 -282.0 L-152.65 -280.8 Q-160.05 -276.55 -165.7 -274.2 L-168.5 -273.1 Q-172.0 -271.8 -175.0 -271.2 L-175.6 -271.05 Q-170.8 -274.1 -165.65 -276.5 -162.15 -278.2 -158.5 -279.55 -154.2 -281.15 -150.5 -282.0 M-154.05 -283.55 L-157.6 -284.3 Q-161.7 -285.35 -163.5 -286.6 -164.5 -287.35 -165.6 -289.1 L-166.75 -291.2 -167.15 -292.0 -166.7 -291.55 -165.6 -290.4 -162.75 -287.8 -159.5 -286.0 -156.0 -284.65 Q-155.1 -284.3 -154.05 -283.55" fill="#ff7119" fill-rule="evenodd" stroke="none"/>
    <path d="M-157.65 -266.3 L-158.25 -260.0 -162.75 -265.35 -162.3 -266.05 Q-161.8 -266.45 -161.65 -266.75 L-161.85 -266.95 -163.45 -267.1 -163.45 -267.5 Q-162.9 -268.0 -161.25 -270.45 L-160.85 -271.0 -158.4 -271.75 -156.95 -272.2 -156.6 -272.3 -157.2 -269.1 -157.65 -266.3" fill="#913d0e" fill-rule="evenodd" stroke="none"/>
    <path d="M-91.55 -259.55 L-92.6 -260.4 -96.0 -263.35 Q-94.85 -264.5 -94.8 -264.9 L-96.45 -264.7 -98.05 -264.5 -98.95 -264.6 Q-98.45 -265.05 -97.25 -267.45 L-97.35 -267.45 -98.65 -266.25 -100.2 -265.15 -100.4 -270.8 -100.35 -271.45 Q-104.65 -269.05 -110.7 -266.4 L-121.05 -262.0 -119.7 -267.4 -123.45 -262.8 -124.35 -261.45 -125.05 -264.1 Q-125.8 -267.1 -125.75 -269.65 L-125.6 -271.45 -126.85 -270.35 -129.3 -268.5 -133.5 -265.8 Q-137.45 -263.6 -141.05 -262.4 -146.25 -260.65 -153.05 -257.7 L-149.35 -261.25 -147.05 -263.6 -148.7 -262.85 -149.0 -262.7 Q-151.55 -261.45 -154.25 -259.75 L-156.95 -257.95 -154.0 -267.95 -157.65 -266.3 -157.2 -269.1 -156.6 -272.3 Q-151.45 -273.9 -147.3 -275.65 L-148.5 -273.95 -152.4 -267.75 -152.65 -267.35 -152.8 -267.0 -153.0 -266.5 -152.95 -266.5 -152.65 -267.1 -146.25 -270.35 Q-137.9 -274.7 -136.65 -275.55 L-141.25 -271.55 Q-143.65 -269.45 -146.0 -267.5 L-131.1 -272.45 Q-124.55 -274.6 -120.95 -277.6 L-121.1 -277.2 Q-122.5 -273.0 -122.2 -269.25 L-121.75 -265.9 -119.5 -268.15 -118.5 -269.15 -114.05 -273.45 -118.55 -266.55 -107.75 -271.15 Q-99.9 -274.65 -95.15 -277.2 L-97.05 -273.75 -97.2 -273.3 Q-98.7 -269.95 -99.35 -267.1 L-95.45 -269.4 -96.55 -267.75 -97.8 -265.55 Q-97.05 -265.65 -94.4 -267.1 L-94.8 -266.4 -94.55 -265.75 -93.8 -265.05 -93.75 -264.85 Q-94.4 -264.7 -94.4 -264.15 L-91.55 -259.55" fill="#5c4435" fill-opacity="0.2509804" fill-rule="evenodd" stroke="none"/>
    <path d="M-105.3 -264.25 Q-94.75 -266.05 -88.95 -257.5 L-87.0 -254.35 -87.85 -249.3 -88.95 -248.85 Q-94.1 -240.3 -104.2 -238.75 -115.45 -237.25 -124.25 -244.8 L-123.55 -242.9 -122.9 -240.6 -122.95 -240.2 Q-124.65 -240.4 -125.5 -242.35 -127.2 -246.25 -127.0 -250.65 -121.25 -260.0 -110.25 -263.15 L-105.3 -264.25 M-95.95 -248.6 L-95.95 -248.55 -97.85 -248.4 -100.15 -246.95 Q-102.2 -246.0 -103.1 -245.75 -105.95 -244.95 -109.95 -244.95 -112.75 -244.95 -114.0 -245.6 -115.2 -246.3 -116.1 -246.3 -116.95 -246.3 -116.95 -245.6 -116.95 -245.0 -115.85 -244.25 -118.25 -245.2 -120.5 -247.4 L-124.25 -251.25 Q-125.15 -251.25 -125.2 -250.2 -125.2 -248.75 -121.75 -245.35 -117.55 -241.15 -112.6 -241.05 -110.35 -240.2 -108.0 -240.2 -104.35 -240.2 -101.4 -241.45 -99.7 -242.15 -97.15 -243.9 L-94.3 -246.55 -93.15 -247.7 -91.65 -249.1 Q-89.45 -251.15 -89.45 -252.6 -89.45 -254.0 -90.6 -254.0 -91.8 -254.0 -92.45 -252.3 -92.65 -251.7 -94.05 -250.45 L-95.95 -248.6 M-150.3 -264.1 Q-146.55 -264.15 -144.6 -262.55 -142.45 -261.8 -138.95 -256.55 -135.35 -251.25 -135.4 -248.75 -135.4 -247.55 -135.85 -246.4 -136.25 -244.15 -137.95 -241.25 -140.0 -237.5 -142.1 -236.15 L-142.45 -236.25 -142.6 -236.65 Q-142.6 -237.35 -140.3 -241.1 L-139.75 -242.0 -140.4 -241.55 Q-144.45 -238.8 -146.8 -238.8 -151.9 -238.8 -154.85 -242.2 -156.35 -243.95 -157.05 -246.05 L-158.45 -249.75 Q-159.5 -253.1 -159.5 -254.05 -159.5 -257.4 -156.95 -261.0 -154.75 -264.1 -150.3 -264.1 M-151.55 -247.3 L-151.8 -247.5 -152.65 -248.55 Q-153.45 -249.5 -154.3 -249.5 -154.7 -249.5 -154.85 -250.0 L-155.1 -250.95 -156.05 -252.8 -156.7 -253.75 Q-157.3 -254.25 -157.7 -253.65 L-157.9 -252.7 -157.85 -251.85 -157.0 -249.2 -155.65 -246.15 Q-155.0 -244.8 -153.65 -243.5 -151.1 -240.9 -147.65 -240.9 -144.7 -240.9 -141.45 -242.45 -139.4 -243.4 -138.25 -244.4 -137.4 -245.15 -136.5 -246.95 -135.7 -248.65 -135.7 -249.55 L-135.85 -250.4 Q-136.15 -251.1 -136.95 -251.1 L-138.95 -249.55 -138.9 -250.0 Q-148.95 -268.45 -155.95 -257.65 -155.15 -256.55 -154.85 -254.25 -154.55 -252.05 -153.75 -250.95 L-151.9 -247.75 -151.55 -247.3" fill="#574032" fill-opacity="0.34117648" fill-rule="evenodd" stroke="none"/>
    <path d="M-95.95 -248.6 L-94.05 -250.45 Q-92.65 -251.7 -92.45 -252.3 -91.8 -254.0 -90.6 -254.0 -89.45 -254.0 -89.45 -252.6 -89.45 -251.15 -91.65 -249.1 L-93.15 -247.7 -94.3 -246.55 -97.15 -243.9 Q-99.7 -242.15 -101.4 -241.45 -104.35 -240.2 -108.0 -240.2 -110.35 -240.2 -112.6 -241.05 -117.55 -241.15 -121.75 -245.35 -125.2 -248.75 -125.2 -250.2 -125.15 -251.25 -124.25 -251.25 L-120.5 -247.4 Q-118.25 -245.2 -115.85 -244.25 -116.95 -245.0 -116.95 -245.6 -116.95 -246.3 -116.1 -246.3 -115.2 -246.3 -114.0 -245.6 -112.75 -244.95 -109.95 -244.95 -105.95 -244.95 -103.1 -245.75 -102.2 -246.0 -100.15 -246.95 L-97.85 -248.4 -95.95 -248.55 -95.95 -248.6 M-138.95 -249.55 L-136.95 -251.1 Q-136.15 -251.1 -135.85 -250.4 L-135.7 -249.55 Q-135.7 -248.65 -136.5 -246.95 -137.4 -245.15 -138.25 -244.4 -139.4 -243.4 -141.45 -242.45 -144.7 -240.9 -147.65 -240.9 -151.1 -240.9 -153.65 -243.5 -155.0 -244.8 -155.65 -246.15 L-157.0 -249.2 -157.85 -251.85 -157.9 -252.7 -157.7 -253.65 Q-157.3 -254.25 -156.7 -253.75 L-156.05 -252.8 -155.1 -250.95 -154.85 -250.0 Q-154.7 -249.5 -154.3 -249.5 -153.45 -249.5 -152.65 -248.55 L-151.8 -247.5 -151.55 -247.3 -149.9 -245.9 Q-149.3 -245.4 -148.5 -245.4 -144.4 -245.4 -140.65 -248.25 L-138.95 -249.55" fill="#573f32" fill-opacity="0.6313726" fill-rule="evenodd" stroke="none"/>
    <path d="M-91.45 -253.05 Q-91.85 -254.85 -93.25 -256.25 -94.55 -257.45 -96.4 -258.1 -109.25 -261.9 -121.7 -252.45 L-123.15 -251.25 -122.7 -250.75 Q-117.1 -245.65 -106.85 -246.6 -99.2 -247.7 -92.65 -252.1 L-91.45 -252.95 -91.45 -253.05 M-88.95 -253.05 L-89.6 -252.55 -90.45 -251.85 Q-98.35 -245.5 -107.2 -243.95 -119.65 -242.65 -125.55 -250.85 L-123.7 -252.55 Q-108.55 -266.05 -94.15 -260.55 -92.0 -259.55 -90.7 -257.85 -89.2 -255.75 -88.95 -253.05 M-137.4 -250.7 L-137.25 -250.95 -138.0 -252.1 Q-144.95 -261.65 -153.25 -258.05 -154.45 -257.4 -155.3 -256.2 -156.05 -255.2 -156.4 -253.9 L-156.65 -252.9 -155.95 -252.1 Q-152.35 -247.6 -147.65 -246.45 -141.3 -245.35 -137.4 -250.7 M-154.4 -260.5 Q-145.15 -265.85 -136.8 -252.2 L-135.8 -250.5 -135.95 -250.2 Q-140.25 -242.35 -147.65 -243.8 -153.0 -245.45 -157.4 -251.85 L-158.25 -253.05 -158.2 -253.25 Q-157.8 -255.85 -156.8 -257.85 -155.75 -259.5 -154.4 -260.5" fill="#201a13" fill-rule="evenodd" stroke="none"/>
    <path d="M-122.7 -250.75 L-123.15 -251.25 -121.7 -252.45 Q-109.25 -261.9 -96.4 -258.1 -94.55 -257.45 -93.25 -256.25 -91.85 -254.85 -91.45 -253.05 -95.45 -254.0 -99.9 -254.0 -111.45 -254.0 -118.55 -252.15 L-122.7 -250.75 M-137.4 -250.7 L-144.5 -252.85 Q-146.9 -253.75 -148.7 -254.05 L-152.95 -254.4 -156.4 -253.9 Q-156.05 -255.2 -155.3 -256.2 -154.45 -257.4 -153.25 -258.05 -144.95 -261.65 -138.0 -252.1 L-137.25 -250.95 -137.4 -250.7" fill="#c0aa94" fill-rule="evenodd" stroke="none"/>
    <path d="M-122.7 -250.75 L-118.55 -252.15 Q-111.45 -254.0 -99.9 -254.0 -95.45 -254.0 -91.45 -253.05 L-91.45 -252.95 -92.65 -252.1 Q-99.2 -247.7 -106.85 -246.6 -117.1 -245.65 -122.7 -250.75 M-156.4 -253.9 L-152.95 -254.4 -148.7 -254.05 Q-146.9 -253.75 -144.5 -252.85 L-137.4 -250.7 Q-141.3 -245.35 -147.65 -246.45 -152.35 -247.6 -155.95 -252.1 L-156.65 -252.9 -156.4 -253.9" fill="#d9c0a6" fill-rule="evenodd" stroke="none"/>
    <path d="M-107.25 -256.25 Q-106.65 -256.65 -106.3 -255.95 L-106.1 -254.3 Q-106.1 -253.25 -106.35 -252.15 -106.8 -250.35 -107.65 -250.35 -108.65 -250.35 -108.35 -252.25 L-107.85 -255.55 Q-107.75 -256.0 -107.25 -256.25 M-145.55 -253.95 L-145.65 -252.1 Q-145.9 -250.4 -146.5 -250.4 -147.2 -250.4 -147.1 -252.85 L-146.85 -255.4 Q-146.7 -255.8 -146.2 -255.75 -145.7 -255.75 -145.55 -255.25 L-145.55 -253.95" fill="#131520" fill-rule="evenodd" stroke="none"/>
    <path d="M-108.6 -257.35 L-108.45 -257.4 -107.4 -257.65 Q-105.0 -257.75 -103.45 -256.8 -101.55 -255.55 -102.0 -253.2 -102.4 -251.1 -104.35 -249.8 -106.15 -248.6 -108.3 -248.55 -110.65 -248.5 -111.55 -249.9 -112.45 -251.2 -112.0 -253.65 -111.7 -255.5 -109.9 -256.7 L-108.6 -257.35 M-107.25 -256.25 Q-107.75 -256.0 -107.85 -255.55 L-108.35 -252.25 Q-108.65 -250.35 -107.65 -250.35 -106.8 -250.35 -106.35 -252.15 -106.1 -253.25 -106.1 -254.3 L-106.3 -255.95 Q-106.65 -256.65 -107.25 -256.25 M-147.6 -252.15 L-147.45 -252.45 Q-147.45 -252.9 -147.95 -252.85 -148.45 -252.8 -148.45 -252.45 -148.45 -252.0 -147.8 -252.0 L-147.6 -252.15 M-148.0 -255.85 Q-148.8 -256.05 -148.8 -255.4 L-148.6 -255.05 Q-148.25 -254.55 -147.7 -254.55 L-147.35 -254.65 -147.25 -255.0 Q-147.25 -255.65 -148.0 -255.85 M-148.05 -254.15 Q-148.65 -254.1 -148.65 -253.7 -148.65 -253.25 -148.0 -253.25 -147.5 -253.25 -147.5 -253.7 -147.5 -254.15 -148.05 -254.15 M-104.9 -250.8 L-104.8 -251.2 Q-104.8 -251.65 -105.35 -251.65 -105.9 -251.6 -105.9 -251.2 -105.95 -250.65 -105.3 -250.65 L-104.9 -250.8 M-104.3 -251.95 Q-103.85 -251.95 -103.85 -252.4 -103.85 -253.05 -104.65 -253.2 -105.5 -253.35 -105.5 -252.75 -105.1 -251.95 -104.3 -251.95 M-104.15 -254.8 Q-105.35 -254.6 -105.35 -254.05 -105.35 -253.5 -104.7 -253.5 -103.0 -253.5 -103.0 -254.3 -103.0 -255.0 -104.15 -254.8 M-149.75 -253.05 Q-150.05 -255.4 -148.9 -256.65 -148.0 -257.55 -146.5 -257.5 L-145.8 -257.2 -145.75 -257.15 -144.9 -256.5 Q-143.8 -255.3 -143.6 -253.45 -143.35 -251.0 -143.85 -249.7 -144.4 -248.3 -145.85 -248.35 -147.15 -248.45 -148.3 -249.65 -149.55 -250.95 -149.75 -253.05 M-145.55 -253.95 L-145.55 -255.25 Q-145.7 -255.75 -146.2 -255.75 -146.7 -255.8 -146.85 -255.4 L-147.1 -252.85 Q-147.2 -250.4 -146.5 -250.4 -145.9 -250.4 -145.65 -252.1 L-145.55 -253.95" fill="#242639" fill-rule="evenodd" stroke="none"/>
    <path d="M-104.15 -254.8 Q-103.0 -255.0 -103.0 -254.3 -103.0 -253.5 -104.7 -253.5 -105.35 -253.5 -105.35 -254.05 -105.35 -254.6 -104.15 -254.8 M-104.3 -251.95 Q-105.1 -251.95 -105.5 -252.75 -105.5 -253.35 -104.65 -253.2 -103.85 -253.05 -103.85 -252.4 -103.85 -251.95 -104.3 -251.95 M-104.9 -250.8 L-105.3 -250.65 Q-105.95 -250.65 -105.9 -251.2 -105.9 -251.6 -105.35 -251.65 -104.8 -251.65 -104.8 -251.2 L-104.9 -250.8 M-148.05 -254.15 Q-147.5 -254.15 -147.5 -253.7 -147.5 -253.25 -148.0 -253.25 -148.65 -253.25 -148.65 -253.7 -148.65 -254.1 -148.05 -254.15 M-148.0 -255.85 Q-147.25 -255.65 -147.25 -255.0 L-147.35 -254.65 -147.7 -254.55 Q-148.25 -254.55 -148.6 -255.05 L-148.8 -255.4 Q-148.8 -256.05 -148.0 -255.85 M-147.6 -252.15 L-147.8 -252.0 Q-148.45 -252.0 -148.45 -252.45 -148.45 -252.8 -147.95 -252.85 -147.45 -252.9 -147.45 -252.45 L-147.6 -252.15" fill="#414569" fill-rule="evenodd" stroke="none"/>
    <path d="M-102.25 -255.6 L-99.7 -255.8 Q-96.65 -255.15 -96.65 -253.75 -96.65 -252.3 -100.85 -252.3 -104.3 -252.3 -104.3 -254.1 -104.3 -254.8 -103.2 -255.25 L-102.25 -255.6 M-104.9 -250.45 L-105.2 -251.3 Q-105.2 -252.3 -103.45 -251.8 -101.7 -251.3 -101.75 -250.3 -101.75 -249.5 -102.95 -249.5 -104.25 -249.5 -104.9 -250.45 M-148.35 -254.35 L-148.5 -253.4 Q-148.65 -252.7 -149.55 -252.7 -151.05 -252.7 -152.0 -253.6 -152.7 -254.25 -152.7 -254.7 -152.7 -256.25 -150.5 -255.95 -148.35 -255.6 -148.35 -254.35 M-147.85 -251.0 Q-147.85 -250.55 -148.4 -250.15 -149.0 -249.65 -149.9 -249.65 -151.15 -249.65 -151.05 -250.7 -151.0 -252.0 -149.0 -252.0 -147.8 -252.0 -147.85 -251.0" fill="#ffffff" fill-opacity="0.6313726" fill-rule="evenodd" stroke="none"/>
    <path d="M-142.55 -262.15 L-142.15 -261.55 -140.3 -258.85 -138.8 -256.65 -137.8 -255.0 -136.8 -253.0 Q-135.85 -251.15 -135.5 -249.15 L-135.1 -247.45 -135.1 -246.55 -134.9 -244.6 -134.95 -243.95 -135.05 -242.6 -135.85 -239.8 -136.5 -237.15 -136.5 -236.45 Q-136.5 -235.35 -135.95 -234.5 L-135.6 -234.3 -134.6 -234.15 -133.05 -234.4 Q-132.4 -234.55 -131.85 -234.85 L-131.15 -235.95 -131.15 -236.0 -130.75 -236.45 Q-130.1 -237.15 -129.3 -237.15 -128.9 -237.15 -128.1 -236.45 L-128.0 -236.35 -127.55 -235.95 -126.6 -235.8 Q-125.7 -235.8 -125.15 -236.45 L-124.85 -236.9 -124.45 -238.25 Q-124.45 -238.7 -124.7 -239.0 L-125.05 -239.35 -125.05 -239.4 -125.1 -239.4 -125.4 -239.5 -126.2 -239.35 Q-126.6 -239.35 -126.55 -239.65 L-126.8 -239.6 -126.6 -239.75 -126.55 -239.75 Q-126.45 -240.2 -125.6 -240.45 -124.5 -240.7 -123.5 -239.85 L-122.95 -238.8 -123.05 -237.85 Q-123.0 -236.15 -124.1 -235.2 L-124.85 -234.75 -126.25 -234.45 Q-127.5 -234.45 -128.3 -235.2 L-128.75 -235.35 -129.2 -235.45 -129.55 -235.3 -130.6 -234.35 -131.95 -232.95 Q-132.65 -232.35 -133.35 -232.2 L-134.6 -232.1 Q-135.65 -232.0 -136.3 -232.8 L-137.05 -234.0 -137.25 -234.75 -137.3 -234.75 Q-138.6 -234.75 -139.35 -235.8 L-139.7 -236.45 -140.0 -237.55 Q-139.9 -238.85 -138.9 -240.0 -137.95 -241.1 -137.05 -241.1 L-136.8 -241.05 Q-136.5 -242.5 -136.65 -243.85 L-136.65 -244.6 -136.85 -246.45 -136.85 -247.45 Q-137.25 -250.25 -138.15 -253.0 L-138.6 -254.35 -139.45 -256.4 -141.1 -259.6 -142.45 -261.95 -142.55 -262.15 M-138.0 -239.15 L-138.55 -237.55 Q-138.5 -236.95 -137.55 -236.5 L-137.4 -236.45 -137.45 -237.3 -136.95 -240.2 -137.25 -239.95 -138.0 -239.15 M-121.65 -228.45 L-132.1 -230.1 -135.2 -230.4 -140.5 -230.8 -140.6 -230.8 -142.25 -230.95 -145.0 -231.1 -146.4 -231.15 -146.7 -231.2 -149.05 -231.3 Q-148.45 -231.4 -146.6 -232.35 L-145.4 -233.0 -145.15 -233.1 -144.7 -233.4 -141.95 -234.65 -143.7 -232.8 -143.7 -232.5 -128.0 -230.9 -120.95 -229.65 -120.35 -229.5 Q-116.55 -228.5 -113.8 -226.95 L-113.65 -226.85 -114.95 -226.05 -116.35 -225.4 Q-118.2 -224.7 -120.7 -224.7 L-131.4 -225.35 -138.1 -225.9 -140.05 -226.0 -142.2 -226.05 -142.3 -226.05 -144.8 -226.0 -148.2 -225.85 -144.75 -226.2 -142.1 -226.45 -139.4 -226.65 -135.75 -226.8 -132.75 -226.7 -124.7 -226.5 -122.45 -226.5 -116.65 -226.8 Q-118.4 -227.7 -121.5 -228.4 L-121.65 -228.45" fill="#5b4435" fill-rule="evenodd" stroke="none"/>
    <path d="M-144.75 -226.2 L-148.2 -225.85 -149.0 -225.8 Q-150.1 -224.4 -149.95 -221.25 L-153.1 -225.3 -148.4 -227.05 Q-146.3 -227.8 -146.3 -229.75 L-146.4 -231.15 -145.0 -231.1 -144.75 -226.2 M-113.8 -226.95 Q-116.55 -228.5 -120.35 -229.5 L-120.95 -229.65 -122.45 -230.7 Q-124.45 -232.0 -125.2 -232.05 L-125.1 -232.2 -123.45 -232.2 -115.55 -230.85 Q-111.3 -229.9 -110.4 -229.35 L-112.3 -227.9 -112.9 -227.5 -113.8 -226.95" fill="#574032" fill-opacity="0.34117648" fill-rule="evenodd" stroke="none"/>
    <path d="M-142.1 -226.45 L-144.75 -226.2 -145.0 -231.1 -142.25 -230.95 -140.8 -228.3 -142.1 -226.45" fill="#573f32" fill-opacity="0.5019608" fill-rule="evenodd" stroke="none"/>
    <path d="M-132.75 -226.7 L-135.75 -226.8 -139.4 -226.65 -138.95 -227.35 Q-138.1 -228.25 -136.6 -228.3 L-136.75 -228.45 -138.4 -228.7 -140.05 -228.9 Q-139.9 -229.4 -140.3 -230.15 L-140.5 -230.8 -135.2 -230.4 -130.95 -229.3 -125.2 -228.0 -125.05 -228.0 -131.1 -226.95 -132.75 -226.7" fill="#b3a27b" fill-rule="evenodd" stroke="none"/>
    <path d="M-135.2 -230.4 L-132.1 -230.1 -121.65 -228.45 Q-122.15 -227.75 -122.9 -227.4 L-122.45 -226.5 -124.7 -226.5 -132.75 -226.7 -131.1 -226.95 -125.05 -228.0 -125.2 -228.0 -130.95 -229.3 -135.2 -230.4 M-139.4 -226.65 L-142.1 -226.45 -140.8 -228.3 -142.25 -230.95 -140.6 -230.8 -140.5 -230.8 -140.3 -230.15 Q-139.9 -229.4 -140.05 -228.9 L-138.4 -228.7 -136.75 -228.45 -136.6 -228.3 Q-138.1 -228.25 -138.95 -227.35 L-139.4 -226.65" fill="#998a69" fill-rule="evenodd" stroke="none"/>
    <path d="M-121.65 -228.45 L-121.5 -228.4 Q-118.4 -227.7 -116.65 -226.8 L-122.45 -226.5 -122.9 -227.4 Q-122.15 -227.75 -121.65 -228.45" fill="#6e634b" fill-rule="evenodd" stroke="none"/>
    <path d="M-86.3 -259.25 Q-88.65 -258.75 -96.9 -259.2 -105.15 -259.7 -109.2 -259.3 -113.25 -258.9 -119.15 -256.75 -125.1 -254.6 -126.95 -254.3 -126.15 -257.45 -121.3 -260.4 -115.45 -264.1 -108.45 -264.1 -102.75 -264.1 -96.05 -262.6 -90.3 -261.25 -86.3 -259.25 M-155.7 -257.0 Q-159.7 -257.55 -161.1 -258.05 -158.65 -260.05 -155.2 -261.4 -151.2 -262.9 -147.8 -262.9 -143.6 -262.9 -140.15 -259.2 -137.3 -256.25 -136.8 -253.1 L-140.9 -254.3 -148.0 -255.85 -155.7 -257.0" fill="#471e06" fill-rule="evenodd" stroke="none"/>
    <path d="M-92.1 -198.6 L-90.0 -198.05 -84.95 -196.6 Q-81.15 -195.45 -79.6 -194.3 L-72.85 -189.5 Q-65.55 -185.0 -61.25 -185.0 -54.6 -185.0 -48.15 -189.05 L-48.3 -187.2 -48.15 -185.35 Q-54.3 -183.25 -62.1 -183.25 -68.4 -183.25 -80.35 -190.55 -88.2 -195.25 -92.1 -198.6 M-37.5 -181.2 Q-38.8 -171.8 -43.95 -158.55 -46.5 -151.7 -55.6 -144.35 -66.3 -135.8 -76.2 -135.8 -88.1 -135.8 -96.4 -145.55 -100.5 -150.45 -102.65 -155.85 -104.55 -159.05 -105.4 -165.45 -101.7 -155.05 -95.15 -149.25 -86.2 -141.45 -71.1 -141.45 -58.95 -141.45 -52.85 -154.15 -51.65 -156.55 -48.0 -166.25 -45.05 -174.25 -42.25 -178.8 L-42.8 -178.8 Q-42.8 -178.4 -43.4 -178.05 -44.0 -177.7 -44.45 -177.7 L-46.85 -181.85 -48.15 -185.35 -46.85 -185.85 -44.75 -186.75 Q-44.5 -185.6 -43.9 -184.8 -42.1 -182.1 -37.5 -181.2" fill="#3a4a13" fill-rule="evenodd" stroke="none"/>
    <path d="M-48.15 -189.05 L-46.95 -189.8 -45.25 -191.1 -45.25 -190.7 Q-45.25 -188.35 -44.75 -186.75 L-46.85 -185.85 -48.15 -185.35 -46.85 -181.85 -44.45 -177.7 Q-44.0 -177.7 -43.4 -178.05 -42.8 -178.4 -42.8 -178.8 L-42.25 -178.8 Q-45.05 -174.25 -48.0 -166.25 -51.65 -156.55 -52.85 -154.15 -58.95 -141.45 -71.1 -141.45 -86.2 -141.45 -95.15 -149.25 -101.7 -155.05 -105.4 -165.45 L-105.65 -166.6 Q-106.4 -172.35 -106.35 -178.05 -106.4 -183.4 -105.65 -188.65 -104.4 -197.95 -101.7 -197.95 L-97.8 -199.0 -92.1 -198.6 Q-88.2 -195.25 -80.35 -190.55 -68.4 -183.25 -62.1 -183.25 -54.3 -183.25 -48.15 -185.35 L-48.3 -187.2 -48.15 -189.05 M-101.1 -173.6 L-101.25 -173.95 Q-101.35 -174.6 -101.4 -173.4 L-101.1 -173.6" fill="#2d3d0f" fill-rule="evenodd" stroke="none"/>
    <path d="M-45.25 -191.1 Q-45.15 -193.7 -44.7 -195.15 -43.75 -198.15 -40.45 -200.25 -35.35 -203.55 -30.8 -203.65 -25.65 -203.75 -26.65 -198.9 L-25.15 -198.9 -22.8 -199.0 Q-18.0 -199.0 -16.6 -196.1 -16.1 -195.0 -16.05 -192.75 -16.15 -189.6 -19.2 -186.05 -23.65 -180.75 -32.2 -180.75 L-37.5 -181.2 Q-42.1 -182.1 -43.9 -184.8 -44.5 -185.6 -44.75 -186.75 -45.25 -188.35 -45.25 -190.7 L-45.25 -191.1" fill="#9e846d" fill-rule="evenodd" stroke="none"/>
  </g>
</svg>
