<?xml version="1.0" encoding="UTF-8" standalone="no"?>
<svg xmlns:xlink="http://www.w3.org/1999/xlink" height="82.25px" width="62.65px" xmlns="http://www.w3.org/2000/svg">
  <g transform="matrix(1.0, 0.0, 0.0, 1.0, 29.25, 41.15)">
    <path d="M-17.75 -4.25 Q-17.75 -6.75 -18.5 -10.55 L-19.8 -15.95 -21.05 -20.35 -15.15 -36.0 -14.9 -36.35 -14.7 -36.85 -14.05 -38.15 -13.85 -38.55 -1.05 -39.85 1.4 -40.05 2.85 -40.15 19.65 -41.15 19.45 -39.05 Q19.45 -35.35 23.35 -17.2 20.95 -8.65 20.95 -4.15 20.95 -0.15 26.7 11.05 L32.75 23.0 33.4 25.2 24.2 31.25 23.55 23.0 Q22.95 17.0 22.0 12.05 L21.9 11.65 Q20.85 6.3 19.45 1.05 L16.1 -14.7 Q12.4 -30.3 10.15 -33.8 L10.0 -33.55 9.85 -33.5 6.6 -25.4 Q4.2 -19.45 4.0 -18.05 L3.2 -11.7 Q2.85 -9.8 2.3 -8.5 L1.35 -6.95 2.3 -28.25 2.85 -40.15 2.3 -28.25 Q-0.75 -26.85 -4.45 -24.15 -10.15 -19.9 -11.2 -15.95 L-11.4 -15.15 -11.75 -13.45 Q-12.65 -10.4 -15.15 -6.9 L-17.1 -4.15 -13.85 -4.05 -17.9 -2.7 -19.5 -2.15 -19.5 -2.25 -18.6 -3.35 -17.9 -4.05 -17.8 -4.15 -17.75 -4.2 -17.75 -4.15 -17.75 -4.25 M-25.05 28.4 L-25.25 28.15 -25.7 27.55 -26.35 26.7 -27.85 24.6 -28.0 24.4 -29.25 22.45 -28.15 20.3 -28.0 19.95 -24.75 13.55 -25.2 19.7 -25.4 22.4 -25.7 27.2 -25.2 28.15 -25.05 28.4 M-19.75 -0.3 L-19.85 -0.5 -18.7 -0.85 -18.8 -0.95 -18.35 -0.85 -14.45 -0.15 -14.45 -0.1 -17.9 -0.3 -18.5 -0.35 -19.75 -0.3 M26.9 18.75 L27.2 18.4 26.9 18.4 26.9 18.75" fill="#c29c9c" fill-rule="evenodd" stroke="none"/>
    <path d="M24.2 31.25 L14.65 37.1 13.95 37.45 12.05 38.35 Q14.5 26.55 14.5 22.35 14.5 18.5 11.8 10.55 L11.65 10.1 Q8.75 1.65 4.9 -4.5 L4.75 -4.25 4.6 -4.2 Q3.05 -1.45 2.3 2.65 1.75 5.5 1.6 9.0 L1.55 10.75 1.55 11.25 1.6 12.45 1.55 22.9 2.3 25.15 7.6 40.45 6.3 41.1 0.05 21.55 0.95 1.85 Q0.2 -7.6 0.05 -15.95 L0.05 -23.9 -5.0 -15.95 -6.95 -12.85 -10.55 -6.35 -11.15 -5.05 -11.25 -4.9 -6.25 -5.6 -9.15 -4.25 -10.5 -3.65 -11.95 -3.05 -12.45 -0.9 -12.45 -0.7 -12.35 -0.7 -12.05 -0.7 -10.1 -0.75 Q-6.3 -0.9 -4.05 -1.65 -5.0 -1.1 -8.15 0.25 L-10.65 1.2 -13.25 2.05 -15.2 8.05 -17.5 14.85 -21.4 26.15 -22.1 28.15 -23.0 30.85 -25.05 28.4 -25.2 28.15 -25.7 27.2 -25.4 22.4 -25.2 19.7 -24.75 13.55 -23.5 11.05 Q-20.5 5.15 -19.05 1.3 L-19.75 -0.3 -18.5 -0.35 -17.9 -0.3 -14.45 -0.1 -14.45 -0.15 -18.35 -0.85 -18.8 -0.95 -19.0 -1.25 -19.15 -1.5 -19.5 -2.15 -17.9 -2.7 -13.85 -4.05 -17.1 -4.15 -15.15 -6.9 Q-12.65 -10.4 -11.75 -13.45 L-11.4 -15.15 -11.2 -15.95 Q-10.15 -19.9 -4.45 -24.15 -0.75 -26.85 2.3 -28.25 L1.35 -6.95 2.3 -8.5 Q2.85 -9.8 3.2 -11.7 L4.0 -18.05 Q4.2 -19.45 6.6 -25.4 L9.85 -33.5 10.0 -33.55 10.15 -33.8 Q12.4 -30.3 16.1 -14.7 L19.45 1.05 Q20.85 6.3 21.9 11.65 L22.0 12.05 Q22.95 17.0 23.55 23.0 L24.2 31.25 M1.35 -6.95 L0.95 1.85 1.35 -6.95 M26.9 18.75 L26.9 18.4 27.2 18.4 26.9 18.75 M-18.25 3.7 L-19.05 1.3 -18.25 3.7" fill="#d2b6b6" fill-rule="evenodd" stroke="none"/>
    <path d="M12.05 38.35 Q10.45 39.1 8.95 39.8 7.55 33.55 5.75 27.1 L2.3 14.95 1.6 12.45 1.55 11.25 1.55 10.75 1.6 9.0 Q1.75 5.5 2.3 2.65 3.05 -1.45 4.6 -4.2 L4.75 -4.25 4.9 -4.5 Q8.75 1.65 11.65 10.1 L11.8 10.55 Q14.5 18.5 14.5 22.35 14.5 26.55 12.05 38.35 M0.05 21.55 L-3.1 25.9 -4.7 28.15 -7.35 31.8 -13.75 40.55 -15.05 39.3 -11.4 34.0 -7.3 28.15 -2.9 21.95 -2.15 8.7 -1.65 0.25 -3.2 1.15 -4.85 2.15 -8.05 8.35 -10.65 13.4 Q-14.2 20.35 -17.45 28.15 L-19.9 34.35 -23.0 30.85 -22.1 28.15 -21.4 26.15 -17.5 14.85 -15.2 8.05 -13.25 2.05 -10.65 1.2 -8.15 0.25 Q-5.0 -1.1 -4.05 -1.65 -6.3 -0.9 -10.1 -0.75 L-12.05 -0.7 -12.35 -0.7 -12.45 -0.7 -12.45 -0.9 -11.95 -3.05 -10.5 -3.65 -9.15 -4.25 -6.25 -5.6 -11.25 -4.9 -11.15 -5.05 -10.55 -6.35 -6.95 -12.85 -5.0 -15.95 0.05 -23.9 0.05 -15.95 Q0.2 -7.6 0.95 1.85 L0.05 21.55" fill="#e0cdcd" fill-rule="evenodd" stroke="none"/>
    <path d="M8.95 39.8 L7.6 40.45 2.3 25.15 1.55 22.9 1.6 12.45 2.3 14.95 5.75 27.1 Q7.55 33.55 8.95 39.8 M-15.05 39.3 L-19.9 34.35 -17.45 28.15 Q-14.2 20.35 -10.65 13.4 L-8.05 8.35 -4.85 2.15 -3.2 1.15 -1.65 0.25 -2.15 8.7 -2.9 21.95 -7.3 28.15 -11.4 34.0 -15.05 39.3" fill="#f2eaea" fill-rule="evenodd" stroke="none"/>
    <path d="M-17.75 -4.25 Q-17.75 -6.75 -18.5 -10.55 L-19.8 -15.95 -21.05 -20.35 -15.15 -36.0 -14.9 -36.35 -14.7 -36.85 -14.05 -38.15 -13.85 -38.55 -1.05 -39.85 1.4 -40.05 2.85 -40.15 19.65 -41.15 19.45 -39.05 Q19.45 -35.35 23.35 -17.2 20.95 -8.65 20.95 -4.15 20.95 -0.15 26.7 11.05 L32.75 23.0 33.4 25.2 24.2 31.25 14.65 37.1 13.95 37.45 12.05 38.35 Q10.45 39.1 8.95 39.8 L7.6 40.45 6.3 41.1 0.05 21.55 -3.1 25.9 -4.7 28.15 -7.35 31.8 -13.75 40.55 -15.05 39.3 -19.9 34.35 -23.0 30.85 -25.05 28.4 -25.25 28.15 -25.7 27.55 -26.35 26.7 -27.85 24.6 -28.0 24.4 -29.25 22.45 -28.15 20.3 -28.0 19.95 -24.75 13.55 -23.5 11.05 Q-20.5 5.15 -19.05 1.3 L-19.75 -0.3 -19.85 -0.5 -18.7 -0.85 -18.8 -0.95 M-19.0 -1.25 L-19.15 -1.5 -19.5 -2.15 -19.5 -2.25 -18.6 -3.35 -17.9 -4.05 M-17.8 -4.15 L-17.75 -4.2 -17.75 -4.25 M2.85 -40.15 L2.3 -28.25 1.35 -6.95 M0.95 1.85 L1.35 -6.95 M0.05 21.55 L0.95 1.85 M-19.05 1.3 L-18.25 3.7" fill="none" stroke="#a36a6a" stroke-linecap="round" stroke-linejoin="round" stroke-opacity="0.69411767" stroke-width="0.05"/>
  </g>
</svg>
