<?xml version="1.0" encoding="UTF-8" standalone="no"?>
<svg xmlns:xlink="http://www.w3.org/1999/xlink" height="1.7px" width="1.7px" xmlns="http://www.w3.org/2000/svg">
  <g transform="matrix(1.0, 0.0, 0.0, 1.0, 0.85, 0.85)">
    <path d="M0.0 -0.85 L0.6 -0.6 0.85 0.0 0.6 0.6 0.0 0.85 -0.6 0.6 -0.85 0.0 -0.6 -0.6 0.0 -0.85" fill="#ffffff" fill-rule="evenodd" stroke="none"/>
  </g>
</svg>
