<?xml version="1.0" encoding="UTF-8" standalone="no"?>
<svg xmlns:xlink="http://www.w3.org/1999/xlink" height="110.35px" width="195.45px" xmlns="http://www.w3.org/2000/svg">
  <g transform="matrix(1.0, 0.0, 0.0, 1.0, 97.7, 55.2)">
    <path d="M3.35 -5.25 Q8.0 -3.2 10.6 -2.3 12.45 -1.75 13.25 -1.75 L15.5 -2.0 15.6 -2.0 33.1 15.5 62.45 15.5 62.45 -48.7 56.85 -48.7 56.85 -55.2 97.75 -55.2 97.75 55.15 -97.7 55.15 -97.7 -55.2 53.0 -55.2 53.0 -48.7 -71.25 -48.7 -71.25 6.35 -58.8 6.35 Q-45.7 -0.4 -41.2 -4.2 L-39.75 -3.15 -37.95 -2.0 -37.6 -1.85 Q-35.85 -0.95 -33.75 -0.55 L-30.15 -0.15 Q-25.85 -0.05 -20.95 -1.9 -20.55 -2.1 -20.1 -2.25 -16.75 -3.7 -11.05 -7.15 L-8.9 -8.5 -8.2 -8.9 -5.85 -8.55 -5.3 -8.45 -4.85 -8.3 Q-2.5 -7.65 0.6 -6.4 L1.75 -5.9 3.35 -5.25" fill="#000000" fill-rule="evenodd" stroke="none"/>
  </g>
</svg>
