<?xml version="1.0" encoding="UTF-8" standalone="no"?>
<svg xmlns:xlink="http://www.w3.org/1999/xlink" height="13.15px" width="18.0px" xmlns="http://www.w3.org/2000/svg">
  <g transform="matrix(1.0, 0.0, 0.0, 1.0, 8.75, 9.95)">
    <path d="M8.15 -2.65 Q6.3 0.05 2.7 1.75 -0.9 3.45 -4.15 3.15 -7.4 2.85 -8.4 0.7 -9.4 -1.45 -7.6 -4.1 -5.75 -6.8 -2.15 -8.5 1.45 -10.2 4.7 -9.9 7.9 -9.65 8.9 -7.5 9.9 -5.35 8.15 -2.65" fill="url(#gradient0)" fill-rule="evenodd" stroke="none"/>
    <path d="M6.55 -4.1 L6.45 -3.75 Q5.0 -2.15 3.7 -1.45 2.6 -0.9 0.8 -0.3 L-2.45 0.3 -3.75 0.15 -3.8 0.1 -4.15 0.0 -5.45 0.45 -5.7 0.5 -5.95 0.5 -6.3 0.35 -6.45 0.0 -6.45 -0.4 -6.35 -0.7 -4.55 -1.8 -4.5 -1.8 Q-1.15 -6.55 2.05 -6.5 5.2 -6.5 6.5 -4.45 L6.55 -4.15 6.55 -4.1" fill="#a36a6a" fill-rule="evenodd" stroke="none"/>
  </g>
  <defs>
    <radialGradient cx="0" cy="0" gradientTransform="matrix(0.0109, -0.0052, 0.003, 0.0063, 0.25, -3.4)" gradientUnits="userSpaceOnUse" id="gradient0" r="819.2" spreadMethod="pad">
      <stop offset="0.3333333333333333" stop-color="#cca9a9"/>
      <stop offset="1.0" stop-color="#cca9a9" stop-opacity="0.0"/>
    </radialGradient>
  </defs>
</svg>
