<?xml version="1.0" encoding="UTF-8" standalone="no"?>
<svg xmlns:xlink="http://www.w3.org/1999/xlink" height="75.5px" width="75.5px" xmlns="http://www.w3.org/2000/svg">
  <g transform="matrix(1.0, 0.0, 0.0, 1.0, 37.65, 37.65)">
    <path d="M0.05 -29.75 Q-2.6 -29.7 -4.85 -28.85 L-0.05 -27.2 4.9 -28.8 Q2.55 -29.7 0.05 -29.75 M0.25 -33.65 Q-13.7 -33.9 -23.85 -23.75 -33.85 -13.75 -33.65 0.25 L-33.45 6.05 Q-31.75 16.15 -23.6 24.3 -13.5 34.4 0.4 34.3 14.35 34.45 24.35 24.45 34.5 14.3 34.3 0.4 34.6 -13.7 24.5 -23.8 16.35 -31.95 6.0 -33.4 L0.25 -33.65 M10.45 -34.15 L10.6 -34.0 10.9 -34.0 18.1 -34.2 19.2 -34.0 Q24.65 -33.15 29.0 -28.9 32.6 -25.1 33.75 -19.95 L34.15 -18.15 Q34.7 -15.0 34.15 -11.35 L34.0 -10.7 34.2 -10.4 34.85 -9.65 Q37.8 -5.3 37.85 0.15 37.8 4.1 36.1 7.5 L35.2 9.1 34.25 10.55 34.0 10.8 Q34.65 14.75 34.2 18.1 L34.15 18.15 Q33.15 24.55 28.8 29.2 25.4 32.3 21.05 33.75 L17.75 34.55 11.65 34.25 10.9 34.1 10.7 34.1 10.5 34.3 Q5.85 37.75 -0.15 37.85 -4.35 37.75 -8.2 35.8 L-10.8 34.1 -18.0 34.5 -20.2 34.1 Q-25.3 32.7 -28.75 29.15 -33.25 24.95 -34.0 19.2 L-34.2 18.1 Q-34.8 14.6 -34.25 10.65 L-35.3 9.2 Q-37.7 4.9 -37.65 0.35 -37.8 -5.3 -34.6 -9.6 L-34.3 -10.0 -34.4 -11.3 Q-34.7 -15.0 -34.2 -18.1 L-33.65 -20.85 Q-32.45 -25.55 -29.0 -28.9 -24.55 -33.55 -18.25 -34.25 L-18.1 -34.2 -10.4 -33.9 -10.3 -34.0 Q-9.25 -34.95 -8.1 -35.5 -4.4 -37.7 0.05 -37.65 5.95 -37.75 10.45 -34.15 M0.95 -22.8 Q1.4 -23.25 1.4 -23.8 1.4 -24.4 0.95 -24.8 L-0.05 -25.25 Q-0.6 -25.25 -1.05 -24.8 -1.5 -24.4 -1.5 -23.8 -1.5 -23.25 -1.05 -22.8 -0.6 -22.4 -0.05 -22.4 0.5 -22.4 0.95 -22.8 M5.65 -22.5 L6.1 -23.5 5.65 -24.5 Q5.25 -24.9 4.65 -24.9 4.1 -24.9 3.65 -24.5 3.25 -24.05 3.25 -23.5 3.25 -22.9 3.65 -22.5 4.1 -22.05 4.65 -22.05 5.25 -22.05 5.65 -22.5 M19.3 -14.05 Q18.85 -13.6 18.85 -13.05 18.85 -12.5 19.3 -12.05 19.7 -11.6 20.3 -11.6 20.85 -11.6 21.3 -12.05 21.7 -12.5 21.7 -13.05 21.7 -13.6 21.3 -14.05 20.85 -14.5 20.3 -14.5 19.7 -14.5 19.3 -14.05 M18.2 -15.65 Q18.6 -16.1 18.6 -16.65 18.6 -17.25 18.2 -17.65 L17.2 -18.1 Q16.6 -18.1 16.2 -17.65 15.75 -17.25 15.75 -16.65 15.75 -16.1 16.2 -15.65 16.6 -15.25 17.2 -15.25 17.75 -15.25 18.2 -15.65 M13.45 -21.35 Q12.85 -21.35 12.45 -20.9 12.0 -20.5 12.0 -19.9 12.0 -19.35 12.45 -18.9 12.85 -18.5 13.45 -18.5 14.0 -18.5 14.45 -18.9 14.85 -19.35 14.85 -19.9 14.85 -20.5 14.45 -20.9 14.0 -21.35 13.45 -21.35 M10.3 -21.15 Q10.7 -21.55 10.7 -22.15 10.7 -22.7 10.3 -23.15 9.85 -23.55 9.3 -23.55 8.7 -23.55 8.3 -23.15 7.85 -22.7 7.85 -22.15 7.85 -21.55 8.3 -21.15 8.7 -20.7 9.3 -20.7 9.85 -20.7 10.3 -21.15 M4.4 -13.8 L4.5 -13.8 6.6 -11.45 7.0 -10.8 8.35 -8.2 11.1 -6.7 12.1 -6.05 14.05 -4.2 14.3 -3.8 Q15.5 -2.2 15.5 0.15 15.5 2.1 14.45 3.75 L14.05 4.35 12.25 6.15 11.0 6.9 8.35 8.35 7.0 10.9 6.7 11.5 5.25 13.3 4.5 13.9 4.4 14.0 Q2.5 15.45 0.1 15.45 -1.6 15.4 -3.2 14.55 L-4.25 13.9 -5.95 12.0 -6.6 11.05 -8.1 8.3 Q-9.5 7.7 -10.7 6.9 L-11.4 6.5 -13.7 4.5 -14.15 3.75 Q-15.15 2.05 -15.15 0.2 -15.25 -2.15 -13.85 -3.85 L-13.6 -4.2 Q-12.75 -5.5 -11.25 -6.5 L-10.7 -6.8 -8.0 -8.05 -6.7 -10.8 -5.95 -12.0 -4.05 -13.75 -3.25 -14.35 -2.9 -14.5 Q-1.5 -15.3 0.2 -15.25 2.55 -15.3 4.4 -13.8 M0.2 -3.8 Q-1.05 -3.8 -1.95 -3.1 L-2.0 -3.05 -2.45 -2.65 -2.5 -2.65 Q-3.55 -1.55 -3.55 0.0 -3.55 1.55 -2.5 2.65 L-2.45 2.7 -2.0 3.1 -1.95 3.1 Q-1.05 3.75 0.2 3.75 1.8 3.75 2.9 2.65 4.0 1.55 4.0 0.0 4.0 -1.55 2.9 -2.65 1.8 -3.8 0.2 -3.8 M0.45 -18.85 Q-5.95 -18.85 -10.5 -15.4 L-12.9 -13.25 Q-18.45 -7.9 -18.45 0.0 -18.45 7.8 -12.9 13.2 L-10.5 15.45 Q-5.95 18.7 0.45 18.7 8.35 18.7 13.65 13.2 19.2 7.8 19.2 0.0 19.2 -7.9 13.65 -13.25 8.35 -18.85 0.45 -18.85 M13.55 21.25 Q14.15 21.25 14.55 20.8 L15.0 19.8 14.55 18.8 Q14.15 18.4 13.55 18.4 13.0 18.4 12.55 18.8 12.15 19.25 12.15 19.8 12.15 20.4 12.55 20.8 13.0 21.25 13.55 21.25 M16.2 17.7 Q16.6 18.15 17.2 18.15 L18.2 17.7 Q18.6 17.3 18.6 16.7 18.6 16.15 18.2 15.7 17.75 15.3 17.2 15.3 16.6 15.3 16.2 15.7 15.75 16.15 15.75 16.7 15.75 17.3 16.2 17.7 M7.9 22.1 Q7.9 22.65 8.35 23.1 8.75 23.5 9.35 23.5 9.9 23.5 10.35 23.1 10.75 22.65 10.75 22.1 10.75 21.5 10.35 21.1 9.9 20.65 9.35 20.65 8.75 20.65 8.35 21.1 7.9 21.5 7.9 22.1 M4.7 21.95 Q4.15 21.95 3.7 22.4 3.3 22.8 3.3 23.4 3.3 23.95 3.7 24.4 4.15 24.8 4.7 24.8 5.3 24.8 5.7 24.4 L6.15 23.4 Q6.15 22.8 5.7 22.4 5.3 21.95 4.7 21.95 M0.75 24.7 Q1.2 24.3 1.2 23.7 1.2 23.15 0.75 22.7 0.35 22.3 -0.25 22.3 -0.8 22.3 -1.25 22.7 -1.65 23.15 -1.65 23.7 -1.65 24.3 -1.25 24.7 -0.8 25.15 -0.25 25.15 0.35 25.15 0.75 24.7 M20.5 15.15 L20.95 14.15 Q20.95 13.55 20.5 13.15 20.1 12.7 19.5 12.7 18.95 12.7 18.5 13.15 18.1 13.55 18.1 14.15 18.1 14.7 18.5 15.15 18.95 15.55 19.5 15.55 20.1 15.55 20.5 15.15 M22.0 8.55 Q21.45 8.55 21.0 9.0 20.55 9.45 20.55 10.0 20.55 10.55 21.0 11.0 21.45 11.45 22.0 11.45 22.55 11.45 23.0 11.0 L23.45 10.0 Q23.45 9.45 23.0 9.0 22.55 8.55 22.0 8.55 M25.0 5.45 Q25.0 4.85 24.55 4.45 24.15 4.0 23.55 4.0 23.0 4.0 22.55 4.45 22.15 4.85 22.15 5.45 22.15 6.0 22.55 6.45 23.0 6.85 23.55 6.85 24.15 6.85 24.55 6.45 L25.0 5.45 M28.85 4.85 Q29.7 2.6 29.8 0.2 29.75 -2.45 28.85 -4.65 28.35 -2.2 27.3 0.1 28.4 2.5 28.85 4.85 M0.5 -32.4 Q14.05 -32.4 23.3 -22.75 32.75 -13.5 32.75 0.05 32.75 13.5 23.3 22.7 14.05 32.2 0.5 32.2 -10.5 32.2 -18.4 26.5 L-22.5 22.7 Q-31.95 13.5 -31.95 0.05 -31.95 -13.5 -22.5 -22.75 -20.4 -25.0 -18.4 -26.45 -10.5 -32.4 0.5 -32.4 M24.15 -0.7 Q23.55 -0.7 23.15 -0.3 22.7 0.15 22.7 0.7 22.7 1.3 23.15 1.7 23.55 2.15 24.15 2.15 24.7 2.15 25.15 1.7 25.55 1.3 25.55 0.7 25.55 0.15 25.15 -0.3 24.7 -0.7 24.15 -0.7 M25.25 -4.2 L24.8 -5.2 Q24.4 -5.6 23.8 -5.6 23.25 -5.6 22.8 -5.2 22.4 -4.75 22.4 -4.2 22.4 -3.6 22.8 -3.2 23.25 -2.75 23.8 -2.75 24.4 -2.75 24.8 -3.2 25.25 -3.6 25.25 -4.2 M22.55 -10.25 Q22.0 -10.25 21.55 -9.8 21.15 -9.4 21.15 -8.8 21.15 -8.25 21.55 -7.8 22.0 -7.4 22.55 -7.4 23.15 -7.4 23.55 -7.8 L24.0 -8.8 23.55 -9.8 Q23.15 -10.25 22.55 -10.25 M5.25 28.9 Q2.5 28.25 -0.05 27.25 L-5.0 28.9 Q-2.65 29.9 0.2 29.8 2.75 29.85 5.25 28.9 M-24.05 3.1 Q-24.5 3.5 -24.5 4.1 L-24.05 5.1 Q-23.6 5.5 -23.05 5.5 -22.5 5.5 -22.05 5.1 -21.6 4.65 -21.6 4.1 -21.6 3.5 -22.05 3.1 -22.5 2.65 -23.05 2.65 -23.6 2.65 -24.05 3.1 M-5.95 22.25 Q-6.4 22.65 -6.4 23.25 -6.4 23.8 -5.95 24.25 -5.5 24.65 -4.95 24.65 -4.4 24.65 -3.95 24.25 -3.5 23.8 -3.5 23.25 -3.5 22.65 -3.95 22.25 -4.4 21.8 -4.95 21.8 -5.5 21.8 -5.95 22.25 M-10.45 20.8 Q-10.85 21.25 -10.85 21.8 -10.85 22.4 -10.45 22.8 -10.0 23.25 -9.45 23.25 -8.85 23.25 -8.45 22.8 -8.0 22.4 -8.0 21.8 -8.0 21.25 -8.45 20.8 -8.85 20.4 -9.45 20.4 L-10.45 20.8 M-17.6 17.5 Q-17.2 17.95 -16.6 17.95 L-15.6 17.5 Q-15.2 17.1 -15.2 16.5 -15.2 15.95 -15.6 15.5 -16.05 15.1 -16.6 15.1 -17.2 15.1 -17.6 15.5 -18.05 15.95 -18.05 16.5 -18.05 17.1 -17.6 17.5 M-12.4 18.55 Q-12.8 18.15 -13.4 18.15 -13.95 18.15 -14.4 18.55 -14.8 19.0 -14.8 19.55 -14.8 20.15 -14.4 20.55 L-13.4 21.0 Q-12.8 21.0 -12.4 20.55 -11.95 20.15 -11.95 19.55 -11.95 19.0 -12.4 18.55 M-18.6 11.9 Q-19.05 11.5 -19.6 11.5 -20.2 11.5 -20.6 11.9 L-21.05 12.9 -20.6 13.9 Q-20.2 14.35 -19.6 14.35 -19.05 14.35 -18.6 13.9 -18.2 13.5 -18.2 12.9 -18.2 12.35 -18.6 11.9 M-19.7 -15.15 L-20.15 -14.15 -19.7 -13.15 Q-19.3 -12.7 -18.7 -12.7 -18.15 -12.7 -17.7 -13.15 -17.3 -13.55 -17.3 -14.15 -17.3 -14.7 -17.7 -15.15 -18.15 -15.55 -18.7 -15.55 -19.3 -15.55 -19.7 -15.15 M-15.45 -17.65 Q-15.85 -18.1 -16.45 -18.1 -17.0 -18.1 -17.45 -17.65 -17.85 -17.25 -17.85 -16.65 -17.85 -16.1 -17.45 -15.65 -17.0 -15.25 -16.45 -15.25 -15.85 -15.25 -15.45 -15.65 -15.0 -16.1 -15.0 -16.65 -15.0 -17.25 -15.45 -17.65 M-13.4 -20.8 Q-13.95 -20.8 -14.4 -20.4 -14.8 -19.95 -14.8 -19.4 -14.8 -18.8 -14.4 -18.4 -13.95 -17.95 -13.4 -17.95 -12.8 -17.95 -12.4 -18.4 -11.95 -18.8 -11.95 -19.4 -11.95 -19.95 -12.4 -20.4 -12.8 -20.8 -13.4 -20.8 M-9.3 -20.45 Q-8.7 -20.45 -8.3 -20.85 -7.85 -21.3 -7.85 -21.85 -7.85 -22.45 -8.3 -22.85 -8.7 -23.3 -9.3 -23.3 L-10.3 -22.85 Q-10.7 -22.45 -10.7 -21.85 -10.7 -21.3 -10.3 -20.85 -9.85 -20.45 -9.3 -20.45 M-3.4 -23.3 Q-3.4 -23.85 -3.8 -24.3 -4.25 -24.7 -4.8 -24.7 -5.4 -24.7 -5.8 -24.3 L-6.25 -23.3 Q-6.25 -22.7 -5.8 -22.3 -5.4 -21.85 -4.8 -21.85 -4.25 -21.85 -3.8 -22.3 -3.4 -22.7 -3.4 -23.3 M-23.4 -2.25 L-24.4 -1.8 Q-24.8 -1.4 -24.8 -0.8 -24.8 -0.25 -24.4 0.2 -23.95 0.6 -23.4 0.6 -22.8 0.6 -22.4 0.2 -21.95 -0.25 -21.95 -0.8 -21.95 -1.4 -22.4 -1.8 -22.8 -2.25 -23.4 -2.25 M-22.8 -6.95 Q-23.4 -6.95 -23.8 -6.5 -24.25 -6.1 -24.25 -5.5 -24.25 -4.95 -23.8 -4.5 -23.4 -4.1 -22.8 -4.1 -22.25 -4.1 -21.8 -4.5 -21.4 -4.95 -21.4 -5.5 -21.4 -6.1 -21.8 -6.5 -22.25 -6.95 -22.8 -6.95 M-22.65 -10.05 Q-22.65 -9.5 -22.25 -9.05 -21.8 -8.6 -21.25 -8.6 -20.65 -8.6 -20.25 -9.05 -19.8 -9.5 -19.8 -10.05 -19.8 -10.6 -20.25 -11.05 -20.65 -11.5 -21.25 -11.5 -21.8 -11.5 -22.25 -11.05 -22.65 -10.6 -22.65 -10.05 M-28.8 4.9 L-26.85 0.1 Q-28.1 -2.45 -28.85 -5.05 -29.85 -2.65 -29.75 0.1 -29.8 2.65 -28.8 4.9 M-21.8 7.3 Q-22.4 7.3 -22.8 7.7 -23.25 8.15 -23.25 8.7 -23.25 9.3 -22.8 9.7 -22.4 10.15 -21.8 10.15 L-20.8 9.7 Q-20.4 9.3 -20.4 8.7 -20.4 8.15 -20.8 7.7 -21.25 7.3 -21.8 7.3" fill="#000000" fill-rule="evenodd" stroke="none"/>
  </g>
</svg>
