<?xml version="1.0" encoding="UTF-8" standalone="no"?>
<svg xmlns:xlink="http://www.w3.org/1999/xlink" height="101.45px" width="101.45px" xmlns="http://www.w3.org/2000/svg">
  <g transform="matrix(1.0, 0.0, 0.0, 1.0, 50.75, 50.7)">
    <path d="M27.2 -37.45 L31.25 -34.05 31.45 -33.9 32.7 -32.7 34.15 -31.2 35.05 -30.15 38.3 -26.05 Q40.55 -22.8 42.15 -19.3 L43.7 -15.6 Q45.95 -9.25 46.2 -2.0 L46.25 0.0 46.25 0.05 46.2 2.1 46.2 2.65 Q45.8 9.8 43.5 16.15 L41.9 19.9 38.75 25.4 Q36.7 28.4 34.1 31.25 L32.75 32.65 32.7 32.65 31.15 34.15 28.85 36.15 Q24.6 39.6 19.9 41.9 L19.35 42.2 15.6 43.7 15.05 43.9 Q8.9 45.95 2.05 46.2 L0.05 46.25 -2.05 46.2 -4.8 46.05 Q-10.75 45.45 -16.05 43.5 L-19.85 41.9 -20.1 41.75 -21.6 41.0 -27.05 37.55 -31.05 34.2 -31.1 34.15 -32.65 32.65 -34.05 31.2 -34.7 30.45 -38.2 26.1 Q-40.45 22.9 -42.05 19.4 L-43.45 16.05 -43.6 15.65 Q-45.9 9.25 -46.15 2.1 L-46.2 0.05 -46.2 0.0 -46.15 -2.05 -46.1 -2.85 Q-45.75 -9.85 -43.45 -16.05 L-41.85 -19.85 Q-40.45 -22.8 -38.55 -25.55 -36.6 -28.45 -34.15 -31.15 L-32.65 -32.7 -32.6 -32.7 -31.2 -34.05 -28.7 -36.2 Q-24.4 -39.7 -19.55 -42.0 L-19.4 -42.05 -15.65 -43.6 -14.7 -43.9 Q-8.7 -45.9 -2.05 -46.15 L0.05 -46.2 2.1 -46.15 4.75 -46.0 Q10.7 -45.45 16.15 -43.45 L19.9 -41.9 20.1 -41.8 Q23.2 -40.3 26.15 -38.25 L27.2 -37.45 M25.7 -25.75 L25.05 -26.4 24.8 -26.65 23.25 -28.0 21.45 -29.45 Q19.4 -31.0 17.25 -32.15 L15.85 -32.9 15.0 -33.3 13.3 -34.0 10.95 -34.8 Q7.45 -35.9 3.7 -36.2 L3.4 -36.25 1.0 -36.4 0.0 -36.4 -1.0 -36.4 -3.4 -36.25 Q-7.15 -35.95 -10.6 -34.9 L-11.55 -34.6 -12.9 -34.15 -14.7 -33.4 -15.4 -33.1 -16.9 -32.35 Q-19.35 -31.05 -21.6 -29.35 L-22.6 -28.55 -23.25 -28.05 -25.0 -26.45 -25.7 -25.8 -25.75 -25.75 -26.45 -25.0 -28.1 -23.2 -30.4 -20.15 -32.2 -17.25 -33.3 -14.95 -34.05 -13.2 -34.8 -10.95 Q-35.95 -7.35 -36.25 -3.4 L-36.35 -2.25 -36.4 -0.95 -36.4 0.0 -36.4 0.05 -36.35 1.1 -36.25 3.4 Q-35.95 7.15 -34.9 10.6 L-34.2 12.7 -34.15 12.9 -33.4 14.7 -32.35 16.95 -30.1 20.6 -28.05 23.25 -27.35 24.05 -26.45 25.05 -25.75 25.75 -25.0 26.5 -24.45 27.0 -23.2 28.1 -21.6 29.4 -21.3 29.6 -17.25 32.2 -15.85 32.95 -15.0 33.35 -13.3 34.05 -10.95 34.9 Q-7.55 35.9 -3.8 36.3 L-3.4 36.3 -0.95 36.45 0.0 36.45 1.0 36.45 3.4 36.35 Q7.1 36.0 10.55 35.0 L11.9 34.6 12.95 34.2 14.6 33.5 15.7 33.0 16.9 32.4 Q19.95 30.75 22.75 28.5 L23.2 28.1 25.0 26.45 25.7 25.75 25.8 25.7 26.4 25.05 28.05 23.25 30.55 20.0 32.2 17.25 33.3 15.05 34.0 13.4 34.85 10.95 Q35.95 7.35 36.3 3.4 L36.4 2.05 36.45 1.05 36.45 0.05 36.45 0.0 36.45 -0.9 36.3 -3.4 Q36.0 -7.15 35.0 -10.55 L34.45 -12.25 34.2 -12.9 33.5 -14.6 32.4 -16.85 30.15 -20.5 28.1 -23.2 27.65 -23.7 26.45 -25.0 25.7 -25.75" fill="#4a5a71" fill-rule="evenodd" stroke="none"/>
    <path d="M0.5 -50.5 Q1.25 -49.75 2.0 -46.6 L2.1 -46.15 0.05 -46.2 -2.05 -46.15 -1.95 -46.6 -1.55 -48.2 Q-0.8 -50.7 0.0 -50.7 L0.5 -50.5 M46.85 -19.05 L46.85 -18.55 Q46.45 -17.55 43.7 -15.6 L42.15 -19.3 44.0 -19.55 Q46.55 -19.85 46.85 -19.05 M34.3 -23.35 L36.3 -24.7 Q39.55 -20.05 41.4 -14.8 L39.15 -13.95 Q37.4 -18.95 34.3 -23.35 L32.3 -21.95 29.6 -25.45 27.6 -27.6 26.55 -28.6 22.95 -31.6 24.4 -33.55 Q21.3 -35.85 18.0 -37.45 L16.25 -38.25 Q10.6 -40.65 4.25 -41.2 L4.0 -38.75 0.05 -38.95 -7.65 -38.25 -12.35 -37.05 -16.5 -35.4 -18.55 -39.8 -21.6 -38.2 Q-24.5 -36.55 -27.2 -34.35 L-24.2 -30.55 -27.5 -27.6 -29.2 -29.3 -29.25 -29.3 Q-32.3 -26.25 -34.55 -22.9 L-36.55 -24.2 Q-34.15 -27.8 -30.95 -31.0 L-30.9 -31.0 -32.6 -32.7 -32.65 -32.7 -34.15 -31.15 -35.25 -32.9 Q-36.5 -35.25 -35.9 -35.85 L-35.4 -36.05 Q-34.2 -36.0 -31.2 -34.05 L-28.7 -36.2 Q-24.4 -39.7 -19.55 -42.0 L-19.4 -42.05 -19.7 -43.95 Q-19.9 -45.95 -19.45 -46.6 L-19.15 -46.9 -18.65 -46.9 -18.15 -46.6 Q-17.2 -45.85 -15.65 -43.6 L-14.7 -43.9 -13.9 -41.65 Q-7.4 -43.8 0.05 -43.8 L4.5 -43.6 4.75 -46.0 Q10.7 -45.45 16.15 -43.45 L17.2 -44.95 Q18.35 -46.3 19.05 -46.6 L19.65 -46.65 19.75 -46.6 20.0 -46.3 Q20.45 -45.25 19.9 -41.9 L20.1 -41.8 19.05 -39.6 21.65 -38.25 25.8 -35.5 27.2 -37.45 31.25 -34.05 33.0 -35.15 Q35.25 -36.4 35.85 -35.8 L36.05 -35.3 Q36.05 -34.15 34.15 -31.2 L33.85 -31.5 35.05 -30.15 38.3 -26.05 36.3 -24.7 33.25 -28.6 31.0 -31.0 29.8 -32.15 28.2 -30.35 29.3 -29.3 31.45 -27.0 34.3 -23.35 M36.85 -13.1 L39.15 -13.95 Q41.45 -7.45 41.45 0.0 L41.45 0.05 41.4 2.35 38.95 2.2 Q38.45 12.85 32.7 21.4 30.55 24.6 27.65 27.55 L25.8 25.7 Q28.5 22.95 30.55 20.0 35.9 12.0 36.4 2.05 L36.45 0.05 39.0 0.05 39.0 0.0 Q39.0 -7.0 36.85 -13.1 M48.2 -1.55 Q50.7 -0.8 50.7 0.0 L50.5 0.5 Q49.7 1.3 46.2 2.1 L46.25 0.05 46.25 0.0 46.2 -2.0 48.2 -1.55 M41.4 2.35 L43.8 2.5 Q43.2 14.5 36.75 24.05 L38.75 25.4 Q36.7 28.4 34.1 31.25 L35.2 33.05 Q36.45 35.3 35.85 35.9 L35.35 36.1 Q34.2 36.1 31.15 34.15 L28.85 36.15 27.35 34.3 Q23.35 37.55 18.9 39.75 L14.25 41.6 Q7.6 43.85 0.05 43.85 L-4.55 43.65 Q-12.35 42.9 -19.05 39.6 L-21.6 38.25 -25.6 35.6 -24.2 33.65 -27.8 30.65 -29.4 32.45 -30.95 30.95 -32.9 28.9 -34.7 30.45 -38.2 26.1 -36.2 24.75 Q-39.35 20.25 -41.2 15.25 L-38.95 14.4 Q-41.4 7.75 -41.4 0.05 L-46.2 0.05 -46.15 2.1 -48.2 1.6 Q-50.75 0.85 -50.75 0.0 L-50.55 -0.5 Q-49.7 -1.3 -46.15 -2.05 L-46.1 -2.85 Q-45.75 -9.85 -43.45 -16.05 L-44.95 -17.2 Q-47.05 -18.85 -46.7 -19.65 L-46.35 -20.05 -41.85 -19.85 Q-40.45 -22.8 -38.55 -25.55 L-36.55 -24.2 Q-43.05 -14.65 -43.7 -2.7 L-38.85 -2.4 Q-38.3 -13.05 -32.5 -21.55 -30.4 -24.75 -27.55 -27.6 L-27.5 -27.6 -25.7 -25.8 -25.75 -25.75 Q-28.4 -23.1 -30.4 -20.15 -35.8 -12.2 -36.35 -2.25 L-36.4 0.0 -36.4 0.05 -38.95 0.05 Q-38.95 7.3 -36.65 13.6 L-38.95 14.4 Q-37.2 19.15 -34.2 23.4 L-36.2 24.75 -32.9 28.9 -31.1 27.3 -29.25 29.25 -27.8 30.65 -26.15 28.9 -22.8 31.65 -24.2 33.65 -21.6 35.45 -18.05 37.45 -16.95 35.2 Q-11.0 38.15 -4.05 38.8 L-3.8 36.3 0.0 36.45 Q6.35 36.45 11.9 34.6 13.85 33.9 15.7 33.0 L16.8 35.35 Q20.8 33.4 24.35 30.5 L27.6 27.55 27.65 27.55 31.05 30.95 Q34.3 27.65 36.75 24.05 L34.75 22.75 Q40.85 13.7 41.4 2.35 M46.65 19.65 L46.3 20.0 41.9 19.9 43.5 16.15 44.95 17.2 Q46.95 18.9 46.65 19.65 M12.7 37.0 Q6.8 39.0 0.05 39.0 L-4.05 38.8 -4.3 41.25 0.05 41.45 Q7.2 41.45 13.5 39.35 L17.85 37.55 16.8 35.35 12.7 37.0 M2.05 46.2 L1.6 48.2 Q0.85 50.75 0.0 50.75 -0.25 50.75 -0.5 50.55 -1.3 49.7 -2.05 46.2 L0.05 46.25 2.05 46.2 M18.55 46.95 Q17.5 46.55 15.6 43.7 L19.35 42.2 19.6 44.05 Q19.9 46.6 19.1 46.95 L18.55 46.95 M-35.9 35.95 L-36.1 35.45 Q-36.05 34.25 -34.05 31.2 L-32.65 32.65 -31.1 34.15 -32.95 35.3 Q-35.3 36.55 -35.9 35.95 M-19.65 46.7 L-20.05 46.35 Q-20.45 45.3 -19.85 41.9 L-16.05 43.5 -17.2 44.95 Q-18.85 47.05 -19.65 46.7 M-43.45 16.05 L-42.05 19.4 -44.0 19.75 Q-46.65 20.0 -47.0 19.2 L-47.0 18.65 Q-46.5 17.6 -43.6 15.65 L-43.45 16.05" fill="#a8b5c6" fill-rule="evenodd" stroke="none"/>
  </g>
</svg>
