<?xml version="1.0" encoding="UTF-8" standalone="no"?>
<svg xmlns:xlink="http://www.w3.org/1999/xlink" height="59.9px" width="63.4px" xmlns="http://www.w3.org/2000/svg">
  <g transform="matrix(1.0, 0.0, 0.0, 1.0, 31.6, 28.2)">
    <path d="M-31.2 -4.8 Q-29.3 -17.7 -18.7 -25.5 L-14.35 -28.2 -17.8 -26.0 Q-28.05 -18.45 -30.2 -5.65 -32.0 6.95 -24.6 17.05 -17.15 27.15 -4.85 28.8 8.05 30.6 18.3 23.05 28.55 15.5 30.7 2.65 31.95 -4.75 29.75 -11.35 32.7 -3.8 31.4 4.8 29.5 17.7 18.9 25.5 8.3 33.3 -4.7 31.3 -17.6 29.4 -25.4 18.8 -33.2 8.2 -31.2 -4.8" fill="#000000" fill-rule="evenodd" stroke="none"/>
  </g>
</svg>
