<?xml version="1.0" encoding="UTF-8" standalone="no"?>
<svg xmlns:xlink="http://www.w3.org/1999/xlink" height="37.7px" width="54.3px" xmlns="http://www.w3.org/2000/svg">
  <g transform="matrix(1.0, 0.0, 0.0, 1.0, 27.6, 43.55)">
    <path d="M26.7 -27.45 Q26.1 -19.1 24.0 -19.1 22.9 -19.1 22.25 -20.65 L21.35 -22.8 20.5 -23.2 Q19.75 -23.6 19.5 -24.15 L19.4 -25.8 19.3 -25.5 18.75 -25.35 Q18.2 -25.35 16.0 -27.5 13.75 -29.7 13.4 -29.7 L8.9 -26.25 4.75 -23.25 4.65 -23.25 -2.25 -20.0 -8.8 -23.5 -17.1 -27.8 Q-18.0 -27.8 -21.8 -22.5 L-20.4 -20.95 Q-19.05 -19.6 -19.05 -18.7 L-19.15 -18.2 -19.25 -18.0 -19.5 -17.9 -20.15 -17.85 Q-20.75 -17.85 -21.75 -18.3 L-22.2 -18.05 Q-21.8 -16.25 -21.65 -13.35 L-21.45 -8.1 -21.45 -6.2 -21.5 -6.0 Q-21.65 -5.85 -22.1 -5.85 -23.05 -5.85 -23.25 -8.7 L-23.4 -12.5 -23.9 -15.8 -24.15 -17.55 Q-25.95 -17.6 -26.95 -21.85 -27.45 -24.0 -27.6 -26.25 -27.6 -31.45 -20.9 -35.7 -15.1 -39.4 -3.35 -42.95 1.75 -44.5 9.35 -42.05 16.1 -39.9 18.75 -37.05 L22.45 -35.05 Q24.8 -33.8 25.5 -32.55 26.05 -31.6 26.4 -30.0 L26.7 -27.45 M-24.2 -20.05 L-24.3 -19.95 -24.25 -19.85 -24.2 -20.05" fill="#000000" fill-opacity="0.16470589" fill-rule="evenodd" stroke="none"/>
  </g>
</svg>
