<?xml version="1.0" encoding="UTF-8" standalone="no"?>
<svg xmlns:xlink="http://www.w3.org/1999/xlink" height="80.05px" width="79.85px" xmlns="http://www.w3.org/2000/svg">
  <g transform="matrix(1.0, 0.0, 0.0, 1.0, 39.9, 40.0)">
    <path d="M21.55 -28.95 Q19.35 -30.55 17.2 -31.8 L17.15 -31.85 Q17.05 -31.85 17.05 -31.9 L17.0 -31.9 16.85 -32.0 16.7 -32.05 16.7 -32.1 16.45 -32.25 16.4 -32.25 16.3 -32.3 16.25 -32.3 14.6 -33.1 14.5 -33.1 13.65 -33.2 13.5 -33.2 12.9 -32.85 12.45 -32.15 12.05 -30.65 Q11.85 -30.15 12.1 -29.6 12.35 -29.1 12.85 -28.9 L12.95 -28.85 14.45 -28.15 14.5 -28.1 14.6 -28.05 14.65 -28.05 14.85 -27.9 14.9 -27.85 18.9 -25.25 18.95 -25.25 19.25 -25.05 Q19.65 -24.7 20.25 -24.75 20.8 -24.8 21.2 -25.2 L21.3 -25.25 22.3 -26.3 22.65 -27.0 22.65 -26.9 22.7 -27.05 22.65 -27.85 22.65 -27.9 22.6 -27.9 22.15 -28.5 21.65 -28.85 21.6 -28.9 21.55 -28.9 21.55 -28.95 M3.1 -25.85 Q6.8 -24.55 9.75 -20.0 11.8 -19.0 13.65 -17.5 L18.7 -22.6 Q11.95 -28.4 3.1 -29.25 L3.1 -25.85 M6.75 -13.65 L3.1 -14.8 0.05 -15.1 -2.5 -14.9 Q-4.7 -14.55 -6.65 -13.55 L-8.2 -12.65 -10.65 -10.65 -12.2 -8.9 Q-14.1 -6.35 -14.75 -3.2 L-14.75 -3.05 -15.1 0.05 -14.9 2.5 -14.75 3.45 Q-14.15 6.25 -12.5 8.6 L-10.65 10.8 -8.6 12.55 -6.7 13.7 Q-4.75 14.7 -2.5 15.05 L0.05 15.25 3.1 15.0 Q5.05 14.6 6.8 13.75 L9.05 12.35 10.8 10.8 12.8 8.35 Q14.3 6.1 14.9 3.45 L15.1 2.5 15.25 0.05 14.95 -3.05 14.9 -3.25 Q14.3 -6.2 12.55 -8.6 L10.8 -10.65 8.65 -12.5 6.75 -13.65 M8.0 -7.8 Q9.0 -6.8 9.3 -5.4 L9.4 -4.9 9.4 -3.05 9.15 -2.05 8.55 0.05 9.15 2.05 9.3 2.5 Q9.55 3.8 9.4 4.9 L9.4 4.95 Q9.15 6.65 7.95 7.9 7.05 8.75 5.85 9.15 L4.95 9.35 3.1 9.25 2.25 9.05 0.1 8.45 -1.95 9.05 -2.5 9.2 -4.7 9.35 -5.3 9.25 Q-6.7 8.85 -7.65 7.9 -8.85 6.75 -9.05 5.2 L-9.1 4.9 -9.05 2.5 -8.95 2.05 -8.2 0.05 -8.95 -2.05 -9.15 -3.05 -9.1 -4.9 -8.95 -5.65 Q-8.65 -6.9 -7.7 -7.8 -6.5 -9.05 -4.8 -9.25 L-4.75 -9.25 -2.5 -9.15 -1.95 -9.05 0.1 -8.4 2.25 -9.05 3.1 -9.2 5.05 -9.25 5.35 -9.2 Q6.85 -8.95 8.0 -7.8 M2.4 -3.6 L1.55 -4.6 Q0.9 -5.15 0.1 -5.05 -0.65 -5.15 -1.25 -4.65 L-2.15 -3.6 -2.6 -2.7 -3.5 -2.3 -4.5 -1.4 Q-5.0 -0.8 -5.0 0.05 -5.0 0.8 -4.5 1.5 L-3.5 2.3 -2.6 2.85 -2.1 3.7 -1.35 4.7 Q-0.6 5.2 0.1 5.2 0.95 5.2 1.55 4.7 L2.45 3.7 2.95 2.85 3.8 2.35 4.85 1.45 Q5.3 0.85 5.3 0.1 L4.85 -1.35 3.8 -2.25 2.95 -2.7 2.4 -3.6 M31.65 -13.85 L30.3 -13.1 Q29.8 -12.85 29.6 -12.3 29.4 -11.8 29.55 -11.25 L30.1 -9.75 30.1 -9.6 30.25 -9.15 30.3 -9.05 Q30.95 -6.9 31.2 -4.6 L31.2 -4.5 31.2 -4.45 31.25 -4.05 31.3 -3.95 Q31.4 -3.45 31.8 -3.05 L31.85 -3.0 32.0 -2.95 32.35 -2.75 32.8 -2.7 34.3 -2.7 35.05 -2.9 35.1 -2.9 35.6 -3.45 35.65 -3.55 35.8 -4.35 35.7 -5.05 Q35.4 -7.85 34.7 -10.25 L34.65 -10.4 34.6 -10.55 34.55 -10.6 34.55 -10.65 34.5 -10.75 34.45 -10.9 34.45 -11.1 33.8 -13.0 33.75 -13.1 33.25 -13.75 33.15 -13.8 32.5 -14.05 32.45 -14.05 31.65 -13.85 M29.15 -3.05 Q28.35 -11.9 22.6 -18.7 L17.5 -13.6 Q21.2 -8.95 21.95 -3.05 L29.15 -3.05 M27.25 -27.2 Q38.45 -15.95 38.45 0.0 38.45 15.95 27.25 27.25 16.0 38.55 0.05 38.55 -15.9 38.55 -27.1 27.25 -38.4 15.95 -38.4 0.0 -38.4 -15.95 -27.1 -27.2 -15.9 -38.5 0.05 -38.5 16.0 -38.5 27.25 -27.2 M29.55 12.25 L28.95 12.85 28.9 12.95 28.25 14.2 28.2 14.25 28.05 14.65 27.95 14.85 27.95 14.9 27.95 14.95 27.9 14.95 27.9 15.0 25.4 19.05 25.3 19.1 25.1 19.3 Q24.75 19.7 24.8 20.3 L25.2 21.3 25.25 21.35 25.3 21.45 26.3 22.4 26.3 22.35 Q26.55 22.65 27.0 22.75 L26.9 22.75 27.05 22.75 27.85 22.7 28.5 22.25 28.5 22.2 28.85 21.8 28.9 21.75 28.95 21.7 28.95 21.75 28.95 21.7 28.95 21.65 29.0 21.65 31.95 16.95 31.95 16.9 32.0 16.85 32.0 16.8 32.1 16.55 32.15 16.5 33.1 14.65 33.1 14.6 33.1 14.55 33.25 13.8 33.2 13.75 32.9 13.05 32.85 13.0 32.15 12.55 30.65 12.15 29.65 12.2 29.55 12.25 M22.05 2.5 Q21.4 8.5 17.8 13.3 L22.85 18.4 Q28.5 11.45 29.2 2.5 L22.05 2.5 M14.0 17.3 Q12.0 18.9 9.8 20.0 6.8 24.55 3.1 25.85 L3.1 29.2 Q12.15 28.35 19.05 22.35 L14.0 17.3 M11.35 29.65 L9.85 30.2 9.7 30.2 9.5 30.25 4.65 31.3 4.5 31.3 4.45 31.3 Q3.85 31.3 3.4 31.75 2.95 32.2 2.95 32.8 L2.95 34.3 3.2 35.05 3.25 35.15 3.8 35.65 3.85 35.65 4.65 35.8 4.7 35.8 5.3 35.7 5.35 35.7 10.65 34.55 10.8 34.5 11.3 34.45 11.35 34.4 13.2 33.7 13.3 33.7 13.85 33.2 13.85 33.15 14.15 32.45 14.15 32.4 14.0 31.7 13.95 31.6 13.25 30.3 13.2 30.2 Q12.9 29.75 12.4 29.6 L12.35 29.55 11.35 29.6 11.35 29.65 M-11.15 -34.4 L-11.2 -34.35 -13.4 -33.5 -13.95 -33.05 -14.0 -32.95 -14.3 -32.2 -14.1 -31.4 -13.35 -30.05 -12.55 -29.35 Q-12.0 -29.15 -11.45 -29.35 L-9.7 -30.1 -9.55 -30.1 -9.3 -30.15 -9.2 -30.2 -4.55 -31.2 -4.2 -31.2 Q-3.65 -31.25 -3.2 -31.6 L-3.15 -31.7 Q-2.75 -32.15 -2.75 -32.7 L-2.75 -34.25 -2.95 -35.0 -3.55 -35.55 -3.7 -35.65 -4.35 -35.75 -4.95 -35.65 -5.1 -35.65 -10.65 -34.5 -10.75 -34.5 -11.15 -34.4 M-2.5 -29.3 Q-11.5 -28.6 -18.35 -22.85 L-13.25 -17.7 -9.7 -19.9 Q-6.55 -24.85 -2.5 -26.0 L-2.5 -29.3 M-25.1 -19.1 Q-24.75 -19.55 -24.75 -20.1 -24.8 -20.7 -25.2 -21.05 L-26.25 -22.1 -26.3 -22.1 Q-26.55 -22.4 -26.85 -22.5 L-26.95 -22.5 -27.75 -22.5 -27.85 -22.45 -28.45 -22.05 -28.55 -21.95 -28.7 -21.9 -28.8 -21.85 -28.8 -21.7 -28.85 -21.6 -29.0 -21.4 -29.05 -21.3 -29.0 -21.35 Q-30.75 -19.1 -31.8 -16.8 L-31.9 -16.65 -32.05 -16.5 -32.1 -16.4 -33.15 -14.25 -33.25 -13.55 -33.25 -13.4 -32.95 -12.7 -32.9 -12.65 -32.2 -12.25 -30.75 -11.8 Q-30.25 -11.65 -29.75 -11.8 L-29.7 -11.85 Q-29.15 -12.1 -28.9 -12.6 L-28.3 -13.95 -28.25 -14.05 -28.15 -14.3 -28.05 -14.5 -27.8 -14.75 -27.8 -14.85 Q-26.95 -16.7 -25.55 -18.45 L-25.45 -18.6 -25.4 -18.7 -25.35 -18.75 -25.2 -18.95 -25.1 -19.1 M-21.85 -3.05 Q-21.1 -9.1 -17.15 -13.85 L-22.3 -19.0 Q-28.3 -12.1 -29.15 -3.05 L-21.85 -3.05 M-18.7 22.6 Q-11.7 28.55 -2.5 29.25 L-2.5 26.0 Q-6.6 24.85 -9.75 19.9 L-13.55 17.5 -18.7 22.6 M-30.0 10.0 L-30.05 9.9 -30.1 9.55 -31.15 4.85 -31.2 4.35 -31.2 4.3 Q-31.3 3.75 -31.75 3.4 L-31.8 3.3 Q-32.2 3.0 -32.7 3.0 L-34.2 3.0 -35.0 3.25 -35.55 3.85 -35.7 4.65 -35.6 5.5 -35.6 5.65 -35.55 5.75 -34.45 10.95 -34.45 10.9 -34.4 11.0 -34.4 11.05 -34.3 11.2 -34.3 11.25 -34.25 11.4 -34.25 11.5 -33.55 13.4 -33.05 14.05 -33.0 14.1 -32.25 14.3 -31.55 14.2 -31.45 14.15 -30.15 13.4 -29.45 12.65 -29.45 12.6 -29.4 11.7 -29.5 11.55 -30.0 10.0 M-29.2 2.5 Q-28.5 11.7 -22.6 18.7 L-17.45 13.55 Q-21.3 8.65 -21.9 2.5 L-29.2 2.5 M-22.5 27.05 L-22.45 27.9 -21.95 28.55 -21.25 29.1 -16.85 32.05 -16.3 32.25 -16.15 32.3 -14.45 33.15 -14.35 33.2 -13.5 33.25 -13.35 33.25 -12.75 32.95 -12.7 32.9 -12.3 32.25 -12.3 32.2 -11.9 30.85 Q-11.75 30.3 -12.0 29.8 L-12.0 29.7 -12.65 29.1 -12.7 29.1 -14.05 28.35 -14.15 28.3 -14.55 28.2 -14.75 28.1 -18.55 25.55 -18.65 25.45 -19.15 25.1 -19.2 25.1 Q-19.65 24.8 -20.15 24.85 -20.6 24.9 -20.95 25.2 L-21.05 25.3 -22.05 26.35 -22.15 26.4 -22.45 26.95 -22.5 27.05" fill="#000000" fill-rule="evenodd" stroke="none"/>
    <path d="M-14.05 36.0 Q-13.85 35.4 -13.3 35.15 L-12.15 35.1 -6.55 36.55 Q-5.95 36.6 -5.55 37.15 -5.2 37.65 -5.3 38.25 -5.4 38.85 -5.9 39.25 L-7.05 39.5 -13.15 37.95 -14.0 37.15 -14.05 36.0 M-23.35 29.3 Q-22.75 29.2 -22.2 29.55 L-17.4 32.75 Q-16.9 33.05 -16.7 33.65 -16.55 34.25 -16.85 34.8 -17.15 35.3 -17.75 35.5 L-18.85 35.35 Q-21.6 33.85 -24.05 31.95 -24.55 31.55 -24.6 30.95 -24.7 30.35 -24.3 29.85 -23.95 29.35 -23.35 29.3 M-32.35 20.9 Q-31.9 20.55 -31.25 20.65 -30.65 20.7 -30.3 21.2 L-26.4 25.85 Q-26.0 26.25 -26.0 26.9 -26.0 27.5 -26.45 27.95 -26.9 28.35 -27.5 28.35 -28.15 28.35 -28.55 27.9 L-32.7 23.0 -32.95 21.9 Q-32.9 21.25 -32.35 20.9 M-38.25 11.75 Q-38.4 11.15 -38.1 10.6 -37.8 10.05 -37.2 9.85 L-36.05 10.0 Q-35.55 10.3 -35.35 10.9 -34.55 13.65 -33.25 16.25 -33.0 16.8 -33.15 17.4 L-33.9 18.25 -35.05 18.35 -35.95 17.6 Q-37.35 14.75 -38.25 11.75 M-37.35 -1.55 Q-36.9 -1.1 -36.9 -0.5 L-36.9 0.0 Q-36.9 2.7 -36.55 5.25 -36.5 5.85 -36.85 6.35 -37.25 6.85 -37.85 6.95 -38.45 7.0 -38.95 6.65 -39.45 6.25 -39.5 5.65 -39.9 2.9 -39.9 0.0 L-39.9 -0.5 -39.45 -1.55 Q-39.0 -2.0 -38.4 -2.0 -37.8 -2.0 -37.35 -1.55 M-37.95 -12.6 Q-37.8 -13.2 -37.2 -13.45 L-36.1 -13.55 Q-35.5 -13.4 -35.2 -12.8 -34.95 -12.3 -35.1 -11.7 -36.0 -9.0 -36.4 -6.15 -36.5 -5.55 -37.0 -5.2 -37.5 -4.85 -38.1 -4.9 L-39.1 -5.5 Q-39.45 -6.0 -39.35 -6.6 -38.9 -9.7 -37.95 -12.6 M-30.1 -23.95 Q-29.6 -23.55 -29.5 -22.95 -29.45 -22.35 -29.8 -21.85 -31.55 -19.55 -32.85 -17.05 L-33.75 -16.3 -34.9 -16.4 Q-35.45 -16.75 -35.6 -17.3 -35.8 -17.9 -35.5 -18.45 -34.05 -21.15 -32.2 -23.65 -31.8 -24.15 -31.2 -24.2 L-30.1 -23.95 M-21.2 -32.15 Q-20.85 -31.7 -20.9 -31.05 -21.0 -30.45 -21.5 -30.1 -23.85 -28.35 -26.0 -26.15 -26.45 -25.7 -27.05 -25.7 -27.7 -25.7 -28.15 -26.1 -28.6 -26.55 -28.6 -27.15 -28.6 -27.8 -28.15 -28.25 L-23.3 -32.5 -22.15 -32.75 Q-21.55 -32.7 -21.2 -32.15 M-12.15 -38.15 L-11.0 -38.05 Q-10.45 -37.8 -10.25 -37.2 -10.1 -36.6 -10.35 -36.05 -10.65 -35.5 -11.25 -35.3 -14.05 -34.45 -16.6 -33.15 L-17.75 -33.05 Q-18.35 -33.25 -18.65 -33.8 -18.95 -34.4 -18.7 -34.95 L-17.95 -35.85 Q-15.15 -37.25 -12.15 -38.15 M20.85 30.8 L25.35 27.1 Q25.75 26.65 26.4 26.65 27.0 26.65 27.45 27.15 27.85 27.55 27.85 28.2 L27.4 29.25 22.6 33.25 21.45 33.5 20.5 32.9 Q20.1 32.35 20.25 31.75 20.3 31.15 20.85 30.8 M0.05 37.05 L4.8 36.75 Q5.4 36.7 5.9 37.1 6.35 37.45 6.45 38.1 6.5 38.7 6.15 39.2 5.75 39.65 5.15 39.75 L0.05 40.05 -0.85 40.05 Q-1.45 40.05 -1.9 39.6 L-2.35 38.55 Q-2.35 37.95 -1.9 37.5 -1.45 37.05 -0.85 37.05 L0.05 37.05 M10.45 35.65 Q13.2 34.85 15.85 33.6 L17.0 33.55 Q17.6 33.75 17.85 34.3 18.1 34.85 17.9 35.45 L17.15 36.3 Q14.3 37.65 11.3 38.55 L10.15 38.45 Q9.6 38.1 9.4 37.55 9.25 36.95 9.55 36.4 9.85 35.85 10.45 35.65 M28.9 23.95 Q28.85 23.3 29.25 22.85 L30.6 21.0 32.45 18.05 Q32.75 17.5 33.35 17.3 L34.5 17.45 Q35.0 17.75 35.2 18.35 L35.05 19.5 32.65 23.25 31.6 24.7 Q31.2 25.15 30.6 25.25 29.95 25.3 29.5 24.95 29.0 24.55 28.9 23.95 M36.3 7.3 Q36.4 6.65 36.9 6.35 37.4 5.95 38.05 6.1 38.65 6.2 39.0 6.7 39.35 7.2 39.25 7.85 38.65 10.95 37.65 13.9 L36.85 14.75 35.7 14.85 Q35.1 14.6 34.85 14.05 34.55 13.5 34.8 12.9 35.75 10.15 36.3 7.3 M36.75 -4.15 Q36.7 -4.75 37.1 -5.25 37.5 -5.75 38.1 -5.8 38.7 -5.85 39.2 -5.45 39.7 -5.05 39.75 -4.45 L39.95 0.0 39.9 1.75 39.85 2.05 39.4 2.8 38.3 3.15 Q37.7 3.1 37.3 2.65 L36.95 2.05 36.9 1.55 36.95 0.0 36.75 -4.15 M33.9 -15.15 Q33.6 -15.7 33.85 -16.3 34.1 -16.85 34.65 -17.1 L35.8 -17.15 36.65 -16.35 Q37.85 -13.55 38.65 -10.5 L38.5 -9.4 Q38.2 -8.85 37.6 -8.7 L36.45 -8.85 Q35.9 -9.15 35.75 -9.75 35.05 -12.55 33.9 -15.15 M0.1 -40.0 L2.4 -39.95 Q3.0 -39.9 3.4 -39.45 3.8 -39.0 3.8 -38.35 3.75 -37.75 3.3 -37.35 2.85 -36.95 2.25 -36.95 L0.1 -37.0 0.0 -37.0 -5.65 -36.6 -6.75 -36.9 Q-7.25 -37.3 -7.3 -37.9 -7.4 -38.5 -7.05 -39.0 -6.65 -39.5 -6.05 -39.55 L0.0 -40.0 0.1 -40.0 M6.8 -37.95 Q6.9 -38.55 7.45 -38.9 L8.55 -39.1 Q11.7 -38.5 14.6 -37.35 L15.45 -36.55 Q15.7 -36.0 15.45 -35.4 15.2 -34.8 14.65 -34.55 14.1 -34.3 13.5 -34.55 L7.95 -36.15 Q7.35 -36.3 7.0 -36.8 6.65 -37.35 6.8 -37.95 M25.1 -31.15 L25.65 -30.15 Q25.7 -29.55 25.3 -29.05 24.9 -28.55 24.3 -28.5 23.7 -28.45 23.2 -28.85 L18.6 -32.1 17.9 -33.0 Q17.75 -33.65 18.1 -34.15 18.4 -34.7 19.0 -34.85 L20.15 -34.65 Q22.7 -33.1 25.1 -31.15 M27.1 -25.8 Q27.15 -26.45 27.6 -26.85 28.05 -27.25 28.7 -27.25 29.3 -27.2 29.7 -26.75 31.9 -24.4 33.6 -21.85 L33.85 -20.7 Q33.7 -20.1 33.2 -19.75 32.65 -19.4 32.05 -19.5 31.45 -19.65 31.1 -20.15 L27.5 -24.75 Q27.1 -25.2 27.1 -25.8" fill="#000000" fill-rule="evenodd" stroke="none"/>
  </g>
</svg>
