<?xml version="1.0" encoding="UTF-8" standalone="no"?>
<svg xmlns:xlink="http://www.w3.org/1999/xlink" height="20.0px" width="30.0px" xmlns="http://www.w3.org/2000/svg">
  <g transform="matrix(1.0, 0.0, 0.0, 1.0, 15.0, 2.9)">
    <path d="M0.85 -2.85 L3.9 -2.45 Q6.85 -1.75 9.2 0.05 11.1 1.55 12.05 3.25 L12.6 4.45 13.05 7.0 13.05 7.1 13.0 8.05 13.0 8.25 12.9 8.85 13.35 8.65 15.0 7.65 14.95 8.05 14.95 8.25 14.8 9.05 Q13.95 11.85 10.95 14.0 L10.6 14.25 9.85 14.75 9.7 14.8 Q6.05 16.85 1.3 17.1 L-1.35 17.1 Q-6.1 16.85 -9.65 14.85 L-9.8 14.8 -10.7 14.25 -11.0 14.05 Q-14.1 11.85 -14.8 9.05 L-14.95 8.3 -15.0 7.7 -13.45 8.65 -12.95 8.9 -13.05 8.3 -13.1 7.1 -12.8 4.65 -11.95 2.85 -11.9 2.85 -11.9 2.8 Q-11.0 1.3 -9.35 0.05 -6.75 -1.95 -3.5 -2.55 L-1.15 -2.85 -1.0 -2.85 -0.45 -2.9 -0.3 -2.9 -0.05 -2.9 0.4 -2.9 0.85 -2.85" fill="url(#gradient0)" fill-rule="evenodd" stroke="none"/>
    <path d="M11.05 12.15 L11.15 12.4 11.2 12.6 10.05 12.3 9.85 12.25 9.65 12.15 9.7 12.25 9.75 12.4 9.8 12.85 9.5 13.8 8.9 14.5 8.85 14.5 Q8.2 15.1 6.95 15.6 5.05 16.35 2.6 16.6 L0.8 16.7 0.7 16.7 0.3 16.7 0.2 16.7 0.0 16.7 -0.35 16.7 -0.7 16.7 -2.95 16.55 -6.9 15.6 -9.05 14.35 -9.5 13.9 -9.75 12.9 -9.75 12.55 -9.75 12.45 -9.65 12.25 -9.65 12.2 -9.8 12.25 -10.0 12.3 -11.25 12.65 -11.25 12.55 -11.25 12.45 -11.1 12.15 -11.0 11.95 Q-10.25 10.9 -7.95 10.15 -5.0 9.1 -1.0 9.0 L1.0 9.0 Q5.05 9.1 7.95 10.15 10.3 10.9 10.95 11.9 L11.05 12.15" fill="url(#gradient1)" fill-rule="evenodd" stroke="none"/>
    <path d="M2.2 11.15 L1.8 12.05 1.8 12.1 1.4 13.2 0.7 13.25 0.35 13.25 -0.5 13.2 -0.9 12.35 -0.75 12.25 Q0.0 11.75 1.2 11.45 L2.2 11.15" fill="#ab8080" fill-rule="evenodd" stroke="none"/>
    <path d="M-0.5 13.2 L-0.6 13.2 -1.0 12.25 -1.65 10.75 -1.5 10.5 0.15 10.5 2.4 10.35 2.45 10.5 2.2 11.15 1.2 11.45 Q0.0 11.75 -0.75 12.25 L-0.9 12.35 -0.5 13.2" fill="#9c7474" fill-rule="evenodd" stroke="none"/>
    <path d="M-2.85 13.15 Q-2.6 13.75 -1.95 14.15 -1.15 14.7 -0.05 14.75 L0.55 14.75 Q1.7 14.7 2.5 14.15 L3.35 13.1" fill="none" stroke="#000000" stroke-linecap="round" stroke-linejoin="round" stroke-width="1.0"/>
  </g>
  <defs>
    <radialGradient cx="0" cy="0" gradientTransform="matrix(0.0197, 0.0, 0.0, 0.0197, 0.25, 3.3)" gradientUnits="userSpaceOnUse" id="gradient0" r="819.2" spreadMethod="pad">
      <stop offset="0.050980392156862744" stop-color="#616161"/>
      <stop offset="0.06666666666666667" stop-color="#4d4d4d"/>
      <stop offset="1.0" stop-color="#000000"/>
    </radialGradient>
    <linearGradient gradientTransform="matrix(0.0, 0.0047, -0.0137, 0.0, 0.0, 13.05)" gradientUnits="userSpaceOnUse" id="gradient1" spreadMethod="pad" x1="-819.2" x2="819.2">
      <stop offset="0.0" stop-color="#e6e6e6"/>
      <stop offset="1.0" stop-color="#b3aba4"/>
    </linearGradient>
  </defs>
</svg>
