<?xml version="1.0" encoding="UTF-8" standalone="no"?>
<svg xmlns:xlink="http://www.w3.org/1999/xlink" height="127.9px" width="215.2px" xmlns="http://www.w3.org/2000/svg">
  <g transform="matrix(1.0, 0.0, 0.0, 1.0, 104.1, 56.65)">
    <path d="M10.05 -49.65 Q3.45 -48.6 -13.15 -41.55 -33.05 -33.05 -33.05 -27.8 -33.05 -21.6 -22.25 -18.25 -14.5 -15.8 -3.45 -15.35 L17.45 -14.15 Q27.9 -13.6 37.85 -13.65 L73.55 -12.55 111.1 -10.65 111.1 71.25 -104.1 71.25 -104.1 51.15 Q-96.75 50.85 -92.85 50.85 -68.15 50.85 -44.2 52.0 L-13.25 53.15 Q4.5 53.15 12.45 50.25 19.5 47.65 19.5 42.5 19.5 32.2 -8.25 27.75 -26.55 24.8 -52.95 24.8 -69.6 24.8 -89.55 27.15 L-104.1 29.2 -104.1 -56.65 111.1 -56.65 111.1 -47.8 103.5 -49.15 88.7 -52.05 Q80.1 -53.85 58.55 -53.85 L33.65 -52.65 Q21.3 -51.55 10.05 -49.65" fill="#000000" fill-rule="evenodd" stroke="none"/>
  </g>
</svg>
