<?xml version="1.0" encoding="UTF-8" standalone="no"?>
<svg xmlns:xlink="http://www.w3.org/1999/xlink" height="1.4px" width="3.2px" xmlns="http://www.w3.org/2000/svg">
  <g transform="matrix(1.0, 0.0, 0.0, 1.0, -13.0, 3.9)">
    <path d="M14.7 -3.6 L16.2 -3.65 Q16.2 -3.45 14.95 -2.95 L13.35 -2.5 Q13.1 -2.5 13.0 -2.65 13.25 -3.1 14.7 -3.6" fill="#ffffff" fill-rule="evenodd" stroke="none"/>
  </g>
</svg>
