{
    "_chain": [
        [
            "_ArtefactId@0",
            [
                0
            ]
        ],
        [
            "_ArtefactId@0",
            [
                1
            ]
        ],
        [
            "_ArtefactId@0",
            [
                2
            ]
        ],
        [
            "_ArtefactId@0",
            [
                3
            ]
        ],
        [
            "_ArtefactId@0",
            [
                4
            ]
        ],
        [
            "_ArtefactId@0",
            [
                5
            ]
        ],
        [
            "_ArtefactId@0",
            [
                6
            ]
        ],
        [
            "_ArtefactId@0",
            [
                7
            ]
        ],
        [
            "_ArtefactId@0",
            [
                24
            ]
        ],
        [
            "_ArtefactId@0",
            [
                9
            ]
        ],
        [
            "_ArtefactId@0",
            [
                26
            ]
        ],
        [
            "_ArtefactId@0",
            [
                11
            ]
        ]
    ],
    "_playCount": null,
    "_texture": "0",
    "_quest": null,
    "_userobjects": null,
    "_worldMod": null,
    "_artefacts": [
        {
            "_freq": 4500,
            "_id": [
                "_ArtefactId@1",
                [
                    2,
                    null
                ]
            ]
        },
        {
            "_freq": 500,
            "_id": [
                "_ArtefactId@1",
                [
                    2,
                    [
                        "_ArtefactId@22",
                        null
                    ]
                ]
            ]
        },
        {
            "_freq": 30,
            "_id": [
                "_ArtefactId@4",
                [
                    0
                ]
            ]
        },
        {
            "_freq": 15,
            "_id": [
                "_ArtefactId@4",
                [
                    1
                ]
            ]
        },
        {
            "_freq": 10,
            "_id": [
                "_ArtefactId@2",
                null
            ]
        },
        {
            "_freq": 35,
            "_id": [
                "_ArtefactId@19",
                null
            ]
        },
        {
            "_freq": 30,
            "_id": [
                "_ArtefactId@11",
                [
                    0
                ]
            ]
        }
    ],
    "_grid": null,
    "_mode": "Default",
    "_chainknown": 10,
    "_sound": "1;1;17",
    "_qmin": 1000000,
    "_bg": "235:0:apterr",
    "_chWeight": [
        18,
        18,
        18,
        18,
        12,
        8,
        7,
        5,
        4,
        1,
        1,
        0
    ],
    "_object": -1,
    "_music": "ap2",
    "_helps": [
        {
            "_help": "\nDétruit une ligne complète.\n",
            "_id": [
                "_ArtefactId@4",
                [
                    0
                ]
            ]
        },
        {
            "_help": "\nDétruit une colonne au choix.\n",
            "_id": [
                "_ArtefactId@4",
                [
                    1
                ]
            ]
        },
        {
            "_help": "\nFait disparaitre tous les éléments identiques à celui sur lequel elle atterrit.\n",
            "_id": [
                "_ArtefactId@2",
                null
            ]
        },
        {
            "_help": "\nRemonte une ligne au dessus du jeu. Touche espace pour choisir.\n",
            "_id": [
                "_ArtefactId@19",
                null
            ]
        },
        {
            "_help": "\nLa chaîne de transmutation est inversée.\n",
            "_id": [
                "_ArtefactId@11",
                [
                    0
                ]
            ]
        }
    ],
    "_object_url": "http://data.naturalchimie.com/swf/objectMc.swf?v=20",
    "_spirit": 0,
    "_pnj_url": "http://data.naturalchimie.com/swf/pnj__.swf?v=11",
    "_mod": false
}