<?xml version="1.0" encoding="UTF-8" standalone="no"?>
<svg xmlns:xlink="http://www.w3.org/1999/xlink" height="75.4px" width="39.75px" xmlns="http://www.w3.org/2000/svg">
  <g transform="matrix(1.0, 0.0, 0.0, 1.0, 22.4, 6.35)">
    <path d="M1.85 -1.6 L1.75 -2.15 1.95 -4.4 Q2.15 -5.75 2.55 -6.35 3.55 -3.95 5.3 -3.5 7.45 -2.7 11.15 -2.85 L17.25 -2.9 17.35 -2.4 Q17.35 -0.5 10.9 -0.5 L5.35 -1.0 4.35 -1.6 3.15 -2.5 2.6 -1.55 2.25 -1.5 1.85 -1.6 M0.7 3.7 L-10.25 4.5 Q-12.65 4.5 -14.9 2.85 L-15.3 3.0 -16.3 1.65 Q-18.25 -0.25 -18.25 -1.15 L-18.2 -1.5 -18.35 -2.15 -18.0 -2.9 -17.75 -3.25 -17.5 -2.75 Q-15.35 1.05 -11.0 1.75 -8.8 2.5 -6.4 2.65 -1.65 2.95 -0.85 1.5 L1.35 1.05 Q2.55 1.05 2.55 2.15 2.55 3.15 0.7 3.7" fill="#000000" fill-opacity="0.17254902" fill-rule="evenodd" stroke="none"/>
    <path d="M5.6 12.0 Q2.25 11.85 -0.65 9.75 L0.75 6.5 Q2.85 8.2 6.65 8.45 L7.95 8.5 10.1 8.4 9.6 9.45 6.85 9.75 6.35 9.65 5.6 12.0 M4.55 15.4 L3.45 19.1 -1.0 18.3 -4.45 17.05 -4.45 17.0 -3.7 14.6 Q-4.95 16.4 -7.1 17.85 -9.95 19.8 -12.85 19.8 -14.7 19.8 -16.05 18.7 L-15.4 15.65 Q-17.4 13.75 -18.5 12.05 L-18.1 10.65 Q-17.05 11.9 -14.95 12.7 -12.3 13.75 -9.15 13.75 L-4.45 13.05 -3.0 12.5 -2.5 12.2 Q-1.25 13.5 0.45 14.3 2.4 15.2 4.55 15.4 M-16.85 22.65 Q-16.0 23.25 -15.05 23.25 -11.85 23.25 -8.95 21.7 -6.5 20.4 -4.85 18.35 L-5.4 20.65 Q-3.95 21.2 -2.65 21.85 L0.15 22.25 2.55 22.05 1.2 26.85 -2.15 27.25 Q-4.0 27.25 -6.35 25.85 L-6.05 23.7 -9.2 26.15 Q-12.7 28.4 -15.45 28.4 L-17.8 28.1 -16.85 22.65 M-2.95 44.0 Q-6.8 47.3 -7.55 47.3 L-8.95 46.75 -8.65 44.95 Q-12.4 49.1 -18.2 49.5 L-17.9 43.9 Q-15.2 43.8 -11.1 41.4 L-7.85 39.25 -8.05 40.8 Q-5.0 40.95 -2.15 39.35 L-2.0 39.3 -2.95 44.0 M-1.05 35.15 Q-2.65 35.8 -4.65 35.8 L-6.2 35.7 -7.3 34.8 -7.15 33.65 -10.65 36.25 Q-14.7 38.75 -17.75 38.75 L-18.0 38.75 -18.15 32.25 -16.05 32.35 Q-13.75 32.35 -9.7 29.65 L-6.65 27.45 -6.55 27.65 -6.75 29.85 -4.85 30.5 -1.65 31.1 0.15 30.55 -1.05 35.15 M-3.95 50.05 L-4.45 54.25 Q-5.1 60.3 -5.1 66.05 -6.15 67.35 -6.9 67.35 -8.1 67.35 -9.65 65.75 L-11.4 63.25 -11.7 65.2 -11.8 66.2 -12.8 68.0 Q-13.65 69.05 -15.1 69.05 -16.1 69.05 -16.8 68.1 L-17.35 67.35 -17.8 62.4 -18.3 54.25 -18.1 54.25 Q-15.8 54.2 -12.05 52.2 L-9.55 50.8 -9.55 50.85 -9.5 50.75 -9.45 50.2 -8.8 50.5 -7.3 51.0 Q-5.7 51.0 -3.95 50.05" fill="#190033" fill-rule="evenodd" stroke="none"/>
    <path d="M5.6 12.0 L6.35 9.65 6.85 9.75 9.6 9.45 8.65 11.4 6.15 12.0 5.6 12.0 M4.55 15.4 L5.4 15.4 7.0 15.15 Q6.15 17.0 5.45 18.9 L3.65 19.1 3.45 19.1 4.55 15.4 M-16.05 18.7 Q-16.9 18.0 -17.55 16.9 -18.5 15.35 -18.9 13.4 L-18.5 12.05 Q-17.4 13.75 -15.4 15.65 L-16.05 18.7 M2.55 22.05 L4.75 21.45 3.65 25.8 Q2.55 26.5 1.2 26.85 L2.55 22.05 M-17.8 28.1 Q-19.3 27.6 -20.25 26.45 L-22.0 23.15 Q-21.5 20.2 -20.25 16.9 L-18.75 20.35 Q-17.85 21.9 -16.85 22.65 L-17.8 28.1 M-2.0 39.3 Q-0.45 38.35 1.2 36.8 L0.55 40.6 0.55 40.8 -2.65 43.7 -2.95 44.0 -2.0 39.3 M-18.2 49.5 L-19.5 49.55 -20.7 49.1 -21.45 43.15 -21.1 43.35 Q-20.05 43.9 -18.15 43.9 L-17.9 43.9 -18.2 49.5 M0.15 30.55 L0.9 30.25 2.8 29.4 2.0 32.9 Q0.65 34.4 -1.05 35.15 L0.15 30.55 M-18.0 38.75 Q-20.25 38.7 -22.0 37.7 L-22.15 36.1 -22.4 30.9 -20.7 31.7 -18.15 32.25 -18.0 38.75 M-5.1 66.05 Q-5.1 60.3 -4.45 54.25 L-3.95 50.05 Q-2.35 49.15 -0.55 47.5 L-1.65 54.25 -2.65 60.1 -2.85 61.65 -3.1 63.2 -4.25 64.9 -5.1 66.05 M-18.3 54.25 L-17.8 62.4 -17.35 67.35 -17.95 66.7 -18.05 66.15 -19.95 54.25 -20.0 53.9 -18.35 54.25 -18.3 54.25" fill="#2a0059" fill-rule="evenodd" stroke="none"/>
  </g>
</svg>
