<?xml version="1.0" encoding="UTF-8" standalone="no"?>
<svg xmlns:xlink="http://www.w3.org/1999/xlink" height="30.0px" width="30.1px" xmlns="http://www.w3.org/2000/svg">
  <g transform="matrix(1.0, 0.0, 0.0, 1.0, 15.05, 15.0)">
    <path d="M15.05 15.0 L-15.05 15.0 -15.05 -15.0 15.05 -15.0 15.05 15.0" fill="#0092ff" fill-opacity="0.0" fill-rule="evenodd" stroke="none"/>
  </g>
</svg>
