<?xml version="1.0" encoding="UTF-8" standalone="no"?>
<svg xmlns:xlink="http://www.w3.org/1999/xlink" height="24.95px" width="41.9px" xmlns="http://www.w3.org/2000/svg">
  <g transform="matrix(1.0, 0.0, 0.0, 1.0, 17.7, -37.45)">
    <path d="M23.65 48.15 L23.0 52.25 22.55 54.95 Q20.9 56.3 19.8 56.3 L15.85 55.95 12.35 55.6 Q10.6 55.6 8.1 57.5 L7.05 58.4 7.1 57.8 Q5.3 59.8 2.0 61.1 -1.4 62.4 -4.85 62.4 -9.0 62.4 -11.45 60.3 -12.35 59.45 -12.95 58.0 L-13.9 55.6 -16.1 56.85 Q-16.0 54.05 -17.7 41.75 L-17.45 42.55 -17.6 40.5 Q-17.6 39.4 -16.85 38.9 -16.25 38.5 -14.75 38.3 L-4.3 37.45 4.8 37.75 12.65 38.2 23.8 39.35 24.2 43.5 23.9 46.2 23.9 46.25 23.85 46.55 23.65 48.15" fill="#000000" fill-opacity="0.17254902" fill-rule="evenodd" stroke="none"/>
  </g>
</svg>
