<?xml version="1.0" encoding="UTF-8" standalone="no"?>
<svg xmlns:xlink="http://www.w3.org/1999/xlink" height="8.4px" width="5.2px" xmlns="http://www.w3.org/2000/svg">
  <g transform="matrix(1.0, 0.0, 0.0, 1.0, 2.6, 8.4)">
    <path d="M1.9 -3.9 L1.9 -4.2 Q1.9 -5.5 1.35 -6.4 0.8 -7.3 0.0 -7.3 -0.8 -7.3 -1.35 -6.4 L-1.85 -4.8 -2.55 -4.95 Q-2.45 -6.25 -1.85 -7.2 -1.1 -8.4 0.0 -8.4 1.1 -8.4 1.85 -7.2 2.6 -5.95 2.6 -4.2 L2.6 -3.75 1.9 -3.9" fill="#a36a6a" fill-rule="evenodd" stroke="none"/>
    <path d="M-1.85 -4.8 L-1.35 -6.4 Q-0.8 -7.3 0.0 -7.3 0.8 -7.3 1.35 -6.4 1.9 -5.5 1.9 -4.2 L1.9 -3.9 0.75 -4.15 0.75 -4.2 0.55 -5.7 0.0 -6.3 -0.55 -5.7 -0.75 -4.5 -1.85 -4.8" fill="#f2eaea" fill-rule="evenodd" stroke="none"/>
    <path d="M-1.85 -4.8 L-0.75 -4.5 -0.75 -4.2 -0.55 -2.7 0.0 -2.1 0.55 -2.7 0.75 -4.15 1.9 -3.9 Q1.85 -2.8 1.35 -2.0 0.8 -1.1 0.0 -1.1 -0.8 -1.1 -1.35 -2.0 -1.9 -2.9 -1.9 -4.2 L-1.85 -4.8" fill="#ffffff" fill-rule="evenodd" stroke="none"/>
    <path d="M1.9 -3.9 L2.6 -3.75 Q2.5 -2.3 1.85 -1.25 1.1 0.0 0.0 0.0 -1.1 0.0 -1.85 -1.25 -2.6 -2.45 -2.6 -4.2 L-2.55 -4.95 -1.85 -4.8 -1.9 -4.2 Q-1.9 -2.9 -1.35 -2.0 -0.8 -1.1 0.0 -1.1 0.8 -1.1 1.35 -2.0 1.85 -2.8 1.9 -3.9" fill="#cca9a9" fill-rule="evenodd" stroke="none"/>
    <path d="M-0.75 -4.5 L-0.55 -5.7 0.0 -6.3 0.55 -5.7 0.75 -4.2 0.75 -4.15 -0.75 -4.5" fill="#5e3d3d" fill-rule="evenodd" stroke="none"/>
    <path d="M0.75 -4.15 L0.55 -2.7 0.0 -2.1 -0.55 -2.7 -0.75 -4.2 -0.75 -4.5 0.75 -4.15" fill="#8d5858" fill-rule="evenodd" stroke="none"/>
  </g>
</svg>
