<?xml version="1.0" encoding="UTF-8" standalone="no"?>
<svg xmlns:xlink="http://www.w3.org/1999/xlink" height="305.75px" width="186.3px" xmlns="http://www.w3.org/2000/svg">
  <g transform="matrix(1.0, 0.0, 0.0, 1.0, 207.55, 225.35)">
    <path d="M-184.05 21.45 L-184.05 22.1 -183.7 23.2 -184.5 27.6 -185.35 32.7 Q-180.15 41.35 -177.6 44.3 -171.35 51.45 -163.7 51.45 -151.45 51.45 -141.8 35.7 -132.15 20.0 -132.15 0.1 -132.15 -6.8 -133.25 -15.6 L-132.9 -17.2 Q-130.75 -22.1 -127.2 -20.05 -123.95 -18.2 -123.95 -15.4 -123.95 -13.7 -125.9 -7.75 -128.35 -0.25 -129.2 3.6 L-130.55 9.65 -130.8 10.6 Q-128.0 11.85 -128.0 15.95 -128.0 16.95 -128.7 19.4 -123.85 13.2 -123.85 23.95 L-123.9 25.0 Q-121.7 25.9 -121.7 28.7 -121.7 30.65 -122.85 35.9 -124.55 43.6 -127.45 50.05 L-128.8 52.85 -128.55 53.95 Q-128.55 55.9 -130.1 59.65 -132.15 64.5 -135.5 68.6 -145.3 80.4 -161.7 80.4 -171.25 80.4 -178.3 75.65 -181.4 68.5 -185.4 62.75 -189.4 56.95 -190.35 51.0 -191.3 45.0 -194.95 36.55 L-200.35 24.0 -200.4 23.35 Q-198.1 24.45 -195.05 24.45 L-192.85 24.3 -192.45 24.3 -191.1 24.25 -192.2 24.75 -190.65 24.2 -188.1 23.15 -186.8 22.6 -184.05 21.45" fill="#450f0f" fill-rule="evenodd" stroke="none"/>
    <path d="M-189.4 -16.75 Q-188.4 -16.1 -187.4 -14.6 -186.7 -12.7 -186.25 -9.9 -185.55 -5.65 -185.55 -0.15 L-185.9 -0.1 Q-188.65 0.55 -190.7 2.25 L-191.15 1.3 Q-192.7 0.8 -193.3 -1.15 L-191.65 -3.8 -191.2 -4.5 -191.5 -10.9 Q-191.5 -16.75 -189.4 -16.75 M-200.4 23.35 L-200.65 23.2 Q-203.2 21.8 -204.75 19.05 L-205.85 16.65 -206.6 15.3 -207.55 12.3 -207.55 11.7 -206.4 12.4 -204.45 13.25 -203.85 16.2 Q-203.3 18.25 -202.55 19.1 L-202.15 19.5 -201.35 19.8 Q-200.55 19.8 -200.15 18.6 L-199.9 17.0 Q-199.9 16.35 -200.45 14.35 L-201.0 12.45 -201.1 12.5 -201.1 12.25 Q-201.25 10.9 -203.05 9.0 L-205.05 6.85 -203.85 6.05 -202.65 7.15 Q-200.95 8.65 -199.35 9.35 L-198.85 12.65 Q-198.05 16.75 -196.75 16.75 -195.85 16.75 -195.75 12.7 L-195.75 9.9 Q-195.25 9.75 -195.25 8.9 L-195.45 7.9 Q-196.05 6.55 -197.95 4.9 L-199.85 3.45 -198.75 2.5 -198.9 1.75 -198.9 1.5 -196.25 3.15 -193.45 4.75 -193.3 4.75 -193.3 4.8 -193.05 4.95 -193.3 5.45 -193.4 6.05 -193.05 8.1 -192.65 8.95 -191.25 9.45 -190.9 9.6 Q-188.55 9.5 -186.25 8.7 L-185.7 8.5 -183.5 6.15 -183.2 6.7 -183.1 7.1 Q-183.1 7.7 -187.25 10.35 -191.4 13.7 -191.4 17.65 L-191.1 20.05 Q-190.4 22.15 -188.25 22.4 L-187.15 22.55 -186.65 22.5 -186.8 22.6 -188.1 23.15 -190.65 24.2 -191.1 24.25 -192.45 24.3 -192.85 24.3 -195.05 24.45 Q-198.1 24.45 -200.4 23.35 M-193.4 -2.1 L-193.2 -2.05 -193.1 -2.0 -193.2 -1.9 -193.4 -2.1" fill="#eaaa48" fill-rule="evenodd" stroke="none"/>
    <path d="M-185.55 -0.15 L-182.55 -0.4 Q-181.35 -0.3 -180.35 0.2 -178.0 1.35 -177.85 4.3 -177.15 6.4 -177.15 7.75 -177.15 13.4 -178.8 16.9 -179.45 18.2 -183.25 20.9 L-184.05 21.45 -186.8 22.6 -186.65 22.5 -187.15 22.55 -188.25 22.4 Q-190.4 22.15 -191.1 20.05 L-191.4 17.65 Q-191.4 13.7 -187.25 10.35 -183.1 7.7 -183.1 7.1 L-183.2 6.7 -183.5 6.15 -185.7 8.5 -186.25 8.7 Q-188.55 9.5 -190.9 9.6 L-191.25 9.45 -192.65 8.95 -193.05 8.1 -193.4 6.05 -193.3 5.45 -193.05 4.95 Q-192.45 3.9 -191.5 2.95 L-190.7 2.25 Q-188.65 0.55 -185.9 -0.1 L-185.55 -0.15 M-195.75 9.9 L-195.75 12.7 Q-195.85 16.75 -196.75 16.75 -198.05 16.75 -198.85 12.65 L-199.35 9.35 -196.8 9.9 -195.75 9.9 M-201.1 12.5 L-201.0 12.45 -200.45 14.35 Q-199.9 16.35 -199.9 17.0 L-200.15 18.6 Q-200.55 19.8 -201.35 19.8 L-202.15 19.5 -202.55 19.1 Q-203.3 18.25 -203.85 16.2 L-204.45 13.25 -202.65 13.5 -201.55 13.5 Q-201.1 13.35 -201.1 12.5 M-191.1 24.25 L-190.65 24.2 -192.2 24.75 -191.1 24.25" fill="#c78f3d" fill-rule="evenodd" stroke="none"/>
    <path d="M-207.55 11.7 Q-207.45 9.05 -206.65 8.1 L-205.05 6.85 -203.05 9.0 Q-201.25 10.9 -201.1 12.25 L-201.1 12.5 Q-201.1 13.35 -201.55 13.5 L-202.65 13.5 -204.45 13.25 -206.4 12.4 -207.55 11.7 M-203.85 6.05 Q-202.6 5.15 -200.75 4.0 L-199.85 3.45 -197.95 4.9 Q-196.05 6.55 -195.45 7.9 L-195.25 8.9 Q-195.25 9.75 -195.75 9.9 L-196.8 9.9 -199.35 9.35 Q-200.95 8.65 -202.65 7.15 L-203.85 6.05 M-198.9 1.5 L-198.85 0.7 Q-198.65 -0.15 -198.25 -0.5 -195.6 -2.45 -193.4 -2.1 L-193.2 -1.9 -193.1 -2.0 -193.1 -3.6 Q-193.8 -7.05 -193.8 -14.8 L-193.75 -15.4 Q-192.75 -16.9 -191.0 -17.3 L-189.4 -16.75 Q-191.5 -16.75 -191.5 -10.9 L-191.2 -4.5 -191.65 -3.8 -193.3 -1.15 Q-192.7 0.8 -191.15 1.3 L-190.7 2.25 -191.5 2.95 Q-192.45 3.9 -193.05 4.95 L-193.3 4.8 -193.3 4.75 -193.45 4.75 -196.25 3.15 -198.9 1.5" fill="#ffb84f" fill-rule="evenodd" stroke="none"/>
    <path d="M-183.7 23.2 L-182.8 26.35 Q-180.05 33.4 -178.15 35.8 -174.45 40.6 -169.0 42.6 -165.05 44.05 -160.25 44.05 L-159.35 44.05 Q-152.15 40.3 -146.95 31.3 -144.05 26.2 -141.75 19.4 L-139.35 11.3 -138.85 9.65 -136.95 2.0 Q-135.45 -4.2 -134.05 -7.75 -133.65 -8.9 -133.5 -12.55 L-133.25 -15.6 Q-132.15 -6.8 -132.15 0.1 -132.15 20.0 -141.8 35.7 -151.45 51.45 -163.7 51.45 -171.35 51.45 -177.6 44.3 -180.15 41.35 -185.35 32.7 L-184.5 27.6 -183.7 23.2 M-178.3 75.65 Q-182.85 72.55 -186.4 67.45 L-189.6 62.9 Q-194.95 54.3 -195.9 48.25 L-196.5 44.8 -197.15 42.6 -198.25 38.1 Q-199.7 31.05 -200.35 24.0 L-194.95 36.55 Q-191.3 45.0 -190.35 51.0 -189.4 56.95 -185.4 62.75 -181.4 68.5 -178.3 75.65" fill="#851d1d" fill-rule="evenodd" stroke="none"/>
    <path d="M-132.95 -7.85 Q-130.55 -20.5 -130.0 -32.85 -129.75 -34.25 -129.4 -41.75 -128.55 -47.3 -125.6 -41.3 L-125.0 -32.3 -121.85 -39.85 Q-116.2 -54.15 -110.75 -60.8 -105.2 -67.6 -105.2 -59.6 -105.2 -56.7 -108.35 -49.25 L-112.6 -39.3 -109.55 -41.2 Q-107.7 -42.1 -105.95 -42.1 -101.0 -42.1 -97.5 -38.85 -96.65 -47.55 -93.9 -47.2 -93.9 -44.1 -93.5 -43.1 -93.1 -42.15 -93.1 -40.75 L-92.8 -31.85 Q-90.95 -27.75 -90.95 -24.8 -90.95 -22.85 -91.35 -20.55 L-91.6 -19.4 Q-90.6 -11.95 -89.0 -3.7 -90.75 2.2 -92.95 6.85 L-94.4 9.7 Q-101.95 23.55 -113.4 23.55 -122.55 23.55 -128.55 8.15 L-129.2 6.4 Q-131.7 -0.55 -132.95 -7.85" fill="#450f0f" fill-rule="evenodd" stroke="none"/>
    <path d="M-89.0 -3.7 Q-86.25 10.25 -81.65 26.25 L-73.8 52.05 Q-70.25 63.55 -70.25 66.0 L-70.35 66.85 Q-68.95 67.8 -68.95 69.5 -68.95 71.4 -69.9 72.15 -71.55 73.4 -76.6 73.4 L-77.4 73.4 Q-81.6 45.8 -88.45 26.6 L-94.4 9.7 -92.95 6.85 Q-90.75 2.2 -89.0 -3.7 M-142.05 72.9 L-148.7 72.8 Q-150.2 72.65 -151.9 71.85 -152.65 71.45 -153.25 70.3 -153.85 69.2 -153.85 68.3 -151.75 60.55 -149.15 56.8 -148.2 52.45 -145.9 44.8 L-141.45 30.05 -134.35 -1.35 -132.95 -7.85 Q-131.7 -0.55 -129.2 6.4 L-128.55 8.15 Q-129.1 13.4 -129.95 18.45 -131.5 27.65 -135.5 42.65 -139.6 58.0 -141.05 66.25 L-142.05 72.9" fill="#851d1d" fill-rule="evenodd" stroke="none"/>
    <path d="M-77.4 73.4 L-142.05 72.9 -141.05 66.25 Q-139.6 58.0 -135.5 42.65 -131.5 27.65 -129.95 18.45 -129.1 13.4 -128.55 8.15 -122.55 23.55 -113.4 23.55 -101.95 23.55 -94.4 9.7 L-88.45 26.6 Q-81.6 45.8 -77.4 73.4 M-103.85 35.15 L-103.75 36.3 Q-102.15 41.05 -97.0 41.05 -94.45 41.05 -92.55 38.45 -91.1 36.4 -91.1 35.0 -91.1 31.4 -93.15 28.7 -95.0 26.3 -97.7 25.55 -100.4 24.85 -102.25 26.25 -103.8 27.45 -104.15 29.9 L-111.25 30.65 -120.2 32.15 -121.0 31.05 Q-122.8 28.95 -125.55 28.65 -128.2 28.4 -130.1 30.0 -132.2 31.7 -132.2 34.75 L-131.55 38.9 Q-129.9 43.0 -124.95 43.0 -120.9 43.0 -119.6 41.05 -118.9 39.95 -118.9 37.4 L-118.95 36.1 -107.35 35.5 -103.85 35.15 M-105.55 54.1 L-105.25 54.85 Q-103.9 57.85 -101.0 57.85 -98.65 57.85 -97.45 56.15 -96.55 54.95 -96.55 53.55 -96.55 51.3 -98.05 49.4 -99.4 47.65 -101.25 47.1 -103.25 46.55 -104.5 47.7 -105.2 48.3 -105.55 49.3 L-115.4 50.5 -119.45 51.2 Q-120.45 48.3 -124.0 48.1 -125.95 48.0 -127.35 49.1 -128.9 50.3 -128.9 52.35 L-128.0 55.9 Q-126.5 59.3 -123.4 59.3 -120.75 59.3 -119.7 57.0 -119.2 55.9 -119.1 54.5 L-117.1 54.55 -105.55 54.1" fill="#621515" fill-rule="evenodd" stroke="none"/>
    <path d="M-104.15 29.9 Q-103.8 27.45 -102.25 26.25 -100.4 24.85 -97.7 25.55 -95.0 26.3 -93.15 28.7 -91.1 31.4 -91.1 35.0 -91.1 36.4 -92.55 38.45 -94.45 41.05 -97.0 41.05 -102.15 41.05 -103.75 36.3 L-103.85 35.15 Q-95.55 34.1 -95.55 32.15 -95.55 29.4 -104.15 29.9 M-118.95 36.1 L-118.9 37.4 Q-118.9 39.95 -119.6 41.05 -120.9 43.0 -124.95 43.0 -129.9 43.0 -131.55 38.9 L-132.2 34.75 Q-132.2 31.7 -130.1 30.0 -128.2 28.4 -125.55 28.65 -122.8 28.95 -121.0 31.05 L-120.2 32.15 Q-127.25 33.65 -128.3 35.3 L-127.9 35.75 -122.3 36.1 -118.95 36.1 M-105.55 49.3 Q-105.2 48.3 -104.5 47.7 -103.25 46.55 -101.25 47.1 -99.4 47.65 -98.05 49.4 -96.55 51.3 -96.55 53.55 -96.55 54.95 -97.45 56.15 -98.65 57.85 -101.0 57.85 -103.9 57.85 -105.25 54.85 L-105.55 54.1 -101.75 53.55 Q-97.85 52.7 -97.85 51.05 -97.85 49.05 -101.3 49.05 L-105.55 49.3 M-119.1 54.5 Q-119.2 55.9 -119.7 57.0 -120.75 59.3 -123.4 59.3 -126.5 59.3 -128.0 55.9 L-128.9 52.35 Q-128.9 50.3 -127.35 49.1 -125.95 48.0 -124.0 48.1 -120.45 48.3 -119.45 51.2 -125.9 52.35 -125.9 53.35 -125.9 54.7 -125.6 54.0 L-119.1 54.5" fill="#821c1c" fill-rule="evenodd" stroke="none"/>
    <path d="M-103.85 35.15 L-107.35 35.5 -118.95 36.1 -122.3 36.1 -127.9 35.75 -128.3 35.3 Q-127.25 33.65 -120.2 32.15 L-111.25 30.65 -104.15 29.9 Q-95.55 29.4 -95.55 32.15 -95.55 34.1 -103.85 35.15 M-105.55 54.1 L-117.1 54.55 -119.1 54.5 -125.6 54.0 Q-125.9 54.7 -125.9 53.35 -125.9 52.35 -119.45 51.2 L-115.4 50.5 -105.55 49.3 -101.3 49.05 Q-97.85 49.05 -97.85 51.05 -97.85 52.7 -101.75 53.55 L-105.55 54.1" fill="#b02626" fill-rule="evenodd" stroke="none"/>
    <path d="M-163.55 -64.45 L-167.85 -58.3 -176.9 -54.55 Q-186.15 -51.0 -189.1 -51.2 -189.55 -51.2 -190.8 -51.7 L-191.05 -51.8 -193.0 -52.4 Q-193.9 -52.45 -194.15 -51.7 -192.95 -50.15 -190.15 -48.8 -188.0 -47.75 -187.5 -47.7 L-184.85 -48.25 -178.85 -48.4 -171.2 -48.6 -164.85 -49.05 -165.3 -48.65 -167.35 -46.75 -169.45 -44.4 -171.3 -43.3 -171.35 -43.2 -171.4 -43.2 -171.35 -43.2 Q-172.25 -41.7 -174.05 -39.85 -177.5 -36.25 -181.1 -34.9 L-175.5 -35.6 -171.4 -36.45 -171.35 -36.6 -171.3 -36.45 -170.3 -36.75 Q-175.8 -30.2 -191.75 -26.3 L-199.05 -24.6 -199.35 -24.55 -202.4 -25.1 -204.15 -25.55 -206.05 -26.05 -206.15 -25.9 -206.25 -26.65 Q-206.2 -27.7 -203.7 -27.7 L-197.25 -27.25 Q-195.65 -28.3 -192.75 -29.2 L-187.25 -31.0 -186.2 -31.6 -178.55 -37.9 -171.4 -43.2 -171.15 -43.4 -169.2 -45.9 -170.35 -45.65 -170.5 -45.6 -174.1 -44.7 -178.4 -43.85 Q-182.4 -44.1 -188.3 -47.1 L-191.15 -48.6 Q-197.35 -49.95 -201.3 -53.9 -204.2 -56.8 -206.0 -60.7 L-205.0 -61.8 Q-203.0 -58.95 -200.65 -57.1 -196.35 -53.6 -189.15 -53.2 -180.4 -52.75 -170.0 -59.6 -166.4 -62.0 -163.55 -64.45 M-75.8 -57.45 L-75.95 -58.0 -76.05 -59.0 -76.35 -59.25 Q-77.7 -63.4 -80.2 -66.1 L-86.85 -73.6 Q-86.05 -73.45 -84.85 -72.7 -82.6 -71.55 -76.25 -66.35 -61.55 -54.4 -56.25 -54.05 -44.9 -53.5 -34.0 -57.25 -25.1 -61.0 -23.75 -60.95 -22.3 -60.85 -21.6 -59.5 -21.2 -58.65 -21.25 -57.95 -21.35 -52.95 -30.6 -49.95 -32.65 -48.45 -35.8 -46.85 -42.35 -43.25 -46.75 -42.45 L-58.45 -45.3 -58.7 -45.35 -57.1 -45.7 Q-50.3 -46.95 -47.45 -47.85 -42.25 -49.5 -42.2 -51.45 L-42.25 -51.9 Q-42.3 -52.25 -42.5 -52.45 -43.2 -53.5 -45.35 -53.6 L-50.15 -53.1 -56.25 -52.75 Q-68.8 -53.45 -75.4 -57.25 L-75.8 -57.45 M-44.8 -41.95 L-44.5 -41.9 -39.5 -40.55 -33.05 -40.1 Q-29.8 -39.95 -28.7 -39.3 -27.3 -38.4 -27.3 -36.1 -27.35 -34.9 -32.15 -33.15 L-36.9 -33.6 -44.7 -34.65 Q-52.4 -35.9 -57.2 -37.5 L-57.1 -37.65 -50.85 -37.15 Q-44.45 -37.0 -41.25 -37.25 L-41.65 -37.3 -43.15 -37.85 -53.6 -41.85 -44.8 -41.95 M-63.7 -30.35 Q-61.1 -28.65 -56.55 -26.3 -52.8 -24.2 -51.4 -22.3 -53.35 -24.0 -58.25 -25.75 -67.4 -29.0 -69.0 -31.7 L-68.35 -31.8 -67.4 -30.8 Q-66.7 -30.25 -65.05 -30.2 L-64.05 -30.25 -63.7 -30.35 M-51.05 -18.5 L-51.3 -18.15 -51.4 -18.35 -51.05 -18.5 M-75.9 -24.25 Q-75.65 -22.25 -74.7 -19.65 L-73.3 -15.65 Q-73.3 -14.2 -74.35 -13.4 -75.2 -12.7 -76.7 -12.75 L-77.3 -12.85 -82.0 -23.0 -81.9 -25.4 -81.2 -25.35 -79.05 -23.5 Q-77.65 -22.3 -77.25 -21.15 L-77.2 -21.55 -77.8 -24.15 -78.35 -26.3 -78.0 -26.35 -75.9 -24.25 M-161.15 -28.3 L-158.4 -30.1 -158.1 -29.95 -162.95 -24.75 Q-162.2 -24.7 -158.25 -26.4 L-154.15 -28.1 Q-160.05 -21.65 -169.9 -12.95 L-172.45 -10.7 Q-174.75 -10.0 -176.15 -10.05 -177.4 -10.15 -177.75 -10.85 L-177.8 -11.6 Q-175.1 -14.1 -171.55 -17.85 L-162.3 -27.6 -161.75 -27.95 -161.15 -28.3 M-157.45 -13.85 L-157.6 -14.05 -148.15 -20.9 -137.25 -28.6 -138.7 -20.55 Q-143.65 -14.6 -146.0 -14.7 -148.85 -14.85 -149.4 -16.7 L-149.4 -16.85 Q-151.55 -14.8 -153.95 -13.1 L-155.0 -14.05 -155.15 -14.65 -154.75 -15.6 -157.45 -13.85" fill="#ced2d1" fill-rule="evenodd" stroke="none"/>
    <path d="M-176.9 -54.55 L-177.35 -53.5 -177.15 -52.65 -176.7 -52.3 Q-175.7 -52.1 -173.9 -53.2 L-171.8 -54.65 -173.05 -52.7 -172.2 -52.3 Q-170.95 -52.05 -167.2 -53.65 -162.7 -55.5 -159.8 -58.5 -156.4 -61.9 -151.55 -67.65 -152.1 -61.85 -151.9 -59.15 L-151.75 -57.4 -155.4 -55.15 Q-161.6 -51.05 -167.35 -46.75 L-165.3 -48.65 -164.85 -49.05 -171.2 -48.6 -178.85 -48.4 -184.85 -48.25 -187.5 -47.7 Q-188.0 -47.75 -190.15 -48.8 -192.95 -50.15 -194.15 -51.7 -193.9 -52.45 -193.0 -52.4 L-191.05 -51.8 -190.8 -51.7 Q-189.55 -51.2 -189.1 -51.2 -186.15 -51.0 -176.9 -54.55 M-171.3 -43.3 L-171.35 -43.2 -171.4 -43.2 -171.35 -43.2 -171.3 -43.3 M-199.05 -24.6 L-199.1 -24.55 -199.35 -24.55 -199.05 -24.6 M-199.05 -23.95 L-192.95 -24.1 Q-188.65 -24.5 -184.55 -26.0 L-186.15 -25.05 -187.45 -23.65 Q-179.55 -25.35 -175.75 -26.55 -169.0 -28.5 -166.5 -31.9 -169.6 -30.8 -171.85 -30.65 L-172.0 -30.95 Q-166.25 -33.15 -163.25 -36.05 -160.4 -38.9 -160.25 -42.1 L-160.2 -41.7 -159.85 -41.15 Q-157.6 -40.75 -153.05 -46.7 L-150.65 -50.0 Q-149.2 -43.75 -146.5 -40.45 L-145.95 -39.9 -147.7 -37.7 Q-148.9 -36.45 -150.25 -35.65 L-153.15 -33.95 -159.35 -29.9 -161.15 -28.3 -161.75 -27.95 -162.3 -27.6 -161.85 -28.15 Q-178.1 -19.0 -190.65 -19.65 -193.0 -19.75 -194.2 -20.4 L-195.5 -21.3 -191.65 -21.7 Q-196.7 -22.15 -198.4 -23.05 L-199.05 -23.95 M-32.15 -33.15 L-36.9 -31.65 -42.3 -30.15 -43.7 -29.6 -44.4 -29.7 -48.2 -29.1 Q-56.4 -29.6 -63.35 -31.2 L-63.35 -30.75 -63.55 -30.45 -63.7 -30.35 -64.05 -30.25 -65.05 -30.2 Q-66.7 -30.25 -67.4 -30.8 L-68.35 -31.8 -69.0 -31.7 Q-67.4 -29.0 -58.25 -25.75 -53.35 -24.0 -51.4 -22.3 -50.25 -21.2 -50.3 -20.15 -50.3 -19.55 -50.6 -18.95 L-51.05 -18.5 -51.4 -18.35 -51.3 -18.15 Q-52.3 -16.75 -54.55 -16.85 -56.25 -16.95 -65.1 -20.9 L-76.05 -26.1 -75.9 -24.25 -78.0 -26.35 -78.35 -26.3 -77.8 -24.15 -77.2 -21.55 -77.25 -21.15 Q-77.65 -22.3 -79.05 -23.5 L-81.2 -25.35 -81.9 -25.4 -82.0 -23.0 -77.3 -12.85 Q-81.65 -14.2 -90.65 -30.3 L-91.0 -30.85 Q-89.7 -31.45 -88.3 -32.3 -86.5 -31.4 -84.85 -30.85 L-74.95 -27.55 Q-70.3 -26.0 -65.3 -23.2 L-59.9 -19.8 -58.55 -19.55 -58.5 -19.9 -62.7 -22.95 -61.65 -22.55 -60.45 -22.1 -58.15 -21.65 -58.0 -22.35 -58.3 -22.75 Q-60.3 -23.55 -62.2 -24.65 L-65.85 -26.95 -71.0 -29.85 Q-75.55 -32.8 -75.25 -34.4 L-74.3 -35.0 -74.2 -35.2 -73.95 -35.1 -73.25 -35.35 -72.75 -35.1 -72.75 -35.0 -72.8 -34.75 Q-67.25 -32.9 -64.15 -32.6 L-63.2 -32.55 -58.55 -32.0 -58.5 -32.25 -59.45 -32.75 -60.45 -33.35 -60.15 -33.3 Q-56.55 -31.8 -55.45 -33.0 L-64.5 -35.55 -76.75 -39.1 -76.7 -39.35 -69.7 -38.75 Q-64.3 -38.45 -63.6 -38.65 -62.8 -39.2 -59.6 -39.3 -56.35 -39.45 -55.75 -39.9 L-56.5 -41.05 -55.05 -40.75 -49.25 -39.05 -44.6 -37.95 -43.15 -37.85 -41.65 -37.3 -41.25 -37.25 Q-44.45 -37.0 -50.85 -37.15 L-57.1 -37.65 -57.2 -37.5 Q-52.4 -35.9 -44.7 -34.65 L-36.9 -33.6 -32.15 -33.15 M-76.3 -45.4 L-75.75 -47.05 -75.7 -47.05 Q-72.15 -46.45 -66.8 -46.9 L-60.85 -47.6 -61.05 -48.95 -56.2 -48.95 Q-51.6 -49.0 -50.9 -49.55 -51.25 -50.1 -54.6 -52.05 L-54.35 -52.0 -46.4 -51.5 -42.25 -51.9 -42.2 -51.45 Q-42.25 -49.5 -47.45 -47.85 -50.3 -46.95 -57.1 -45.7 L-58.7 -45.35 -58.45 -45.3 -63.4 -44.7 -76.3 -45.4 M-169.9 -12.95 L-169.95 -12.7 Q-169.7 -12.65 -169.75 -12.45 -168.8 -12.2 -164.25 -15.55 -161.4 -17.6 -160.15 -18.8 L-159.7 -19.35 -159.1 -20.3 -159.15 -20.0 -160.15 -18.8 -160.75 -18.2 -161.0 -16.95 Q-158.95 -17.4 -154.1 -21.85 -149.6 -26.0 -148.55 -27.85 L-150.15 -27.65 -151.5 -27.9 -151.25 -29.2 -145.55 -33.7 Q-143.7 -35.2 -142.05 -36.85 -137.55 -34.2 -130.05 -32.8 -131.75 -30.15 -134.2 -26.65 -136.7 -23.05 -138.7 -20.55 L-137.25 -28.6 -148.15 -20.9 -157.6 -14.05 -157.45 -13.85 -159.05 -12.9 Q-164.05 -10.1 -166.8 -10.25 L-167.35 -10.25 Q-169.25 -10.55 -169.85 -11.75 L-172.45 -10.7 -169.9 -12.95 M-143.3 -30.65 L-144.05 -30.75 Q-144.15 -30.7 -144.35 -30.6 L-145.25 -29.45 -146.8 -27.3 -147.0 -26.3 Q-145.55 -26.65 -144.75 -27.55 L-143.5 -29.6 -143.3 -30.65 M-81.8 -58.1 L-83.4 -61.25 -84.3 -62.85 Q-82.75 -60.9 -81.7 -58.05 L-81.8 -58.1" fill="#afb3b2" fill-rule="evenodd" stroke="none"/>
    <path d="M-151.55 -67.65 Q-156.4 -61.9 -159.8 -58.5 -162.7 -55.5 -167.2 -53.65 -170.95 -52.05 -172.2 -52.3 L-173.05 -52.7 -171.8 -54.65 -173.9 -53.2 Q-175.7 -52.1 -176.7 -52.3 L-177.15 -52.65 -177.35 -53.5 -176.9 -54.55 -167.85 -58.3 -163.55 -64.45 -163.0 -65.2 Q-155.25 -76.2 -149.75 -82.15 L-151.55 -67.65 M-167.35 -46.75 Q-161.6 -51.05 -155.4 -55.15 L-151.75 -57.4 Q-151.45 -53.9 -150.8 -50.95 L-151.0 -50.7 -151.25 -50.45 -150.75 -50.35 -150.65 -50.0 -153.05 -46.7 Q-157.6 -40.75 -159.85 -41.15 L-160.2 -41.7 -160.25 -42.1 Q-160.4 -38.9 -163.25 -36.05 -166.25 -33.15 -172.0 -30.95 L-171.85 -30.65 Q-169.6 -30.8 -166.5 -31.9 -169.0 -28.5 -175.75 -26.55 -179.55 -25.35 -187.45 -23.65 L-186.15 -25.05 -184.55 -26.0 Q-188.65 -24.5 -192.95 -24.1 L-199.05 -23.95 -199.1 -24.55 -199.05 -24.6 -191.75 -26.3 Q-175.8 -30.2 -170.3 -36.75 L-171.3 -36.45 -171.35 -36.6 -171.4 -36.45 -175.5 -35.6 -181.1 -34.9 Q-177.5 -36.25 -174.05 -39.85 -172.25 -41.7 -171.35 -43.2 L-171.3 -43.3 -169.45 -44.4 -167.35 -46.75 M-46.75 -42.45 L-44.8 -41.95 -53.6 -41.85 -43.15 -37.85 -44.6 -37.95 -49.25 -39.05 -55.05 -40.75 -56.5 -41.05 -55.75 -39.9 Q-56.35 -39.45 -59.6 -39.3 -62.8 -39.2 -63.6 -38.65 -64.3 -38.45 -69.7 -38.75 L-76.7 -39.35 -76.75 -39.1 -64.5 -35.55 -55.45 -33.0 Q-56.55 -31.8 -60.15 -33.3 L-60.45 -33.35 -59.45 -32.75 -58.5 -32.25 -58.55 -32.0 -63.2 -32.55 -64.15 -32.6 Q-67.25 -32.9 -72.8 -34.75 L-72.75 -35.0 -72.75 -35.1 -73.25 -35.35 -73.95 -35.1 -74.2 -35.2 -74.3 -35.0 -75.25 -34.4 Q-75.55 -32.8 -71.0 -29.85 L-65.85 -26.95 -62.2 -24.65 Q-60.3 -23.55 -58.3 -22.75 L-58.0 -22.35 -58.15 -21.65 -60.45 -22.1 -61.65 -22.55 -62.7 -22.95 -58.5 -19.9 -58.55 -19.55 -59.9 -19.8 -65.3 -23.2 Q-70.3 -26.0 -74.95 -27.55 L-84.85 -30.85 Q-86.5 -31.4 -88.3 -32.3 -86.95 -33.1 -85.65 -34.1 -83.1 -35.85 -81.25 -37.8 -77.8 -41.35 -76.3 -45.4 L-63.4 -44.7 -58.45 -45.3 -46.75 -42.45 M-75.75 -47.05 L-75.45 -48.35 Q-75.05 -50.5 -75.2 -52.95 L-74.7 -53.0 -75.2 -53.2 -75.7 -57.1 -75.8 -57.45 -75.4 -57.25 Q-68.8 -53.45 -56.25 -52.75 L-50.15 -53.1 -45.35 -53.6 Q-43.2 -53.5 -42.5 -52.45 -42.3 -52.25 -42.25 -51.9 L-46.4 -51.5 -54.35 -52.0 -54.6 -52.05 Q-51.25 -50.1 -50.9 -49.55 -51.6 -49.0 -56.2 -48.95 L-61.05 -48.95 -60.85 -47.6 -66.8 -46.9 Q-72.15 -46.45 -75.7 -47.05 L-75.75 -47.05 M-161.15 -28.3 L-159.35 -29.9 -153.15 -33.95 -150.25 -35.65 Q-148.9 -36.45 -147.7 -37.7 L-145.95 -39.9 Q-144.35 -38.2 -142.05 -36.85 -143.7 -35.2 -145.55 -33.7 L-151.25 -29.2 -151.5 -27.9 -150.15 -27.65 -148.55 -27.85 Q-149.6 -26.0 -154.1 -21.85 -158.95 -17.4 -161.0 -16.95 L-160.75 -18.2 -160.15 -18.8 -159.15 -20.0 -159.1 -20.3 -159.7 -19.35 -160.15 -18.8 Q-161.4 -17.6 -164.25 -15.55 -168.8 -12.2 -169.75 -12.45 -169.7 -12.65 -169.95 -12.7 L-169.9 -12.95 Q-160.05 -21.65 -154.15 -28.1 L-158.25 -26.4 Q-162.2 -24.7 -162.95 -24.75 L-158.1 -29.95 -158.4 -30.1 -161.15 -28.3 M-143.3 -30.65 L-143.5 -29.6 -144.75 -27.55 Q-145.55 -26.65 -147.0 -26.3 L-146.8 -27.3 -145.25 -29.45 -144.35 -30.6 Q-144.15 -30.7 -144.05 -30.75 L-143.3 -30.65" fill="#878a89" fill-rule="evenodd" stroke="none"/>
    <path d="M-81.9 -54.55 Q-82.35 -52.4 -83.75 -48.95 L-85.0 -45.55 Q-85.8 -43.25 -85.8 -42.15 L-85.8 -40.95 Q-85.6 -39.8 -84.65 -39.8 -84.15 -39.8 -83.85 -40.2 L-83.85 -40.15 Q-83.8 -39.8 -84.15 -39.35 L-84.5 -38.7 Q-84.5 -37.45 -84.15 -36.2 L-85.65 -34.15 Q-86.45 -37.35 -86.2 -40.6 -86.2 -42.75 -85.45 -45.55 -84.45 -49.2 -82.2 -53.95 L-81.9 -54.55 M-82.05 -39.4 L-82.1 -39.8 -82.0 -39.45 -82.05 -39.4 M-81.3 -41.2 L-81.45 -41.7 -81.2 -41.5 -81.3 -41.2 M-80.85 -42.65 L-81.65 -43.15 -81.75 -43.15 -81.85 -42.4 -82.2 -42.05 -81.65 -44.2 -81.4 -45.0 -80.6 -45.5 -81.05 -43.55 -80.3 -44.75 -80.85 -42.65 M-77.9 -61.8 L-78.4 -61.55 -78.8 -61.3 -78.25 -62.95 Q-78.25 -63.4 -78.75 -64.1 -79.3 -64.8 -79.3 -65.3 -79.3 -65.85 -78.85 -66.3 -78.35 -66.8 -77.6 -66.8 L-76.95 -66.6 -76.3 -66.4 -76.0 -66.55 -77.9 -61.8 M-149.9 -65.25 Q-153.4 -65.3 -155.95 -63.25 -157.35 -62.15 -158.05 -60.75 L-158.25 -58.75 -158.05 -56.65 -157.25 -58.1 Q-157.15 -59.55 -155.9 -61.0 -153.85 -63.3 -149.85 -63.4 L-151.35 -62.3 Q-153.7 -59.9 -153.7 -56.75 -153.7 -55.25 -153.0 -53.35 -152.3 -51.35 -151.3 -50.1 -150.75 -49.4 -149.25 -48.5 -147.75 -47.65 -146.3 -47.15 L-145.85 -46.95 -145.9 -46.3 Q-145.9 -45.05 -145.15 -42.0 L-144.5 -39.4 -145.15 -36.3 Q-145.75 -33.45 -147.15 -33.45 -148.1 -33.45 -148.8 -34.85 -149.3 -35.9 -149.3 -36.6 L-149.25 -36.75 -149.05 -37.5 -149.05 -37.6 -148.9 -38.0 Q-148.9 -38.45 -149.3 -38.45 -149.8 -38.45 -150.1 -37.3 L-150.35 -36.75 -150.6 -35.45 Q-150.6 -34.45 -150.15 -33.5 -149.25 -31.6 -146.95 -31.6 -145.0 -31.6 -143.95 -33.0 -143.3 -33.8 -143.1 -34.95 L-143.0 -35.35 -140.85 -32.55 -140.35 -32.0 Q-142.5 -26.75 -147.8 -26.75 -152.95 -26.75 -152.95 -33.0 -152.95 -34.7 -152.1 -38.2 -151.2 -41.7 -151.2 -43.0 -151.2 -45.0 -152.95 -46.55 L-156.75 -49.25 Q-162.25 -52.9 -162.25 -58.05 -162.25 -61.35 -161.2 -63.05 -159.5 -65.85 -154.45 -67.3 -151.8 -67.8 -150.5 -67.25 L-149.9 -65.25 M-144.25 -46.0 L-143.4 -45.45 -142.25 -44.7 -142.6 -43.15 -143.35 -42.25 -144.0 -44.95 -144.25 -46.0 M-141.15 -46.85 L-140.65 -48.2 -140.15 -46.55 -140.85 -46.15 -141.0 -46.25 -141.0 -46.55 -141.15 -46.85 M-141.95 -39.15 L-139.85 -42.3 -139.3 -42.95 -139.1 -40.6 Q-138.9 -37.85 -139.4 -35.15 L-142.0 -38.7 -141.95 -39.15 M-146.2 -64.55 L-147.95 -65.05 -148.35 -66.55 -148.35 -66.6 -147.7 -66.8 Q-146.95 -66.8 -146.45 -66.3 -146.0 -65.85 -146.0 -65.3 L-146.2 -64.55 M-82.35 -46.8 L-82.4 -46.8 -82.4 -46.9 -82.35 -46.8 M-82.95 -33.85 Q-81.65 -32.25 -79.3 -32.25 -77.8 -32.25 -76.5 -33.15 L-76.15 -32.85 -75.3 -34.25 Q-74.1 -35.55 -74.1 -36.3 L-74.1 -36.35 -73.95 -37.1 Q-73.95 -38.45 -74.7 -39.85 -75.5 -41.25 -75.5 -40.1 L-75.0 -38.1 -75.75 -36.05 -75.75 -36.0 -76.15 -35.5 Q-77.25 -34.0 -78.4 -34.0 -80.55 -34.0 -81.45 -36.5 L-81.45 -36.55 -81.0 -37.4 Q-80.2 -36.45 -79.05 -36.45 -78.45 -36.45 -78.0 -36.85 -77.6 -37.2 -77.6 -37.5 L-78.95 -37.95 Q-79.85 -38.25 -80.3 -38.75 L-79.35 -40.7 -78.65 -40.75 -78.6 -41.05 -79.05 -41.4 Q-78.15 -43.4 -78.15 -44.05 L-78.25 -46.65 -75.55 -47.4 Q-72.75 -47.9 -71.6 -51.4 -70.85 -53.55 -70.85 -56.2 -70.85 -58.4 -71.2 -59.55 -71.75 -61.35 -73.25 -62.0 L-71.45 -62.25 Q-68.25 -62.25 -68.25 -58.95 -68.25 -57.65 -68.95 -55.85 L-69.65 -54.15 Q-69.65 -53.45 -68.85 -53.45 -67.9 -53.45 -67.1 -55.75 -66.45 -57.55 -66.45 -58.25 -66.45 -59.75 -66.95 -61.1 -67.6 -62.95 -68.95 -63.7 -70.75 -65.1 -73.5 -64.15 L-72.75 -67.55 -70.85 -67.3 Q-65.8 -65.85 -64.1 -63.05 -63.05 -61.35 -63.05 -58.05 -63.05 -52.9 -68.55 -49.25 L-72.35 -46.55 -73.25 -45.55 Q-74.1 -44.4 -74.1 -43.0 -74.1 -41.7 -73.2 -38.2 -72.35 -34.7 -72.35 -33.0 -72.35 -26.75 -77.5 -26.75 -82.45 -26.75 -84.65 -31.35 -83.85 -32.35 -82.95 -33.85 M-70.4 -53.95 L-70.45 -53.6 Q-69.85 -52.2 -69.45 -52.2 L-69.15 -52.35 -69.1 -52.7 -69.45 -53.3 Q-69.9 -53.9 -70.4 -53.95 M-71.0 -52.75 L-71.05 -52.45 Q-70.95 -51.85 -70.55 -51.85 L-70.25 -52.0 Q-70.35 -52.75 -71.0 -52.75 M-73.25 -31.5 L-73.4 -32.4 -73.45 -32.4 Q-73.55 -31.55 -74.45 -30.1 L-76.0 -27.6 -75.75 -27.45 Q-75.1 -27.5 -74.15 -29.15 -73.25 -30.8 -73.25 -31.5" fill="#c78f3d" fill-rule="evenodd" stroke="none"/>
    <path d="M-81.9 -54.55 L-81.8 -54.95 -83.6 -52.3 Q-85.4 -49.8 -85.8 -49.8 -86.4 -49.8 -86.45 -50.45 -86.45 -51.85 -83.35 -56.0 -82.7 -56.8 -81.95 -58.3 L-82.2 -59.35 Q-82.2 -60.35 -81.2 -60.35 L-80.6 -60.05 -78.8 -61.3 -78.4 -61.55 -77.9 -61.8 -78.5 -60.2 -79.0 -58.5 Q-81.0 -56.55 -81.0 -55.9 -81.05 -55.35 -80.35 -55.35 L-79.7 -55.75 -79.95 -54.7 -80.65 -51.1 -81.2 -49.7 -80.9 -49.0 -80.9 -48.5 -80.8 -46.25 -80.55 -46.3 -80.2 -47.25 -80.6 -45.5 -81.4 -45.0 -81.65 -44.2 -82.2 -42.05 -81.85 -42.4 -81.75 -43.15 -81.65 -43.15 -80.85 -42.65 -81.2 -41.5 -81.45 -41.7 -81.3 -41.2 -81.75 -40.0 -82.0 -39.45 -82.1 -39.8 -82.05 -39.4 Q-82.75 -38.15 -84.15 -36.2 -84.5 -37.45 -84.5 -38.7 L-84.15 -39.35 Q-83.8 -39.8 -83.85 -40.15 L-83.85 -40.2 Q-84.15 -39.8 -84.65 -39.8 -85.6 -39.8 -85.8 -40.95 L-85.8 -42.15 Q-85.8 -43.25 -85.0 -45.55 L-83.75 -48.95 Q-82.35 -52.4 -81.9 -54.55 M-145.85 -46.95 L-146.3 -47.15 Q-147.75 -47.65 -149.25 -48.5 -150.75 -49.4 -151.3 -50.1 -152.3 -51.35 -153.0 -53.35 -153.7 -55.25 -153.7 -56.75 -153.7 -59.9 -151.35 -62.3 L-149.85 -63.4 Q-153.85 -63.3 -155.9 -61.0 -157.15 -59.55 -157.25 -58.1 L-158.05 -56.65 -158.25 -58.75 -158.05 -60.75 Q-157.35 -62.15 -155.95 -63.25 -153.4 -65.3 -149.9 -65.25 L-148.95 -62.2 -149.7 -61.1 Q-150.65 -59.2 -150.65 -56.85 -150.65 -54.9 -149.8 -53.2 -148.25 -50.1 -144.55 -50.1 -143.45 -50.1 -142.45 -51.6 L-142.2 -52.0 -142.0 -51.6 -141.9 -52.5 Q-141.35 -53.7 -141.35 -55.1 -141.35 -59.75 -144.9 -62.85 L-147.2 -63.2 -147.4 -63.65 -147.95 -65.05 -146.2 -64.55 Q-144.35 -63.8 -142.9 -62.2 L-142.85 -62.15 -142.3 -61.8 Q-139.4 -58.55 -138.3 -56.35 -137.15 -54.0 -137.15 -51.2 -137.15 -49.3 -137.65 -47.5 L-137.85 -46.75 Q-136.65 -47.45 -135.55 -47.45 -134.45 -47.45 -134.05 -46.6 L-133.85 -45.75 Q-133.85 -44.9 -134.55 -44.9 -134.85 -44.9 -135.15 -45.15 L-135.55 -45.45 -136.4 -45.3 Q-135.55 -44.95 -135.55 -44.15 -135.55 -43.5 -136.15 -43.5 L-137.15 -43.7 -138.85 -43.45 -139.3 -42.95 -139.85 -42.3 -141.95 -39.15 -141.65 -41.05 Q-141.25 -43.6 -141.0 -46.25 L-140.85 -46.15 -140.15 -46.55 Q-139.7 -47.2 -139.45 -48.6 L-139.15 -51.1 Q-139.15 -52.8 -139.95 -54.75 L-139.9 -53.2 Q-139.9 -51.6 -140.45 -49.1 L-140.65 -48.2 -141.15 -46.85 -141.45 -47.25 -142.25 -44.7 -143.4 -45.45 -144.25 -46.0 Q-144.85 -48.45 -145.6 -49.95 L-145.75 -49.95 -145.85 -46.95 M-143.0 -35.35 L-143.1 -34.95 Q-143.3 -33.8 -143.95 -33.0 -145.0 -31.6 -146.95 -31.6 -149.25 -31.6 -150.15 -33.5 -150.6 -34.45 -150.6 -35.45 L-150.35 -36.75 -150.1 -37.3 Q-149.8 -38.45 -149.3 -38.45 -148.9 -38.45 -148.9 -38.0 L-149.05 -37.6 -149.05 -37.5 -149.25 -36.75 -149.3 -36.6 Q-149.3 -35.9 -148.8 -34.85 -148.1 -33.45 -147.15 -33.45 -145.75 -33.45 -145.15 -36.3 L-144.5 -39.4 -144.2 -37.95 -143.65 -36.4 -143.65 -36.0 -143.55 -35.7 -143.25 -35.65 -143.2 -35.65 -143.0 -35.35 M-146.1 -60.85 L-146.3 -61.25 -146.35 -61.3 -145.75 -60.95 -146.1 -60.85 M-143.3 -54.35 L-143.3 -54.3 -143.55 -53.65 -143.95 -52.95 -144.95 -55.85 Q-145.05 -57.55 -145.65 -59.35 L-145.75 -59.7 -143.3 -54.35 M-143.0 -41.0 L-143.35 -42.25 -142.6 -43.15 -142.85 -41.9 -143.0 -41.0 M-82.35 -46.8 L-82.4 -46.9 -82.4 -46.8 -82.35 -46.8 M-82.95 -33.85 L-81.45 -36.5 Q-80.55 -34.0 -78.4 -34.0 -77.25 -34.0 -76.15 -35.5 L-75.75 -36.0 -75.75 -36.05 -75.0 -38.1 -75.5 -40.1 Q-75.5 -41.25 -74.7 -39.85 -73.95 -38.45 -73.95 -37.1 L-74.1 -36.35 -74.1 -36.3 Q-74.1 -35.55 -75.3 -34.25 L-76.15 -32.85 -76.5 -33.15 Q-77.8 -32.25 -79.3 -32.25 -81.65 -32.25 -82.95 -33.85 M-81.0 -37.4 L-80.3 -38.75 Q-79.85 -38.25 -78.95 -37.95 L-77.6 -37.5 Q-77.6 -37.2 -78.0 -36.85 -78.45 -36.45 -79.05 -36.45 -80.2 -36.45 -81.0 -37.4 M-79.35 -40.7 L-79.05 -41.4 -78.6 -41.05 -78.65 -40.75 -79.35 -40.7 M-78.25 -46.65 L-78.45 -48.45 -78.2 -49.0 Q-76.75 -49.4 -75.6 -50.6 -73.6 -52.65 -73.6 -56.15 L-73.8 -58.9 Q-74.0 -59.6 -74.45 -60.1 L-74.05 -61.85 -73.5 -64.15 Q-70.75 -65.1 -68.95 -63.7 -67.6 -62.95 -66.95 -61.1 -66.45 -59.75 -66.45 -58.25 -66.45 -57.55 -67.1 -55.75 -67.9 -53.45 -68.85 -53.45 -69.65 -53.45 -69.65 -54.15 L-68.95 -55.85 Q-68.25 -57.65 -68.25 -58.95 -68.25 -62.25 -71.45 -62.25 L-73.25 -62.0 Q-71.75 -61.35 -71.2 -59.55 -70.85 -58.4 -70.85 -56.2 -70.85 -53.55 -71.6 -51.4 -72.75 -47.9 -75.55 -47.4 L-78.25 -46.65 M-71.0 -52.75 Q-70.35 -52.75 -70.25 -52.0 L-70.55 -51.85 Q-70.95 -51.85 -71.05 -52.45 L-71.0 -52.75 M-70.4 -53.95 Q-69.9 -53.9 -69.45 -53.3 L-69.1 -52.7 -69.15 -52.35 -69.45 -52.2 Q-69.85 -52.2 -70.45 -53.6 L-70.4 -53.95 M-73.25 -31.5 Q-73.25 -30.8 -74.15 -29.15 -75.1 -27.5 -75.75 -27.45 L-76.0 -27.6 -74.45 -30.1 Q-73.55 -31.55 -73.45 -32.4 L-73.4 -32.4 -73.25 -31.5" fill="#ab7834" fill-rule="evenodd" stroke="none"/>
    <path d="M-80.9 -49.0 L-81.2 -49.7 -80.65 -51.1 -80.9 -49.0 M-79.7 -55.75 L-80.35 -55.35 Q-81.05 -55.35 -81.0 -55.9 -81.0 -56.55 -79.0 -58.5 L-79.7 -55.75 M-142.25 -44.7 L-141.45 -47.25 -141.15 -46.85 -141.0 -46.55 -141.0 -46.25 Q-141.25 -43.6 -141.65 -41.05 L-141.95 -39.15 -142.0 -38.7 -142.7 -40.0 -143.0 -41.0 -142.85 -41.9 -142.6 -43.15 -142.25 -44.7 M-147.2 -63.2 L-144.9 -62.85 Q-141.35 -59.75 -141.35 -55.1 -141.35 -53.7 -141.9 -52.5 L-142.2 -52.0 -142.45 -51.6 Q-143.45 -50.1 -144.55 -50.1 -148.25 -50.1 -149.8 -53.2 -150.65 -54.9 -150.65 -56.85 -150.65 -59.2 -149.7 -61.1 L-148.95 -62.2 -148.3 -60.2 Q-146.35 -54.05 -145.55 -50.45 L-145.3 -50.5 Q-144.95 -53.1 -144.95 -55.25 L-144.95 -55.85 -143.95 -52.95 -143.55 -53.65 -143.3 -54.3 -143.3 -54.35 Q-143.3 -56.25 -143.9 -58.1 -144.6 -60.15 -145.75 -60.95 L-146.35 -61.3 -146.3 -61.25 -146.1 -60.85 -145.85 -60.0 -147.2 -63.2 M-143.65 -36.4 L-143.2 -35.65 -143.25 -35.65 -143.55 -35.7 -143.65 -36.0 -143.65 -36.4 M-78.2 -49.0 Q-76.8 -52.15 -75.65 -55.8 L-74.45 -60.1 Q-74.0 -59.6 -73.8 -58.9 L-73.6 -56.15 Q-73.6 -52.65 -75.6 -50.6 -76.75 -49.4 -78.2 -49.0" fill="#96692e" fill-rule="evenodd" stroke="none"/>
    <path d="M-164.3 -59.85 Q-163.9 -63.95 -160.7 -66.35 -159.3 -67.45 -157.6 -68.25 -154.4 -69.8 -151.1 -69.35 L-151.25 -69.9 -151.25 -70.2 -151.7 -73.2 -151.7 -73.25 Q-151.8 -74.2 -151.25 -74.9 L-151.3 -74.85 Q-148.25 -79.55 -143.6 -82.9 L-143.45 -83.75 -143.6 -83.7 -144.05 -83.7 -144.15 -83.75 -144.3 -83.75 -144.85 -83.8 Q-145.7 -83.75 -146.55 -84.55 L-146.85 -84.95 -147.05 -85.55 -147.15 -85.85 Q-147.75 -87.25 -146.55 -88.25 -143.05 -91.2 -138.55 -91.7 L-133.55 -92.4 -133.6 -92.35 Q-130.45 -93.0 -127.15 -92.5 L-127.15 -92.6 -127.15 -93.1 -126.9 -93.5 -126.85 -93.5 -127.15 -94.05 -127.2 -94.1 -127.7 -95.45 Q-128.25 -96.45 -127.25 -97.45 L-127.1 -97.55 -124.1 -97.45 -124.1 -97.5 Q-121.75 -95.95 -119.05 -94.75 L-117.45 -95.25 -117.35 -95.3 -111.9 -96.25 -109.65 -96.0 -109.4 -95.85 Q-106.3 -96.65 -103.45 -98.1 -97.05 -101.35 -89.85 -101.4 L-89.4 -101.3 -88.7 -100.95 -88.35 -100.65 -88.15 -100.3 -87.95 -99.55 Q-87.9 -99.25 -88.0 -99.0 L-88.3 -98.5 -90.5 -96.65 Q-85.05 -96.35 -80.95 -92.85 L-80.6 -92.2 -80.55 -91.65 Q-80.55 -91.3 -80.7 -91.0 L-81.2 -90.4 -81.3 -90.3 Q-82.1 -89.7 -82.9 -89.4 L-83.0 -89.35 -84.35 -89.15 -83.45 -88.7 -83.4 -88.7 Q-81.45 -87.9 -80.7 -86.1 -77.35 -83.65 -75.35 -80.4 -72.15 -75.35 -72.85 -69.5 -68.15 -69.35 -64.45 -66.35 -62.6 -64.9 -61.85 -62.7 L-61.85 -62.75 Q-60.45 -58.9 -61.45 -55.05 L-61.45 -55.0 Q-62.55 -51.1 -66.0 -48.7 L-66.0 -48.65 -70.15 -45.55 -70.7 -45.1 Q-72.5 -43.7 -71.9 -41.4 L-70.75 -36.85 Q-69.7 -32.4 -71.3 -28.2 L-71.3 -28.15 Q-72.25 -25.85 -74.45 -25.2 -77.5 -24.2 -80.6 -25.15 L-80.6 -25.1 Q-82.25 -25.55 -83.45 -26.6 -85.1 -28.05 -86.15 -29.9 -86.85 -29.45 -87.45 -29.45 -88.15 -29.45 -88.4 -29.8 -92.55 -27.25 -95.35 -23.55 -97.2 -21.1 -98.45 -18.1 L-98.05 -14.55 -98.15 -13.95 -98.5 -13.3 -98.25 -4.55 Q-98.2 -1.7 -99.05 0.7 -100.3 4.2 -103.6 5.55 L-104.95 6.2 Q-107.65 7.75 -110.45 8.05 -113.85 8.5 -116.85 7.25 -121.9 5.4 -124.4 0.75 -127.3 -4.55 -127.15 -10.6 -127.1 -12.35 -127.35 -14.05 -127.55 -15.7 -128.1 -17.25 -130.2 -22.9 -133.95 -27.3 -135.4 -27.35 -137.1 -29.35 L-138.95 -30.55 -139.5 -29.45 Q-140.85 -26.7 -143.65 -25.5 -147.1 -24.0 -150.75 -25.35 -153.75 -26.45 -154.55 -29.45 L-154.55 -29.5 Q-155.0 -31.15 -154.8 -33.1 L-153.35 -42.45 -153.4 -43.35 -153.4 -43.3 Q-154.0 -45.2 -155.75 -46.15 L-155.8 -46.15 Q-159.15 -48.05 -161.55 -51.05 -164.75 -54.8 -164.3 -59.8 L-164.3 -59.85 M-78.8 -61.3 L-80.6 -60.05 -81.2 -60.35 Q-82.2 -60.35 -82.2 -59.35 L-81.95 -58.3 Q-82.7 -56.8 -83.35 -56.0 -86.45 -51.85 -86.45 -50.45 -86.4 -49.8 -85.8 -49.8 -85.4 -49.8 -83.6 -52.3 L-81.8 -54.95 -81.9 -54.55 -82.2 -53.95 Q-84.45 -49.2 -85.45 -45.55 -86.2 -42.75 -86.2 -40.6 -86.45 -37.35 -85.65 -34.15 L-84.15 -36.2 Q-82.75 -38.15 -82.05 -39.4 L-82.0 -39.45 -81.75 -40.0 -81.3 -41.2 -81.2 -41.5 -80.85 -42.65 -80.3 -44.75 -81.05 -43.55 -80.6 -45.5 -80.2 -47.25 -80.55 -46.3 -80.8 -46.25 -80.9 -48.5 -80.9 -49.0 -80.65 -51.1 -79.95 -54.7 -79.7 -55.75 -79.0 -58.5 -78.5 -60.2 -77.9 -61.8 -76.0 -66.55 -76.3 -66.4 -76.95 -66.6 -77.6 -66.8 Q-78.35 -66.8 -78.85 -66.3 -79.3 -65.85 -79.3 -65.3 -79.3 -64.8 -78.75 -64.1 -78.25 -63.4 -78.25 -62.95 L-78.8 -61.3 M-149.9 -65.25 L-150.5 -67.25 Q-151.8 -67.8 -154.45 -67.3 -159.5 -65.85 -161.2 -63.05 -162.25 -61.35 -162.25 -58.05 -162.25 -52.9 -156.75 -49.25 L-152.95 -46.55 Q-151.2 -45.0 -151.2 -43.0 -151.2 -41.7 -152.1 -38.2 -152.95 -34.7 -152.95 -33.0 -152.95 -26.75 -147.8 -26.75 -142.5 -26.75 -140.35 -32.0 L-140.85 -32.55 -143.0 -35.35 -143.2 -35.65 -143.65 -36.4 -144.2 -37.95 -144.5 -39.4 -145.15 -42.0 Q-145.9 -45.05 -145.9 -46.3 L-145.85 -46.95 -145.75 -49.95 -145.6 -49.95 Q-144.85 -48.45 -144.25 -46.0 L-144.0 -44.95 -143.35 -42.25 -143.0 -41.0 -142.7 -40.0 -142.0 -38.7 -139.4 -35.15 Q-138.9 -37.85 -139.1 -40.6 L-139.3 -42.95 -138.85 -43.45 -137.15 -43.7 -136.15 -43.5 Q-135.55 -43.5 -135.55 -44.15 -135.55 -44.95 -136.4 -45.3 L-135.55 -45.45 -135.15 -45.15 Q-134.85 -44.9 -134.55 -44.9 -133.85 -44.9 -133.85 -45.75 L-134.05 -46.6 Q-134.45 -47.45 -135.55 -47.45 -136.65 -47.45 -137.85 -46.75 L-137.65 -47.5 Q-137.15 -49.3 -137.15 -51.2 -137.15 -54.0 -138.3 -56.35 -139.4 -58.55 -142.3 -61.8 L-142.85 -62.15 -142.9 -62.2 Q-144.35 -63.8 -146.2 -64.55 L-146.0 -65.3 Q-146.0 -65.85 -146.45 -66.3 -146.95 -66.8 -147.7 -66.8 L-148.35 -66.6 -148.35 -66.55 -147.95 -65.05 -147.4 -63.65 -147.2 -63.2 -145.85 -60.0 -146.1 -60.85 -145.75 -60.95 Q-144.6 -60.15 -143.9 -58.1 -143.3 -56.25 -143.3 -54.35 L-145.75 -59.7 -145.65 -59.35 Q-145.05 -57.55 -144.95 -55.85 L-144.95 -55.25 Q-144.95 -53.1 -145.3 -50.5 L-145.55 -50.45 Q-146.35 -54.05 -148.3 -60.2 L-148.95 -62.2 -149.9 -65.25 M-140.65 -48.2 L-140.45 -49.1 Q-139.9 -51.6 -139.9 -53.2 L-139.95 -54.75 Q-139.15 -52.8 -139.15 -51.1 L-139.45 -48.6 Q-139.7 -47.2 -140.15 -46.55 L-140.65 -48.2 M-141.9 -52.5 L-142.0 -51.6 -142.2 -52.0 -141.9 -52.5 M-81.45 -36.5 L-82.95 -33.85 Q-83.85 -32.35 -84.65 -31.35 -82.45 -26.75 -77.5 -26.75 -72.35 -26.75 -72.35 -33.0 -72.35 -34.7 -73.2 -38.2 -74.1 -41.7 -74.1 -43.0 -74.1 -44.4 -73.25 -45.55 L-72.35 -46.55 -68.55 -49.25 Q-63.05 -52.9 -63.05 -58.05 -63.05 -61.35 -64.1 -63.05 -65.8 -65.85 -70.85 -67.3 L-72.75 -67.55 -73.5 -64.15 -74.05 -61.85 -74.45 -60.1 -75.65 -55.8 Q-76.8 -52.15 -78.2 -49.0 L-78.45 -48.45 -78.25 -46.65 -78.15 -44.05 Q-78.15 -43.4 -79.05 -41.4 L-79.35 -40.7 -80.3 -38.75 -81.0 -37.4 -81.45 -36.55 -81.45 -36.5" fill="#6e450e" fill-rule="evenodd" stroke="none"/>
    <path d="M-109.25 -93.75 L-110.75 -93.3 Q-110.6 -93.5 -110.6 -93.7 L-110.6 -93.8 -109.25 -93.75 M-93.95 -91.35 L-92.3 -90.9 -91.65 -90.55 -98.4 -90.15 -93.95 -91.35 M-89.3 -89.25 L-87.3 -88.1 -87.35 -88.1 Q-90.7 -88.8 -90.7 -87.4 L-90.6 -86.8 -90.5 -86.5 -89.5 -86.35 -84.1 -85.15 -83.1 -85.35 Q-80.2 -83.3 -78.6 -81.45 -75.15 -77.5 -74.9 -73.55 -74.7 -69.7 -75.5 -64.1 L-75.55 -63.95 Q-76.7 -56.4 -78.7 -49.05 -79.9 -45.9 -80.75 -44.25 -83.35 -39.05 -85.7 -36.0 -88.45 -32.4 -91.7 -30.55 -95.05 -28.55 -97.8 -25.75 -101.0 -22.55 -101.85 -19.45 L-102.55 -19.4 Q-102.2 -20.1 -102.2 -20.7 -102.2 -24.8 -106.15 -25.8 L-106.15 -25.45 Q-106.15 -24.8 -106.85 -21.85 L-107.1 -20.75 -106.55 -20.8 Q-103.15 -20.95 -103.15 -17.6 -103.15 -16.6 -104.05 -15.3 -105.1 -13.75 -106.45 -13.75 -107.7 -13.75 -108.55 -14.45 -108.1 -12.8 -108.1 -10.65 -108.1 -8.15 -111.05 -5.65 -113.2 -6.05 -114.25 -7.3 -115.45 -8.65 -116.45 -10.9 L-116.35 -9.2 Q-116.35 -8.05 -116.85 -7.15 -117.65 -5.85 -119.35 -5.85 -120.9 -5.85 -121.4 -8.35 L-121.6 -10.5 Q-121.6 -15.9 -118.95 -14.95 -117.95 -14.6 -117.3 -13.6 -116.35 -14.25 -116.0 -15.05 -115.7 -15.7 -115.7 -16.8 -115.7 -17.6 -117.55 -19.75 -116.9 -20.55 -116.9 -22.15 -116.9 -24.2 -119.0 -23.6 -121.15 -22.95 -121.15 -20.7 -121.15 -20.05 -120.95 -19.8 -120.55 -19.15 -119.15 -19.15 L-118.9 -19.15 Q-119.6 -18.4 -120.65 -18.4 -122.4 -18.4 -123.05 -19.65 L-123.4 -20.95 Q-123.4 -23.25 -121.9 -23.95 L-122.1 -24.15 Q-124.8 -26.3 -126.4 -26.55 L-128.6 -28.2 -135.65 -32.95 Q-139.45 -35.85 -141.1 -38.95 -143.15 -42.85 -144.6 -47.25 L-144.9 -47.2 -144.95 -48.2 Q-145.2 -53.15 -146.35 -57.85 L-146.9 -60.3 -148.0 -64.9 -148.3 -66.35 -148.65 -67.85 -149.9 -73.55 -149.5 -74.4 -149.25 -74.7 -148.9 -75.15 Q-146.25 -78.6 -142.55 -81.1 L-140.65 -82.35 -138.1 -83.0 Q-140.6 -81.75 -140.6 -80.05 L-140.5 -79.3 Q-140.15 -78.3 -139.15 -78.3 -138.8 -78.3 -137.4 -79.1 L-135.9 -79.7 -137.7 -78.45 Q-139.7 -76.75 -140.4 -74.35 L-140.6 -74.4 Q-146.65 -76.1 -146.65 -74.05 -146.65 -73.0 -144.25 -71.5 L-144.8 -71.35 Q-146.45 -70.8 -146.45 -69.9 -146.45 -68.6 -144.3 -68.3 -145.55 -67.45 -145.55 -66.55 -145.45 -65.55 -144.75 -65.2 L-145.15 -64.95 -145.6 -63.9 Q-143.8 -61.55 -141.05 -59.25 -138.45 -57.05 -135.95 -55.85 -138.15 -55.2 -139.9 -54.05 -142.4 -52.35 -142.4 -50.65 L-142.25 -49.8 Q-142.0 -49.2 -141.3 -49.05 L-141.65 -48.25 Q-141.65 -46.75 -139.7 -46.75 L-137.25 -47.45 Q-136.5 -42.6 -132.45 -37.05 -124.8 -26.5 -109.95 -26.5 L-107.85 -26.55 Q-106.5 -28.6 -106.2 -26.7 -95.8 -27.95 -90.35 -36.4 -87.1 -41.4 -86.0 -47.5 L-85.05 -46.8 Q-84.35 -46.3 -83.8 -46.3 -82.75 -46.3 -82.1 -47.05 -81.55 -47.75 -81.55 -48.6 L-81.85 -49.45 Q-81.05 -49.55 -80.45 -50.2 -79.85 -50.95 -79.85 -51.85 -79.85 -54.6 -82.65 -56.15 -85.2 -57.6 -88.85 -57.45 -92.55 -57.3 -95.1 -55.65 L-95.8 -55.1 -96.1 -55.45 Q-97.8 -57.4 -99.5 -57.85 L-99.6 -57.95 Q-101.65 -59.6 -102.25 -60.7 L-102.5 -60.7 -100.0 -57.3 -99.6 -56.85 -97.4 -53.85 -97.15 -53.55 -97.65 -52.4 -99.35 -54.65 -98.45 -54.4 -98.35 -54.55 Q-98.9 -55.4 -100.75 -56.9 L-103.4 -59.25 -103.6 -59.25 Q-103.3 -57.9 -101.85 -56.45 L-100.85 -55.55 -101.05 -54.85 Q-99.55 -50.95 -98.15 -50.95 L-97.9 -50.95 -97.9 -50.75 Q-97.9 -49.65 -95.65 -49.65 L-92.8 -51.05 Q-89.75 -52.45 -87.5 -52.45 L-86.45 -52.1 Q-88.55 -51.9 -90.35 -48.8 -92.35 -44.4 -93.7 -41.8 L-93.65 -42.2 Q-93.65 -43.25 -95.95 -44.35 -98.3 -45.5 -98.3 -43.35 -98.25 -42.85 -97.8 -42.2 -96.95 -40.75 -95.2 -40.75 -94.4 -40.75 -93.95 -41.35 -95.8 -37.8 -98.15 -35.45 L-98.15 -35.6 -100.4 -38.05 Q-102.65 -39.85 -102.65 -36.65 L-102.1 -35.5 Q-101.3 -34.3 -100.1 -34.3 L-99.35 -34.35 Q-103.75 -30.75 -109.8 -30.75 -119.45 -30.75 -125.2 -34.9 -129.1 -37.7 -130.85 -42.1 L-132.7 -45.7 -133.65 -47.65 -133.6 -47.65 Q-132.8 -47.7 -132.8 -48.8 -132.8 -49.25 -134.0 -50.6 L-135.65 -51.85 -135.75 -52.0 -132.3 -52.5 Q-130.8 -52.5 -130.1 -51.25 -131.5 -50.65 -131.5 -49.95 -131.5 -48.85 -129.85 -48.85 L-129.75 -48.85 Q-131.65 -47.5 -131.65 -46.75 L-131.55 -46.2 -131.5 -46.05 -131.05 -45.9 -130.55 -45.85 Q-130.05 -45.85 -128.8 -46.5 -130.25 -45.5 -130.25 -44.65 -130.25 -43.6 -129.05 -43.6 -128.85 -43.6 -123.65 -47.05 -123.65 -49.2 -126.6 -47.75 L-124.35 -49.3 Q-123.5 -49.55 -122.45 -50.3 L-123.35 -49.3 Q-123.35 -48.65 -122.95 -48.4 L-123.2 -47.65 -123.1 -47.05 -122.75 -46.9 Q-121.45 -47.4 -119.3 -49.7 L-117.4 -52.0 Q-117.4 -52.65 -117.7 -52.5 L-117.4 -53.0 Q-117.4 -53.45 -117.55 -53.6 L-117.8 -53.8 Q-118.7 -53.7 -119.95 -52.7 -118.15 -54.85 -118.15 -55.9 L-118.15 -56.05 -117.95 -56.1 -117.4 -58.05 -117.2 -58.75 -117.2 -58.9 -117.15 -59.1 Q-116.6 -61.05 -116.6 -62.05 -116.6 -62.8 -117.2 -64.3 L-117.35 -64.3 -117.8 -60.1 -117.9 -58.8 -119.5 -57.1 -121.25 -55.25 -122.75 -54.0 -123.65 -53.0 -124.85 -51.85 -126.25 -52.2 Q-126.3 -54.2 -127.25 -55.25 -124.7 -56.35 -122.3 -59.0 L-124.4 -55.85 Q-124.4 -55.4 -124.15 -55.45 L-123.95 -55.65 Q-122.0 -56.6 -120.05 -59.15 L-119.8 -59.4 -120.05 -58.75 -119.95 -58.25 -119.9 -58.3 Q-119.5 -58.45 -119.0 -59.65 L-118.55 -61.25 -118.55 -61.45 Q-118.1 -62.6 -118.1 -63.4 L-118.2 -63.9 -118.3 -64.0 -119.8 -62.4 -118.7 -64.35 -117.1 -64.5 Q-116.45 -64.75 -116.45 -65.65 -116.45 -67.4 -118.25 -67.25 L-118.9 -67.15 -120.05 -66.75 -120.05 -66.9 -120.35 -68.15 Q-120.7 -68.85 -121.35 -69.1 L-120.65 -70.2 -120.2 -71.3 Q-120.05 -71.9 -120.05 -72.45 -120.05 -83.05 -130.3 -84.2 L-133.2 -84.25 -126.45 -85.55 -126.95 -85.0 Q-126.5 -84.55 -125.9 -84.55 -125.05 -84.55 -123.45 -83.95 -121.85 -83.35 -118.4 -83.35 L-116.3 -83.35 -118.25 -82.9 -118.1 -82.65 -115.8 -82.3 -113.2 -82.15 Q-109.4 -82.15 -105.5 -84.0 L-103.6 -84.95 -101.85 -85.35 -102.3 -85.15 Q-108.8 -81.6 -108.8 -80.05 L-108.05 -79.15 -101.15 -83.2 -93.8 -87.75 -91.85 -88.4 -90.95 -88.45 -90.85 -88.6 -90.8 -88.75 -89.3 -89.25 M-133.2 -86.8 L-132.2 -87.35 -127.95 -87.6 -126.0 -87.55 -121.45 -86.65 -119.6 -85.95 -116.7 -85.55 -120.7 -85.2 -123.25 -85.6 -122.9 -85.6 -123.35 -85.95 Q-128.5 -87.15 -133.2 -86.8 M-126.0 -90.3 L-125.2 -90.65 -124.35 -91.0 Q-123.55 -90.3 -122.2 -89.65 L-122.05 -89.55 -122.45 -89.65 -126.0 -90.3 M-85.7 -77.7 L-87.2 -79.65 Q-89.5 -81.85 -92.75 -81.9 -91.25 -82.75 -90.9 -83.3 L-89.95 -83.7 Q-89.3 -84.0 -89.3 -84.35 -89.3 -86.9 -93.35 -85.7 L-94.55 -85.25 Q-99.05 -84.9 -101.8 -81.3 -104.05 -78.35 -104.05 -75.65 L-103.75 -72.5 -103.55 -71.85 Q-107.05 -70.4 -107.05 -67.15 -107.2 -66.4 -107.0 -65.65 -106.65 -64.15 -104.9 -64.15 -103.2 -64.15 -101.95 -65.1 L-101.25 -64.1 -101.75 -64.3 Q-103.65 -64.3 -104.3 -63.75 -104.75 -63.4 -104.75 -62.6 L-104.65 -61.95 -104.45 -61.65 -103.85 -61.5 Q-103.45 -61.5 -103.35 -61.75 L-102.85 -62.05 -99.6 -59.55 Q-96.45 -57.1 -93.5 -57.1 -89.1 -57.1 -87.1 -59.35 -85.15 -61.6 -84.7 -61.6 L-83.75 -61.05 Q-84.6 -60.7 -85.7 -59.75 -87.1 -58.55 -87.05 -57.75 L-86.8 -57.55 Q-86.15 -57.85 -84.65 -59.0 -83.1 -60.15 -83.0 -60.55 L-82.25 -60.45 Q-81.65 -60.45 -81.2 -60.85 L-81.0 -61.05 Q-80.75 -61.1 -80.45 -61.35 -80.0 -61.75 -80.0 -62.35 L-80.2 -64.95 Q-79.3 -64.8 -78.75 -65.45 -78.4 -65.9 -78.4 -66.25 -78.4 -67.4 -79.35 -67.5 L-79.3 -67.9 Q-79.3 -68.4 -80.35 -69.25 L-81.5 -70.1 -78.6 -70.65 Q-77.45 -70.85 -77.45 -71.2 L-77.55 -71.75 -77.65 -71.95 -80.5 -72.0 -79.55 -72.9 Q-77.15 -75.2 -77.15 -76.0 -77.15 -78.25 -81.15 -75.5 L-81.5 -75.85 Q-81.5 -79.2 -83.6 -79.3 -85.4 -79.45 -85.7 -77.7 M-84.8 -64.1 L-84.4 -64.9 -83.9 -63.95 -84.8 -64.1 M-82.4 -66.2 L-82.7 -67.05 Q-82.7 -67.8 -82.4 -67.2 L-81.65 -66.85 -82.4 -66.2 M-87.55 -84.7 L-87.65 -84.1 Q-87.65 -82.4 -84.8 -80.9 L-79.85 -78.7 -79.55 -78.85 -79.4 -79.0 -79.25 -79.2 -79.25 -79.6 Q-79.25 -82.45 -87.55 -84.7 M-108.35 -67.85 L-108.3 -67.2 -108.25 -67.25 -108.3 -68.05 -108.35 -67.85 M-118.7 -56.6 L-118.7 -56.7 -118.05 -57.3 -118.2 -56.2 -118.7 -56.6 M-121.65 -52.55 Q-122.95 -50.85 -123.8 -49.9 L-123.8 -50.0 Q-123.8 -50.5 -123.95 -50.75 L-121.65 -52.55 M-101.7 -53.6 L-103.4 -57.8 Q-104.5 -60.45 -105.55 -61.5 -105.8 -61.75 -105.8 -61.0 -105.8 -60.15 -104.0 -56.7 -102.3 -53.45 -101.8 -52.95 L-101.8 -52.9 -101.6 -50.5 Q-101.2 -48.25 -100.0 -48.25 L-99.55 -48.3 -99.65 -48.4 -100.45 -51.0 -101.3 -53.8 -101.6 -53.8 -101.7 -53.6 M-104.25 -55.1 L-105.1 -57.2 -107.05 -61.5 -107.3 -61.45 -107.45 -59.6 Q-107.45 -58.9 -105.95 -56.0 L-104.75 -53.65 Q-104.4 -51.15 -103.4 -51.15 L-102.9 -51.3 -102.95 -51.45 Q-103.55 -54.75 -103.85 -55.35 L-104.25 -55.1 M-108.5 -58.45 L-108.65 -58.45 -108.8 -57.55 -108.05 -54.55 -107.3 -52.2 -107.0 -52.3 -107.0 -53.95 -108.5 -58.45 M-82.85 -74.2 L-84.4 -72.8 -84.7 -75.05 Q-84.0 -74.45 -82.85 -74.2 M-83.65 -58.0 L-82.25 -58.0 -80.65 -59.25 Q-81.55 -59.5 -82.45 -58.95 L-83.65 -58.0 M-143.2 -65.15 L-141.95 -65.9 Q-141.35 -64.5 -140.2 -62.8 L-139.9 -62.4 Q-142.05 -64.55 -143.2 -65.15 M-144.2 -60.7 Q-143.95 -59.5 -142.35 -58.0 -140.7 -56.5 -139.65 -56.5 L-139.15 -56.55 -139.25 -56.65 Q-140.1 -58.15 -141.45 -59.5 -143.2 -61.2 -144.2 -60.7 M-122.75 -55.05 L-122.95 -55.55 -123.4 -55.6 -125.0 -54.9 -125.65 -53.95 -125.5 -53.4 -125.15 -53.35 Q-124.15 -53.55 -123.45 -54.1 -122.75 -54.6 -122.75 -55.05 M-120.7 -41.7 Q-121.25 -41.9 -122.35 -41.3 L-122.75 -41.05 Q-122.05 -41.9 -122.05 -42.2 -122.05 -43.85 -123.1 -43.5 -122.3 -44.45 -122.3 -44.75 -122.3 -47.1 -125.8 -45.4 -129.35 -43.75 -129.35 -42.15 L-129.05 -40.95 Q-128.45 -39.85 -127.1 -39.85 L-126.8 -40.05 -126.8 -39.95 Q-127.0 -38.5 -125.6 -38.5 -125.15 -38.5 -124.2 -39.4 -124.55 -38.75 -124.55 -37.9 -124.55 -36.9 -123.65 -36.9 L-121.85 -38.5 Q-120.2 -40.2 -120.2 -40.6 L-120.4 -41.5 -120.2 -41.35 Q-118.2 -40.05 -117.5 -37.75 L-117.45 -37.2 -118.6 -36.95 Q-120.4 -36.2 -120.4 -34.45 -120.7 -33.0 -119.3 -33.0 -119.05 -33.0 -117.95 -34.3 L-117.2 -35.25 -116.9 -34.05 Q-116.05 -31.6 -112.9 -31.6 -109.95 -31.6 -108.95 -34.2 L-107.3 -37.75 Q-103.05 -40.55 -102.25 -41.3 -101.0 -42.5 -101.0 -44.25 -101.0 -47.7 -103.4 -48.6 -105.8 -49.5 -105.8 -46.85 -105.8 -43.85 -107.25 -43.05 -110.3 -41.35 -113.0 -37.6 -113.7 -38.65 -114.65 -41.0 -115.8 -43.15 -118.7 -44.5 L-118.0 -45.45 Q-117.65 -45.95 -117.65 -46.45 L-117.8 -47.15 Q-118.1 -47.8 -118.9 -47.8 -120.5 -47.8 -121.3 -46.15 -121.85 -45.05 -121.85 -44.05 -121.85 -42.65 -120.7 -41.7 M-132.6 -32.5 L-132.7 -32.7 -132.65 -32.45 -132.65 -32.5 -132.6 -32.5 M-100.4 -40.6 L-99.5 -39.1 Q-98.35 -37.45 -97.25 -37.45 -96.65 -37.45 -96.2 -37.8 -95.75 -38.15 -95.75 -38.8 -95.75 -39.75 -98.05 -41.2 -100.4 -42.65 -100.4 -40.6 M-91.85 -45.7 L-91.6 -46.6 Q-91.6 -48.1 -94.5 -48.4 -97.4 -48.7 -97.4 -47.45 -97.4 -46.7 -96.8 -46.1 -95.7 -45.1 -93.05 -45.1 -92.25 -45.1 -91.85 -45.7 M-119.05 -37.9 Q-119.05 -39.35 -120.65 -38.7 -122.3 -38.1 -122.3 -36.55 -122.45 -35.35 -121.25 -35.35 -120.95 -35.35 -120.05 -36.3 -119.05 -37.3 -119.05 -37.9 M-105.35 -31.5 L-105.2 -31.65 -105.05 -32.45 Q-105.05 -34.8 -106.55 -35.55 -108.1 -36.3 -108.1 -34.15 L-107.65 -32.8 Q-107.0 -31.35 -106.0 -31.35 L-105.35 -31.5 M-103.8 -36.35 Q-105.7 -37.45 -105.7 -35.85 -103.4 -32.85 -103.0 -32.85 L-102.3 -32.95 -102.05 -33.1 -101.95 -33.35 -101.9 -33.85 Q-101.9 -35.25 -103.8 -36.35 M-108.15 -26.1 Q-109.65 -26.15 -110.8 -25.4 -112.4 -24.35 -112.4 -22.3 -112.4 -19.95 -110.25 -17.6 L-110.0 -17.3 -109.8 -18.7 -109.85 -19.05 -109.9 -20.65 Q-109.9 -23.25 -108.15 -26.1 M-115.45 -22.05 L-115.4 -21.4 Q-115.15 -20.65 -113.95 -20.65 -113.45 -20.65 -113.0 -20.95 -112.45 -21.35 -112.45 -22.0 -112.45 -23.3 -113.95 -23.55 -115.45 -23.85 -115.45 -22.05 M-111.35 -14.4 Q-110.9 -15.05 -110.9 -15.85 -110.9 -17.6 -112.55 -17.8 -114.25 -18.0 -114.25 -15.7 L-114.15 -14.65 Q-114.0 -13.95 -113.45 -13.7 -114.25 -13.15 -114.25 -11.8 -113.7 -8.05 -111.2 -8.05 -109.85 -8.05 -109.25 -9.7 -108.95 -10.6 -108.95 -11.65 -108.95 -13.95 -111.55 -14.1 L-111.35 -14.4 M-106.55 -16.15 L-106.4 -15.15 -106.0 -14.9 -105.35 -14.8 Q-104.7 -14.8 -104.3 -15.6 L-104.0 -16.6 Q-104.0 -17.8 -105.25 -17.55 -106.55 -17.3 -106.55 -16.15 M-119.9 -17.05 L-120.25 -16.9 -120.4 -17.4 -119.9 -17.05 M-120.35 -10.3 Q-120.2 -8.5 -118.55 -8.5 -116.9 -8.5 -116.9 -11.05 -116.9 -13.0 -118.6 -13.0 -120.35 -12.95 -120.35 -10.3 M-116.75 -3.2 Q-116.75 -5.05 -115.0 -5.1 -113.3 -5.1 -113.3 -3.55 -113.3 -2.85 -113.6 -2.2 -114.1 -1.35 -115.0 -1.35 -116.2 -1.35 -116.6 -2.25 L-116.75 -3.2 M-103.75 -8.7 Q-104.15 -8.05 -104.9 -8.05 -105.85 -8.05 -106.15 -8.85 L-106.3 -9.5 Q-106.3 -10.9 -104.9 -10.9 -103.55 -10.9 -103.55 -9.5 L-103.75 -8.7 M-108.4 -6.1 Q-108.4 -7.2 -107.1 -7.35 -105.85 -7.5 -105.85 -6.1 L-106.25 -5.2 Q-106.7 -4.5 -107.15 -4.5 -108.35 -4.5 -108.4 -6.1" fill="#eaaa48" fill-rule="evenodd" stroke="none"/>
    <path d="M-148.0 -64.9 L-148.6 -66.2 -148.5 -66.25 -148.3 -66.35 -148.0 -64.9" fill="#170b10" fill-rule="evenodd" stroke="none"/>
    <path d="M-109.25 -93.75 Q-106.35 -94.7 -102.6 -96.3 -94.05 -99.95 -90.5 -99.45 L-89.95 -99.4 Q-92.4 -97.35 -96.3 -95.45 -99.7 -95.35 -104.05 -93.5 -111.5 -90.25 -113.8 -90.25 -117.15 -90.25 -120.7 -91.4 L-122.45 -91.95 -123.15 -92.45 Q-125.35 -94.1 -125.9 -96.1 -124.35 -95.6 -121.55 -93.7 -120.6 -93.05 -119.15 -92.7 L-116.75 -93.25 -114.25 -94.0 -110.8 -94.3 Q-110.6 -94.45 -110.6 -93.8 L-110.6 -93.7 Q-110.6 -93.5 -110.75 -93.3 L-109.25 -93.75 M-94.3 -94.6 Q-87.8 -95.5 -82.55 -91.75 -83.45 -90.85 -84.8 -91.05 L-91.55 -91.6 -93.95 -91.35 -98.4 -90.15 -102.9 -89.0 Q-111.4 -86.35 -116.7 -85.55 L-119.6 -85.95 -121.45 -86.65 -126.0 -87.55 -127.95 -87.6 -132.2 -87.35 -137.8 -86.65 -143.95 -85.75 -145.1 -85.95 -145.15 -86.2 -145.25 -86.8 Q-145.25 -87.75 -141.05 -89.05 -135.6 -90.7 -127.7 -90.7 L-126.0 -90.3 -122.45 -89.65 -122.05 -89.55 Q-118.65 -88.0 -113.35 -88.0 -111.6 -88.0 -102.5 -91.4 L-94.3 -94.6 M-78.7 -49.05 L-80.4 -43.3 Q-82.05 -38.15 -85.25 -33.95 -95.0 -29.15 -99.2 -21.45 L-100.55 -18.35 -100.55 -18.25 Q-100.1 -17.05 -100.1 -14.7 L-100.55 -13.9 -100.3 -3.9 Q-100.3 -1.05 -101.45 1.05 -102.95 3.7 -106.0 4.2 -108.75 6.15 -112.6 6.1 -116.45 6.1 -119.5 3.65 -123.7 0.25 -124.65 -5.15 -125.15 -7.9 -125.05 -10.55 -124.8 -18.35 -129.4 -24.7 -133.0 -29.7 -138.0 -33.7 -144.55 -38.85 -144.9 -47.2 L-144.6 -47.25 Q-143.15 -42.85 -141.1 -38.95 -139.45 -35.85 -135.65 -32.95 L-128.6 -28.2 -126.4 -26.55 Q-124.8 -26.3 -122.1 -24.15 L-121.9 -23.95 Q-123.4 -23.25 -123.4 -20.95 L-123.05 -19.65 Q-122.4 -18.4 -120.65 -18.4 -119.6 -18.4 -118.9 -19.15 -118.05 -19.2 -117.55 -19.75 -115.7 -17.6 -115.7 -16.8 -115.7 -15.7 -116.0 -15.05 -116.35 -14.25 -117.3 -13.6 -117.95 -14.6 -118.95 -14.95 -121.6 -15.9 -121.6 -10.5 L-121.4 -8.35 Q-120.9 -5.85 -119.35 -5.85 -117.65 -5.85 -116.85 -7.15 -116.35 -8.05 -116.35 -9.2 L-116.45 -10.9 Q-115.45 -8.65 -114.25 -7.3 -113.2 -6.05 -111.05 -5.65 -108.1 -8.15 -108.1 -10.65 -108.1 -12.8 -108.55 -14.45 -107.7 -13.75 -106.45 -13.75 -105.1 -13.75 -104.05 -15.3 -103.15 -16.6 -103.15 -17.6 -103.15 -20.95 -106.55 -20.8 L-107.1 -20.75 -106.85 -21.85 Q-106.15 -24.8 -106.15 -25.45 L-106.15 -25.8 Q-102.2 -24.8 -102.2 -20.7 -102.2 -20.1 -102.55 -19.4 L-101.85 -19.45 Q-101.0 -22.55 -97.8 -25.75 -95.05 -28.55 -91.7 -30.55 -88.45 -32.4 -85.7 -36.0 -83.35 -39.05 -80.75 -44.25 -79.9 -45.9 -78.7 -49.05 M-90.8 -88.75 L-90.85 -88.6 -90.95 -88.45 -91.85 -88.4 -90.8 -88.75 M-103.6 -84.95 L-105.5 -84.0 Q-109.4 -82.15 -113.2 -82.15 L-115.8 -82.3 -118.1 -82.65 -118.25 -82.9 -116.3 -83.35 Q-109.95 -83.6 -103.6 -84.95 M-133.2 -84.25 L-130.3 -84.2 Q-120.05 -83.05 -120.05 -72.45 -120.05 -71.9 -120.2 -71.3 L-120.65 -70.2 -121.35 -69.1 Q-120.7 -68.85 -120.35 -68.15 L-120.05 -66.9 -120.05 -66.75 Q-121.75 -65.85 -122.6 -63.55 -123.05 -62.05 -124.6 -60.45 -127.25 -57.7 -131.25 -57.7 -135.45 -57.7 -139.1 -61.55 L-139.9 -62.4 -140.2 -62.8 Q-141.35 -64.5 -141.95 -65.9 L-143.2 -65.15 -143.95 -65.4 -144.75 -65.2 Q-145.45 -65.55 -145.55 -66.55 -145.55 -67.45 -144.3 -68.3 -146.45 -68.6 -146.45 -69.9 -146.45 -70.8 -144.8 -71.35 L-144.25 -71.5 Q-146.65 -73.0 -146.65 -74.05 -146.65 -76.1 -140.6 -74.4 L-140.4 -74.35 Q-139.7 -76.75 -137.7 -78.45 L-135.9 -79.7 -137.4 -79.1 Q-138.8 -78.3 -139.15 -78.3 -140.15 -78.3 -140.5 -79.3 L-140.6 -80.05 Q-140.6 -81.75 -138.1 -83.0 L-133.2 -84.25 M-135.75 -52.0 L-135.65 -51.85 -134.0 -50.6 Q-132.8 -49.25 -132.8 -48.8 -132.8 -47.7 -133.6 -47.65 L-133.65 -47.65 -132.7 -45.7 -130.85 -42.1 Q-129.1 -37.7 -125.2 -34.9 -119.45 -30.75 -109.8 -30.75 -103.75 -30.75 -99.35 -34.35 -98.25 -34.55 -98.15 -35.45 -95.8 -37.8 -93.95 -41.35 L-93.7 -41.8 Q-92.35 -44.4 -90.35 -48.8 -88.55 -51.9 -86.45 -52.1 L-84.8 -50.95 Q-83.05 -49.45 -82.1 -49.45 L-81.85 -49.45 -81.55 -48.6 Q-81.55 -47.75 -82.1 -47.05 -82.75 -46.3 -83.8 -46.3 -84.35 -46.3 -85.05 -46.8 L-86.0 -47.5 Q-87.1 -41.4 -90.35 -36.4 -95.8 -27.95 -106.2 -26.7 -106.5 -28.6 -107.85 -26.55 L-109.95 -26.5 Q-124.8 -26.5 -132.45 -37.05 -136.5 -42.6 -137.25 -47.45 L-139.7 -46.75 Q-141.65 -46.75 -141.65 -48.25 L-141.3 -49.05 -140.9 -49.0 -138.45 -50.75 Q-137.25 -51.6 -135.75 -52.0 M-101.25 -64.1 L-101.95 -65.1 Q-103.2 -64.15 -104.9 -64.15 -106.65 -64.15 -107.0 -65.65 -107.2 -66.4 -107.05 -67.15 -107.05 -70.4 -103.55 -71.85 L-103.75 -72.5 -104.05 -75.65 Q-104.05 -78.35 -101.8 -81.3 -99.05 -84.9 -94.55 -85.25 L-93.35 -85.7 Q-89.3 -86.9 -89.3 -84.35 -89.3 -84.0 -89.95 -83.7 L-90.9 -83.3 Q-91.25 -82.75 -92.75 -81.9 -89.5 -81.85 -87.2 -79.65 L-85.7 -77.7 -85.75 -77.0 Q-85.75 -75.95 -84.8 -75.15 L-84.7 -75.05 -84.4 -72.8 -82.85 -74.2 -81.2 -74.05 -80.7 -74.1 -80.8 -74.2 -80.6 -74.8 -81.15 -75.5 Q-77.15 -78.25 -77.15 -76.0 -77.15 -75.2 -79.55 -72.9 L-80.5 -72.0 -77.65 -71.95 -77.55 -71.75 -77.45 -71.2 Q-77.45 -70.85 -78.6 -70.65 L-81.5 -70.1 -80.35 -69.25 Q-79.3 -68.4 -79.3 -67.9 L-79.35 -67.5 -80.7 -67.3 -81.65 -66.85 -82.4 -67.2 Q-82.7 -67.8 -82.7 -67.05 L-82.4 -66.2 Q-83.0 -65.45 -83.0 -64.35 L-82.9 -63.6 -83.1 -63.7 -83.9 -63.95 -84.4 -64.9 -84.8 -64.1 Q-86.05 -64.2 -86.8 -63.55 -87.9 -62.0 -88.7 -61.2 -90.2 -59.8 -93.35 -59.8 -96.25 -59.8 -98.7 -62.05 L-101.25 -64.1 M-108.35 -67.85 L-108.3 -68.05 -108.25 -67.25 -108.3 -67.2 -108.35 -67.85 M-120.7 -41.7 Q-121.85 -42.65 -121.85 -44.05 -121.85 -45.05 -121.3 -46.15 -120.5 -47.8 -118.9 -47.8 -118.1 -47.8 -117.8 -47.15 L-117.65 -46.45 Q-117.65 -45.95 -118.0 -45.45 L-118.7 -44.5 Q-115.8 -43.15 -114.65 -41.0 -113.7 -38.65 -113.0 -37.6 -110.3 -41.35 -107.25 -43.05 -105.8 -43.85 -105.8 -46.85 -105.8 -49.5 -103.4 -48.6 -101.0 -47.7 -101.0 -44.25 -101.0 -42.5 -102.25 -41.3 -103.05 -40.55 -107.3 -37.75 L-108.95 -34.2 Q-109.95 -31.6 -112.9 -31.6 -116.05 -31.6 -116.9 -34.05 L-117.2 -35.25 -116.8 -36.2 Q-116.8 -37.1 -117.45 -37.2 L-117.5 -37.75 Q-118.2 -40.05 -120.2 -41.35 L-120.4 -41.5 -120.7 -41.7 M-108.15 -26.1 Q-109.9 -23.25 -109.9 -20.65 L-109.85 -19.05 -109.8 -18.7 -110.0 -17.3 -110.25 -17.6 Q-112.4 -19.95 -112.4 -22.3 -112.4 -24.35 -110.8 -25.4 -109.65 -26.15 -108.15 -26.1 M-119.9 -17.05 L-120.4 -17.4 -120.25 -16.9 -119.9 -17.05 M-108.4 -6.1 Q-108.35 -4.5 -107.15 -4.5 -106.7 -4.5 -106.25 -5.2 L-105.85 -6.1 Q-105.85 -7.5 -107.1 -7.35 -108.4 -7.2 -108.4 -6.1 M-103.75 -8.7 L-103.55 -9.5 Q-103.55 -10.9 -104.9 -10.9 -106.3 -10.9 -106.3 -9.5 L-106.15 -8.85 Q-105.85 -8.05 -104.9 -8.05 -104.15 -8.05 -103.75 -8.7 M-116.75 -3.2 L-116.6 -2.25 Q-116.2 -1.35 -115.0 -1.35 -114.1 -1.35 -113.6 -2.2 -113.3 -2.85 -113.3 -3.55 -113.3 -5.1 -115.0 -5.1 -116.75 -5.05 -116.75 -3.2" fill="#c78f3d" fill-rule="evenodd" stroke="none"/>
    <path d="M-122.45 -91.95 L-120.7 -91.4 Q-117.15 -90.25 -113.8 -90.25 -111.5 -90.25 -104.05 -93.5 -99.7 -95.35 -96.3 -95.45 L-93.1 -95.1 -94.3 -94.6 -102.5 -91.4 Q-111.6 -88.0 -113.35 -88.0 -118.65 -88.0 -122.05 -89.55 L-122.2 -89.65 Q-123.55 -90.3 -124.35 -91.0 L-125.3 -92.35 -124.45 -92.55 -122.45 -91.95 M-91.65 -90.55 Q-89.8 -90.35 -88.25 -89.65 L-89.3 -89.25 -90.8 -88.75 -91.85 -88.4 -93.8 -87.75 -101.15 -83.2 -108.05 -79.15 -108.8 -80.05 Q-108.8 -81.6 -102.3 -85.15 L-101.85 -85.35 -103.6 -84.95 Q-109.95 -83.6 -116.3 -83.35 L-118.4 -83.35 Q-121.85 -83.35 -123.45 -83.95 -125.05 -84.55 -125.9 -84.55 -126.5 -84.55 -126.95 -85.0 L-126.45 -85.55 -133.2 -84.25 -138.1 -83.0 -140.65 -82.35 -140.8 -82.35 -141.4 -82.45 -141.8 -82.75 -141.8 -83.35 Q-141.8 -85.45 -136.15 -86.45 L-133.2 -86.8 Q-128.5 -87.15 -123.35 -85.95 L-122.9 -85.6 -123.25 -85.6 -120.7 -85.2 -116.7 -85.55 Q-111.4 -86.35 -102.9 -89.0 L-98.4 -90.15 -91.65 -90.55 M-87.3 -88.1 Q-84.0 -87.4 -82.55 -85.6 L-83.1 -85.35 -84.1 -85.15 -89.5 -86.35 -90.5 -86.5 -90.6 -86.8 -90.7 -87.4 Q-90.7 -88.8 -87.35 -88.1 L-87.3 -88.1 M-127.25 -55.25 Q-126.3 -54.2 -126.25 -52.2 L-124.85 -51.85 -123.65 -53.0 -122.5 -53.95 -118.85 -57.25 -118.7 -56.7 -118.7 -56.6 -118.7 -56.3 Q-118.7 -55.15 -121.65 -52.6 L-121.65 -52.55 -123.95 -50.75 Q-123.8 -50.5 -123.8 -50.0 L-123.8 -49.9 -124.35 -49.3 -126.6 -47.75 Q-123.65 -49.2 -123.65 -47.05 -128.85 -43.6 -129.05 -43.6 -130.25 -43.6 -130.25 -44.65 -130.25 -45.5 -128.8 -46.5 -130.05 -45.85 -130.55 -45.85 L-131.05 -45.9 -131.5 -46.05 -131.55 -46.2 -131.65 -46.75 Q-131.65 -47.5 -129.75 -48.85 L-129.85 -48.85 Q-131.5 -48.85 -131.5 -49.95 -131.5 -50.65 -130.1 -51.25 -130.8 -52.5 -132.3 -52.5 L-135.75 -52.0 Q-137.25 -51.6 -138.45 -50.75 L-140.9 -49.0 -141.3 -49.05 Q-142.0 -49.2 -142.25 -49.8 L-142.4 -50.65 Q-142.4 -52.35 -139.9 -54.05 -138.15 -55.2 -135.95 -55.85 L-134.3 -56.3 Q-129.15 -57.35 -127.25 -55.25 M-119.95 -52.7 Q-118.7 -53.7 -117.8 -53.8 L-117.55 -53.6 Q-117.4 -53.45 -117.4 -53.0 L-117.7 -52.5 Q-117.4 -52.65 -117.4 -52.0 L-119.3 -49.7 Q-121.45 -47.4 -122.75 -46.9 L-123.1 -47.05 -123.2 -47.65 -122.95 -48.4 Q-123.35 -48.65 -123.35 -49.3 L-122.45 -50.3 -119.95 -52.7 M-99.35 -34.35 L-100.1 -34.3 Q-101.3 -34.3 -102.1 -35.5 L-102.65 -36.65 Q-102.65 -39.85 -100.4 -38.05 L-98.15 -35.6 -98.15 -35.45 Q-98.25 -34.55 -99.35 -34.35 M-93.95 -41.35 Q-94.4 -40.75 -95.2 -40.75 -96.95 -40.75 -97.8 -42.2 -98.25 -42.85 -98.3 -43.35 -98.3 -45.5 -95.95 -44.35 -93.65 -43.25 -93.65 -42.2 L-93.7 -41.8 -93.95 -41.35 M-86.45 -52.1 L-87.5 -52.45 Q-89.75 -52.45 -92.8 -51.05 L-95.65 -49.65 Q-97.9 -49.65 -97.9 -50.75 L-97.9 -50.95 -98.15 -50.95 Q-99.55 -50.95 -101.05 -54.85 L-100.85 -55.55 Q-100.7 -55.75 -100.4 -55.75 L-99.35 -54.65 -97.65 -52.4 -97.15 -53.55 -97.4 -53.85 -99.6 -56.85 -100.25 -58.0 -99.5 -57.85 Q-97.8 -57.4 -96.1 -55.45 L-95.8 -55.1 -95.1 -55.65 Q-92.55 -57.3 -88.85 -57.45 -85.2 -57.6 -82.65 -56.15 -79.85 -54.6 -79.85 -51.85 -79.85 -50.95 -80.45 -50.2 -81.05 -49.55 -81.85 -49.45 L-82.1 -49.45 Q-83.05 -49.45 -84.8 -50.95 L-86.45 -52.1 M-85.7 -77.7 Q-85.4 -79.45 -83.6 -79.3 -81.5 -79.2 -81.5 -75.85 L-81.15 -75.5 -80.6 -74.8 -80.8 -74.2 -80.7 -74.1 -81.2 -74.05 -82.85 -74.2 Q-84.0 -74.45 -84.7 -75.05 L-84.8 -75.15 Q-85.75 -75.95 -85.75 -77.0 L-85.7 -77.7 M-87.55 -84.7 Q-79.25 -82.45 -79.25 -79.6 L-79.25 -79.2 -79.4 -79.0 -79.55 -78.85 -79.85 -78.7 -84.8 -80.9 Q-87.65 -82.4 -87.65 -84.1 L-87.55 -84.7 M-101.7 -53.6 L-101.6 -53.8 -101.3 -53.8 -100.45 -51.0 -99.65 -48.4 -99.55 -48.3 -100.0 -48.25 Q-101.2 -48.25 -101.6 -50.5 L-101.8 -52.9 -101.8 -52.95 -101.7 -53.6 M-104.25 -55.1 L-103.85 -55.35 Q-103.55 -54.75 -102.95 -51.45 L-102.9 -51.3 -103.4 -51.15 Q-104.4 -51.15 -104.75 -53.65 L-104.75 -53.7 Q-104.75 -54.65 -104.25 -55.1 M-120.4 -41.5 L-120.2 -40.6 Q-120.2 -40.2 -121.85 -38.5 L-123.65 -36.9 Q-124.55 -36.9 -124.55 -37.9 -124.55 -38.75 -124.2 -39.4 -125.15 -38.5 -125.6 -38.5 -127.0 -38.5 -126.8 -39.95 L-126.8 -40.05 -127.1 -39.85 Q-128.45 -39.85 -129.05 -40.95 L-129.35 -42.15 Q-129.35 -43.75 -125.8 -45.4 -122.3 -47.1 -122.3 -44.75 -122.3 -44.45 -123.1 -43.5 -122.05 -43.85 -122.05 -42.2 -122.05 -41.9 -122.75 -41.05 L-122.35 -41.3 Q-121.25 -41.9 -120.7 -41.7 L-120.4 -41.5 M-117.2 -35.25 L-117.95 -34.3 Q-119.05 -33.0 -119.3 -33.0 -120.7 -33.0 -120.4 -34.45 -120.4 -36.2 -118.6 -36.95 L-117.45 -37.2 Q-116.8 -37.1 -116.8 -36.2 L-117.2 -35.25 M-118.9 -19.15 L-119.15 -19.15 Q-120.55 -19.15 -120.95 -19.8 -121.15 -20.05 -121.15 -20.7 -121.15 -22.95 -119.0 -23.6 -116.9 -24.2 -116.9 -22.15 -116.9 -20.55 -117.55 -19.75 -118.05 -19.2 -118.9 -19.15 M-91.85 -45.7 Q-92.25 -45.1 -93.05 -45.1 -95.7 -45.1 -96.8 -46.1 -97.4 -46.7 -97.4 -47.45 -97.4 -48.7 -94.5 -48.4 -91.6 -48.1 -91.6 -46.6 L-91.85 -45.7 M-100.4 -40.6 Q-100.4 -42.65 -98.05 -41.2 -95.75 -39.75 -95.75 -38.8 -95.75 -38.15 -96.2 -37.8 -96.65 -37.45 -97.25 -37.45 -98.35 -37.45 -99.5 -39.1 L-100.4 -40.6 M-119.05 -37.9 Q-119.05 -37.3 -120.05 -36.3 -120.95 -35.35 -121.25 -35.35 -122.45 -35.35 -122.3 -36.55 -122.3 -38.1 -120.65 -38.7 -119.05 -39.35 -119.05 -37.9 M-103.8 -36.35 Q-101.9 -35.25 -101.9 -33.85 L-101.95 -33.35 -102.05 -33.1 -102.3 -32.95 -103.0 -32.85 Q-103.4 -32.85 -105.7 -35.85 -105.7 -37.45 -103.8 -36.35 M-105.35 -31.5 L-106.0 -31.35 Q-107.0 -31.35 -107.65 -32.8 L-108.1 -34.15 Q-108.1 -36.3 -106.55 -35.55 -105.05 -34.8 -105.05 -32.45 L-105.2 -31.65 -105.35 -31.5 M-106.55 -16.15 Q-106.55 -17.3 -105.25 -17.55 -104.0 -17.8 -104.0 -16.6 L-104.3 -15.6 Q-104.7 -14.8 -105.35 -14.8 L-106.0 -14.9 -106.4 -15.15 -106.55 -16.15 M-111.35 -14.4 L-111.55 -14.1 Q-108.95 -13.95 -108.95 -11.65 -108.95 -10.6 -109.25 -9.7 -109.85 -8.05 -111.2 -8.05 -113.7 -8.05 -114.25 -11.8 -114.25 -13.15 -113.45 -13.7 -114.0 -13.95 -114.15 -14.65 L-114.25 -15.7 Q-114.25 -18.0 -112.55 -17.8 -110.9 -17.6 -110.9 -15.85 -110.9 -15.05 -111.35 -14.4 M-115.45 -22.05 Q-115.45 -23.85 -113.95 -23.55 -112.45 -23.3 -112.45 -22.0 -112.45 -21.35 -113.0 -20.95 -113.45 -20.65 -113.95 -20.65 -115.15 -20.65 -115.4 -21.4 L-115.45 -22.05 M-120.35 -10.3 Q-120.35 -12.95 -118.6 -13.0 -116.9 -13.0 -116.9 -11.05 -116.9 -8.5 -118.55 -8.5 -120.2 -8.5 -120.35 -10.3" fill="#ffb84f" fill-rule="evenodd" stroke="none"/>
    <path d="M-120.05 -66.75 L-118.9 -67.15 -118.25 -67.25 Q-116.45 -67.4 -116.45 -65.65 -116.45 -64.75 -117.1 -64.5 L-118.7 -64.35 -119.8 -62.4 -118.3 -64.0 -118.2 -63.9 -118.1 -63.4 Q-118.1 -62.6 -118.55 -61.45 L-118.55 -61.25 -119.0 -59.65 Q-119.5 -58.45 -119.9 -58.3 L-119.95 -58.25 -120.05 -58.75 -119.8 -59.4 -120.05 -59.15 Q-122.0 -56.6 -123.95 -55.65 L-124.15 -55.45 Q-124.4 -55.4 -124.4 -55.85 L-122.3 -59.0 Q-124.7 -56.35 -127.25 -55.25 -129.15 -57.35 -134.3 -56.3 L-135.95 -55.85 Q-138.45 -57.05 -141.05 -59.25 -143.8 -61.55 -145.6 -63.9 L-145.15 -64.95 -144.75 -65.2 -143.95 -65.4 -143.2 -65.15 Q-142.05 -64.55 -139.9 -62.4 L-139.1 -61.55 Q-135.45 -57.7 -131.25 -57.7 -127.25 -57.7 -124.6 -60.45 -123.05 -62.05 -122.6 -63.55 -121.75 -65.85 -120.05 -66.75 M-123.65 -53.0 L-122.75 -54.0 -121.25 -55.25 -119.5 -57.1 -117.9 -58.8 -117.8 -60.1 -117.35 -64.3 -117.2 -64.3 Q-116.6 -62.8 -116.6 -62.05 -116.6 -61.05 -117.15 -59.1 L-117.2 -58.9 -117.2 -58.75 -117.4 -58.05 -117.95 -56.1 -118.15 -56.05 -118.15 -55.9 Q-118.15 -54.85 -119.95 -52.7 L-122.45 -50.3 Q-123.5 -49.55 -124.35 -49.3 L-123.8 -49.9 Q-122.95 -50.85 -121.65 -52.55 L-121.65 -52.6 Q-118.7 -55.15 -118.7 -56.3 L-118.7 -56.6 -118.2 -56.2 -118.05 -57.3 -118.7 -56.7 -118.85 -57.25 -122.5 -53.95 -123.65 -53.0 M-100.85 -55.55 L-101.85 -56.45 Q-103.3 -57.9 -103.6 -59.25 L-103.4 -59.25 -100.75 -56.9 Q-98.9 -55.4 -98.35 -54.55 L-98.45 -54.4 -99.35 -54.65 -100.4 -55.75 Q-100.7 -55.75 -100.85 -55.55 M-99.6 -56.85 L-100.0 -57.3 -102.5 -60.7 -102.25 -60.7 Q-101.65 -59.6 -99.6 -57.95 L-99.5 -57.85 -100.25 -58.0 -99.6 -56.85 M-79.35 -67.5 Q-78.4 -67.4 -78.4 -66.25 -78.4 -65.9 -78.75 -65.45 -79.3 -64.8 -80.2 -64.95 L-80.0 -62.35 Q-80.0 -61.75 -80.45 -61.35 -80.75 -61.1 -81.0 -61.05 L-81.2 -60.85 Q-81.65 -60.45 -82.25 -60.45 L-83.0 -60.55 Q-83.1 -60.15 -84.65 -59.0 -86.15 -57.85 -86.8 -57.55 L-87.05 -57.75 Q-87.1 -58.55 -85.7 -59.75 -84.6 -60.7 -83.75 -61.05 L-84.7 -61.6 Q-85.15 -61.6 -87.1 -59.35 -89.1 -57.1 -93.5 -57.1 -96.45 -57.1 -99.6 -59.55 L-102.85 -62.05 -103.35 -61.75 Q-103.45 -61.5 -103.85 -61.5 L-104.45 -61.65 -104.65 -61.95 -104.75 -62.6 Q-104.75 -63.4 -104.3 -63.75 -103.65 -64.3 -101.75 -64.3 L-101.25 -64.1 -98.7 -62.05 Q-96.25 -59.8 -93.35 -59.8 -90.2 -59.8 -88.7 -61.2 -87.9 -62.0 -86.8 -63.55 -86.05 -64.2 -84.8 -64.1 L-83.9 -63.95 -83.1 -63.7 -82.9 -63.6 -83.0 -64.35 Q-83.0 -65.45 -82.4 -66.2 L-81.65 -66.85 -80.7 -67.3 -79.35 -67.5 M-101.8 -52.95 Q-102.3 -53.45 -104.0 -56.7 -105.8 -60.15 -105.8 -61.0 -105.8 -61.75 -105.55 -61.5 -104.5 -60.45 -103.4 -57.8 L-101.7 -53.6 -101.8 -52.95 M-108.5 -58.45 L-107.0 -53.95 -107.0 -52.3 -107.3 -52.2 -108.05 -54.55 -108.8 -57.55 -108.65 -58.45 -108.5 -58.45 M-104.75 -53.65 L-105.95 -56.0 Q-107.45 -58.9 -107.45 -59.6 L-107.3 -61.45 -107.05 -61.5 -105.1 -57.2 -104.25 -55.1 Q-104.75 -54.65 -104.75 -53.7 L-104.75 -53.65 M-83.65 -58.0 L-82.45 -58.95 Q-81.55 -59.5 -80.65 -59.25 L-82.25 -58.0 -83.65 -58.0 M-144.2 -60.7 Q-143.2 -61.2 -141.45 -59.5 -140.1 -58.15 -139.25 -56.65 L-139.15 -56.55 -139.65 -56.5 Q-140.7 -56.5 -142.35 -58.0 -143.95 -59.5 -144.2 -60.7 M-122.75 -55.05 Q-122.75 -54.6 -123.45 -54.1 -124.15 -53.55 -125.15 -53.35 L-125.5 -53.4 -125.65 -53.95 -125.0 -54.9 -123.4 -55.6 -122.95 -55.55 -122.75 -55.05" fill="#ffc773" fill-rule="evenodd" stroke="none"/>
    <path d="M-99.5 -75.65 L-99.45 -75.25 -98.95 -75.2 -98.6 -75.35 -97.9 -75.9 -97.15 -76.2 -97.3 -75.3 -97.3 -74.9 Q-98.85 -74.4 -98.85 -73.85 L-98.65 -73.6 -96.35 -74.25 -96.05 -74.25 -94.95 -74.3 Q-95.85 -73.95 -96.3 -73.4 -99.1 -72.6 -99.1 -71.55 -99.1 -71.25 -98.65 -71.25 L-96.9 -72.0 -95.7 -72.4 -94.9 -72.7 Q-92.2 -73.6 -90.0 -73.6 L-89.9 -73.6 -89.7 -73.45 -89.25 -73.3 -89.0 -73.25 -88.3 -73.4 -88.1 -73.4 Q-87.75 -73.4 -87.75 -73.8 L-88.0 -74.3 Q-88.15 -75.55 -89.9 -75.55 L-89.65 -75.85 Q-89.65 -77.2 -91.25 -77.65 L-91.05 -77.75 Q-91.05 -78.4 -92.4 -78.4 -94.15 -78.4 -96.8 -77.45 -99.5 -76.4 -99.5 -75.65 M-102.2 -70.1 L-102.35 -70.95 Q-102.35 -74.65 -99.55 -77.0 -97.0 -79.1 -93.35 -79.2 -89.7 -79.35 -87.2 -77.25 -84.6 -75.1 -84.4 -71.35 L-84.55 -71.15 -84.45 -70.6 -84.0 -70.6 Q-81.65 -70.45 -81.65 -69.5 -81.65 -68.65 -82.3 -68.15 -83.0 -67.6 -84.2 -67.6 L-84.6 -67.6 Q-84.85 -66.8 -85.3 -66.4 -85.7 -66.05 -86.3 -66.05 L-86.4 -66.05 Q-89.1 -62.7 -93.5 -62.7 -98.3 -62.7 -100.75 -66.6 L-101.65 -66.6 Q-103.8 -66.6 -104.35 -67.45 -104.6 -67.85 -104.45 -68.35 -104.45 -69.0 -103.5 -69.4 -102.8 -69.7 -102.2 -70.1 M-97.4 -71.25 L-97.8 -71.05 Q-100.85 -69.4 -100.85 -68.55 -100.85 -68.2 -100.4 -68.2 L-100.25 -68.2 -99.05 -67.8 -93.2 -67.45 -93.15 -67.45 -91.3 -67.4 Q-93.25 -66.75 -93.25 -66.3 L-93.15 -65.85 -93.05 -65.8 -91.6 -65.6 Q-90.55 -65.6 -89.2 -66.25 -87.8 -66.9 -87.8 -67.5 L-87.8 -67.8 -86.4 -68.2 -86.25 -68.2 Q-85.6 -68.2 -85.6 -68.75 -85.6 -69.6 -87.3 -71.05 L-87.45 -71.2 Q-89.45 -72.9 -91.8 -72.9 -94.3 -72.9 -97.4 -71.25 M-130.65 -75.85 L-131.4 -75.75 Q-136.7 -74.95 -136.7 -73.3 L-136.65 -73.15 -136.35 -73.1 -135.25 -73.6 -135.15 -73.3 -134.7 -73.2 -134.15 -73.3 -131.55 -73.45 Q-129.3 -73.45 -127.25 -72.4 L-125.5 -71.35 Q-124.85 -71.35 -124.85 -71.95 -124.85 -72.85 -129.0 -74.25 L-128.2 -74.25 -126.75 -74.0 -126.35 -74.1 -126.25 -74.05 Q-125.95 -74.05 -125.8 -74.3 L-125.7 -74.55 Q-125.7 -75.3 -127.55 -76.15 L-131.35 -77.55 Q-133.05 -77.7 -134.5 -77.0 -135.8 -76.4 -135.8 -75.85 -135.8 -75.3 -135.3 -75.3 -134.75 -75.9 -132.7 -75.9 L-130.65 -75.85 M-126.85 -71.25 L-129.55 -72.0 -134.05 -71.8 Q-135.25 -71.45 -136.3 -70.75 -137.6 -69.9 -138.75 -68.5 L-137.9 -67.8 Q-131.35 -66.4 -125.05 -67.8 L-124.75 -68.2 Q-124.75 -70.35 -126.85 -71.25 M-130.5 -70.0 Q-131.9 -70.0 -132.55 -69.4 L-133.55 -68.5 Q-134.05 -68.75 -134.05 -69.15 -134.05 -71.05 -131.1 -71.4 -128.15 -71.75 -128.15 -69.7 -128.15 -68.9 -128.75 -68.9 -129.3 -68.9 -129.8 -69.45 L-130.5 -70.0 M-131.4 -78.4 Q-127.95 -78.55 -125.6 -76.7 -122.95 -74.6 -122.95 -70.9 L-122.95 -70.1 Q-119.9 -69.9 -119.9 -67.8 -119.9 -66.05 -122.75 -66.05 L-124.2 -66.25 -124.65 -65.55 Q-127.3 -61.95 -132.9 -61.95 -137.35 -61.95 -139.05 -65.95 L-139.2 -66.45 Q-140.9 -66.45 -141.65 -67.6 L-142.1 -68.8 Q-142.1 -70.75 -139.75 -70.65 -139.65 -74.05 -137.15 -76.2 -134.8 -78.3 -131.4 -78.4 M-126.7 -66.4 L-127.5 -66.25 -131.3 -66.1 -135.4 -66.3 -136.55 -66.45 -136.1 -65.75 -130.1 -65.3 -134.75 -65.1 -135.45 -65.25 -135.4 -65.15 Q-135.55 -64.75 -135.25 -64.65 L-131.5 -64.55 -131.4 -64.55 -133.65 -63.75 -133.55 -63.7 -132.4 -63.55 -129.2 -64.2 Q-127.2 -64.8 -127.2 -65.15 -127.2 -65.4 -127.75 -65.4 L-127.7 -65.45 -126.75 -65.65 Q-125.9 -65.85 -125.9 -66.0 -125.9 -66.4 -126.7 -66.4 M-94.8 -69.2 L-95.0 -69.4 -95.05 -69.9 Q-95.05 -71.7 -92.15 -72.05 -89.25 -72.45 -89.25 -70.5 -89.25 -69.65 -90.0 -69.65 -90.6 -69.65 -90.7 -70.1 -90.75 -70.6 -91.85 -70.6 -92.95 -70.6 -93.45 -69.85 -94.0 -69.15 -94.4 -69.15 L-94.8 -69.2 M-87.5 -69.4 L-87.45 -69.35 -87.55 -69.35 -87.5 -69.4" fill="#6e450e" fill-rule="evenodd" stroke="none"/>
    <path d="M-97.4 -71.25 Q-94.3 -72.9 -91.8 -72.9 -89.45 -72.9 -87.45 -71.2 -87.6 -70.15 -89.55 -69.45 -91.4 -68.8 -93.95 -68.8 L-96.6 -69.15 Q-97.65 -69.5 -97.65 -70.5 L-97.4 -71.25 M-126.85 -71.25 L-126.65 -70.35 Q-126.65 -69.3 -128.45 -68.4 -130.3 -67.45 -132.5 -67.45 -136.65 -67.45 -136.65 -69.6 -136.65 -70.25 -136.3 -70.75 -135.25 -71.45 -134.05 -71.8 L-129.55 -72.0 -126.85 -71.25 M-130.5 -70.0 L-129.8 -69.45 Q-129.3 -68.9 -128.75 -68.9 -128.15 -68.9 -128.15 -69.7 -128.15 -71.75 -131.1 -71.4 -134.05 -71.05 -134.05 -69.15 -134.05 -68.75 -133.55 -68.5 L-132.55 -69.4 Q-131.9 -70.0 -130.5 -70.0 M-94.8 -69.2 L-94.4 -69.15 Q-94.0 -69.15 -93.45 -69.85 -92.95 -70.6 -91.85 -70.6 -90.75 -70.6 -90.7 -70.1 -90.6 -69.65 -90.0 -69.65 -89.25 -69.65 -89.25 -70.5 -89.25 -72.45 -92.15 -72.05 -95.05 -71.7 -95.05 -69.9 L-95.0 -69.4 -94.8 -69.2" fill="#ffd699" fill-rule="evenodd" stroke="none"/>
    <path d="M-99.5 -75.65 Q-99.5 -76.4 -96.8 -77.45 -94.15 -78.4 -92.4 -78.4 -91.05 -78.4 -91.05 -77.75 L-91.25 -77.65 Q-89.65 -77.2 -89.65 -75.85 L-89.9 -75.55 Q-88.15 -75.55 -88.0 -74.3 L-87.75 -73.8 Q-87.75 -73.4 -88.1 -73.4 L-88.3 -73.4 -89.0 -73.25 -89.25 -73.3 -89.7 -73.45 -89.9 -73.6 -90.0 -73.6 Q-92.2 -73.6 -94.9 -72.7 L-95.7 -72.4 -96.9 -72.0 -98.65 -71.25 Q-99.1 -71.25 -99.1 -71.55 -99.1 -72.6 -96.3 -73.4 -95.85 -73.95 -94.95 -74.3 L-96.05 -74.25 -96.35 -74.25 -98.65 -73.6 -98.85 -73.85 Q-98.85 -74.4 -97.3 -74.9 L-97.3 -75.3 -97.15 -76.2 -97.9 -75.9 -98.6 -75.35 -98.95 -75.2 -99.45 -75.25 -99.5 -75.65 M-87.8 -67.8 L-87.8 -67.5 Q-87.8 -66.9 -89.2 -66.25 -90.55 -65.6 -91.6 -65.6 L-93.05 -65.8 -93.15 -65.85 -93.25 -66.3 Q-93.25 -66.75 -91.3 -67.4 L-89.5 -67.55 -87.8 -67.8 M-130.65 -75.85 L-132.7 -75.9 Q-134.75 -75.9 -135.3 -75.3 -135.8 -75.3 -135.8 -75.85 -135.8 -76.4 -134.5 -77.0 -133.05 -77.7 -131.35 -77.55 L-127.55 -76.15 Q-125.7 -75.3 -125.7 -74.55 L-125.8 -74.3 Q-125.95 -74.05 -126.25 -74.05 L-126.35 -74.1 -126.75 -74.0 -128.2 -74.25 -129.0 -74.25 Q-124.85 -72.85 -124.85 -71.95 -124.85 -71.35 -125.5 -71.35 L-127.25 -72.4 Q-129.3 -73.45 -131.55 -73.45 L-134.15 -73.3 -134.7 -73.2 -135.15 -73.3 -135.25 -73.6 -136.35 -73.1 -136.65 -73.15 -136.7 -73.3 Q-136.7 -74.95 -131.4 -75.75 L-130.65 -75.85 M-126.7 -66.4 Q-125.9 -66.4 -125.9 -66.0 -125.9 -65.85 -126.75 -65.65 L-127.7 -65.45 -127.75 -65.4 Q-127.2 -65.4 -127.2 -65.15 -127.2 -64.8 -129.2 -64.2 L-132.4 -63.55 -133.55 -63.7 -133.65 -63.75 -131.4 -64.55 -131.5 -64.55 -135.25 -64.65 Q-135.55 -64.75 -135.4 -65.15 L-135.45 -65.25 -134.75 -65.1 -130.1 -65.3 -136.1 -65.75 -136.55 -66.45 -135.4 -66.3 -131.3 -66.1 -127.5 -66.25 -126.7 -66.4" fill="#8a5611" fill-rule="evenodd" stroke="none"/>
    <path d="M-91.3 -67.4 L-93.15 -67.45 -93.2 -67.45 -99.05 -67.8 -100.25 -68.2 -100.4 -68.2 Q-100.85 -68.2 -100.85 -68.55 -100.85 -69.4 -97.8 -71.05 L-97.4 -71.25 -97.65 -70.5 Q-97.65 -69.5 -96.6 -69.15 L-93.95 -68.8 Q-91.4 -68.8 -89.55 -69.45 -87.6 -70.15 -87.45 -71.2 L-87.3 -71.05 Q-85.6 -69.6 -85.6 -68.75 -85.6 -68.2 -86.25 -68.2 L-86.4 -68.2 -87.8 -67.8 -89.5 -67.55 -91.3 -67.4 M-136.3 -70.75 Q-136.65 -70.25 -136.65 -69.6 -136.65 -67.45 -132.5 -67.45 -130.3 -67.45 -128.45 -68.4 -126.65 -69.3 -126.65 -70.35 L-126.85 -71.25 Q-124.75 -70.35 -124.75 -68.2 L-125.05 -67.8 Q-131.35 -66.4 -137.9 -67.8 L-138.75 -68.5 Q-137.6 -69.9 -136.3 -70.75 M-87.5 -69.4 L-87.55 -69.35 -87.45 -69.35 -87.5 -69.4" fill="#d6b380" fill-rule="evenodd" stroke="none"/>
    <path d="M-112.65 -78.7 Q-110.65 -79.55 -109.5 -78.5 -108.2 -77.4 -108.2 -74.65 L-108.8 -69.75 -109.4 -65.65 -109.65 -60.45 -109.9 -56.9 Q-109.9 -54.3 -108.15 -51.15 L-106.55 -51.15 Q-104.15 -50.95 -102.45 -49.55 -100.6 -48.05 -100.6 -45.8 L-100.7 -44.85 -100.7 -44.8 -101.7 -43.5 Q-103.15 -43.8 -104.9 -43.1 -109.3 -41.3 -109.65 -36.35 -110.7 -35.3 -112.05 -35.1 -112.35 -34.9 -112.7 -34.9 L-113.35 -35.1 Q-114.75 -35.35 -115.45 -36.8 -115.5 -38.35 -116.35 -40.3 -117.8 -43.6 -120.65 -43.6 L-122.4 -43.5 -122.6 -45.1 Q-122.6 -47.8 -120.9 -49.4 -119.5 -50.65 -117.5 -50.8 L-116.85 -52.1 Q-114.7 -56.3 -114.7 -60.0 L-114.75 -66.1 -114.75 -74.35 Q-114.7 -77.85 -112.65 -78.7 M-87.2 -53.35 Q-87.2 -52.15 -88.15 -48.85 -89.05 -45.9 -90.25 -43.25 L-88.4 -43.35 Q-84.5 -43.3 -84.5 -40.5 L-84.6 -40.15 -84.8 -39.9 Q-85.25 -40.2 -85.8 -41.45 -86.5 -42.55 -88.15 -42.55 L-90.45 -42.1 -90.9 -41.9 -91.7 -40.5 -93.9 -37.15 -93.55 -36.9 Q-92.95 -36.2 -92.95 -35.1 -92.95 -34.8 -93.65 -33.4 -94.45 -31.9 -94.85 -31.9 L-95.3 -32.05 -95.35 -32.45 -94.75 -33.65 -94.15 -35.2 -94.8 -35.8 -94.95 -35.85 Q-97.75 -32.7 -101.2 -30.95 -100.15 -30.05 -100.15 -28.95 L-100.55 -27.1 Q-101.0 -25.55 -101.45 -25.2 -101.9 -25.35 -101.9 -25.8 L-101.5 -27.1 Q-101.15 -28.3 -101.15 -28.9 -101.15 -29.6 -102.05 -30.35 L-102.2 -30.5 Q-104.3 -29.6 -106.6 -29.2 L-105.1 -26.45 Q-105.1 -25.65 -106.2 -24.85 L-108.05 -23.05 Q-108.35 -22.5 -108.3 -21.45 L-108.2 -19.65 -108.2 -19.55 Q-106.85 -20.1 -106.4 -18.3 -106.25 -17.55 -106.25 -14.8 L-106.25 -12.4 -106.75 -9.25 -107.05 -9.25 -107.2 -13.85 Q-107.15 -16.85 -107.5 -18.45 L-108.2 -18.6 -108.2 -13.05 Q-108.2 -12.9 -108.35 -12.65 L-108.65 -12.4 Q-109.6 -12.4 -109.4 -16.15 L-109.15 -21.4 Q-109.15 -24.15 -107.8 -25.1 -106.45 -26.0 -106.45 -26.4 L-107.95 -29.0 -110.3 -28.9 -113.8 -29.05 -114.35 -27.85 Q-115.35 -25.75 -116.8 -25.75 -118.3 -25.75 -118.85 -26.95 L-119.15 -28.35 Q-119.15 -29.05 -118.75 -29.9 L-118.65 -30.05 -121.15 -30.95 Q-121.85 -30.35 -122.4 -28.95 L-123.05 -26.45 -121.35 -24.3 Q-119.65 -22.35 -119.6 -21.4 L-119.25 -18.45 -119.05 -16.25 Q-119.05 -14.25 -119.6 -13.9 -120.2 -15.1 -120.4 -17.0 L-120.5 -20.2 Q-120.45 -22.0 -122.25 -23.6 -124.0 -25.25 -124.0 -26.4 -124.0 -28.65 -122.5 -31.2 L-122.3 -31.5 Q-124.95 -32.85 -127.15 -34.9 L-128.4 -33.45 -129.75 -31.9 Q-130.4 -31.9 -130.3 -32.5 -130.3 -33.1 -129.4 -34.15 L-129.5 -34.3 -129.95 -35.0 -131.0 -33.9 Q-132.25 -32.75 -132.65 -32.5 L-132.65 -32.45 -132.7 -32.7 -131.55 -34.35 Q-131.4 -35.2 -130.15 -35.4 -129.15 -35.55 -128.65 -35.0 L-128.3 -35.4 -127.95 -35.65 Q-129.7 -37.45 -131.1 -39.7 L-132.1 -38.85 Q-132.65 -38.85 -133.55 -40.0 L-134.2 -39.15 Q-134.7 -38.45 -134.9 -38.4 -135.35 -38.6 -135.35 -39.05 -135.35 -39.6 -133.6 -41.25 -133.15 -41.25 -132.7 -40.8 L-132.25 -40.35 -131.75 -40.7 Q-134.6 -45.75 -135.2 -51.1 L-135.1 -52.3 Q-134.9 -52.9 -134.2 -52.9 -133.95 -52.9 -132.95 -49.65 L-132.05 -47.0 -132.05 -47.05 Q-131.45 -47.8 -130.7 -47.8 L-129.7 -47.55 -128.3 -47.35 Q-127.7 -47.35 -126.55 -48.65 -125.6 -49.75 -124.85 -49.3 -124.7 -49.3 -124.7 -48.9 -124.7 -48.3 -126.2 -47.25 -127.75 -46.2 -128.75 -46.2 L-129.7 -46.4 -130.4 -46.65 Q-130.75 -46.65 -131.2 -46.05 L-131.5 -45.65 -130.3 -43.2 Q-129.75 -43.65 -128.3 -43.9 -125.95 -44.3 -125.95 -41.85 -125.95 -40.9 -126.25 -40.55 L-127.6 -39.2 -125.1 -36.75 -123.95 -37.55 -122.0 -38.35 Q-121.9 -38.4 -121.9 -38.05 -121.9 -37.65 -123.0 -36.95 L-124.15 -36.05 -124.15 -36.0 Q-118.6 -32.05 -110.3 -32.05 -105.4 -32.05 -101.45 -34.25 L-102.05 -35.55 Q-102.05 -36.1 -99.9 -37.7 -97.75 -39.3 -97.75 -39.75 L-98.0 -40.85 -98.3 -42.1 -97.35 -43.55 Q-96.3 -44.6 -95.6 -44.65 -95.5 -44.7 -95.5 -44.35 L-96.35 -43.15 -97.25 -42.0 -96.7 -39.65 Q-96.7 -38.7 -101.0 -35.65 L-100.55 -34.8 Q-98.65 -36.05 -96.95 -37.85 -94.6 -40.4 -92.3 -45.1 L-92.1 -45.5 -93.25 -45.4 Q-94.35 -45.4 -95.45 -46.9 L-95.45 -47.4 Q-93.9 -47.4 -93.75 -47.0 -93.55 -46.65 -91.9 -46.65 L-91.6 -46.65 -91.05 -48.55 -90.25 -52.0 Q-89.35 -55.65 -88.25 -55.85 -87.2 -56.05 -87.2 -53.35 M-127.75 -43.0 Q-128.3 -43.0 -129.75 -42.25 L-128.15 -39.85 -127.7 -40.4 Q-126.95 -41.3 -126.95 -41.7 L-127.1 -42.4 Q-127.35 -43.0 -127.75 -43.0 M-114.8 -42.85 Q-114.5 -41.2 -113.3 -41.2 -112.75 -41.2 -112.25 -41.85 -111.85 -42.45 -111.85 -42.95 -111.85 -44.0 -113.3 -44.2 -114.8 -44.4 -114.8 -42.85 M-114.8 -46.05 Q-114.5 -46.65 -114.5 -47.15 -114.5 -48.8 -116.45 -48.8 -118.45 -48.8 -118.45 -46.9 -118.45 -45.25 -116.15 -45.25 -115.3 -45.25 -114.8 -46.05 M-110.4 -46.05 Q-109.35 -46.05 -108.75 -46.9 -108.35 -47.55 -108.35 -48.2 -108.35 -50.4 -110.75 -50.65 -113.15 -50.9 -113.15 -48.2 L-112.9 -47.1 Q-112.25 -46.05 -110.4 -46.05 M-108.7 -44.35 L-108.65 -43.75 Q-108.4 -43.3 -107.6 -43.3 L-106.85 -43.55 Q-106.45 -43.9 -106.45 -44.4 -106.45 -45.6 -107.55 -45.55 -108.7 -45.5 -108.7 -44.35 M-116.9 -26.8 Q-115.65 -26.8 -115.05 -28.6 L-114.85 -29.2 -117.85 -29.8 -118.25 -28.5 Q-118.25 -27.95 -117.85 -27.4 -117.45 -26.8 -116.9 -26.8 M-115.9 -21.1 Q-116.45 -20.95 -116.45 -19.45 L-116.15 -16.9 -115.7 -14.2 -116.0 -14.05 Q-117.1 -16.25 -117.1 -19.5 -117.1 -22.75 -115.5 -21.6 -113.85 -20.45 -113.75 -16.8 L-113.9 -16.7 -114.2 -16.65 -114.8 -16.8 -115.1 -19.0 Q-115.35 -20.35 -115.9 -21.1" fill="#c7780e" fill-rule="evenodd" stroke="none"/>
    <path d="M-108.7 -44.35 Q-108.7 -45.5 -107.55 -45.55 -106.45 -45.6 -106.45 -44.4 -106.45 -43.9 -106.85 -43.55 L-107.6 -43.3 Q-108.4 -43.3 -108.65 -43.75 L-108.7 -44.35 M-110.4 -46.05 Q-112.25 -46.05 -112.9 -47.1 L-113.15 -48.2 Q-113.15 -50.9 -110.75 -50.65 -108.35 -50.4 -108.35 -48.2 -108.35 -47.55 -108.75 -46.9 -109.35 -46.05 -110.4 -46.05 M-114.8 -46.05 Q-115.3 -45.25 -116.15 -45.25 -118.45 -45.25 -118.45 -46.9 -118.45 -48.8 -116.45 -48.8 -114.5 -48.8 -114.5 -47.15 -114.5 -46.65 -114.8 -46.05 M-114.8 -42.85 Q-114.8 -44.4 -113.3 -44.2 -111.85 -44.0 -111.85 -42.95 -111.85 -42.45 -112.25 -41.85 -112.75 -41.2 -113.3 -41.2 -114.5 -41.2 -114.8 -42.85" fill="#ab670c" fill-rule="evenodd" stroke="none"/>
    <path d="M-93.6 -53.65 Q-91.25 -57.15 -88.1 -55.55 -84.4 -53.7 -83.35 -50.1 L-84.15 -49.8 Q-88.7 -52.4 -94.1 -51.55 L-94.35 -52.45 -93.6 -53.65 M-127.75 -52.45 L-128.0 -51.55 Q-133.4 -52.4 -137.95 -49.8 L-138.75 -50.1 Q-137.7 -53.7 -134.0 -55.55 -130.85 -57.15 -128.5 -53.65 L-127.75 -52.45" fill="#a86915" fill-rule="evenodd" stroke="none"/>
    <path d="M-129.9 -129.75 L-135.4 -125.6 -135.5 -125.7 -134.95 -126.15 -130.0 -129.9 -129.9 -129.75" fill="#450f0f" fill-rule="evenodd" stroke="none"/>
    <path d="M-109.85 -181.5 Q-103.15 -179.25 -96.8 -173.05 L-99.15 -173.7 Q-126.75 -178.7 -145.2 -159.85 -149.3 -155.7 -152.9 -150.4 -152.05 -155.45 -150.15 -159.85 -148.2 -164.4 -145.1 -168.2 L-145.4 -167.3 -146.3 -164.0 -146.1 -163.75 -132.15 -172.5 Q-124.6 -176.5 -114.9 -176.5 L-108.8 -176.0 -104.5 -175.25 -104.3 -175.35 Q-106.4 -178.3 -107.9 -179.8 L-109.85 -181.5 M-98.9 -169.95 Q-94.25 -168.6 -89.5 -166.0 -85.05 -163.55 -81.5 -159.85 L-80.35 -158.55 Q-90.1 -160.65 -99.95 -159.35 -109.35 -158.35 -118.25 -156.15 -115.75 -157.65 -111.15 -159.65 L-110.7 -159.85 Q-102.15 -163.55 -95.15 -163.95 L-95.2 -164.6 -95.25 -165.15 -95.5 -165.65 -97.8 -168.75 -98.9 -169.95 M-131.75 -152.0 Q-145.3 -147.05 -157.7 -139.0 -150.0 -151.15 -138.85 -159.85 L-135.1 -162.6 -135.15 -162.55 -137.7 -159.85 -138.0 -159.15 -134.6 -155.2 -131.75 -152.0 M-170.65 -118.85 Q-170.45 -115.35 -169.05 -113.2 -167.6 -111.0 -165.5 -111.0 -161.95 -111.0 -157.9 -114.25 -156.25 -115.55 -153.3 -118.8 -150.5 -121.8 -141.2 -127.3 -131.35 -133.05 -128.1 -134.3 -124.4 -135.75 -117.85 -137.05 -124.25 -133.9 -130.0 -129.9 L-134.95 -126.15 -135.5 -125.7 Q-146.2 -117.05 -154.35 -105.1 L-157.1 -100.45 Q-160.55 -93.8 -161.25 -86.45 -161.55 -83.35 -161.35 -80.15 L-164.7 -84.0 Q-167.15 -87.05 -169.15 -90.45 -173.7 -98.3 -173.35 -106.95 -173.1 -112.4 -170.9 -118.2 L-170.65 -118.85 M-135.4 -125.6 L-138.0 -122.4 Q-141.5 -118.0 -142.25 -116.6 -143.3 -114.6 -144.25 -111.4 -145.35 -107.85 -145.35 -106.0 -145.35 -104.05 -144.25 -103.4 -143.35 -102.85 -141.05 -102.85 -139.85 -102.85 -132.9 -104.9 L-135.7 -102.65 -141.7 -97.05 -142.45 -96.3 Q-151.05 -87.75 -158.2 -77.8 -158.8 -79.45 -158.6 -80.95 L-157.05 -89.1 Q-154.35 -100.05 -148.25 -110.05 L-148.0 -110.45 -144.0 -116.4 Q-140.2 -121.55 -135.4 -125.6 M-58.5 -111.65 L-56.6 -111.0 -55.5 -111.0 Q-53.8 -121.4 -53.8 -126.55 -53.8 -128.4 -55.0 -131.35 -50.15 -125.45 -49.3 -117.25 -48.35 -108.0 -51.55 -99.2 -52.3 -102.95 -54.2 -106.15 -56.1 -109.25 -58.5 -111.65 M-63.3 -111.3 Q-60.65 -109.1 -58.75 -106.0 L-56.55 -101.6 Q-55.5 -98.9 -54.95 -95.95 L-54.55 -92.1 -56.35 -89.1 Q-63.15 -79.25 -71.4 -70.7 -71.5 -75.3 -72.85 -79.4 -76.25 -89.7 -87.5 -96.5 -92.85 -99.7 -98.8 -100.65 -120.55 -104.05 -139.0 -90.75 -148.25 -83.95 -151.15 -73.95 L-151.9 -70.9 -155.9 -74.85 Q-155.8 -78.3 -147.3 -88.85 -144.7 -92.15 -140.8 -95.25 -137.45 -98.05 -133.15 -100.7 -126.25 -104.95 -116.95 -109.05 -107.75 -113.1 -98.35 -114.9 L-100.8 -113.7 Q-105.3 -111.4 -106.5 -110.3 L-100.55 -111.0 -94.3 -111.5 Q-86.5 -111.5 -74.6 -108.4 L-72.85 -107.9 Q-61.7 -104.8 -59.9 -101.05 L-59.75 -101.15 -61.6 -107.0 Q-62.35 -109.55 -63.3 -111.3 M-140.7 -188.8 L-140.5 -187.8 -140.0 -186.7 Q-146.1 -181.45 -150.2 -174.35 L-146.25 -182.85 Q-144.2 -186.9 -140.7 -188.8 M-143.25 -179.9 L-144.0 -178.5 -140.35 -176.9 Q-146.75 -171.5 -151.45 -163.25 -149.4 -171.0 -144.9 -177.65 L-143.25 -179.9" fill="#621515" fill-rule="evenodd" stroke="none"/>
    <path d="M-109.85 -181.5 L-107.9 -179.8 Q-106.4 -178.3 -104.3 -175.35 L-104.5 -175.25 -108.8 -176.0 -114.9 -176.5 Q-124.6 -176.5 -132.15 -172.5 L-146.1 -163.75 -146.3 -164.0 -145.4 -167.3 -145.1 -168.2 Q-141.4 -172.8 -136.1 -176.35 -123.7 -184.7 -112.35 -182.2 L-109.85 -181.5 M-98.9 -169.95 L-97.8 -168.75 -95.5 -165.65 -95.25 -165.15 -95.2 -164.6 -95.15 -163.95 Q-102.15 -163.55 -110.7 -159.85 L-111.15 -159.65 Q-115.75 -157.65 -118.25 -156.15 -125.15 -154.45 -131.75 -152.0 L-134.6 -155.2 -138.0 -159.15 -137.7 -159.85 -135.15 -162.55 -135.1 -162.6 -131.75 -164.8 Q-115.6 -174.95 -98.9 -169.95 M-146.75 -142.4 Q-137.7 -147.3 -127.95 -150.55 -107.0 -157.5 -85.4 -154.65 L-83.95 -155.4 -78.0 -152.7 Q-75.35 -151.5 -72.85 -150.1 -64.8 -145.7 -57.8 -139.6 L-57.95 -139.45 Q-65.3 -142.9 -72.85 -144.4 -90.4 -147.9 -108.95 -140.9 -113.55 -139.15 -117.85 -137.05 -124.4 -135.75 -128.1 -134.3 -131.35 -133.05 -141.2 -127.3 -150.5 -121.8 -153.3 -118.8 -156.25 -115.55 -157.9 -114.25 -161.95 -111.0 -165.5 -111.0 -167.6 -111.0 -169.05 -113.2 -170.45 -115.35 -170.65 -118.85 -165.45 -131.65 -146.7 -142.25 L-146.75 -142.4 M-129.9 -129.75 Q-121.2 -135.5 -109.85 -138.3 L-108.25 -138.7 Q-87.35 -143.7 -75.0 -140.85 L-72.85 -140.35 Q-61.95 -137.7 -58.9 -135.25 -56.7 -133.45 -55.0 -131.35 -53.8 -128.4 -53.8 -126.55 -53.8 -121.4 -55.5 -111.0 L-56.6 -111.0 -58.5 -111.65 Q-64.25 -117.45 -72.85 -118.9 L-73.65 -119.05 Q-96.3 -122.6 -117.65 -113.75 -125.95 -110.4 -132.9 -104.9 -139.85 -102.85 -141.05 -102.85 -143.35 -102.85 -144.25 -103.4 -145.35 -104.05 -145.35 -106.0 -145.35 -107.85 -144.25 -111.4 -143.3 -114.6 -142.25 -116.6 -141.5 -118.0 -138.0 -122.4 L-135.4 -125.6 -129.9 -129.75 M-63.3 -111.3 Q-62.35 -109.55 -61.6 -107.0 L-59.75 -101.15 -59.9 -101.05 Q-61.7 -104.8 -72.85 -107.9 L-74.6 -108.4 Q-86.5 -111.5 -94.3 -111.5 L-100.55 -111.0 -106.5 -110.3 Q-105.3 -111.4 -100.8 -113.7 L-98.35 -114.9 Q-85.75 -117.3 -72.85 -115.65 L-72.25 -115.6 -70.65 -115.15 Q-66.45 -113.9 -63.3 -111.3 M-123.7 -164.0 L-123.6 -164.1 -123.7 -164.0 M-140.0 -186.7 L-140.5 -187.8 -140.7 -188.8 Q-138.25 -190.2 -135.1 -190.5 -137.7 -188.75 -140.0 -186.7 M-140.35 -176.9 L-144.0 -178.5 -143.25 -179.9 Q-131.45 -195.0 -114.1 -187.3 -129.6 -186.15 -140.35 -176.9" fill="#851d1d" fill-rule="evenodd" stroke="none"/>
    <path d="M-123.7 -164.0 L-123.6 -164.1 -123.7 -164.0" fill="#b02626" fill-rule="evenodd" stroke="none"/>
    <path d="M-146.6 -71.85 L-148.9 -67.45 -148.15 -65.15 Q-156.15 -68.05 -162.2 -73.95 -165.45 -77.1 -168.1 -81.15 -171.1 -85.6 -173.35 -91.15 -183.6 -116.3 -164.25 -135.5 -161.8 -137.9 -159.95 -140.75 L-157.05 -145.2 Q-157.45 -152.7 -155.8 -159.85 -154.65 -164.9 -152.5 -169.8 -151.35 -196.1 -125.0 -194.55 -124.6 -194.65 -124.65 -194.35 L-124.65 -194.15 Q-110.15 -191.3 -99.1 -179.95 -90.5 -171.15 -80.0 -164.95 -76.5 -162.9 -74.25 -159.85 L-72.85 -157.55 -71.8 -155.15 Q-36.2 -135.95 -49.55 -97.2 L-51.15 -92.9 Q-55.85 -81.85 -64.3 -73.05 -69.2 -67.95 -73.3 -62.0 L-74.05 -60.9 -75.0 -60.7 -75.5 -65.35 Q-76.2 -70.0 -77.7 -73.95 -83.8 -89.8 -102.85 -94.9 -113.85 -98.0 -124.35 -92.75 -137.8 -85.85 -145.35 -73.95 L-146.6 -71.85 M-145.1 -168.2 Q-148.2 -164.4 -150.15 -159.85 -152.05 -155.45 -152.9 -150.4 -149.3 -155.7 -145.2 -159.85 -126.75 -178.7 -99.15 -173.7 L-96.8 -173.05 Q-103.15 -179.25 -109.85 -181.5 L-112.35 -182.2 Q-123.7 -184.7 -136.1 -176.35 -141.4 -172.8 -145.1 -168.2 M-118.25 -156.15 Q-109.35 -158.35 -99.95 -159.35 -90.1 -160.65 -80.35 -158.55 L-81.5 -159.85 Q-85.05 -163.55 -89.5 -166.0 -94.25 -168.6 -98.9 -169.95 -115.6 -174.95 -131.75 -164.8 L-135.1 -162.6 -138.85 -159.85 Q-150.0 -151.15 -157.7 -139.0 -145.3 -147.05 -131.75 -152.0 -125.15 -154.45 -118.25 -156.15 M-57.8 -139.6 Q-64.8 -145.7 -72.85 -150.1 -75.35 -151.5 -78.0 -152.7 L-83.95 -155.4 -85.4 -154.65 Q-107.0 -157.5 -127.95 -150.55 -137.7 -147.3 -146.75 -142.4 L-151.35 -139.8 -146.7 -142.25 Q-165.45 -131.65 -170.65 -118.85 L-170.9 -118.2 Q-173.1 -112.4 -173.35 -106.95 -173.7 -98.3 -169.15 -90.45 -167.15 -87.05 -164.7 -84.0 L-161.35 -80.15 Q-161.55 -83.35 -161.25 -86.45 -160.55 -93.8 -157.1 -100.45 L-154.35 -105.1 Q-146.2 -117.05 -135.5 -125.7 L-135.4 -125.6 Q-140.2 -121.55 -144.0 -116.4 L-148.0 -110.45 -148.25 -110.05 Q-154.35 -100.05 -157.05 -89.1 L-158.6 -80.95 Q-158.8 -79.45 -158.2 -77.8 -151.05 -87.75 -142.45 -96.3 L-141.7 -97.05 -135.7 -102.65 -132.9 -104.9 Q-125.95 -110.4 -117.65 -113.75 -96.3 -122.6 -73.65 -119.05 L-72.85 -118.9 Q-64.25 -117.45 -58.5 -111.65 -56.1 -109.25 -54.2 -106.15 -52.3 -102.95 -51.55 -99.2 -48.35 -108.0 -49.3 -117.25 -50.15 -125.45 -55.0 -131.35 -56.7 -133.45 -58.9 -135.25 -61.95 -137.7 -72.85 -140.35 L-75.0 -140.85 Q-87.35 -143.7 -108.25 -138.7 L-109.85 -138.3 Q-121.2 -135.5 -129.9 -129.75 L-130.0 -129.9 Q-124.25 -133.9 -117.85 -137.05 -113.55 -139.15 -108.95 -140.9 -90.4 -147.9 -72.85 -144.4 -65.3 -142.9 -57.95 -139.45 L-56.8 -138.7 -57.8 -139.6 M-98.35 -114.9 Q-107.75 -113.1 -116.95 -109.05 -126.25 -104.95 -133.15 -100.7 -137.45 -98.05 -140.8 -95.25 -144.7 -92.15 -147.3 -88.85 -155.8 -78.3 -155.9 -74.85 L-151.9 -70.9 -151.15 -73.95 Q-148.25 -83.95 -139.0 -90.75 -120.55 -104.05 -98.8 -100.65 -92.85 -99.7 -87.5 -96.5 -76.25 -89.7 -72.85 -79.4 -71.5 -75.3 -71.4 -70.7 -63.15 -79.25 -56.35 -89.1 L-54.55 -92.1 -54.95 -95.95 Q-55.5 -98.9 -56.55 -101.6 L-58.75 -106.0 Q-60.65 -109.1 -63.3 -111.3 -66.45 -113.9 -70.65 -115.15 L-72.25 -115.6 -72.85 -115.65 Q-85.75 -117.3 -98.35 -114.9 M-140.0 -186.7 Q-137.7 -188.75 -135.1 -190.5 -138.25 -190.2 -140.7 -188.8 -144.2 -186.9 -146.25 -182.85 L-150.2 -174.35 Q-146.1 -181.45 -140.0 -186.7 M-140.35 -176.9 Q-129.6 -186.15 -114.1 -187.3 -131.45 -195.0 -143.25 -179.9 L-144.9 -177.65 Q-149.4 -171.0 -151.45 -163.25 -146.75 -171.5 -140.35 -176.9" fill="#571313" fill-rule="evenodd" stroke="none"/>
    <path d="M-75.5 -65.35 Q-80.3 -71.9 -88.95 -77.3 -100.85 -84.75 -112.4 -84.75 -116.85 -84.75 -123.6 -83.25 -130.35 -81.8 -134.05 -80.0 -136.1 -79.0 -138.95 -77.2 L-144.05 -74.0 -146.6 -71.85 -145.35 -73.95 Q-137.8 -85.85 -124.35 -92.75 -113.85 -98.0 -102.85 -94.9 -83.8 -89.8 -77.7 -73.95 -76.2 -70.0 -75.5 -65.35" fill="#571313" fill-opacity="0.47058824" fill-rule="evenodd" stroke="none"/>
    <path d="M-135.0 -183.5 L-134.2 -185.15 Q-127.85 -197.5 -130.2 -201.55 -131.45 -203.65 -134.45 -203.8 L-132.75 -205.1 Q-130.55 -206.4 -128.0 -206.5 L-127.6 -205.45 Q-125.5 -191.75 -135.0 -183.5 M-142.2 -194.7 L-142.65 -194.0 -144.15 -192.0 -145.05 -194.85 Q-146.05 -197.55 -147.55 -200.2 -150.15 -204.65 -152.0 -206.25 -153.1 -207.15 -154.2 -207.25 -156.7 -209.45 -160.1 -212.1 L-164.25 -215.3 -164.2 -216.0 Q-164.05 -217.3 -161.95 -218.5 -159.95 -219.65 -157.15 -219.1 L-154.65 -218.35 -151.55 -216.8 Q-145.5 -209.0 -142.55 -199.65 -142.15 -198.25 -142.2 -194.7 M-157.2 -195.45 L-161.2 -196.8 -162.7 -197.2 -164.9 -198.2 Q-170.1 -200.55 -173.45 -201.15 L-171.75 -202.7 Q-169.75 -203.85 -167.75 -204.0 L-165.3 -203.65 -164.5 -202.9 -162.4 -200.85 -157.2 -195.45" fill="#9d5915" fill-rule="evenodd" stroke="none"/>
    <path d="M-128.0 -206.5 Q-130.55 -206.4 -132.75 -205.1 L-134.45 -203.8 -138.65 -203.25 Q-135.2 -207.4 -129.0 -206.95 -128.3 -206.9 -128.0 -206.5 M-151.55 -216.8 L-154.65 -218.35 -157.15 -219.1 Q-159.95 -219.65 -161.95 -218.5 -164.05 -217.3 -164.2 -216.0 L-164.25 -215.3 Q-169.55 -219.6 -170.7 -221.6 L-171.0 -222.15 -170.95 -222.25 Q-169.0 -225.95 -164.65 -225.2 -162.05 -224.75 -159.8 -223.75 -155.6 -221.9 -152.5 -218.15 L-151.55 -216.8 M-167.2 -205.45 L-165.3 -203.65 -167.75 -204.0 Q-169.75 -203.85 -171.75 -202.7 L-173.45 -201.15 -177.85 -200.85 -179.8 -199.2 Q-179.85 -201.5 -177.85 -203.95 -176.1 -206.2 -173.25 -206.05 L-167.2 -205.45" fill="#da7a1d" fill-rule="evenodd" stroke="none"/>
    <path d="M-134.45 -203.8 Q-131.45 -203.65 -130.2 -201.55 -127.85 -197.5 -134.2 -185.15 L-135.0 -183.5 -136.1 -182.65 -139.75 -180.2 Q-140.55 -179.75 -141.6 -179.8 L-147.3 -180.6 -146.25 -180.9 -144.1 -181.5 Q-143.4 -181.9 -140.0 -185.5 L-138.6 -187.05 -136.4 -189.55 Q-133.9 -195.1 -138.5 -194.3 -140.6 -193.95 -142.15 -193.2 -143.3 -192.6 -144.1 -191.85 L-144.15 -192.0 -142.65 -194.0 -142.2 -194.7 -142.2 -194.6 -142.15 -194.8 Q-140.95 -196.7 -140.45 -198.5 L-139.75 -201.8 -138.9 -202.95 -138.65 -203.25 -134.45 -203.8 M-164.25 -215.3 L-160.1 -212.1 Q-156.7 -209.45 -154.2 -207.25 -155.15 -207.3 -156.05 -206.8 -157.95 -205.7 -157.15 -202.5 -156.5 -200.2 -153.25 -193.6 -154.7 -194.55 -157.2 -195.45 L-162.4 -200.85 -164.5 -202.9 -165.3 -203.65 -167.2 -205.45 -166.55 -205.4 Q-175.5 -213.25 -171.0 -222.15 L-170.7 -221.6 Q-169.55 -219.6 -164.25 -215.3 M-162.7 -197.2 Q-166.95 -198.35 -167.95 -197.75 -169.0 -197.4 -169.7 -196.65 -171.2 -195.15 -170.05 -193.15 -168.95 -191.25 -160.55 -187.7 L-151.2 -183.95 -151.95 -182.85 -152.2 -181.65 Q-165.3 -185.05 -176.2 -193.45 -179.75 -196.15 -179.8 -199.2 L-177.85 -200.85 -173.45 -201.15 Q-170.1 -200.55 -164.9 -198.2 L-162.7 -197.2" fill="#6e450e" fill-rule="evenodd" stroke="none"/>
    <path d="M-144.15 -192.0 L-144.1 -191.85 Q-143.3 -192.6 -142.15 -193.2 -140.6 -193.95 -138.5 -194.3 -133.9 -195.1 -136.4 -189.55 L-138.6 -187.05 -140.0 -185.5 Q-143.4 -181.9 -144.1 -181.5 L-146.25 -180.9 -147.3 -180.6 -148.7 -180.15 Q-149.4 -179.75 -150.35 -179.85 -151.45 -180.05 -151.95 -180.9 L-152.2 -181.65 -151.95 -182.85 -151.2 -183.95 -160.55 -187.7 Q-168.95 -191.25 -170.05 -193.15 -171.2 -195.15 -169.7 -196.65 -169.0 -197.4 -167.95 -197.75 -166.95 -198.35 -162.7 -197.2 L-161.2 -196.8 -157.2 -195.45 Q-154.7 -194.55 -153.25 -193.6 -156.5 -200.2 -157.15 -202.5 -157.95 -205.7 -156.05 -206.8 -155.15 -207.3 -154.2 -207.25 -153.1 -207.15 -152.0 -206.25 -150.15 -204.65 -147.55 -200.2 -146.05 -197.55 -145.05 -194.85 L-144.15 -192.0" fill="#5e3a0c" fill-rule="evenodd" stroke="none"/>
  </g>
</svg>
