<?xml version="1.0" encoding="UTF-8" standalone="no"?>
<svg xmlns:xlink="http://www.w3.org/1999/xlink" height="76.55px" width="146.75px" xmlns="http://www.w3.org/2000/svg">
  <g transform="matrix(1.0, 0.0, 0.0, 1.0, -33.15, 0.55)">
    <path d="M51.45 7.7 L51.45 -0.55 53.45 -0.55 53.45 7.7 51.45 7.7 M145.7 8.25 L145.7 -0.55 148.2 -0.55 148.2 8.25 145.7 8.25" fill="#000000" fill-rule="evenodd" stroke="none"/>
    <path d="M176.6 25.6 L172.55 46.35 165.35 45.35 Q133.5 41.0 129.4 41.0 L112.9 41.8 73.75 45.75 Q51.45 48.0 34.95 51.5 L34.3 35.35 47.5 32.75 Q75.0 28.15 97.85 26.3 L146.15 24.5 176.6 25.6" fill="#474747" fill-rule="evenodd" stroke="none"/>
    <path d="M172.55 46.35 L171.0 54.35 166.25 53.35 Q145.5 49.0 139.0 49.0 132.85 49.0 119.45 51.5 101.75 54.85 78.5 61.5 66.6 64.9 54.8 69.25 L35.65 68.5 34.95 51.5 Q51.45 48.0 73.75 45.75 L112.9 41.8 129.4 41.0 Q133.5 41.0 165.35 45.35 L172.55 46.35" fill="#404040" fill-rule="evenodd" stroke="none"/>
    <path d="M124.3 8.1 L127.35 8.15 142.3 9.6 145.7 9.9 148.2 10.15 175.25 12.25 179.1 12.5 176.6 25.6 146.15 24.5 97.85 26.3 Q75.0 28.15 47.5 32.75 L34.3 35.35 33.85 24.4 34.0 24.25 39.4 19.35 Q39.75 19.1 41.4 19.75 L57.55 16.35 Q75.15 12.7 86.75 11.75 L114.25 9.1 124.3 8.1" fill="#4d4d4d" fill-rule="evenodd" stroke="none"/>
    <path d="M56.3 7.75 L124.3 8.1 114.25 9.1 86.75 11.75 Q75.15 12.7 57.55 16.35 L41.4 19.75 Q39.75 19.1 39.4 19.35 L34.0 24.25 33.85 24.4 33.55 17.1 Q40.05 13.95 51.45 9.55 L53.45 8.8 55.95 7.85 56.3 7.75 M127.35 8.15 L145.7 8.25 148.2 8.25 179.9 8.4 179.1 12.5 175.25 12.25 148.2 10.15 145.7 9.9 142.3 9.6 127.35 8.15" fill="#525252" fill-rule="evenodd" stroke="none"/>
    <path d="M171.0 54.35 L167.25 73.65 54.8 69.25 Q66.6 64.9 78.5 61.5 101.75 54.85 119.45 51.5 132.85 49.0 139.0 49.0 145.5 49.0 166.25 53.35 L171.0 54.35" fill="#373737" fill-rule="evenodd" stroke="none"/>
    <path d="M167.25 73.65 L163.4 76.0 37.0 69.5 35.65 68.5 54.8 69.25 167.25 73.65" fill="#262626" fill-rule="evenodd" stroke="none"/>
    <path d="M51.45 7.7 L53.45 7.7 56.3 7.75 55.95 7.85 53.45 8.8 51.45 9.55 Q40.05 13.95 33.55 17.1 L33.15 7.6 51.45 7.7" fill="#595959" fill-rule="evenodd" stroke="none"/>
    <path d="M143.2 13.25 Q143.8 13.3 144.25 13.85 144.2 14.4 143.4 14.95 142.65 15.45 142.55 15.95 142.15 18.5 141.8 24.7 L141.65 28.7 142.2 29.55 Q142.7 30.1 142.65 30.4 142.65 30.8 141.95 31.25 141.2 31.8 141.15 32.15 L141.2 32.5 141.15 33.15 140.5 33.45 Q140.15 33.45 138.55 32.3 L136.85 30.75 137.35 30.15 137.8 29.55 Q138.15 28.35 138.35 24.8 L138.65 19.7 Q138.8 16.6 138.15 14.75 L138.15 14.5 138.3 14.05 Q138.45 13.75 138.65 13.75 140.2 13.8 140.95 14.75 L141.85 14.0 Q142.5 13.25 143.2 13.25 M145.35 22.6 Q145.4 21.8 145.95 20.95 146.5 20.05 147.25 20.0 147.9 19.95 148.65 19.1 149.4 18.3 149.95 18.3 150.25 18.3 151.85 19.3 L154.0 20.4 Q154.4 20.65 154.35 21.15 L153.95 23.7 153.6 26.3 Q153.5 28.75 153.85 29.2 L154.45 29.5 Q154.9 29.7 154.85 30.35 154.8 30.9 153.95 31.55 153.25 32.25 153.2 32.75 L153.25 33.05 153.25 33.3 Q153.25 33.65 152.6 33.6 151.35 33.6 150.5 32.65 149.65 31.75 149.25 31.75 L148.7 31.9 148.8 33.05 148.4 33.4 147.8 33.5 Q147.2 33.5 146.15 32.65 145.0 31.8 144.25 31.65 143.75 31.55 143.8 30.95 143.8 30.5 144.15 30.45 145.05 30.3 145.2 27.8 L145.2 26.45 145.2 25.6 Q145.7 25.25 147.15 25.05 L149.1 24.6 Q150.05 24.1 150.1 22.95 150.15 22.25 149.6 21.75 149.0 21.25 148.2 21.25 147.35 21.25 147.3 21.9 L148.0 22.4 Q148.65 22.75 148.65 23.35 148.6 23.95 148.1 24.2 L147.05 24.55 Q146.3 24.5 145.85 23.95 145.35 23.3 145.35 22.6 M129.0 13.95 L129.85 15.45 Q129.4 15.55 128.85 16.55 L127.9 17.5 Q127.5 17.5 126.9 16.9 126.9 16.5 126.25 16.05 L125.6 15.35 Q125.65 14.9 126.35 14.3 L127.15 13.25 127.55 13.2 Q128.35 13.2 129.0 13.95 M123.6 23.0 L123.4 26.45 Q123.35 28.65 123.75 29.85 123.25 30.25 122.15 30.6 120.85 30.95 120.4 31.25 119.6 31.85 119.55 32.8 L118.8 32.9 Q117.9 32.85 116.6 31.9 L114.45 30.7 114.3 30.2 Q114.3 29.95 114.65 29.35 L114.95 28.5 115.15 24.55 115.05 22.85 114.9 21.25 Q114.95 20.55 116.05 20.2 L117.85 19.65 118.8 18.6 Q119.15 17.9 119.7 17.95 120.1 17.95 121.6 18.9 123.1 20.0 123.85 20.15 L124.05 20.95 123.85 21.95 123.6 23.0 M124.6 21.4 Q124.65 20.85 125.45 19.95 126.25 19.05 126.2 18.4 L126.9 18.15 Q127.5 18.15 128.3 18.95 129.2 19.8 129.7 19.9 L129.85 20.5 129.65 21.05 Q128.95 22.2 128.8 25.6 128.55 29.2 129.8 29.95 L128.8 31.25 Q128.05 32.0 128.1 32.7 127.75 33.05 127.4 33.05 L125.65 32.05 124.05 30.75 Q125.0 29.15 125.2 26.1 L125.35 23.55 Q125.3 21.85 124.6 21.4 M138.3 36.5 L142.05 36.85 145.65 37.05 150.1 36.7 Q151.1 35.65 152.5 35.7 153.65 35.7 153.55 36.9 153.5 38.2 151.55 39.2 149.45 40.1 149.4 41.45 L150.1 44.75 151.0 48.35 154.05 49.7 Q156.05 50.75 155.95 52.2 155.95 52.65 155.55 53.1 155.15 53.6 154.6 53.6 153.95 53.55 153.3 52.85 L152.05 51.7 151.7 52.1 153.25 58.0 Q154.5 60.85 157.5 62.0 L157.85 62.35 Q157.8 63.2 156.6 63.7 L154.75 64.15 150.7 63.4 Q148.0 62.7 146.7 62.7 145.95 62.7 144.45 63.55 143.0 64.4 142.3 64.35 141.35 64.35 140.85 63.15 140.9 61.8 142.8 60.65 144.9 59.5 145.3 58.5 145.25 56.95 145.35 55.4 145.3 52.85 144.75 52.9 144.0 52.85 142.9 54.5 141.75 56.25 141.1 56.25 L140.55 56.1 139.45 54.1 Q138.75 53.0 137.85 52.55 L136.95 54.8 136.2 57.25 136.6 59.05 Q136.9 60.1 137.4 60.6 L139.0 61.15 Q140.0 61.4 140.0 62.2 139.9 63.75 137.45 63.6 L134.8 63.1 132.0 62.7 Q130.9 62.7 129.25 63.4 L126.8 64.0 Q125.9 64.0 125.45 63.0 125.5 61.7 127.5 60.4 130.25 59.8 131.95 56.9 L134.35 51.6 Q134.25 51.25 133.75 51.25 133.1 51.2 132.45 52.2 131.9 53.15 131.3 53.2 L130.05 52.9 Q129.6 52.55 129.65 51.7 129.75 49.8 131.85 49.05 L135.35 48.2 136.25 47.35 137.75 43.75 138.8 40.2 Q138.4 39.5 136.1 38.9 134.1 38.35 134.2 37.2 134.3 35.25 136.05 35.3 L137.3 35.7 138.3 36.5 M125.45 35.7 L124.9 45.25 Q124.75 47.55 124.0 49.35 122.8 51.95 120.95 51.9 L119.7 51.45 Q118.9 51.05 118.9 50.65 119.0 49.35 120.45 48.85 121.95 48.25 122.05 46.75 122.1 45.8 121.5 44.25 120.95 42.55 121.0 41.5 121.05 40.7 120.0 39.35 118.95 37.85 118.35 37.9 116.8 37.8 116.1 49.65 115.95 52.4 116.45 55.35 117.2 59.45 119.0 59.5 L119.8 59.3 120.4 58.05 Q120.75 57.6 121.7 57.6 122.35 57.65 122.8 58.1 L123.15 59.3 Q123.1 60.25 122.05 61.0 L120.35 62.2 118.3 62.4 114.05 61.7 109.75 61.05 Q106.9 60.95 104.9 62.8 L104.6 62.8 Q102.75 62.8 102.85 61.6 102.95 60.15 104.3 59.3 L106.8 58.0 Q108.2 57.25 108.5 56.45 109.25 54.05 109.55 50.0 L110.1 40.5 Q110.15 38.05 109.4 38.15 L108.4 38.35 106.65 40.05 Q105.8 41.1 105.75 42.35 L105.15 44.3 Q104.5 45.65 104.45 46.35 104.4 47.9 105.35 48.9 106.75 48.95 106.65 50.25 106.6 51.0 105.9 51.45 105.25 52.0 104.45 52.0 102.5 51.9 101.75 49.0 101.25 47.0 101.4 44.45 101.45 43.45 102.05 41.55 102.65 39.7 102.7 38.65 102.85 36.45 101.95 35.3 L101.95 34.7 Q102.3 34.0 102.75 34.0 L106.05 34.55 109.45 35.15 114.4 35.35 119.0 35.35 121.6 35.0 124.25 34.65 125.1 34.95 Q125.45 35.3 125.45 35.7 M138.85 48.9 L140.1 50.3 Q140.9 51.05 141.65 51.25 142.35 51.2 143.2 50.55 144.4 50.3 144.45 49.55 144.55 48.45 143.75 44.95 143.0 41.4 142.4 40.75 141.35 42.25 140.45 44.75 L138.85 48.9 M149.9 26.45 L149.55 26.15 Q149.15 26.15 148.7 26.6 L148.85 27.3 148.65 28.05 148.5 28.9 Q148.45 29.7 149.25 29.75 149.85 29.75 149.95 28.65 L149.85 27.55 149.9 26.45 M110.1 15.2 L111.05 14.2 Q112.1 13.15 112.75 13.15 L113.7 13.85 112.7 15.4 Q112.0 16.35 111.95 17.0 L111.95 18.15 Q112.05 18.7 112.75 18.7 113.35 18.75 113.95 17.9 L114.75 17.05 Q115.05 17.05 115.35 17.35 L115.55 18.05 114.9 19.15 Q114.15 19.85 114.1 20.3 L114.3 20.85 Q114.25 21.25 113.2 21.15 112.8 20.7 112.3 20.7 111.9 20.7 111.85 21.0 L111.8 23.5 111.65 26.05 111.35 28.6 112.7 28.9 Q113.8 29.2 113.8 29.6 113.8 30.1 113.05 30.9 112.35 31.65 112.35 32.1 L112.3 32.55 111.6 32.65 Q111.2 32.65 109.2 31.55 L107.2 30.25 Q108.0 27.1 108.2 23.45 L108.3 20.85 107.35 20.5 Q106.85 20.4 106.9 19.75 106.95 18.5 107.65 18.5 L108.25 18.45 108.6 17.6 108.35 16.25 108.05 14.9 Q108.1 14.65 108.75 14.65 109.1 14.65 109.5 14.95 L110.1 15.2 M118.95 21.3 L118.75 23.65 118.75 24.85 118.8 26.05 118.65 27.1 118.4 28.15 118.45 28.9 119.4 29.15 119.9 29.0 Q119.75 28.2 119.85 26.95 L120.0 25.3 120.15 23.7 120.1 21.85 Q119.65 21.35 118.95 21.3 M88.9 17.6 Q90.15 18.3 91.7 18.15 L91.85 18.75 Q91.85 19.2 90.85 19.85 89.85 20.6 89.9 21.4 L89.1 21.65 Q88.6 21.65 87.9 21.05 87.05 20.4 86.65 20.35 L86.5 21.1 Q86.45 21.9 87.45 22.3 L89.55 22.8 Q90.75 23.2 90.95 24.0 L91.0 25.6 90.85 27.15 Q90.8 28.2 91.05 28.8 90.5 29.45 89.55 29.65 L88.1 30.05 Q87.35 30.5 86.95 31.6 86.8 32.05 86.05 32.05 85.05 32.05 84.15 31.25 83.2 30.45 82.8 30.4 82.5 30.4 82.1 30.8 82.15 31.25 82.95 31.6 83.75 31.95 83.75 32.35 L83.3 33.1 82.4 33.3 Q80.15 33.25 80.35 30.55 80.35 29.8 81.6 28.9 82.85 28.0 82.9 27.15 L83.85 26.9 Q84.45 26.9 85.4 27.6 86.35 28.25 86.95 28.2 L87.35 28.25 87.15 26.8 Q87.15 25.95 86.55 25.7 L83.9 24.8 Q83.05 24.4 82.85 23.8 82.7 23.2 82.85 20.95 82.9 20.0 82.4 19.5 82.75 18.75 83.7 18.6 L85.4 18.35 Q86.3 18.1 86.45 17.2 86.5 16.9 87.2 16.9 87.6 16.9 88.9 17.6 M98.05 12.8 Q98.35 12.8 99.05 13.5 L98.0 15.05 Q97.3 16.0 97.25 16.65 L97.25 17.8 Q97.35 18.35 98.05 18.35 98.65 18.4 99.25 17.55 99.8 16.7 100.1 16.7 100.35 16.7 100.65 17.05 L100.9 17.7 Q100.85 18.2 100.2 18.8 99.45 19.5 99.4 19.95 L99.6 20.5 Q99.55 20.9 98.5 20.8 98.1 20.35 97.6 20.35 97.2 20.35 97.15 20.65 L97.1 23.15 96.95 25.7 96.65 28.25 98.0 28.55 Q99.1 28.85 99.1 29.25 99.1 29.75 98.35 30.55 97.65 31.3 97.65 31.75 L97.6 32.2 96.9 32.3 94.5 31.2 92.5 29.9 Q93.3 26.75 93.5 23.1 L93.6 20.5 92.65 20.15 Q92.15 20.05 92.2 19.4 92.25 18.15 92.95 18.15 L93.55 18.1 93.9 17.25 93.65 15.9 93.35 14.55 Q93.4 14.3 94.05 14.3 94.4 14.3 94.8 14.6 L95.4 14.85 96.35 13.85 Q97.4 12.8 98.05 12.8 M97.95 34.15 Q98.8 33.5 99.4 33.5 99.85 33.5 100.25 34.3 L98.85 38.1 Q98.25 40.2 98.15 42.15 L97.6 42.75 96.7 43.1 Q95.9 43.1 95.55 41.4 95.1 38.95 94.7 38.2 93.7 36.35 91.35 36.35 88.2 36.25 86.75 39.0 85.85 40.65 85.3 44.45 L85.75 44.75 89.4 44.95 91.9 44.45 93.0 43.5 Q93.4 43.1 93.7 43.1 94.55 43.1 94.8 44.2 94.05 46.1 94.0 47.4 L94.3 48.65 Q94.6 49.4 94.5 49.85 L94.1 51.25 Q93.75 52.05 93.0 52.05 92.25 52.05 91.7 50.85 91.3 49.75 90.6 49.6 L87.6 49.35 Q86.05 49.3 85.1 50.05 85.2 54.3 85.65 55.85 86.6 59.45 89.4 59.5 91.55 59.6 93.15 57.45 L95.05 53.65 Q96.05 51.65 96.95 51.8 98.35 51.95 98.0 57.3 97.9 59.15 98.4 60.7 99.0 62.9 100.5 62.95 100.95 62.9 101.4 63.45 101.8 64.0 101.8 64.45 101.75 65.15 101.05 65.85 100.3 66.5 99.65 66.45 98.0 66.45 97.05 65.35 96.55 64.65 96.0 62.9 L94.95 60.25 Q92.4 62.4 88.55 62.25 82.3 62.1 79.45 57.15 77.7 54.05 76.55 46.5 77.75 44.9 80.0 40.35 81.7 36.85 83.5 35.55 86.15 33.65 91.25 33.75 94.35 33.85 96.65 35.3 L97.95 34.15 M69.1 10.55 Q69.7 10.6 70.3 11.5 L71.4 12.7 71.4 12.9 71.05 13.55 70.5 14.1 70.0 16.25 Q69.7 17.85 69.05 17.85 L68.6 17.65 68.35 17.3 68.3 15.95 68.25 14.65 Q68.3 14.25 67.65 13.9 67.15 13.4 67.15 12.95 67.2 12.6 67.75 12.0 68.35 11.5 68.4 10.9 68.4 10.55 69.1 10.55 M64.7 18.45 Q65.95 20.25 65.9 20.95 L64.9 21.95 63.65 23.0 Q62.9 22.85 62.4 21.95 L61.55 20.35 61.25 20.6 61.3 22.6 61.35 24.6 61.15 25.8 60.9 27.0 Q60.85 27.85 62.65 27.9 L63.5 27.75 63.7 26.85 63.85 26.3 Q63.95 25.9 64.2 25.95 64.7 25.95 65.1 26.35 65.5 26.7 65.45 27.2 65.4 28.1 64.65 28.85 L63.3 29.85 Q62.65 30.5 62.7 31.1 62.2 31.5 61.6 31.5 L59.0 30.5 Q56.85 29.55 56.6 29.25 57.35 27.75 57.5 25.0 L57.55 20.65 57.35 20.15 Q57.05 19.8 57.1 19.55 L57.15 19.3 60.1 18.2 Q61.85 17.6 62.65 16.55 63.35 16.6 64.7 18.45 M71.7 19.6 Q72.0 19.25 73.2 18.95 L75.4 18.3 Q76.7 17.75 77.4 16.8 78.0 16.8 79.35 19.4 80.6 21.75 80.6 22.4 80.55 23.0 79.2 23.75 L76.7 25.1 Q75.3 26.15 75.2 27.55 L76.4 27.9 77.7 28.0 78.1 26.85 Q78.2 26.1 78.75 26.1 79.8 26.05 79.75 27.25 79.65 28.95 77.4 30.65 L77.4 30.9 Q77.35 31.85 76.6 31.85 L73.5 30.7 Q71.1 29.6 71.15 29.2 L71.45 28.55 71.75 27.85 71.95 25.45 72.1 23.1 72.1 20.75 71.8 20.3 Q71.55 20.05 71.6 19.8 L71.7 19.6 M75.7 22.85 Q75.7 23.35 75.95 23.65 76.6 23.3 76.7 22.85 L76.55 21.6 75.85 20.55 75.7 22.85 M54.95 33.8 Q55.45 33.4 56.2 33.35 57.4 33.4 58.8 34.85 L66.55 34.1 Q70.1 34.15 72.45 35.75 75.3 37.75 75.15 41.05 75.05 42.65 73.8 44.35 72.5 46.2 71.0 46.4 L70.45 46.95 Q72.65 47.55 74.45 49.35 76.35 51.3 76.25 53.35 76.05 56.5 72.8 59.1 69.55 61.65 66.3 61.6 L61.85 61.05 57.35 60.4 Q55.7 60.4 54.6 60.85 L53.3 61.8 52.25 62.25 Q51.55 62.25 51.1 61.55 50.7 60.9 50.75 60.2 50.8 59.45 51.9 58.7 53.1 58.05 54.15 57.55 55.35 56.55 55.55 55.35 L56.85 42.75 Q57.05 39.95 56.85 38.6 56.8 37.7 55.6 36.7 54.4 35.7 54.45 35.0 54.5 34.3 54.95 33.8 M65.0 37.1 Q64.5 37.35 64.4 37.65 63.8 39.25 63.55 43.1 L63.55 45.3 63.8 44.85 64.1 44.35 Q65.35 43.7 65.6 43.7 66.3 43.7 66.85 44.25 L67.6 45.05 Q68.65 43.5 68.8 41.5 68.9 39.75 68.3 38.55 67.55 36.9 66.0 36.85 65.65 36.8 65.0 37.1 M63.4 46.1 L63.1 50.85 Q62.65 58.85 65.35 58.95 66.6 58.95 67.5 57.0 68.35 55.35 68.45 53.8 L68.3 52.0 68.2 50.2 Q68.25 49.1 66.2 48.0 63.7 46.75 63.4 46.1" fill="#525252" fill-rule="evenodd" stroke="none"/>
    <path d="M142.5 14.8 Q141.75 15.3 141.65 15.8 141.25 18.35 140.9 24.55 L140.75 28.55 141.3 29.4 Q141.8 29.95 141.75 30.25 141.75 30.65 141.05 31.1 140.3 31.65 140.25 32.0 L140.3 32.35 140.25 33.0 139.6 33.3 137.65 32.15 135.95 30.6 136.45 30.0 136.9 29.4 Q137.25 28.2 137.45 24.65 L137.75 19.55 Q137.9 16.45 137.25 14.6 L137.25 14.35 137.4 13.9 137.75 13.6 Q139.3 13.65 140.05 14.6 L140.95 13.85 Q141.6 13.1 142.3 13.1 142.9 13.15 143.35 13.7 143.3 14.25 142.5 14.8 M144.95 23.8 Q144.45 23.15 144.45 22.45 144.5 21.65 145.05 20.8 145.6 19.9 146.35 19.85 147.0 19.8 147.75 18.95 L149.05 18.15 150.95 19.15 153.1 20.25 Q153.5 20.5 153.45 21.0 L153.05 23.55 152.7 26.15 Q152.6 28.6 152.95 29.05 L153.55 29.35 Q154.0 29.55 153.95 30.2 153.9 30.75 153.05 31.4 152.35 32.1 152.3 32.6 L152.35 32.9 152.35 33.15 Q152.35 33.5 151.7 33.45 150.45 33.45 149.6 32.5 148.75 31.6 148.35 31.6 L147.8 31.75 147.9 32.9 147.5 33.25 146.9 33.35 Q146.3 33.35 145.25 32.5 144.1 31.65 143.35 31.5 142.85 31.4 142.9 30.8 142.9 30.35 143.25 30.3 144.15 30.15 144.3 27.65 L144.3 26.3 144.3 25.45 Q144.8 25.1 146.25 24.9 L148.2 24.45 Q149.15 23.95 149.2 22.8 149.25 22.1 148.7 21.6 148.1 21.1 147.3 21.1 146.45 21.1 146.4 21.75 146.4 21.95 147.1 22.25 147.75 22.6 147.75 23.2 147.7 23.8 147.2 24.05 L146.15 24.4 Q145.4 24.35 144.95 23.8 M127.95 16.4 L127.0 17.35 Q126.6 17.35 126.0 16.75 126.0 16.35 125.35 15.9 124.7 15.45 124.7 15.2 124.75 14.75 125.45 14.15 L126.25 13.1 126.65 13.05 Q127.45 13.05 128.1 13.8 L128.95 15.3 Q128.5 15.4 127.95 16.4 M126.0 18.0 Q126.6 18.0 127.4 18.8 L128.8 19.75 128.95 20.35 128.75 20.9 Q128.05 22.05 127.9 25.45 127.65 29.05 128.9 29.8 L127.9 31.1 Q127.15 31.85 127.2 32.55 126.85 32.9 126.5 32.9 L124.75 31.9 123.15 30.6 Q124.1 29.0 124.3 25.95 L124.45 23.4 Q124.4 21.7 123.7 21.25 123.75 20.7 124.55 19.8 125.35 18.9 125.3 18.25 125.6 18.0 126.0 18.0 M123.15 20.8 L122.95 21.8 122.7 22.85 122.5 26.3 Q122.45 28.5 122.85 29.7 L121.25 30.45 Q119.95 30.8 119.5 31.1 118.7 31.7 118.65 32.65 L117.9 32.75 Q117.0 32.7 115.7 31.75 L113.55 30.55 113.4 30.05 Q113.4 29.8 113.75 29.2 L114.05 28.35 114.25 24.4 114.15 22.7 114.0 21.1 Q114.05 20.4 115.15 20.05 L116.95 19.5 117.9 18.45 Q118.25 17.75 118.8 17.8 119.2 17.8 120.7 18.75 122.2 19.85 122.95 20.0 L123.15 20.8 M136.4 35.55 L137.4 36.35 141.15 36.7 144.75 36.9 149.2 36.55 Q150.2 35.5 151.6 35.55 152.75 35.55 152.65 36.75 152.6 38.05 150.65 39.05 148.55 39.95 148.5 41.3 148.45 41.85 149.2 44.6 L150.1 48.2 153.15 49.55 Q155.15 50.6 155.05 52.05 155.05 52.5 154.65 52.95 154.25 53.45 153.7 53.45 L152.4 52.7 151.15 51.55 150.8 51.95 152.35 57.85 Q153.6 60.7 156.6 61.85 L156.95 62.2 Q156.9 63.05 155.7 63.55 L153.85 64.0 149.8 63.25 Q147.1 62.55 145.8 62.55 145.05 62.55 143.55 63.4 142.1 64.25 141.4 64.2 140.45 64.2 139.95 63.0 140.0 61.65 141.9 60.5 144.0 59.35 144.4 58.35 144.35 56.8 144.45 55.25 144.4 52.7 143.85 52.75 143.1 52.7 142.0 54.35 140.85 56.1 140.2 56.1 L139.65 55.95 138.55 53.95 Q137.85 52.85 136.95 52.4 L136.05 54.65 135.3 57.1 135.7 58.9 136.5 60.45 138.1 61.0 Q139.1 61.25 139.1 62.05 139.0 63.6 136.55 63.45 L133.9 62.95 131.1 62.55 Q130.0 62.55 128.35 63.25 L125.9 63.85 Q125.0 63.85 124.55 62.85 124.6 61.55 126.6 60.25 129.35 59.65 131.05 56.75 L133.45 51.45 Q133.35 51.1 132.85 51.1 132.2 51.05 131.55 52.05 131.0 53.0 130.4 53.05 L129.15 52.75 Q128.7 52.4 128.75 51.55 128.85 49.65 130.95 48.9 L134.45 48.05 135.35 47.2 136.85 43.6 Q137.7 41.6 137.9 40.05 137.5 39.35 135.2 38.75 133.2 38.2 133.3 37.05 133.4 35.1 135.15 35.15 135.7 35.15 136.4 35.55 M124.55 35.55 L124.0 45.1 Q123.85 47.4 123.1 49.2 121.9 51.8 120.05 51.75 L118.8 51.3 Q118.0 50.9 118.0 50.5 118.1 49.2 119.55 48.7 121.05 48.1 121.15 46.6 121.2 45.65 120.6 44.1 120.05 42.4 120.1 41.35 120.15 40.55 119.1 39.2 118.05 37.7 117.45 37.75 115.9 37.65 115.2 49.5 115.05 52.25 115.55 55.2 116.3 59.3 118.1 59.35 L118.9 59.15 119.5 57.9 Q119.85 57.45 120.8 57.45 121.45 57.5 121.9 57.95 L122.25 59.15 Q122.2 60.1 121.15 60.85 L119.45 62.05 117.4 62.25 113.15 61.55 108.85 60.9 Q106.0 60.8 104.0 62.65 L103.7 62.65 Q101.85 62.65 101.95 61.45 102.05 60.0 103.4 59.15 L105.9 57.85 Q107.3 57.1 107.6 56.3 108.35 53.9 108.65 49.85 L109.2 40.35 Q109.25 37.9 108.5 38.0 L107.5 38.2 105.75 39.9 Q104.9 40.95 104.85 42.2 L104.25 44.15 Q103.6 45.5 103.55 46.2 103.5 47.75 104.45 48.75 105.85 48.8 105.75 50.1 105.7 50.85 105.0 51.3 104.35 51.85 103.55 51.85 101.6 51.75 100.85 48.85 100.35 46.85 100.5 44.3 100.55 43.3 101.15 41.4 101.75 39.55 101.8 38.5 101.95 36.3 101.05 35.15 L101.05 34.55 Q101.4 33.85 101.85 33.85 L105.15 34.4 108.55 35.0 113.5 35.2 118.1 35.2 120.7 34.85 123.35 34.5 124.2 34.8 124.55 35.55 M137.95 48.75 L139.2 50.15 140.75 51.1 Q141.45 51.05 142.3 50.4 143.5 50.15 143.55 49.4 143.65 48.3 142.85 44.8 142.1 41.25 141.5 40.6 140.45 42.1 139.55 44.6 L137.95 48.75 M148.65 26.0 Q148.25 26.0 147.8 26.45 L147.95 27.15 147.75 27.9 147.6 28.75 Q147.55 29.55 148.35 29.6 148.95 29.6 149.05 28.5 L148.95 27.4 149.0 26.3 148.65 26.0 M110.15 14.05 Q111.2 13.0 111.85 13.0 L112.8 13.7 111.8 15.25 Q111.1 16.2 111.05 16.85 L111.05 18.0 Q111.15 18.55 111.85 18.55 112.45 18.6 113.05 17.75 L113.85 16.9 Q114.15 16.9 114.45 17.2 L114.65 17.9 114.0 19.0 Q113.25 19.7 113.2 20.15 L113.4 20.7 Q113.35 21.1 112.3 21.0 111.9 20.55 111.4 20.55 111.0 20.55 110.95 20.85 L110.9 23.35 110.75 25.9 110.45 28.45 111.8 28.75 Q112.9 29.05 112.9 29.45 112.9 29.95 112.15 30.75 111.45 31.5 111.45 31.95 L111.4 32.4 110.7 32.5 Q110.3 32.5 108.3 31.4 106.3 30.3 106.3 30.1 107.1 26.95 107.3 23.3 L107.4 20.7 106.45 20.35 Q105.95 20.25 106.0 19.6 106.05 18.35 106.75 18.35 L107.35 18.3 107.7 17.45 107.45 16.1 107.15 14.75 Q107.2 14.5 107.85 14.5 108.2 14.5 108.6 14.8 L109.2 15.05 110.15 14.05 M117.85 23.5 L117.85 24.7 117.9 25.9 117.75 26.95 117.5 28.0 117.55 28.75 118.5 29.0 119.0 28.85 Q118.85 28.05 118.95 26.8 L119.1 25.15 119.25 23.55 119.2 21.7 Q118.75 21.2 118.05 21.15 L117.85 23.5 M88.0 17.45 Q89.25 18.15 90.8 18.0 L90.95 18.6 Q90.95 19.05 89.95 19.7 88.95 20.45 89.0 21.25 L88.2 21.5 Q87.7 21.5 87.0 20.9 L85.75 20.2 85.6 20.95 Q85.55 21.75 86.55 22.15 L88.65 22.65 Q89.85 23.05 90.05 23.85 L90.1 25.45 89.95 27.0 Q89.9 28.05 90.15 28.65 89.6 29.3 88.65 29.5 L87.2 29.9 Q86.45 30.35 86.05 31.45 85.9 31.9 85.15 31.9 84.15 31.9 83.25 31.1 L81.9 30.25 Q81.6 30.25 81.2 30.65 81.25 31.1 82.05 31.45 82.85 31.8 82.85 32.2 L82.4 32.95 81.5 33.15 Q79.25 33.1 79.45 30.4 79.45 29.65 80.7 28.75 81.95 27.85 82.0 27.0 L82.95 26.75 Q83.55 26.75 84.5 27.45 85.45 28.1 86.05 28.05 L86.45 28.1 86.25 26.65 Q86.25 25.8 85.65 25.55 L83.0 24.65 Q82.15 24.25 81.95 23.65 81.8 23.05 81.95 20.8 82.0 19.85 81.5 19.35 81.85 18.6 82.8 18.45 L84.5 18.2 Q85.4 17.95 85.55 17.05 85.6 16.75 86.3 16.75 86.7 16.75 88.0 17.45 M98.15 13.35 L97.1 14.9 Q96.4 15.85 96.35 16.5 L96.35 17.65 Q96.45 18.2 97.15 18.2 97.75 18.25 98.35 17.4 98.9 16.55 99.2 16.55 99.45 16.55 99.75 16.9 L100.0 17.55 Q99.95 18.05 99.3 18.65 98.55 19.35 98.5 19.8 L98.7 20.35 Q98.65 20.75 97.6 20.65 97.2 20.2 96.7 20.2 96.3 20.2 96.25 20.5 L96.2 23.0 96.05 25.55 95.75 28.1 97.1 28.4 Q98.2 28.7 98.2 29.1 98.2 29.6 97.45 30.4 96.75 31.15 96.75 31.6 L96.7 32.05 96.0 32.15 93.6 31.05 91.6 29.75 Q92.4 26.6 92.6 22.95 L92.7 20.35 91.75 20.0 Q91.25 19.9 91.3 19.25 91.35 18.0 92.05 18.0 L92.65 17.95 93.0 17.1 92.75 15.75 92.45 14.4 Q92.5 14.15 93.15 14.15 93.5 14.15 93.9 14.45 L94.5 14.7 95.45 13.7 Q96.5 12.65 97.15 12.65 L98.15 13.35 M99.35 34.15 L97.95 37.95 Q97.35 40.05 97.25 42.0 L96.7 42.6 Q96.2 43.0 95.8 42.95 95.0 42.95 94.65 41.25 94.2 38.8 93.8 38.05 92.8 36.2 90.45 36.2 87.3 36.1 85.85 38.85 84.95 40.5 84.4 44.3 L84.85 44.6 88.5 44.8 91.0 44.3 92.1 43.35 Q92.5 42.95 92.8 42.95 93.65 42.95 93.9 44.05 93.15 45.95 93.1 47.25 L93.4 48.5 Q93.7 49.25 93.6 49.7 L93.2 51.1 Q92.85 51.9 92.1 51.9 91.35 51.9 90.8 50.7 90.4 49.6 89.7 49.45 L86.7 49.2 Q85.15 49.15 84.2 49.9 84.3 54.15 84.75 55.7 85.7 59.3 88.5 59.35 90.65 59.45 92.25 57.3 L94.15 53.5 Q95.15 51.5 96.05 51.65 97.45 51.8 97.1 57.15 97.0 59.0 97.5 60.55 98.1 62.75 99.6 62.8 100.05 62.75 100.5 63.3 100.9 63.85 100.9 64.3 100.85 65.0 100.15 65.7 99.4 66.35 98.75 66.3 97.1 66.3 96.15 65.2 95.65 64.5 95.1 62.75 L94.05 60.1 Q91.5 62.25 87.65 62.1 81.4 61.95 78.55 57.0 76.8 53.9 75.65 46.35 76.85 44.75 79.1 40.2 80.8 36.7 82.6 35.4 85.25 33.5 90.35 33.6 93.45 33.7 95.75 35.15 L97.05 34.0 Q97.9 33.35 98.5 33.35 98.95 33.35 99.35 34.15 M68.2 10.4 Q68.8 10.45 69.4 11.35 L70.5 12.55 70.5 12.75 70.15 13.4 69.6 13.95 69.1 16.1 Q68.8 17.7 68.15 17.7 L67.7 17.5 67.45 17.15 67.4 15.8 67.35 14.5 Q67.4 14.1 66.75 13.75 66.25 13.25 66.25 12.8 66.3 12.45 66.85 11.85 67.45 11.35 67.5 10.75 67.5 10.4 68.2 10.4 M63.8 18.3 Q65.05 20.1 65.0 20.8 L64.0 21.8 Q62.85 22.6 62.75 22.85 62.0 22.7 61.5 21.8 L60.65 20.2 60.35 20.45 60.4 22.45 60.45 24.45 60.25 25.65 60.0 26.85 Q59.95 27.7 61.75 27.75 L62.6 27.6 62.8 26.7 62.95 26.15 Q63.05 25.75 63.3 25.8 63.8 25.8 64.2 26.2 64.6 26.55 64.55 27.05 64.5 27.95 63.75 28.7 L62.4 29.7 Q61.75 30.35 61.8 30.95 61.3 31.35 60.7 31.35 L58.1 30.35 Q55.95 29.4 55.7 29.1 56.45 27.6 56.6 24.85 L56.65 20.5 56.45 20.0 Q56.15 19.65 56.2 19.4 L56.25 19.15 59.2 18.05 Q60.95 17.45 61.75 16.4 62.45 16.45 63.8 18.3 M70.8 19.45 Q71.1 19.1 72.3 18.8 L74.5 18.15 Q75.8 17.6 76.5 16.65 77.1 16.65 78.45 19.25 79.7 21.6 79.7 22.25 79.65 22.85 78.3 23.6 76.15 24.7 75.8 24.95 74.4 26.0 74.3 27.4 L75.5 27.75 76.8 27.85 77.2 26.7 Q77.3 25.95 77.85 25.95 78.9 25.9 78.85 27.1 78.75 28.8 76.5 30.5 L76.5 30.75 Q76.45 31.7 75.7 31.7 75.05 31.65 72.6 30.55 70.2 29.45 70.25 29.05 L70.55 28.4 70.85 27.7 71.05 25.3 71.2 22.95 71.2 20.6 70.9 20.15 Q70.65 19.9 70.7 19.65 L70.8 19.45 M75.8 22.7 L75.65 21.45 74.95 20.4 74.8 22.7 Q74.8 23.2 75.05 23.5 L75.8 22.7 M53.55 34.85 Q53.6 34.15 54.05 33.65 54.55 33.25 55.3 33.2 56.5 33.25 57.9 34.7 L65.65 33.95 Q69.2 34.0 71.55 35.6 74.4 37.6 74.25 40.9 74.15 42.5 72.9 44.2 71.6 46.05 70.1 46.25 L69.55 46.8 Q71.75 47.4 73.55 49.2 75.45 51.15 75.35 53.2 75.15 56.35 71.9 58.95 68.65 61.5 65.4 61.45 L60.95 60.9 56.45 60.25 Q54.8 60.25 53.7 60.7 L52.4 61.65 51.35 62.1 Q50.65 62.1 50.2 61.4 49.8 60.75 49.85 60.05 49.9 59.3 51.0 58.55 52.2 57.9 53.25 57.4 54.45 56.4 54.65 55.2 L55.95 42.6 Q56.15 39.8 55.95 38.45 55.9 37.55 54.7 36.55 53.5 35.55 53.55 34.85 M64.1 36.95 L63.5 37.5 Q62.9 39.1 62.65 42.95 L62.65 45.15 62.9 44.7 63.2 44.2 Q64.45 43.55 64.7 43.55 65.4 43.55 65.95 44.1 L66.7 44.9 Q67.75 43.35 67.9 41.35 68.0 39.6 67.4 38.4 66.65 36.75 65.1 36.7 L64.1 36.95 M62.5 45.95 L62.2 50.7 Q61.75 58.7 64.45 58.8 65.7 58.8 66.6 56.85 67.45 55.2 67.55 53.65 L67.4 51.85 67.3 50.05 Q67.35 48.95 65.3 47.85 62.8 46.6 62.5 45.95" fill="#262626" fill-rule="evenodd" stroke="none"/>
  </g>
</svg>
