<?xml version="1.0" encoding="UTF-8" standalone="no"?>
<svg xmlns:xlink="http://www.w3.org/1999/xlink" height="4.85px" width="8.75px" xmlns="http://www.w3.org/2000/svg">
  <g transform="matrix(1.0, 0.0, 0.0, 1.0, 0.3, -3.5)">
    <path d="M6.1 3.9 Q7.75 4.4 8.45 5.4 8.5 6.45 7.8 7.35 L6.95 8.15 6.7 8.2 6.3 8.25 6.05 8.25 5.25 8.35 5.15 8.35 3.15 7.8 Q1.8 7.35 1.0 6.55 L-0.3 4.65 0.5 4.25 Q1.7 3.75 2.85 3.6 L6.1 3.9" fill="#fbf2e1" fill-rule="evenodd" stroke="none"/>
  </g>
</svg>
