<?xml version="1.0" encoding="UTF-8" standalone="no"?>
<svg xmlns:xlink="http://www.w3.org/1999/xlink" height="109.55px" width="102.3px" xmlns="http://www.w3.org/2000/svg">
  <g transform="matrix(1.0, 0.0, 0.0, 1.0, 6.85, 11.6)">
    <path d="M14.35 -1.75 L14.25 -1.55 14.3 -1.5 Q11.0 -1.05 11.0 0.0 11.0 0.55 11.8 0.55 L13.3 0.15 13.45 0.35 Q13.55 0.55 13.95 0.55 L16.4 -0.8 17.75 -1.1 Q18.65 -1.3 18.65 -1.8 L18.4 -2.2 18.4 -2.25 18.65 -2.25 23.1 -2.3 Q20.3 -1.8 17.3 -0.55 L12.5 1.5 12.25 1.45 12.15 1.35 12.4 0.85 12.2 0.8 10.15 2.75 8.15 5.45 7.05 7.8 6.45 10.15 Q5.95 11.65 5.35 11.65 L5.2 11.6 4.85 11.25 Q4.35 11.2 4.3 11.7 L4.25 12.4 3.8 13.85 Q3.35 14.8 2.85 14.8 2.4 14.8 2.4 13.95 L2.3 14.0 Q2.15 14.2 2.15 14.55 L2.05 14.75 1.85 12.0 1.85 11.9 2.0 10.75 2.15 9.9 2.2 9.75 2.1 8.85 2.05 8.75 1.3 10.05 Q-0.05 12.35 -0.95 12.35 L-1.2 12.35 -0.5 10.5 -0.55 10.2 -0.6 10.25 0.0 8.85 Q1.3 6.0 2.25 5.05 4.7 2.4 7.65 0.75 10.7 -1.0 14.35 -1.75 M20.0 -0.5 L19.6 -0.15 19.1 0.05 18.55 -0.1 Q18.45 -0.8 19.2 -0.95 20.0 -1.1 20.0 -0.5 M23.7 -1.45 L24.2 -1.55 25.5 -1.3 Q26.4 -1.0 26.4 -0.6 26.4 -0.1 25.85 0.0 L24.6 0.0 22.75 -0.05 Q21.7 -0.15 21.4 -0.6 L21.8 -0.95 22.4 -1.15 Q22.45 -0.6 23.35 -0.6 24.1 -0.6 24.1 -1.15 L23.7 -1.45 M-0.7 46.0 L0.15 44.05 0.45 43.5 Q1.1 42.15 2.05 40.7 L3.9 37.45 Q5.6 33.85 5.6 30.7 L5.55 29.1 Q5.9 29.0 5.9 28.3 L6.15 27.7 6.2 27.65 6.3 27.6 6.7 28.05 6.95 29.5 7.0 31.35 Q7.0 32.5 6.6 33.6 6.65 34.9 5.65 36.75 L5.7 37.15 Q5.2 39.25 4.4 39.25 L4.2 39.25 3.05 41.55 Q1.9 43.95 0.6 45.0 L0.75 44.35 0.2 45.3 -0.6 46.05 -0.7 46.0 M64.15 -4.95 L65.6 -6.05 66.9 -6.95 68.05 -7.65 Q70.85 -9.35 73.35 -10.05 L77.0 -10.7 77.0 -10.6 77.7 -10.65 79.9 -10.25 79.9 -10.45 79.9 -10.5 Q84.1 -9.8 87.4 -6.95 L89.55 -4.8 89.6 -4.75 89.55 -4.75 89.5 -3.95 Q89.25 -3.45 88.5 -3.45 87.75 -3.45 86.35 -4.45 L84.9 -5.6 83.65 -5.55 Q82.65 -6.05 82.65 -6.6 L83.0 -7.1 81.8 -7.45 80.45 -7.8 80.05 -7.65 79.8 -7.2 80.85 -5.9 82.3 -3.8 82.8 -1.35 82.8 -1.3 82.75 -0.85 82.35 -0.6 78.2 -4.85 Q77.85 -4.5 77.6 -4.5 L77.3 -4.5 76.95 -4.55 75.6 -5.45 75.2 -5.7 73.35 -6.25 73.05 -6.3 Q72.05 -6.3 70.35 -5.3 69.0 -4.5 68.05 -4.2 L67.5 -4.1 67.5 -4.85 67.85 -5.25 67.85 -5.35 67.85 -5.3 66.2 -4.5 Q65.1 -3.9 64.2 -3.95 64.05 -4.1 64.05 -4.5 L64.15 -4.95 M83.9 8.65 L84.15 9.25 Q84.5 9.8 85.25 9.8 86.55 9.8 86.95 8.65 L87.05 7.8 87.3 8.35 Q87.3 9.35 86.8 9.75 86.3 10.1 85.25 10.1 L84.3 9.8 84.0 9.35 83.9 8.65 M84.75 5.7 L84.8 5.55 Q85.2 4.8 86.15 4.8 87.8 4.8 88.3 6.2 L88.2 6.15 Q87.3 5.6 86.45 5.6 L85.8 5.9 85.85 5.6 Q85.85 5.1 85.5 5.25 85.1 5.4 85.1 5.7 85.1 6.05 85.45 6.05 L85.05 6.15 84.75 5.7 M81.95 16.15 L82.0 16.05 81.5 15.25 81.4 14.95 Q81.4 14.3 82.35 14.3 83.3 14.3 83.5 15.05 L83.3 15.6 Q82.95 16.2 82.35 16.2 L81.95 16.15 M71.75 5.45 L72.1 4.55 72.4 4.0 Q72.8 3.3 73.35 2.8 74.4 1.85 75.95 1.85 77.5 1.85 78.15 2.85 77.8 3.45 76.8 3.35 L74.55 3.15 Q74.0 3.2 73.35 3.95 L73.0 4.35 71.75 5.45 M75.2 5.7 L75.25 4.85 75.25 4.8 75.3 4.65 75.4 4.45 Q75.65 4.0 76.2 3.9 L76.3 3.85 76.3 3.95 76.95 4.1 Q77.45 4.35 77.45 4.8 76.9 6.15 75.95 6.15 L75.45 5.9 75.25 5.7 75.2 5.7 M69.85 -6.2 Q70.65 -6.65 70.7 -7.1 70.7 -7.4 71.8 -7.7 L73.35 -8.0 73.5 -8.0 Q75.45 -8.0 76.25 -7.0 77.0 -6.05 77.5 -6.05 77.9 -6.05 78.2 -6.4 L78.45 -7.0 Q78.45 -7.55 77.55 -8.15 79.05 -8.25 79.05 -8.95 79.05 -9.8 77.6 -9.65 L76.4 -9.35 75.5 -9.0 74.35 -9.3 73.35 -9.2 71.65 -8.8 70.3 -8.2 68.4 -7.25 68.05 -6.9 67.9 -6.35 68.0 -6.05 68.05 -6.0 Q68.25 -5.8 68.8 -5.8 L69.85 -6.2 M79.35 -5.4 Q79.35 -5.0 79.8 -5.0 L80.1 -5.3 Q80.1 -5.75 79.75 -5.75 79.35 -5.75 79.35 -5.4 M80.4 -4.0 L80.6 -3.45 Q80.9 -2.9 81.5 -2.9 81.95 -2.9 81.95 -3.5 81.95 -4.05 81.2 -4.4 80.4 -4.8 80.4 -4.0 M76.5 -9.9 Q76.45 -10.2 76.15 -10.2 75.55 -10.2 75.55 -9.75 L75.55 -9.6 Q75.6 -9.45 75.95 -9.45 76.15 -9.45 76.35 -9.65 L76.5 -9.9 M83.75 -7.25 Q83.25 -6.75 83.25 -6.45 L83.4 -6.1 Q83.65 -5.8 84.15 -5.8 L84.5 -6.0 84.8 -6.2 85.75 -5.75 Q86.5 -5.3 87.0 -5.3 87.45 -5.3 87.45 -5.7 L86.55 -6.8 Q85.45 -7.7 84.45 -7.7 L83.75 -7.25 M82.25 -8.25 Q82.75 -8.25 82.75 -8.55 80.95 -10.15 80.95 -8.95 80.95 -8.8 81.25 -8.6 81.65 -8.25 82.25 -8.25 M85.85 -4.25 Q86.45 -4.25 86.5 -3.4 86.5 -2.8 85.95 -2.8 L85.45 -3.2 85.3 -3.65 Q85.3 -4.25 85.85 -4.25 M87.5 -2.25 Q87.9 -2.25 88.5 -1.7 L88.9 -1.35 89.1 -1.15 89.25 -1.05 89.8 -1.15 Q90.9 -1.15 91.6 -0.1 92.15 0.75 92.15 1.6 L92.15 2.2 91.65 2.55 Q91.3 2.55 90.35 1.6 L89.25 0.45 88.05 -0.15 Q87.2 -0.7 87.05 -1.35 L87.0 -1.7 87.15 -2.0 87.5 -2.25 M89.75 -3.1 L90.1 -3.15 90.55 -3.05 90.55 -2.6 Q90.05 -2.25 89.95 -2.25 89.35 -2.25 89.35 -2.7 L89.4 -2.85 89.7 -3.05 89.75 -3.1 M91.25 1.4 Q91.6 1.4 91.6 0.9 91.6 0.05 90.9 -0.25 90.15 -0.6 90.15 0.1 L90.4 0.75 Q90.75 1.4 91.25 1.4 M82.65 4.4 L82.8 4.35 83.1 5.85 82.85 7.1 Q82.6 8.0 82.25 8.0 L81.95 7.95 81.95 7.85 Q82.55 6.35 82.65 4.4 M90.65 52.1 L90.85 52.05 91.05 52.2 91.15 52.4 90.7 53.2 90.95 53.25 Q90.25 54.3 88.45 54.9 L84.95 55.65 83.65 56.05 83.35 55.75 Q82.75 55.75 82.25 56.2 L81.65 56.65 81.4 56.5 80.15 56.7 Q79.85 56.85 79.85 57.25 L79.9 57.5 80.3 57.75 80.75 57.6 Q80.9 57.4 81.05 57.4 L81.4 57.4 81.25 57.5 79.65 58.8 79.5 58.7 79.35 58.45 78.7 59.0 78.6 58.9 Q78.7 57.6 79.65 56.8 L80.5 56.25 Q81.65 55.65 84.8 55.1 L85.75 54.95 Q89.5 54.1 90.55 52.35 L90.65 52.1 M87.45 57.15 L87.45 57.2 87.45 57.15 M85.85 64.3 Q85.5 63.75 85.5 62.8 L85.75 62.0 Q86.1 61.35 86.65 61.35 87.65 61.35 87.9 62.55 87.9 63.25 87.35 63.25 L86.95 63.1 86.9 62.9 87.0 62.75 87.1 62.55 87.1 62.5 86.95 62.3 86.75 62.15 86.4 62.45 86.25 62.8 86.25 62.85 86.05 63.45 85.85 64.3 M78.35 67.35 L78.3 67.05 Q78.3 66.35 78.45 65.9 78.7 65.15 79.4 64.95 79.65 64.7 80.05 64.65 L80.45 64.7 80.65 64.75 80.8 64.85 81.05 65.3 81.25 65.85 Q81.25 66.95 80.3 66.95 L79.7 66.65 79.15 66.35 Q78.7 66.35 78.45 67.05 L78.35 67.35 M87.6 63.0 L87.65 62.65 87.4 62.35 Q87.1 62.35 87.1 62.7 L87.1 62.9 87.4 63.05 87.6 63.0 M79.25 81.1 L79.45 80.35 79.65 80.05 Q80.0 79.45 80.65 79.45 L81.5 79.65 81.55 79.55 Q81.55 78.8 80.95 78.4 80.45 78.05 79.85 78.05 L79.6 77.9 79.2 78.15 Q78.45 78.4 77.9 79.3 L77.5 80.1 77.15 80.35 77.25 80.0 Q77.35 79.5 77.75 78.95 L78.1 78.5 78.0 78.25 79.15 77.5 Q79.15 77.3 78.8 77.3 78.3 77.3 77.7 77.85 L77.15 78.5 77.25 78.75 Q76.45 79.65 76.45 80.9 L76.45 81.15 76.55 81.35 76.45 82.85 Q75.75 82.6 75.45 81.55 L75.45 81.5 Q75.65 79.7 76.6 78.5 77.9 76.8 80.15 76.8 81.25 76.8 82.25 78.05 83.1 79.1 83.15 80.15 L83.15 80.3 83.15 80.8 83.15 80.95 82.95 81.35 Q82.5 82.15 81.8 82.15 L81.05 82.0 80.75 81.85 81.05 81.85 Q81.5 81.85 81.85 81.4 L82.1 80.7 Q81.9 79.8 81.4 79.8 80.1 79.8 80.1 80.95 L80.2 81.4 79.6 81.5 Q79.3 81.5 79.25 81.1 M77.2 87.1 L76.85 86.85 Q75.95 86.2 74.85 86.2 L74.8 86.2 Q74.4 86.2 74.1 86.5 L72.9 87.2 Q72.3 87.6 72.0 87.95 L71.95 87.85 Q71.95 85.75 73.35 85.1 L75.05 84.9 76.05 85.15 76.0 84.95 77.8 85.9 Q79.5 86.7 80.1 88.0 L80.3 88.3 80.5 89.0 80.9 90.3 Q80.9 90.7 80.6 90.7 80.25 90.7 80.1 90.1 L79.9 89.2 79.25 88.2 78.5 87.65 Q78.0 87.15 77.2 87.1 M73.8 88.9 L73.8 88.3 Q73.85 87.65 74.95 87.65 75.85 87.65 76.3 88.15 L76.6 88.95 76.6 89.05 76.4 89.35 75.4 89.55 Q74.3 89.55 73.8 88.9 M76.7 5.3 L76.85 4.85 Q76.9 4.3 76.25 4.3 75.65 4.3 75.55 4.55 L75.5 5.05 75.5 5.35 Q75.6 5.65 76.15 5.65 L76.7 5.3 M73.15 6.1 Q73.15 6.55 72.65 6.55 72.2 6.55 72.2 6.2 72.2 5.65 72.7 5.65 L73.15 6.1 M72.45 9.95 L72.2 10.4 Q71.8 10.4 71.8 9.95 71.8 9.65 72.15 9.6 72.45 9.55 72.45 9.95 M5.6 9.15 Q6.3 9.05 6.9 6.65 L8.1 4.0 7.75 3.5 Q7.6 3.55 7.4 3.75 L7.45 3.35 7.45 3.0 Q7.4 2.7 7.0 2.7 6.25 2.7 5.7 3.7 L5.15 4.05 4.1 5.0 Q4.05 4.35 3.45 4.7 2.95 4.95 2.7 5.45 L2.4 6.1 Q2.15 6.7 1.4 6.9 0.8 7.05 0.8 7.9 0.8 8.35 1.3 8.35 L1.75 8.1 2.35 7.65 3.1 7.0 3.5 7.05 4.55 6.45 5.25 5.8 5.45 5.95 5.75 6.25 Q5.05 7.65 5.05 8.4 L5.05 8.8 5.3 9.1 Q4.75 9.15 4.75 9.9 L4.75 10.15 5.1 10.35 Q5.8 10.35 5.8 9.7 5.8 9.25 5.6 9.15 M9.9 1.35 Q9.9 0.85 8.85 0.85 8.45 0.85 7.95 1.3 7.5 1.7 7.5 1.95 7.5 2.4 8.15 2.4 9.9 1.9 9.9 1.35 M3.35 8.1 Q2.9 8.35 2.9 8.85 2.75 9.35 3.3 9.35 3.8 9.35 3.8 8.5 3.8 7.9 3.35 8.1 M3.75 11.65 Q3.7 11.1 3.35 11.1 2.75 11.1 2.75 12.05 L2.75 12.4 3.1 12.65 Q3.75 12.65 3.75 11.65 M0.0 13.55 L0.1 13.7 Q0.1 14.55 -0.45 15.45 -1.05 16.4 -1.85 16.7 L-1.9 16.6 -2.0 16.25 -1.5 14.95 -1.25 14.55 -1.05 14.1 -0.85 14.05 -0.7 13.95 0.0 13.55 M0.8 44.25 L0.8 44.1 0.75 44.35 0.8 44.25 M-1.3 72.75 L-1.3 72.6 Q-1.25 71.35 -0.45 70.4 L0.75 69.5 Q1.55 69.15 2.55 69.15 3.75 69.15 4.65 70.1 L4.9 70.4 Q5.75 71.5 5.75 73.0 5.7 74.25 4.75 75.35 L4.4 75.7 Q3.05 76.85 1.4 77.3 L0.85 77.5 0.5 77.7 -1.4 78.95 -2.35 79.85 -2.55 80.05 -3.35 81.05 -4.0 81.45 -4.1 81.6 -4.7 82.05 -5.05 82.45 -5.05 82.5 -5.1 82.6 -4.6 85.15 -4.75 85.55 -5.05 85.8 -5.35 85.75 -5.4 88.8 Q-5.85 88.9 -6.25 88.2 L-6.55 87.65 -6.7 86.8 -6.75 86.55 -6.85 84.7 Q-6.85 80.3 -4.5 77.65 L-3.35 76.55 -2.25 75.85 Q-1.35 75.35 -0.3 75.05 L0.2 75.15 Q1.4 75.15 2.3 74.45 3.2 73.75 3.2 72.8 3.2 72.0 2.25 72.0 L2.0 73.2 Q1.55 74.0 0.45 74.0 -0.95 74.0 -1.25 72.75 L-1.3 72.75 M-2.05 89.6 L-2.2 88.5 Q-2.2 83.45 2.55 83.4 4.45 83.4 5.8 84.4 7.3 85.5 7.3 87.2 L7.3 87.55 Q7.2 88.35 6.55 89.15 5.65 90.35 4.05 90.4 L3.9 90.4 2.95 90.3 Q2.55 89.95 2.55 89.4 L2.7 88.95 3.15 88.55 3.25 88.55 3.25 88.7 3.45 89.25 4.55 89.45 5.45 89.15 5.95 88.55 Q6.0 88.25 5.7 88.25 L4.85 88.75 4.65 88.7 4.9 88.4 4.85 88.6 5.6 87.9 5.75 87.2 5.75 87.0 4.9 85.8 4.8 85.7 Q4.3 85.2 3.85 85.0 L3.15 84.8 2.9 84.8 2.0 84.95 Q0.85 85.3 0.15 86.35 L-0.1 86.7 -0.1 86.6 -1.2 87.75 -1.25 87.7 -1.25 87.15 -1.25 87.2 Q-2.0 88.6 -2.05 89.6 M2.2 84.05 Q2.2 84.4 2.5 84.4 2.8 84.4 2.8 84.05 L2.5 83.75 Q2.2 83.75 2.2 84.05 M0.0 85.45 L1.5 84.55 Q1.5 83.7 0.15 84.55 -1.2 85.4 -1.2 85.9 -1.2 86.5 -0.9 86.5 -0.55 86.5 -0.35 86.05 L0.0 85.45 M1.4 76.75 L2.15 76.25 Q3.05 75.75 3.05 75.2 3.05 74.2 2.05 74.85 1.1 75.45 1.05 75.85 L-1.4 76.25 Q-2.8 76.6 -3.3 77.05 -5.2 78.95 -5.2 79.55 L-4.95 80.05 -5.05 80.25 Q-5.05 80.7 -4.45 80.7 -3.85 80.7 -3.3 79.9 -2.85 79.25 -2.85 78.9 L-2.9 78.5 -3.1 78.15 -2.3 77.3 -0.7 76.8 1.4 76.75 M3.9 74.75 L4.15 74.55 4.25 74.25 Q4.25 73.85 3.9 73.9 3.55 73.95 3.55 74.4 3.55 74.75 3.9 74.75 M4.15 71.05 Q4.15 70.15 2.55 70.15 L1.8 70.25 0.7 70.3 Q0.1 70.45 0.05 71.15 -0.5 71.35 -0.5 72.1 -0.4 73.15 0.5 73.15 L1.2 72.75 1.4 72.15 Q1.4 71.45 0.9 71.2 L1.5 71.1 2.25 70.95 Q3.15 71.7 3.65 71.7 4.15 71.7 4.15 71.05 M43.0 81.6 L41.85 80.05 Q40.8 78.45 38.15 78.45 L37.35 78.55 36.95 78.3 35.85 78.65 34.9 79.0 34.45 78.9 Q33.65 78.9 33.65 79.75 L33.75 79.95 Q33.9 80.15 34.25 80.15 L34.85 79.85 35.2 79.85 34.95 80.05 33.55 81.6 Q33.1 81.6 33.1 81.1 L33.05 81.1 33.0 81.15 32.6 81.85 32.35 82.05 32.4 81.5 Q32.55 80.55 33.05 79.85 33.5 79.15 34.25 78.65 36.0 77.4 38.75 77.4 41.05 77.4 42.6 78.9 L43.3 79.7 43.75 80.45 43.7 80.7 Q43.65 81.6 43.0 81.6 M34.9 83.6 L35.15 84.0 Q35.45 82.75 37.45 82.75 L38.25 82.85 Q38.9 83.05 39.2 83.6 L38.7 84.4 Q38.05 85.25 37.3 85.25 L36.9 85.2 36.6 84.9 36.1 85.25 35.2 84.75 Q34.85 84.3 34.85 83.85 L34.9 83.6 M44.2 84.65 L44.15 85.1 46.55 83.55 Q49.4 81.9 53.6 85.65 57.5 89.1 58.85 89.75 L59.3 89.85 59.5 89.85 60.05 90.15 61.5 90.0 Q62.2 90.0 63.3 88.9 L63.65 88.55 63.35 89.2 Q62.2 91.4 59.4 91.4 57.0 91.4 55.05 89.15 L54.25 88.15 53.15 86.85 52.7 86.2 Q51.35 84.3 50.15 84.3 49.7 84.3 48.75 84.65 L47.35 85.0 46.35 84.75 Q46.2 84.75 45.15 85.65 L44.2 86.45 43.8 86.95 42.95 87.5 42.6 87.3 42.6 87.05 Q42.6 86.4 43.25 86.35 L44.2 84.65 M60.75 85.65 L60.7 85.95 60.65 86.05 60.65 86.3 Q61.8 86.45 61.8 86.95 L61.3 87.7 60.55 88.1 Q59.4 88.1 59.2 87.25 L59.2 86.35 Q59.2 83.9 61.45 83.9 L62.55 84.05 63.3 84.55 63.05 84.9 Q62.45 84.25 60.8 84.25 L60.25 84.45 60.0 84.8 60.25 84.9 60.75 84.7 61.5 84.75 Q61.8 85.05 62.4 85.05 L62.45 85.1 61.95 85.2 Q60.9 85.4 60.65 85.65 L60.75 85.65 M24.65 89.15 Q25.2 88.85 25.8 88.7 L27.5 88.5 30.95 89.15 34.2 89.8 35.8 89.6 37.35 89.0 38.25 88.75 39.7 88.0 37.6 89.75 37.45 89.75 Q36.8 89.9 36.75 90.45 L35.9 90.85 Q35.9 90.45 35.0 90.45 L33.15 90.65 32.2 90.25 31.45 90.0 30.8 89.75 Q30.0 89.3 29.6 89.5 29.25 89.65 29.25 90.1 29.25 90.25 29.65 90.3 L30.55 90.45 30.65 90.55 30.3 90.5 28.6 90.85 Q27.85 90.85 27.85 90.3 L27.85 89.9 28.3 89.65 27.65 89.55 26.0 89.9 24.65 90.25 24.35 90.25 24.2 89.9 24.65 89.15 M35.1 85.35 L34.85 85.5 Q34.55 85.5 34.3 85.2 L34.05 84.8 Q34.05 84.05 34.65 84.35 35.2 84.6 35.2 85.1 L35.1 85.35 M36.85 84.15 L37.4 84.5 Q38.1 84.5 38.1 83.8 38.1 83.35 37.45 83.2 36.8 83.05 36.8 83.75 L36.85 84.15 M41.45 88.55 L41.25 88.75 Q40.7 89.2 40.35 89.2 L39.9 89.15 39.8 89.05 39.75 88.85 Q39.75 88.2 40.75 87.8 41.7 87.4 41.7 88.15 L41.45 88.55 M36.5 92.35 Q36.5 92.7 36.05 92.7 35.5 92.7 35.5 92.35 35.5 91.9 36.05 91.9 36.5 91.9 36.5 92.35 M79.9 66.3 Q80.45 66.3 80.45 65.6 80.45 64.9 79.95 64.9 79.15 64.9 79.15 65.6 L79.3 65.95 Q79.55 66.3 79.9 66.3 M56.55 89.45 L56.85 89.1 55.6 87.9 Q54.35 86.95 54.5 87.45 56.0 89.45 56.55 89.45 M57.25 89.35 Q57.0 89.3 57.0 89.6 L57.05 89.75 57.25 89.9 57.5 89.6 57.25 89.35 M60.35 87.0 L60.4 87.25 60.8 87.5 Q61.3 87.5 61.3 86.95 61.3 86.5 60.85 86.55 60.35 86.6 60.35 87.0 M46.6 84.05 L46.85 84.35 47.75 84.6 48.9 84.4 Q49.3 84.2 49.3 83.9 49.3 83.45 48.5 83.45 L48.0 83.45 47.85 83.65 46.85 83.55 46.6 84.05 M72.75 86.2 L72.75 86.4 Q72.75 86.55 73.05 86.55 73.35 86.55 73.9 86.0 L74.9 85.6 75.15 85.4 74.8 85.15 Q73.9 85.15 73.3 85.55 72.75 85.9 72.75 86.2 M76.7 84.1 L76.6 83.9 Q76.6 83.5 77.0 83.5 77.4 83.5 77.4 83.95 L77.1 84.4 Q76.85 84.4 76.7 84.1 M79.85 92.35 L79.85 91.95 Q79.85 91.2 80.25 91.2 80.65 91.2 80.65 91.9 80.65 92.7 80.25 92.7 79.9 92.7 79.85 92.35 M74.75 89.15 L75.15 88.9 75.3 88.5 Q75.3 88.0 74.7 87.95 74.1 87.9 74.1 88.55 74.1 89.15 74.75 89.15 M77.75 95.95 L77.85 95.9 77.8 96.0 77.75 95.95 M79.5 95.1 L79.55 95.2 79.5 95.2 79.5 95.1 M-3.65 89.5 L-2.6 91.15 Q-2.6 91.65 -2.95 91.65 -4.4 91.65 -4.75 89.2 -4.75 88.05 -3.65 89.5" fill="#515644" fill-rule="evenodd" stroke="none"/>
    <path d="M75.2 5.75 L75.2 5.7 75.25 5.7 75.2 5.75 M67.85 -5.3 L67.85 -5.35 67.85 -5.25 67.85 -5.3 M0.8 44.25 L0.75 44.35 0.8 44.1 0.8 44.25" fill="#434638" fill-rule="evenodd" stroke="none"/>
    <path d="M1.85 12.0 L2.05 14.75 Q0.95 16.75 0.15 19.05 L0.25 29.95 Q-2.4 23.65 -2.7 19.85 L-2.7 19.8 Q-2.2 19.8 -2.05 19.2 L-2.0 19.2 -2.0 19.45 -1.65 19.55 Q-0.85 19.55 0.4 15.9 L1.85 12.0 M27.6 0.1 L27.6 0.0 27.85 -0.35 27.55 -0.85 27.7 -0.8 28.65 -1.05 29.25 -1.45 Q31.3 -0.95 32.75 -0.05 L27.6 0.1 M16.55 1.85 L16.5 1.85 16.15 2.0 15.65 2.15 Q14.05 2.8 12.55 3.7 L10.05 6.65 Q7.5 9.8 6.4 12.85 L7.55 8.95 Q8.55 5.65 9.35 4.7 L9.35 5.3 9.5 5.4 11.05 3.65 12.75 1.75 13.35 1.75 13.2 2.2 14.05 1.5 Q15.3 0.6 16.15 0.6 16.55 0.6 16.6 0.85 L16.6 1.35 16.55 1.85 M2.35 44.55 Q1.1 46.8 0.5 48.45 -0.2 50.25 -0.2 51.35 L-0.05 51.8 0.55 52.0 0.55 55.0 -0.95 52.8 Q-1.5 51.6 -1.5 49.95 L-1.35 48.55 -1.2 48.55 Q-0.8 48.55 -0.5 47.85 L-0.25 47.15 -0.35 48.1 1.55 45.65 2.35 44.55 M72.1 -3.1 L70.2 -1.35 70.2 -1.3 60.55 -1.0 60.75 -1.35 62.0 -3.0 61.85 -2.7 Q61.85 -2.1 62.35 -2.1 63.0 -2.1 64.2 -2.8 64.2 -2.15 65.15 -2.15 65.65 -2.15 66.25 -2.7 L67.2 -3.25 67.55 -2.95 67.55 -2.35 68.05 -2.25 69.25 -2.9 Q70.25 -3.55 70.8 -3.55 L71.2 -3.35 71.45 -3.0 Q71.7 -4.1 72.85 -4.85 L73.35 -5.1 75.3 -5.5 75.6 -5.45 76.95 -4.55 77.3 -4.5 77.55 -4.05 77.5 -4.05 76.5 -4.5 75.15 -4.35 74.7 -4.4 Q74.05 -4.4 73.35 -4.0 L72.95 -3.8 Q72.4 -3.45 72.1 -3.1 M95.0 10.5 Q95.0 16.55 93.5 20.55 92.25 23.9 90.9 25.5 L90.9 17.95 91.75 14.85 Q92.1 13.25 91.9 10.2 91.75 8.4 90.9 6.3 L89.9 4.05 Q90.35 4.45 90.65 4.45 L91.3 4.2 Q91.7 4.2 91.75 5.25 91.8 6.3 92.3 6.3 L92.65 6.1 Q93.35 8.6 93.2 11.25 L93.5 11.35 94.05 10.9 93.2 13.5 Q92.5 16.05 92.5 16.65 L92.5 16.7 Q92.1 17.2 92.1 17.85 L92.15 18.3 Q92.3 18.7 92.75 18.7 93.15 18.7 93.55 17.85 L93.85 16.8 93.8 16.3 Q94.4 15.35 94.65 14.0 L95.0 10.5 M92.5 20.95 L92.7 20.2 Q92.7 19.25 92.15 19.6 91.55 19.95 91.55 20.85 L91.55 21.15 Q91.6 21.45 92.0 21.45 L92.5 20.95 M90.65 52.1 L90.9 51.0 90.9 50.25 91.65 50.6 Q91.95 50.85 91.95 52.2 91.95 53.1 90.9 54.4 90.1 55.35 88.9 55.75 L89.45 55.3 Q90.85 54.4 91.15 53.3 L90.95 53.25 90.7 53.2 91.15 52.4 91.05 52.2 90.85 52.05 90.65 52.1 M86.75 57.55 L86.65 57.45 Q86.75 56.8 87.1 56.45 L87.35 56.9 Q87.35 57.25 87.15 57.4 86.9 57.5 86.75 57.55 M81.6 93.75 L81.55 93.85 Q81.1 95.35 79.65 96.45 L79.65 96.7 Q79.65 97.35 79.1 97.35 L78.35 97.15 Q76.6 97.95 74.25 97.95 71.45 97.95 69.8 96.65 L69.05 95.95 68.2 94.3 71.55 94.3 71.75 94.65 71.9 94.7 75.0 95.2 75.35 95.2 Q74.6 95.3 74.0 95.65 73.9 96.0 74.45 96.1 L75.35 96.05 75.35 96.65 75.8 96.8 Q76.8 96.8 77.75 95.95 L77.8 96.0 77.85 96.05 Q78.3 96.0 79.45 94.8 L79.5 95.1 79.5 95.2 79.55 95.2 80.3 94.65 81.15 93.75 81.6 93.75 M4.75 15.25 L5.05 16.25 4.7 17.2 4.55 17.1 4.55 17.7 Q5.15 19.0 5.15 20.35 L5.1 21.05 4.55 21.45 Q3.4 18.65 3.4 18.05 L3.6 17.15 Q4.2 16.8 4.75 15.25 M8.55 92.6 L14.65 92.85 Q13.4 94.0 11.55 94.9 9.25 96.05 6.9 96.4 L6.7 96.6 Q6.2 97.05 5.55 97.05 4.1 97.05 3.9 96.35 L0.85 95.6 0.9 95.5 1.15 95.5 2.6 95.9 Q2.45 95.45 2.65 95.35 L3.25 95.3 5.65 95.6 Q7.15 95.6 9.1 94.55 L9.05 94.55 9.2 94.55 Q9.4 94.45 10.1 94.2 L10.95 93.5 10.95 93.4 Q10.85 93.0 10.15 93.0 L8.8 93.25 8.05 93.25 8.05 93.0 8.4 92.75 8.55 92.6 M41.75 83.8 L41.95 82.2 Q41.95 81.0 41.1 80.15 40.25 79.3 38.95 79.3 37.3 79.3 35.95 80.4 L35.4 80.95 Q34.85 81.1 34.4 81.7 L33.95 82.7 33.45 83.45 Q33.05 83.45 32.75 82.55 L32.6 81.85 33.0 81.15 33.05 81.1 33.1 81.1 Q33.1 81.6 33.55 81.6 L34.95 80.05 35.2 79.85 35.7 79.8 36.25 79.35 37.1 78.9 37.35 78.6 37.35 78.55 38.15 78.45 Q40.8 78.45 41.85 80.05 L43.0 81.6 43.2 82.4 42.85 83.35 Q42.45 83.95 42.15 83.95 L41.75 83.8 M28.45 92.0 L27.9 91.95 27.35 92.0 27.25 92.05 26.4 92.5 25.9 93.55 Q25.15 94.75 24.05 94.75 22.9 94.75 22.45 93.95 L22.2 93.05 Q22.2 92.65 22.5 92.1 L22.5 91.95 22.8 91.05 22.7 91.55 Q22.7 92.35 23.2 92.35 23.65 92.35 24.5 91.8 L25.75 91.05 25.9 91.5 26.2 91.55 26.7 91.45 27.4 91.3 28.2 91.45 28.45 92.0 M39.9 89.15 L40.35 89.2 Q40.7 89.2 41.25 88.75 L41.45 88.55 41.55 88.6 40.25 90.5 Q38.7 92.35 38.15 92.35 L37.8 92.15 Q38.05 91.5 38.7 90.95 L39.9 90.0 39.3 90.25 39.2 90.15 Q39.25 89.5 39.65 89.25 L39.9 89.15 M80.0 94.1 Q79.7 94.1 79.7 93.75 79.7 93.25 80.1 93.15 80.5 93.0 80.5 93.6 80.5 94.1 80.0 94.1 M-1.25 20.25 L-1.75 20.25 -1.85 20.35 Q-1.65 20.75 -1.55 21.85 -1.35 22.85 -0.7 22.9 -0.55 22.7 -0.55 21.9 L-0.6 21.1 -1.25 20.25" fill="#383b2f" fill-rule="evenodd" stroke="none"/>
    <path d="M14.3 -1.5 L14.25 -1.55 14.35 -1.75 15.0 -2.4 Q15.8 -3.05 16.45 -3.05 L17.8 -2.75 18.4 -2.25 18.4 -2.2 16.7 -2.35 Q14.7 -2.2 14.4 -1.55 L14.3 -1.5 M-0.6 10.25 L-0.55 10.2 -0.5 10.5 -1.2 12.35 -0.95 12.35 Q-0.05 12.35 1.3 10.05 L2.05 8.75 2.1 8.85 2.2 9.75 2.15 9.9 2.0 10.75 1.85 11.9 1.85 12.0 0.4 15.9 Q-0.85 19.55 -1.65 19.55 L-2.0 19.45 -2.0 19.2 -2.05 19.2 Q-2.2 19.8 -2.7 19.8 L-2.7 17.95 -2.05 14.15 Q-2.35 14.0 -2.45 13.35 L-2.0 11.65 Q-1.45 10.6 -0.6 10.25 M2.15 14.55 Q2.15 14.2 2.3 14.0 L2.4 13.95 Q2.4 14.8 2.85 14.8 3.35 14.8 3.8 13.85 L4.25 12.4 4.3 11.7 Q4.35 11.2 4.85 11.25 L5.2 11.6 5.35 11.65 Q5.95 11.65 6.45 10.15 L7.05 7.8 8.15 5.45 10.15 2.75 12.2 0.8 12.4 0.85 12.15 1.35 12.25 1.45 12.5 1.5 17.3 -0.55 Q20.3 -1.8 23.1 -2.3 L25.75 -2.1 28.05 -1.75 29.2 -1.45 29.25 -1.45 28.65 -1.05 27.7 -0.8 27.55 -0.85 27.85 -0.35 27.6 0.0 27.6 0.1 24.85 0.2 Q20.4 0.45 16.55 1.85 L16.6 1.35 16.6 0.85 Q16.55 0.6 16.15 0.6 15.3 0.6 14.05 1.5 L13.2 2.2 13.35 1.75 12.75 1.75 11.05 3.65 9.5 5.4 9.35 5.3 9.35 4.7 Q8.55 5.65 7.55 8.95 L6.4 12.85 6.35 13.1 6.3 13.3 6.55 15.1 Q6.25 16.85 5.7 16.85 L5.6 16.85 5.6 17.4 Q5.6 19.4 6.9 23.75 8.15 28.15 8.15 30.2 L7.95 31.8 Q7.75 34.1 6.2 37.55 L6.25 38.0 Q5.65 40.75 4.75 40.75 L4.55 40.75 4.0 41.65 3.9 41.8 2.35 44.55 1.55 45.65 -0.35 48.1 -0.25 47.15 -0.5 47.85 Q-0.8 48.55 -1.2 48.55 L-1.35 48.55 -0.75 46.2 -0.7 46.05 -0.7 46.0 -0.6 46.05 0.2 45.3 0.75 44.35 0.6 45.0 Q1.9 43.95 3.05 41.55 L4.2 39.25 4.4 39.25 Q5.2 39.25 5.7 37.15 L5.65 36.75 Q6.65 34.9 6.6 33.6 7.0 32.5 7.0 31.35 L6.95 29.5 6.7 28.05 6.3 27.6 6.2 27.65 6.15 27.7 5.9 28.3 Q5.9 29.0 5.55 29.1 L5.45 29.1 Q5.15 29.1 5.1 28.7 L5.05 28.25 Q5.05 27.85 5.35 27.35 4.95 24.85 4.0 22.1 L3.55 20.65 3.0 19.0 2.75 17.9 2.6 17.4 2.5 16.75 2.45 16.55 Q2.2 15.95 2.1 14.95 L2.15 14.55 M20.0 -0.5 Q20.0 -1.1 19.2 -0.95 18.45 -0.8 18.55 -0.1 L19.1 0.05 19.6 -0.15 20.0 -0.5 M23.7 -1.45 L23.25 -1.55 Q22.4 -1.65 22.4 -1.2 L22.4 -1.15 21.8 -0.95 21.4 -0.6 Q21.7 -0.15 22.75 -0.05 L24.6 0.0 25.85 0.0 Q26.4 -0.1 26.4 -0.6 26.4 -1.0 25.5 -1.3 L24.2 -1.55 23.7 -1.45 M62.0 -3.0 L62.15 -3.2 64.15 -4.95 64.05 -4.5 Q64.05 -4.1 64.2 -3.95 65.1 -3.9 66.2 -4.5 L67.85 -5.3 67.85 -5.25 67.5 -4.85 67.5 -4.1 68.05 -4.2 Q69.0 -4.5 70.35 -5.3 72.05 -6.3 73.05 -6.3 L73.35 -6.25 75.2 -5.7 75.6 -5.45 75.3 -5.5 73.35 -5.1 72.85 -4.85 Q71.7 -4.1 71.45 -3.0 L71.2 -3.35 70.8 -3.55 Q70.25 -3.55 69.25 -2.9 L68.05 -2.25 67.55 -2.35 67.55 -2.95 67.2 -3.25 66.25 -2.7 Q65.65 -2.15 65.15 -2.15 64.2 -2.15 64.2 -2.8 63.0 -2.1 62.35 -2.1 61.85 -2.1 61.85 -2.7 L62.0 -3.0 M77.0 -10.7 Q77.05 -11.5 78.45 -11.6 79.9 -11.65 79.9 -10.5 L79.9 -10.45 79.9 -10.25 77.7 -10.65 77.0 -10.6 77.0 -10.7 M89.6 -4.75 L90.3 -3.85 91.9 -1.4 92.05 -1.35 93.3 -0.55 93.7 0.4 93.95 1.25 93.65 2.35 94.7 6.3 94.75 6.3 Q95.45 6.5 95.45 7.15 95.4 7.9 94.9 8.0 L95.0 9.25 95.0 10.25 95.0 10.5 94.65 14.0 Q94.4 15.35 93.8 16.3 L93.85 16.8 93.55 17.85 Q93.15 18.7 92.75 18.7 92.3 18.7 92.15 18.3 L92.1 17.85 Q92.1 17.2 92.5 16.7 L92.5 16.65 Q92.5 16.05 93.2 13.5 L94.05 10.9 93.5 11.35 93.2 11.25 Q93.35 8.6 92.65 6.1 L92.3 6.3 Q91.8 6.3 91.75 5.25 91.7 4.2 91.3 4.2 L90.65 4.45 Q90.35 4.45 89.9 4.05 L89.45 3.3 89.4 3.2 Q87.85 0.4 85.7 -1.35 L85.1 -1.8 83.75 -2.65 82.7 -3.15 82.9 -2.55 83.25 -1.35 83.7 1.0 Q84.25 2.1 84.2 3.5 L83.75 7.6 83.85 8.55 83.9 8.6 83.9 8.65 84.0 9.35 84.3 9.8 85.25 10.1 Q86.3 10.1 86.8 9.75 87.3 9.35 87.3 8.35 L87.05 7.8 87.1 7.45 87.05 6.85 86.2 6.25 Q85.95 6.5 85.95 6.8 L86.5 7.45 86.65 7.65 86.55 8.2 85.8 8.35 Q85.1 8.35 84.75 7.6 L84.55 6.8 84.75 5.7 85.05 6.15 85.45 6.05 85.8 5.9 86.45 5.6 Q87.3 5.6 88.2 6.15 L88.3 6.2 88.5 7.35 Q88.5 11.25 85.25 11.25 83.1 11.25 82.55 9.5 L82.55 9.45 82.55 9.15 82.45 9.45 82.05 10.55 Q80.6 14.75 80.6 15.5 L80.65 16.15 80.9 16.25 81.4 16.35 81.75 16.3 81.95 16.15 82.35 16.2 Q82.95 16.2 83.3 15.6 L83.5 15.05 83.55 15.45 Q83.55 16.15 83.15 16.85 82.6 17.8 81.5 17.8 79.9 17.8 79.45 16.65 L79.35 15.5 Q79.35 13.9 80.95 9.65 79.05 11.65 76.1 11.65 74.6 11.65 73.6 11.0 L73.35 11.15 73.0 11.2 72.6 11.1 72.55 11.1 Q71.95 11.1 71.75 10.55 L71.65 10.0 Q71.65 9.45 72.05 9.05 L71.55 6.45 71.75 5.45 73.0 4.35 73.35 3.95 Q74.0 3.2 74.55 3.15 L76.8 3.35 Q77.8 3.45 78.15 2.85 L78.35 3.3 78.5 4.8 78.35 6.35 Q77.9 7.4 76.25 7.4 75.4 7.4 75.2 6.6 L75.2 5.75 75.25 5.7 75.45 5.9 75.95 6.15 Q76.9 6.15 77.45 4.8 77.45 4.35 76.95 4.1 L76.3 3.95 76.3 3.85 76.35 3.8 76.3 3.8 75.95 3.75 Q74.65 3.75 73.9 5.15 L73.45 6.6 73.8 8.25 Q74.65 9.7 77.15 9.8 77.2 9.35 77.9 9.35 78.3 9.35 78.45 9.65 79.95 9.0 80.95 6.35 81.6 4.65 81.85 2.85 81.85 1.1 80.4 -1.25 L80.35 -1.35 79.6 -2.4 77.55 -4.05 77.5 -4.05 77.55 -4.05 77.3 -4.5 77.6 -4.5 Q77.85 -4.5 78.2 -4.85 L82.35 -0.6 82.75 -0.85 82.8 -1.3 82.8 -1.35 82.3 -3.8 80.85 -5.9 79.8 -7.2 80.05 -7.65 80.45 -7.8 81.8 -7.45 83.0 -7.1 82.65 -6.6 Q82.65 -6.05 83.65 -5.55 L84.9 -5.6 86.35 -4.45 Q87.75 -3.45 88.5 -3.45 89.25 -3.45 89.5 -3.95 L89.55 -4.75 89.6 -4.75 M75.15 -4.35 L74.6 -4.25 74.6 -4.2 Q74.6 -3.1 73.35 -3.1 L72.4 -3.3 72.15 -3.15 72.1 -3.1 Q72.4 -3.45 72.95 -3.8 L73.35 -4.0 Q74.05 -4.4 74.7 -4.4 L75.15 -4.35 M85.85 -4.25 Q85.3 -4.25 85.3 -3.65 L85.45 -3.2 85.95 -2.8 Q86.5 -2.8 86.5 -3.4 86.45 -4.25 85.85 -4.25 M89.75 -3.1 L89.7 -3.05 89.4 -2.85 89.35 -2.7 Q89.35 -2.25 89.95 -2.25 90.05 -2.25 90.55 -2.6 L90.55 -3.05 90.1 -3.15 89.75 -3.1 M87.5 -2.25 L87.15 -2.0 87.0 -1.7 87.05 -1.35 Q87.2 -0.7 88.05 -0.15 L89.25 0.45 90.35 1.6 Q91.3 2.55 91.65 2.55 L92.15 2.2 92.15 1.6 Q92.15 0.75 91.6 -0.1 90.9 -1.15 89.8 -1.15 L89.25 -1.05 89.1 -1.15 88.9 -1.35 88.5 -1.7 Q87.9 -2.25 87.5 -2.25 M82.65 4.4 Q82.55 6.35 81.95 7.85 L81.95 7.95 82.25 8.0 Q82.6 8.0 82.85 7.1 L83.1 5.85 82.8 4.35 82.65 4.4 M92.5 20.95 L92.0 21.45 Q91.6 21.45 91.55 21.15 L91.55 20.85 Q91.55 19.95 92.15 19.6 92.7 19.25 92.7 20.2 L92.5 20.95 M90.95 53.25 L91.15 53.3 Q90.85 54.4 89.45 55.3 L88.9 55.75 88.7 55.8 88.55 55.9 Q87.75 56.55 87.45 57.15 L87.45 57.2 87.25 57.9 Q87.25 58.55 88.25 59.85 89.25 61.2 89.25 62.55 89.25 65.1 87.55 65.1 86.35 65.1 85.85 64.3 L86.05 63.45 86.25 62.85 Q86.25 64.25 87.35 64.25 88.4 64.25 88.45 62.55 88.45 61.6 87.45 60.3 86.45 59.05 86.45 57.9 L86.65 56.8 86.35 56.2 83.65 56.95 Q81.1 57.8 81.1 59.65 81.1 60.2 82.35 61.9 83.6 63.6 83.6 64.95 L83.25 66.65 82.8 67.5 81.85 68.45 Q81.2 69.0 80.45 69.0 79.3 69.0 78.75 68.2 L78.55 67.8 78.35 67.35 78.45 67.05 Q78.7 66.35 79.15 66.35 L79.7 66.65 80.3 66.95 Q81.25 66.95 81.25 65.85 L81.05 65.3 80.8 64.85 Q81.3 65.15 81.3 66.15 L81.25 66.75 81.6 67.15 81.85 66.75 82.05 66.3 82.4 65.2 Q82.4 64.1 80.5 62.4 78.55 60.75 78.55 59.25 L78.6 58.9 78.7 59.0 79.35 58.45 79.5 58.7 79.65 58.8 81.25 57.5 81.4 57.4 82.75 56.95 Q83.65 56.5 83.65 56.1 L83.65 56.05 84.95 55.65 88.45 54.9 Q90.25 54.3 90.95 53.25 M86.75 57.55 Q86.9 57.5 87.15 57.4 87.35 57.25 87.35 56.9 L87.1 56.45 Q86.75 56.8 86.65 57.45 L86.75 57.55 M79.85 78.05 L79.8 78.05 79.2 78.15 79.6 77.9 79.85 78.05 M77.5 80.1 Q77.2 80.9 77.2 81.85 77.2 83.5 79.5 86.5 L80.85 88.7 Q81.75 90.55 81.75 92.45 L81.6 93.75 81.15 93.75 80.3 94.65 79.55 95.2 79.5 95.1 79.45 94.8 Q78.3 96.0 77.85 96.05 L77.8 96.0 77.85 95.9 77.75 95.95 Q76.8 96.8 75.8 96.8 L75.35 96.65 75.35 96.05 74.45 96.1 Q73.9 96.0 74.0 95.65 74.6 95.3 75.35 95.2 77.05 95.15 78.2 94.4 L78.9 93.8 Q79.5 93.1 79.6 92.2 L79.6 91.85 79.6 91.4 Q79.4 90.15 78.4 88.55 L77.7 87.6 77.2 87.1 Q78.0 87.15 78.5 87.65 L79.25 88.2 79.9 89.2 80.1 90.1 Q80.25 90.7 80.6 90.7 80.9 90.7 80.9 90.3 L80.5 89.0 80.3 88.3 80.1 88.0 Q79.5 86.7 77.8 85.9 L76.0 84.95 Q75.35 83.75 75.35 82.75 L75.45 81.5 75.45 81.55 Q75.75 82.6 76.45 82.85 L76.55 81.35 76.75 81.4 77.15 80.35 77.5 80.1 M74.1 86.5 L73.6 87.1 Q73.25 87.7 73.25 88.05 L73.35 88.35 73.8 89.2 73.85 89.25 73.85 89.2 73.8 88.9 Q74.3 89.55 75.4 89.55 L76.4 89.35 76.6 89.05 76.3 90.35 Q75.8 91.35 74.75 91.35 73.5 91.35 72.7 89.95 L72.55 89.75 Q72.0 88.65 71.95 87.95 L71.95 87.85 72.0 87.95 Q72.3 87.6 72.9 87.2 L74.1 86.5 M83.15 80.95 L83.15 81.1 82.75 82.3 Q82.15 83.25 81.2 83.25 79.95 83.25 79.45 82.4 L79.2 81.45 79.25 81.1 Q79.3 81.5 79.6 81.5 L80.2 81.4 80.75 81.85 81.05 82.0 81.8 82.15 Q82.5 82.15 82.95 81.35 L83.15 80.95 M73.15 6.1 L72.7 5.65 Q72.2 5.65 72.2 6.2 72.2 6.55 72.65 6.55 73.15 6.55 73.15 6.1 M72.45 9.95 Q72.45 9.55 72.15 9.6 71.8 9.65 71.8 9.95 71.8 10.4 72.2 10.4 L72.45 9.95 M5.6 9.15 Q5.8 9.25 5.8 9.7 5.8 10.35 5.1 10.35 L4.75 10.15 4.75 9.9 Q4.75 9.15 5.3 9.1 L5.5 9.15 5.6 9.15 M5.25 5.8 L4.55 6.45 3.5 7.05 3.1 7.0 3.2 6.85 4.1 5.1 4.1 5.0 5.15 4.05 5.7 3.7 Q5.35 4.3 5.1 5.35 L5.25 5.8 M2.4 6.1 L2.7 5.45 2.45 6.0 2.4 6.1 M3.35 8.1 Q3.8 7.9 3.8 8.5 3.8 9.35 3.3 9.35 2.75 9.35 2.9 8.85 2.9 8.35 3.35 8.1 M4.75 15.25 Q4.2 16.8 3.6 17.15 L3.4 18.05 Q3.4 18.65 4.55 21.45 L5.1 21.05 5.15 20.35 Q5.15 19.0 4.55 17.7 L4.55 17.1 4.7 17.2 5.05 16.25 4.75 15.25 M0.0 13.55 L-0.7 13.95 -0.85 14.05 -1.05 14.1 -1.25 14.55 -1.5 14.95 -2.0 16.25 -1.9 16.6 -1.85 16.7 Q-1.05 16.4 -0.45 15.45 0.1 14.55 0.1 13.7 L0.0 13.55 M-3.35 81.05 Q-4.75 83.15 -4.1 86.4 -3.3 90.45 -1.3 91.7 L-0.95 91.9 -0.9 91.9 -0.95 91.85 -2.05 89.6 Q-2.0 88.6 -1.25 87.2 L-1.25 87.15 -1.25 87.7 -1.2 87.75 -0.1 86.6 -0.1 86.7 Q-0.6 87.65 -0.7 88.65 -0.7 90.2 1.15 91.85 2.0 92.6 3.1 93.1 L3.75 93.15 5.15 93.2 Q6.9 93.15 8.35 92.6 L8.55 92.5 8.55 92.6 8.4 92.75 8.05 93.0 8.05 93.25 8.8 93.25 10.15 93.0 Q10.85 93.0 10.95 93.4 L10.95 93.5 10.1 94.2 Q9.4 94.45 9.2 94.55 L9.05 94.55 9.1 94.55 Q7.15 95.6 5.65 95.6 L3.25 95.3 2.65 95.35 Q2.45 95.45 2.6 95.9 L1.15 95.5 0.9 95.5 0.85 95.6 Q-2.4 94.45 -4.3 92.2 -5.95 90.25 -6.55 87.65 L-6.25 88.2 Q-5.85 88.9 -5.4 88.8 L-5.35 85.75 -5.05 85.8 -4.75 85.55 -4.6 85.15 -5.1 82.6 -5.05 82.5 -5.05 82.45 -4.7 82.05 -4.1 81.6 -4.0 81.45 -3.35 81.05 M2.95 90.3 Q2.2 90.05 1.85 89.4 L1.65 88.4 Q1.65 86.6 3.2 86.6 4.6 86.6 4.85 87.55 L4.9 88.4 4.65 88.7 4.4 88.5 Q4.2 88.25 3.8 88.25 3.35 88.25 3.3 88.4 L3.25 88.55 3.15 88.55 2.7 88.95 2.55 89.4 Q2.55 89.95 2.95 90.3 M-0.3 75.05 L-0.75 74.3 -0.95 73.95 -1.3 72.75 -1.25 72.75 Q-0.95 74.0 0.45 74.0 1.55 74.0 2.0 73.2 L2.25 72.0 Q3.2 72.0 3.2 72.8 3.2 73.75 2.3 74.45 1.4 75.15 0.2 75.15 L-0.3 75.05 M41.75 83.8 L42.15 83.95 Q42.45 83.95 42.85 83.35 L43.2 82.4 43.0 81.6 Q43.65 81.6 43.7 80.7 L43.75 80.45 Q44.3 81.65 44.3 83.25 L44.25 84.2 44.2 84.65 43.25 86.35 Q42.6 86.4 42.6 87.05 L42.6 87.3 42.95 87.5 43.8 86.95 44.2 86.45 45.15 85.65 Q46.2 84.75 46.35 84.75 L47.35 85.0 48.75 84.65 Q49.7 84.3 50.15 84.3 51.35 84.3 52.7 86.2 L53.15 86.85 Q51.75 85.45 50.2 85.1 L45.9 86.65 44.05 88.05 42.2 89.4 41.3 90.45 39.35 92.2 Q37.3 93.65 35.2 93.65 L31.8 92.8 Q30.25 92.25 29.05 92.05 L28.9 92.05 28.45 92.0 28.2 91.45 27.4 91.3 26.7 91.45 26.2 91.55 25.9 91.5 25.75 91.05 24.5 91.8 Q23.65 92.35 23.2 92.35 22.7 92.35 22.7 91.55 L22.8 91.05 22.9 90.8 23.1 90.5 23.95 89.6 24.65 89.15 24.2 89.9 24.35 90.25 24.65 90.25 26.0 89.9 27.65 89.55 28.3 89.65 27.85 89.9 27.85 90.3 Q27.85 90.85 28.6 90.85 L30.3 90.5 30.65 90.55 31.1 90.85 Q31.55 91.2 31.9 91.2 L32.75 91.5 34.3 91.75 35.5 91.45 Q35.9 91.15 35.9 90.85 L36.75 90.45 36.7 90.6 36.7 90.9 Q36.75 91.15 37.15 91.15 37.6 91.15 37.95 90.75 L38.2 90.25 Q38.2 89.6 37.6 89.75 L39.7 88.0 38.25 88.75 37.35 89.0 Q38.5 88.4 39.6 87.25 L40.8 85.8 41.75 83.8 M32.6 81.85 L32.75 82.55 Q33.05 83.45 33.45 83.45 L33.95 82.7 34.4 81.7 Q34.85 81.1 35.4 80.95 34.65 81.75 34.65 82.6 L34.9 83.6 34.85 83.85 Q34.85 84.3 35.2 84.75 L36.1 85.25 36.6 84.9 36.9 85.2 37.3 85.25 Q38.05 85.25 38.7 84.4 L39.2 83.6 39.35 84.55 39.0 85.7 38.5 86.15 Q37.6 86.8 36.35 86.8 34.05 86.8 33.05 85.4 32.3 84.35 32.3 82.5 L32.35 82.05 32.6 81.85 M59.5 89.85 Q61.35 89.75 62.1 88.25 L62.5 86.8 62.5 86.65 62.15 85.9 Q61.8 85.55 61.45 85.55 L60.75 85.65 60.65 85.65 Q60.9 85.4 61.95 85.2 L62.45 85.1 62.7 85.4 62.9 85.8 63.25 86.2 63.4 85.85 Q63.4 85.25 63.05 84.9 L63.3 84.55 63.75 85.2 Q64.05 85.85 63.95 86.55 L63.65 88.55 63.3 88.9 Q62.2 90.0 61.5 90.0 L60.05 90.15 59.5 89.85 M35.1 85.35 L35.2 85.1 Q35.2 84.6 34.65 84.35 34.05 84.05 34.05 84.8 L34.3 85.2 Q34.55 85.5 34.85 85.5 L35.1 85.35 M39.9 89.15 L39.65 89.25 Q39.25 89.5 39.2 90.15 L39.3 90.25 39.9 90.0 38.7 90.95 Q38.05 91.5 37.8 92.15 L38.15 92.35 Q38.7 92.35 40.25 90.5 L41.55 88.6 41.45 88.55 41.7 88.15 Q41.7 87.4 40.75 87.8 39.75 88.2 39.75 88.85 L39.8 89.05 39.9 89.15 M36.5 92.35 Q36.5 91.9 36.05 91.9 35.5 91.9 35.5 92.35 35.5 92.7 36.05 92.7 36.5 92.7 36.5 92.35 M76.7 84.1 Q76.85 84.4 77.1 84.4 L77.4 83.95 Q77.4 83.5 77.0 83.5 76.6 83.5 76.6 83.9 L76.7 84.1 M79.85 92.35 Q79.9 92.7 80.25 92.7 80.65 92.7 80.65 91.9 80.65 91.2 80.25 91.2 79.85 91.2 79.85 91.95 L79.85 92.35 M80.0 94.1 Q80.5 94.1 80.5 93.6 80.5 93.0 80.1 93.15 79.7 93.25 79.7 93.75 79.7 94.1 80.0 94.1 M-1.25 20.25 L-0.6 21.1 -0.55 21.9 Q-0.55 22.7 -0.7 22.9 -1.35 22.85 -1.55 21.85 -1.65 20.75 -1.85 20.35 L-1.75 20.25 -1.25 20.25 M-3.65 89.5 Q-4.75 88.05 -4.75 89.2 -4.4 91.65 -2.95 91.65 -2.6 91.65 -2.6 91.15 L-3.65 89.5" fill="#454a3a" fill-rule="evenodd" stroke="none"/>
    <path d="M14.3 -1.5 L14.4 -1.55 Q14.7 -2.2 16.7 -2.35 L18.4 -2.2 18.65 -1.8 Q18.65 -1.3 17.75 -1.1 L16.4 -0.8 13.95 0.55 Q13.55 0.55 13.45 0.35 L13.3 0.15 11.8 0.55 Q11.0 0.55 11.0 0.0 11.0 -1.05 14.3 -1.5 M22.4 -1.15 L22.4 -1.2 Q22.4 -1.65 23.25 -1.55 L23.7 -1.45 24.1 -1.15 Q24.1 -0.6 23.35 -0.6 22.45 -0.6 22.4 -1.15 M69.85 -6.2 L68.8 -5.8 Q68.25 -5.8 68.05 -6.0 L68.0 -6.05 67.9 -6.35 68.05 -6.9 68.4 -7.25 70.3 -8.2 71.65 -8.8 73.35 -9.2 74.35 -9.3 75.5 -9.0 76.4 -9.35 77.6 -9.65 Q79.05 -9.8 79.05 -8.95 79.05 -8.25 77.55 -8.15 78.45 -7.55 78.45 -7.0 L78.2 -6.4 Q77.9 -6.05 77.5 -6.05 77.0 -6.05 76.25 -7.0 75.45 -8.0 73.5 -8.0 L73.35 -8.0 71.8 -7.7 Q70.7 -7.4 70.7 -7.1 70.65 -6.65 69.85 -6.2 M76.5 -9.9 L76.35 -9.65 Q76.15 -9.45 75.95 -9.45 75.6 -9.45 75.55 -9.6 L75.55 -9.75 Q75.55 -10.2 76.15 -10.2 76.45 -10.2 76.5 -9.9 M80.4 -4.0 Q80.4 -4.8 81.2 -4.4 81.95 -4.05 81.95 -3.5 81.95 -2.9 81.5 -2.9 80.9 -2.9 80.6 -3.45 L80.4 -4.0 M79.35 -5.4 Q79.35 -5.75 79.75 -5.75 80.1 -5.75 80.1 -5.3 L79.8 -5.0 Q79.35 -5.0 79.35 -5.4 M82.25 -8.25 Q81.65 -8.25 81.25 -8.6 80.95 -8.8 80.95 -8.95 80.95 -10.15 82.75 -8.55 82.75 -8.25 82.25 -8.25 M83.75 -7.25 L84.45 -7.7 Q85.45 -7.7 86.55 -6.8 L87.45 -5.7 Q87.45 -5.3 87.0 -5.3 86.5 -5.3 85.75 -5.75 L84.8 -6.2 84.5 -6.0 84.15 -5.8 Q83.65 -5.8 83.4 -6.1 L83.25 -6.45 Q83.25 -6.75 83.75 -7.25 M91.25 1.4 Q90.75 1.4 90.4 0.75 L90.15 0.1 Q90.15 -0.6 90.9 -0.25 91.6 0.05 91.6 0.9 91.6 1.4 91.25 1.4 M85.45 6.05 Q85.1 6.05 85.1 5.7 85.1 5.4 85.5 5.25 85.85 5.1 85.85 5.6 L85.8 5.9 85.45 6.05 M83.65 56.05 L83.65 56.1 Q83.65 56.5 82.75 56.95 L81.4 57.4 81.05 57.4 Q80.9 57.4 80.75 57.6 L80.3 57.75 79.9 57.5 79.85 57.25 Q79.85 56.85 80.15 56.7 L81.4 56.5 81.65 56.65 82.25 56.2 Q82.75 55.75 83.35 55.75 L83.65 56.05 M87.6 63.0 L87.4 63.05 87.1 62.9 87.1 62.7 Q87.1 62.35 87.4 62.35 L87.65 62.65 87.6 63.0 M80.2 81.4 L80.1 80.95 Q80.1 79.8 81.4 79.8 81.9 79.8 82.1 80.7 L81.85 81.4 Q81.5 81.85 81.05 81.85 L80.75 81.85 80.2 81.4 M76.7 5.3 L76.15 5.65 Q75.6 5.65 75.5 5.35 L75.5 5.05 75.55 4.55 Q75.65 4.3 76.25 4.3 76.9 4.3 76.85 4.85 L76.7 5.3 M9.9 1.35 Q9.9 1.9 8.15 2.4 7.5 2.4 7.5 1.95 7.5 1.7 7.95 1.3 8.45 0.85 8.85 0.85 9.9 0.85 9.9 1.35 M5.7 3.7 Q6.25 2.7 7.0 2.7 7.4 2.7 7.45 3.0 L7.45 3.35 7.4 3.75 Q7.6 3.55 7.75 3.5 L8.1 4.0 6.9 6.65 Q6.3 9.05 5.6 9.15 L5.5 9.15 5.3 9.1 5.05 8.8 5.05 8.4 Q5.05 7.65 5.75 6.25 L5.45 5.95 5.25 5.8 5.1 5.35 Q5.35 4.3 5.7 3.7 M3.1 7.0 L2.35 7.65 1.75 8.1 1.3 8.35 Q0.8 8.35 0.8 7.9 0.8 7.05 1.4 6.9 2.15 6.7 2.4 6.1 L2.45 6.0 2.7 5.45 Q2.95 4.95 3.45 4.7 4.05 4.35 4.1 5.0 L4.1 5.1 3.2 6.85 3.1 7.0 M3.75 11.65 Q3.75 12.65 3.1 12.65 L2.75 12.4 2.75 12.05 Q2.75 11.1 3.35 11.1 3.7 11.1 3.75 11.65 M4.15 71.05 Q4.15 71.7 3.65 71.7 3.15 71.7 2.25 70.95 L1.5 71.1 0.9 71.2 Q1.4 71.45 1.4 72.15 L1.2 72.75 0.5 73.15 Q-0.4 73.15 -0.5 72.1 -0.5 71.35 0.05 71.15 0.1 70.45 0.7 70.3 L1.8 70.25 2.55 70.15 Q4.15 70.15 4.15 71.05 M3.9 74.75 Q3.55 74.75 3.55 74.4 3.55 73.95 3.9 73.9 4.25 73.85 4.25 74.25 L4.15 74.55 3.9 74.75 M1.4 76.75 L-0.7 76.8 -2.3 77.3 -3.1 78.15 -2.9 78.5 -2.85 78.9 Q-2.85 79.25 -3.3 79.9 -3.85 80.7 -4.45 80.7 -5.05 80.7 -5.05 80.25 L-4.95 80.05 -5.2 79.55 Q-5.2 78.95 -3.3 77.05 -2.8 76.6 -1.4 76.25 L1.05 75.85 Q1.1 75.45 2.05 74.85 3.05 74.2 3.05 75.2 3.05 75.75 2.15 76.25 L1.4 76.75 M0.0 85.45 L-0.35 86.05 Q-0.55 86.5 -0.9 86.5 -1.2 86.5 -1.2 85.9 -1.2 85.4 0.15 84.55 1.5 83.7 1.5 84.55 L0.0 85.45 M2.2 84.05 Q2.2 83.75 2.5 83.75 L2.8 84.05 Q2.8 84.4 2.5 84.4 2.2 84.4 2.2 84.05 M4.65 88.7 L4.85 88.75 5.7 88.25 Q6.0 88.25 5.95 88.55 L5.45 89.15 4.55 89.45 3.45 89.25 3.25 88.7 3.25 88.55 3.3 88.4 Q3.35 88.25 3.8 88.25 4.2 88.25 4.4 88.5 L4.65 88.7 M37.35 78.55 L37.35 78.6 37.1 78.9 36.25 79.35 35.7 79.8 35.2 79.85 34.85 79.85 34.25 80.15 Q33.9 80.15 33.75 79.95 L33.65 79.75 Q33.65 78.9 34.45 78.9 L34.9 79.0 35.85 78.65 36.95 78.3 37.35 78.55 M36.85 84.15 L36.8 83.75 Q36.8 83.05 37.45 83.2 38.1 83.35 38.1 83.8 38.1 84.5 37.4 84.5 L36.85 84.15 M30.65 90.55 L30.55 90.45 29.65 90.3 Q29.25 90.25 29.25 90.1 29.25 89.65 29.6 89.5 30.0 89.3 30.8 89.75 L31.45 90.0 32.2 90.25 33.15 90.65 35.0 90.45 Q35.9 90.45 35.9 90.85 35.9 91.15 35.5 91.45 L34.3 91.75 32.75 91.5 31.9 91.2 Q31.55 91.2 31.1 90.85 L30.65 90.55 M36.75 90.45 Q36.8 89.9 37.45 89.75 L37.6 89.75 Q38.2 89.6 38.2 90.25 L37.95 90.75 Q37.6 91.15 37.15 91.15 36.75 91.15 36.7 90.9 L36.7 90.6 36.75 90.45 M79.9 66.3 Q79.55 66.3 79.3 65.95 L79.15 65.6 Q79.15 64.9 79.95 64.9 80.45 64.9 80.45 65.6 80.45 66.3 79.9 66.3 M62.45 85.1 L62.4 85.05 Q61.8 85.05 61.5 84.75 L60.75 84.7 60.25 84.9 60.0 84.8 60.25 84.45 60.8 84.25 Q62.45 84.25 63.05 84.9 63.4 85.25 63.4 85.85 L63.25 86.2 62.9 85.8 62.7 85.4 62.45 85.1 M46.6 84.05 L46.85 83.55 47.85 83.65 48.0 83.45 48.5 83.45 Q49.3 83.45 49.3 83.9 49.3 84.2 48.9 84.4 L47.75 84.6 46.85 84.35 46.6 84.05 M60.35 87.0 Q60.35 86.6 60.85 86.55 61.3 86.5 61.3 86.95 61.3 87.5 60.8 87.5 L60.4 87.25 60.35 87.0 M57.25 89.35 L57.5 89.6 57.25 89.9 57.05 89.75 57.0 89.6 Q57.0 89.3 57.25 89.35 M56.55 89.45 Q56.0 89.45 54.5 87.45 54.35 86.95 55.6 87.9 L56.85 89.1 56.55 89.45 M76.55 81.35 L76.45 81.15 76.45 80.9 Q76.45 79.65 77.25 78.75 L77.15 78.5 77.7 77.85 Q78.3 77.3 78.8 77.3 79.15 77.3 79.15 77.5 L78.0 78.25 78.1 78.5 77.75 78.95 Q77.35 79.5 77.25 80.0 L77.15 80.35 76.75 81.4 76.55 81.35 M72.75 86.2 Q72.75 85.9 73.3 85.55 73.9 85.15 74.8 85.15 L75.15 85.4 74.9 85.6 73.9 86.0 Q73.35 86.55 73.05 86.55 72.75 86.55 72.75 86.4 L72.75 86.2 M74.75 89.15 Q74.1 89.15 74.1 88.55 74.1 87.9 74.7 87.95 75.3 88.0 75.3 88.5 L75.15 88.9 74.75 89.15" fill="#62664e" fill-rule="evenodd" stroke="none"/>
  </g>
</svg>
