<?xml version="1.0" encoding="UTF-8" standalone="no"?>
<svg xmlns:xlink="http://www.w3.org/1999/xlink" height="54.35px" width="79.05px" xmlns="http://www.w3.org/2000/svg">
  <g transform="matrix(1.0, 0.0, 0.0, 1.0, 36.65, 53.9)">
    <path d="M-21.25 -1.2 L-36.65 -6.55 42.4 -4.4 28.1 0.45 -21.25 -1.2" fill="url(#gradient0)" fill-rule="evenodd" stroke="none"/>
    <path d="M5.25 -53.9 L42.4 -4.4 -36.65 -6.55 5.25 -53.9" fill="url(#gradient1)" fill-rule="evenodd" stroke="none"/>
  </g>
  <defs>
    <linearGradient gradientTransform="matrix(8.0E-4, 0.0094, -0.0385, 0.0032, 4.2, -4.65)" gradientUnits="userSpaceOnUse" id="gradient0" spreadMethod="pad" x1="-819.2" x2="819.2">
      <stop offset="0.0" stop-color="#537379"/>
      <stop offset="1.0" stop-color="#779bad"/>
    </linearGradient>
    <linearGradient gradientTransform="matrix(0.0134, 0.0234, -0.0336, 0.0193, -2.15, -18.6)" gradientUnits="userSpaceOnUse" id="gradient1" spreadMethod="pad" x1="-819.2" x2="819.2">
      <stop offset="0.0" stop-color="#d7f0d5"/>
      <stop offset="0.19607843137254902" stop-color="#c3e0ca"/>
      <stop offset="0.7294117647058823" stop-color="#94b7af"/>
      <stop offset="1.0" stop-color="#95b8b0"/>
    </linearGradient>
  </defs>
</svg>
