<?xml version="1.0" encoding="UTF-8" standalone="no"?>
<svg xmlns:xlink="http://www.w3.org/1999/xlink" height="29.3px" width="44.05px" xmlns="http://www.w3.org/2000/svg">
  <g transform="matrix(1.0, 0.0, 0.0, 1.0, 22.0, 14.65)">
    <path d="M0.75 -12.8 L2.45 -12.95 6.4 -13.35 5.85 -12.85 3.7 -11.15 0.7 -8.65 1.25 -8.65 Q0.6 -8.3 0.0 -8.2 L6.15 -8.55 12.6 -9.2 17.2 -9.95 15.5 -8.5 13.45 -6.8 7.3 -7.15 1.45 -7.55 -2.85 -7.15 -4.85 -6.8 -2.05 -9.05 1.05 -11.25 0.95 -11.25 0.75 -11.35 Q-0.75 -11.35 -5.35 -9.75 -11.15 -7.75 -13.9 -5.2 -17.5 -1.85 -21.9 -0.05 L-22.0 -0.1 Q-21.1 -0.75 -20.15 -1.5 L-17.35 -4.15 -14.9 -6.45 -10.6 -11.55 -11.0 -10.3 -11.3 -9.6 -12.55 -7.3 Q-11.0 -9.45 -5.35 -11.3 -1.75 -12.5 0.75 -12.8" fill="#a0a1b0" fill-rule="evenodd" stroke="none"/>
    <path d="M13.45 -6.8 Q12.05 -5.75 10.8 -5.05 L5.25 -5.7 2.45 -5.85 2.35 -5.85 -3.0 -5.5 -6.05 -5.2 Q-7.35 -5.2 -7.35 -5.6 -7.35 -6.15 -6.25 -7.1 L-4.35 -8.45 -4.45 -8.45 -9.05 -6.8 -11.9 -4.95 -14.7 -2.95 Q-17.05 -1.35 -20.0 0.15 L-20.95 0.65 -21.9 -0.05 Q-17.5 -1.85 -13.9 -5.2 -11.15 -7.75 -5.35 -9.75 -0.75 -11.35 0.75 -11.35 L0.95 -11.25 1.05 -11.25 -2.05 -9.05 -4.85 -6.8 -2.85 -7.15 1.45 -7.55 7.3 -7.15 13.45 -6.8" fill="#9494a3" fill-rule="evenodd" stroke="none"/>
    <path d="M1.25 -8.65 L4.2 -8.65 13.8 -10.25 Q18.9 -11.5 21.95 -14.4 L22.05 -14.25 17.2 -9.95 12.6 -9.2 6.15 -8.55 0.0 -8.2 Q0.6 -8.3 1.25 -8.65 M-17.35 -4.15 L-15.55 -6.15 Q-11.65 -10.65 -10.1 -14.65 L-10.1 -13.9 -10.55 -11.65 -10.6 -11.6 -10.6 -11.55 -14.9 -6.45 -17.35 -4.15 M-11.3 -9.6 L-11.85 -8.65 -11.85 -8.4 Q-9.7 -11.75 -3.15 -12.6 L0.75 -12.8 Q-1.75 -12.5 -5.35 -11.3 -11.0 -9.45 -12.55 -7.3 L-11.3 -9.6" fill="#abacbd" fill-rule="evenodd" stroke="none"/>
    <path d="M10.8 -5.05 Q9.1 -4.15 7.7 -3.9 10.4 -3.7 11.95 -2.4 L12.05 -2.35 6.4 -2.1 6.2 -2.05 4.95 -1.95 8.95 -0.9 6.5 -0.3 2.1 0.65 2.65 -1.4 1.8 -1.05 1.25 -0.45 0.6 -0.25 -3.1 0.65 -3.15 0.65 -5.4 1.2 -5.5 1.25 -7.35 1.65 -9.6 2.15 -11.5 2.55 -14.25 2.85 -15.2 2.8 -15.55 2.75 -16.9 2.5 -17.95 2.15 -18.65 1.85 -18.9 1.75 -20.95 0.65 -20.0 0.15 Q-17.05 -1.35 -14.7 -2.95 L-11.9 -4.95 -9.05 -6.8 -4.45 -8.45 -4.35 -8.45 -6.25 -7.1 Q-7.35 -6.15 -7.35 -5.6 -7.35 -5.2 -6.05 -5.2 L-3.0 -5.5 2.35 -5.85 2.45 -5.85 5.25 -5.7 10.8 -5.05" fill="#868794" fill-rule="evenodd" stroke="none"/>
    <path d="M-15.2 2.8 L-10.6 2.6 Q-4.2 1.2 1.95 1.85 5.7 2.2 9.4 3.35 L3.7 3.85 Q6.5 3.9 8.95 5.15 L2.5 5.75 -8.4 7.05 -15.25 8.05 Q-16.85 4.95 -20.2 3.15 L-20.15 3.0 -18.65 1.85 -17.95 2.15 -16.9 2.5 -15.55 2.75 -15.2 2.8" fill="#ffffff" fill-rule="evenodd" stroke="none"/>
    <path d="M8.95 5.15 L9.45 5.4 2.95 6.85 Q-1.85 8.3 -6.15 10.8 L-0.65 11.65 0.95 11.9 Q-6.3 14.15 -13.1 11.65 L-13.6 14.65 -13.9 12.8 -14.05 11.65 Q-14.4 9.65 -15.25 8.05 L-8.4 7.05 2.5 5.75 8.95 5.15" fill="#ffffff" fill-opacity="0.5647059" fill-rule="evenodd" stroke="none"/>
    <path d="M-2.8 -6.5 L0.55 -6.0 Q2.2 -5.65 3.85 -4.95 L3.9 -4.05 3.8 -2.9 3.6 -1.75 2.0 -1.8 2.15 -2.95 2.2 -4.05 2.2 -4.25 2.0 -4.3 0.35 -4.85 -4.25 -5.65 -7.65 -5.5 -6.95 -5.7 -2.8 -6.5 M-18.0 2.05 L-18.1 1.95 -18.35 1.7 -19.55 0.3 -19.35 0.1 -17.35 -1.3 -17.95 -0.1 -18.1 0.5 -17.8 1.05 -17.45 1.65 -17.35 1.8 -18.0 2.05" fill="#342145" fill-rule="evenodd" stroke="none"/>
    <path d="M-7.65 -5.5 L-4.25 -5.65 0.35 -4.85 2.0 -4.3 2.2 -4.25 2.2 -4.05 2.15 -2.95 2.0 -1.8 1.8 -1.05 1.7 -0.55 1.45 0.15 Q0.65 2.25 -0.85 4.15 -2.25 5.75 -4.2 6.4 -9.15 8.05 -12.75 6.3 -15.1 5.1 -16.9 2.5 L-17.35 1.8 -17.45 1.65 -17.8 1.05 -18.1 0.5 -17.95 -0.1 -17.35 -1.3 -16.95 -1.7 Q-14.95 -3.15 -12.85 -4.05 L-12.75 -4.1 Q-10.25 -5.2 -7.65 -5.5 M-15.35 -0.65 L-17.05 0.4 -17.2 0.55 -16.95 1.3 -16.7 1.6 -15.85 2.5 -15.55 2.75 Q-14.25 3.95 -12.75 4.7 -11.1 5.55 -9.15 5.9 -4.1 6.95 -0.95 2.6 L0.35 0.4 0.6 -0.25 0.65 -0.3 0.8 -0.9 1.15 -1.75 1.25 -1.6 1.35 -1.8 1.7 -3.0 0.0 -3.2 -3.3 -3.35 -4.25 -3.35 -4.4 -3.5 -5.05 -4.05 Q-6.25 -4.85 -7.7 -4.85 -9.2 -4.85 -10.35 -4.05 L-11.0 -3.5 -11.9 -2.15 -12.5 -1.95 -12.75 -1.85 -15.15 -0.8 -15.35 -0.65" fill="#ba6a21" fill-rule="evenodd" stroke="none"/>
    <path d="M0.0 -3.2 L1.7 -3.0 1.35 -1.8 1.25 -1.6 1.15 -1.75 0.8 -0.9 0.65 -0.3 0.6 -0.25 0.35 0.4 -0.95 2.6 Q-4.1 6.95 -9.15 5.9 -11.1 5.55 -12.75 4.7 -14.25 3.95 -15.55 2.75 L-15.85 2.5 -16.7 1.6 -16.95 1.3 -17.2 0.55 -17.05 0.4 -15.35 -0.65 -14.95 1.0 Q-14.45 2.25 -13.2 3.2 L-12.75 3.55 Q-10.95 4.8 -8.75 4.8 -6.55 4.8 -4.85 4.0 -4.4 4.0 -4.2 3.65 L-2.15 1.7 -1.95 1.45 -1.05 -0.1 -1.1 -0.05 -0.45 -1.5 -0.35 -1.75 -0.05 -3.0 0.0 -3.2" fill="#cd8e25" fill-rule="evenodd" stroke="none"/>
    <path d="M3.6 -1.75 L3.6 -1.7 3.45 -0.95 3.1 0.15 2.5 1.7 0.45 5.1 Q-0.8 6.7 -2.5 7.55 L-3.25 7.85 -4.15 8.15 Q-8.4 9.45 -11.75 8.15 L-12.75 7.7 -13.0 7.55 Q-15.85 5.9 -17.95 2.15 L-18.0 2.1 -18.0 2.05 -17.35 1.8 -16.9 2.5 Q-15.1 5.1 -12.75 6.3 -9.15 8.05 -4.2 6.4 -2.25 5.75 -0.85 4.15 0.65 2.25 1.45 0.15 L1.7 -0.55 1.8 -1.05 2.0 -1.8 3.6 -1.75 M-7.9 8.6 Q-2.85 6.95 -2.0 6.4 -1.35 5.9 0.4 3.45 -0.9 5.0 -4.0 6.75 -6.35 8.05 -7.85 8.55 L-7.9 8.6" fill="#4b395c" fill-rule="evenodd" stroke="none"/>
    <path d="M-19.35 0.1 Q-17.4 -2.45 -14.5 -4.05 L-12.75 -4.9 Q-8.85 -6.5 -4.65 -6.55 L-4.25 -6.55 -2.8 -6.5 -6.95 -5.7 -7.65 -5.5 Q-10.25 -5.2 -12.75 -4.1 L-12.85 -4.05 Q-14.95 -3.15 -16.95 -1.7 L-17.35 -1.3 -19.35 0.1" fill="#20142b" fill-rule="evenodd" stroke="none"/>
    <path d="M-11.9 -2.15 L-11.0 -3.5 -10.35 -4.05 Q-9.2 -4.85 -7.7 -4.85 -6.25 -4.85 -5.05 -4.05 L-4.4 -3.5 -4.25 -3.35 -4.05 -3.15 -6.25 -3.1 -6.4 -3.2 Q-6.95 -3.7 -7.7 -3.7 -8.7 -3.7 -9.4 -2.8 L-9.45 -2.75 -11.9 -2.15" fill="#3b210b" fill-rule="evenodd" stroke="none"/>
    <path d="M-15.35 -0.65 L-15.15 -0.8 -12.75 -1.85 -12.5 -1.95 -11.9 -2.15 -12.25 -1.1 -12.45 -1.0 -12.75 -0.8 Q-14.0 -0.05 -14.1 0.7 L-14.1 0.8 Q-14.1 1.35 -13.1 2.0 L-12.75 2.25 -11.5 2.65 -11.4 2.65 -11.0 3.1 Q-9.65 4.45 -7.7 4.45 L-5.9 4.15 -5.5 3.95 -5.6 3.95 -4.15 2.6 -4.1 2.8 -3.7 2.3 Q-3.25 1.55 -3.1 0.7 L-3.1 0.65 -3.05 0.15 -3.1 0.15 Q-3.1 -0.85 -3.35 -1.55 L-3.75 -2.45 -3.65 -2.5 -3.85 -2.85 -4.05 -3.15 -4.25 -3.35 -3.3 -3.35 0.0 -3.2 -0.05 -3.0 -0.35 -1.75 -0.45 -1.5 -1.1 -0.05 -1.05 -0.1 -1.95 1.45 -2.15 1.7 -4.2 3.65 Q-4.4 4.0 -4.85 4.0 -6.55 4.8 -8.75 4.8 -10.95 4.8 -12.75 3.55 L-13.2 3.2 Q-14.45 2.25 -14.95 1.0 L-15.35 -0.65" fill="#e6be29" fill-rule="evenodd" stroke="none"/>
    <path d="M-12.25 -1.1 L-11.9 -2.15 -9.45 -2.75 -9.5 -2.7 -9.9 -1.8 Q-11.05 -1.75 -12.25 -1.1 M-6.25 -3.1 L-4.05 -3.15 -3.85 -2.85 -3.65 -2.5 -3.75 -2.45 -3.35 -1.55 Q-3.1 -0.85 -3.1 0.15 L-3.05 0.15 -3.1 0.65 -3.1 0.7 Q-3.25 1.55 -3.7 2.3 L-4.1 2.8 -4.15 2.6 -5.6 3.95 -5.5 3.95 -5.9 4.15 -7.7 4.45 Q-9.65 4.45 -11.0 3.1 L-11.4 2.65 Q-10.5 2.6 -9.65 2.0 L-9.6 2.15 -9.5 2.3 Q-8.75 3.3 -7.7 3.3 L-7.3 3.3 -6.8 3.1 -6.85 3.0 Q-5.8 2.35 -5.5 1.25 L-5.4 1.3 -5.4 1.2 -5.25 0.75 -5.2 0.25 -5.2 -0.3 -5.35 -1.3 -5.35 -1.35 -5.5 -1.75 -5.45 -1.8 -5.6 -2.15 -5.7 -2.3 -5.95 -2.7 -6.25 -3.1" fill="#593110" fill-rule="evenodd" stroke="none"/>
    <path d="M-9.65 2.0 Q-10.2 1.05 -10.2 -0.2 L-10.2 -0.4 -10.1 -1.1 -9.9 -1.8 -9.5 -1.85 -9.05 -1.8 -8.75 -1.2 -8.5 -0.75 -8.35 -0.05 Q-8.35 0.7 -9.25 1.6 L-9.65 2.0" fill="#262626" fill-rule="evenodd" stroke="none"/>
    <path d="M-11.4 2.65 L-11.5 2.55 Q-12.25 1.5 -12.35 0.15 L-12.35 -0.2 -12.35 -0.4 -12.25 -1.1 Q-11.05 -1.75 -9.9 -1.8 L-10.1 -1.1 -10.2 -0.4 -10.2 -0.2 Q-10.2 1.05 -9.65 2.0 -10.5 2.6 -11.4 2.65" fill="#703b14" fill-rule="evenodd" stroke="none"/>
    <path d="M-11.4 2.65 L-11.5 2.65 -12.75 2.25 -13.1 2.0 Q-14.1 1.35 -14.1 0.8 L-14.1 0.7 Q-14.0 -0.05 -12.75 -0.8 L-12.45 -1.0 -12.25 -1.1 -12.35 -0.4 -12.35 -0.2 -12.35 0.15 Q-12.25 1.5 -11.5 2.55 L-11.4 2.65" fill="#ffd32e" fill-rule="evenodd" stroke="none"/>
    <path d="M-9.45 -2.75 L-9.4 -2.8 Q-8.7 -3.7 -7.7 -3.7 -6.95 -3.7 -6.4 -3.2 L-6.25 -3.1 -7.1 -3.05 -9.45 -2.75" fill="#000000" fill-rule="evenodd" stroke="none"/>
    <path d="M-9.65 2.0 L-9.25 1.6 Q-8.35 0.7 -8.35 -0.05 L-8.5 -0.75 -8.75 -1.2 -9.05 -1.8 -9.5 -1.85 -9.9 -1.8 -9.5 -2.7 -9.45 -2.75 -7.1 -3.05 -6.25 -3.1 -5.95 -2.7 -5.7 -2.3 -5.6 -2.15 -5.45 -1.8 -5.5 -1.75 -5.35 -1.35 -5.35 -1.3 -5.2 -0.3 -5.2 0.25 -5.25 0.75 -5.4 1.2 -5.4 1.3 -5.5 1.25 Q-5.8 2.35 -6.85 3.0 L-6.8 3.1 -7.3 3.3 -7.7 3.3 Q-8.75 3.3 -9.5 2.3 L-9.6 2.15 -9.65 2.0" fill="#171717" fill-rule="evenodd" stroke="none"/>
    <path d="M-7.9 8.6 L-7.85 8.55 Q-6.35 8.05 -4.0 6.75 -0.9 5.0 0.4 3.45 -1.35 5.9 -2.0 6.4 -2.85 6.95 -7.9 8.6" fill="#5f4875" fill-rule="evenodd" stroke="none"/>
    <path d="M0.8 -0.9 Q0.25 -0.4 -1.05 -0.1 L-3.05 0.15 -5.2 0.25 -5.8 0.25 Q-6.65 0.25 -6.85 -0.05 L-6.9 -0.4 Q-6.9 -0.95 -5.65 -1.7 L-5.45 -1.8 -3.65 -2.5 -2.85 -2.75 -1.25 -3.0 -0.05 -3.0 0.5 -2.85 1.1 -2.25 1.15 -1.75 0.8 -0.9 M-5.55 -0.4 L-2.7 -0.9 Q-0.35 -1.45 -0.35 -1.85 -0.35 -2.4 -1.55 -2.45 L-2.8 -1.95 Q-5.75 -0.9 -5.85 -0.45 L-5.55 -0.4 M-4.2 3.65 Q-4.4 4.0 -4.85 4.0 L-5.5 3.95 -6.8 3.1 -6.9 2.95 -7.35 1.85 -7.35 1.65 Q-7.25 0.4 -5.7 1.15 L-5.5 1.25 -5.4 1.3 Q-4.2 1.95 -4.1 2.8 L-4.1 2.95 -4.2 3.65 M-6.4 2.95 L-5.7 3.3 Q-5.35 3.3 -5.35 2.8 -5.35 2.2 -5.75 1.8 L-6.25 1.45 -6.6 1.35 -6.85 1.95 Q-6.85 2.5 -6.4 2.95" fill="#ffffff" fill-opacity="0.5137255" fill-rule="evenodd" stroke="none"/>
    <path d="M-5.55 -0.4 L-5.85 -0.45 Q-5.75 -0.9 -2.8 -1.95 L-1.55 -2.45 Q-0.35 -2.4 -0.35 -1.85 -0.35 -1.45 -2.7 -0.9 L-5.55 -0.4 M-6.4 2.95 Q-6.85 2.5 -6.85 1.95 L-6.6 1.35 -6.25 1.45 -5.75 1.8 Q-5.35 2.2 -5.35 2.8 -5.35 3.3 -5.7 3.3 L-6.4 2.95" fill="#ffffff" fill-opacity="0.6901961" fill-rule="evenodd" stroke="none"/>
  </g>
</svg>
