<?xml version="1.0" encoding="UTF-8" standalone="no"?>
<svg xmlns:xlink="http://www.w3.org/1999/xlink" height="12.15px" width="4.7px" xmlns="http://www.w3.org/2000/svg">
  <g transform="matrix(1.0, 0.0, 0.0, 1.0, 31.65, 19.45)">
    <path d="M-29.6 -13.0 L-30.65 -10.55 -28.65 -8.3" fill="none" stroke="#361a0e" stroke-linecap="round" stroke-linejoin="round" stroke-width="2.0">
      <animate attributeName="stroke" dur="2s" repeatCount="indefinite" values="#361a0e;#361a0f"/>
      <animate attributeName="stroke-width" dur="2s" repeatCount="indefinite" values="2.0;2.0"/>
      <animate attributeName="fill-opacity" dur="2s" repeatCount="indefinite" values="1.0;1.0"/>
      <animate attributeName="d" dur="2s" repeatCount="indefinite" values="M-29.6 -13.0 L-30.65 -10.55 -28.65 -8.3;M-28.65 -14.3 L-30.65 -16.55 -27.95 -18.45"/>
    </path>
  </g>
</svg>
