<?xml version="1.0" encoding="UTF-8" standalone="no"?>
<svg xmlns:xlink="http://www.w3.org/1999/xlink" height="6.45px" width="4.25px" xmlns="http://www.w3.org/2000/svg">
  <g transform="matrix(1.0, 0.0, 0.0, 1.0, 1.65, 3.0)">
    <path d="M2.0 -3.0 L2.6 3.45 -1.5 3.4 -1.65 -1.75 2.0 -3.0" fill="#ff9900" fill-rule="evenodd" stroke="none"/>
  </g>
</svg>
