<?xml version="1.0" encoding="UTF-8" standalone="no"?>
<svg xmlns:xlink="http://www.w3.org/1999/xlink" height="9.95px" width="15.1px" xmlns="http://www.w3.org/2000/svg">
  <g transform="matrix(1.0, 0.0, 0.0, 1.0, -7.25, 123.25)">
    <path d="M22.35 -114.9 Q21.55 -114.15 19.5 -113.6 16.05 -112.65 12.7 -114.6 8.7 -116.9 7.65 -119.8 6.85 -121.85 7.6 -123.2 L7.65 -123.25 14.9 -118.85 Q19.85 -116.0 22.35 -114.9" fill="#cfd0d1" fill-rule="evenodd" stroke="none"/>
  </g>
</svg>
