[
xmin 169
ymin 37
xmax 3480
ymax 1330
][
font 87
height 240
color #ffffff
x 160
y 240
]Vous pouvez arrêter la partie [
letterspacing 1
x 260
y 600
]pour continuer votre quête.  [
letterspacing 1
x 680
y 940
]Voulez-vous arrêter[
x 1040
y 1300
] maintenant ?