<?xml version="1.0" encoding="UTF-8" standalone="no"?>
<svg xmlns:xlink="http://www.w3.org/1999/xlink" height="47.2px" width="28.75px" xmlns="http://www.w3.org/2000/svg">
  <g transform="matrix(1.0, 0.0, 0.0, 1.0, 13.35, 28.0)">
    <path d="M8.85 -25.25 Q10.95 -23.4 11.65 -21.1 12.25 -19.85 12.25 -18.3 12.25 -16.6 11.6 -15.0 10.85 -12.95 8.85 -11.35 L8.5 -11.05 6.65 -11.35 Q4.65 -11.35 3.35 -9.35 L2.95 -8.7 0.75 -8.5 0.6 -8.5 -1.5 -8.7 -1.9 -9.35 Q-3.2 -11.35 -5.15 -11.35 L-7.0 -11.05 -7.3 -11.35 Q-9.25 -12.95 -10.0 -15.0 -10.6 -16.6 -10.6 -18.3 -10.6 -19.85 -10.05 -21.1 -9.35 -23.4 -7.3 -25.25 -4.5 -27.75 -0.55 -28.0 L1.9 -28.0 Q5.95 -27.75 8.85 -25.25 M9.55 -19.25 Q9.55 -22.25 6.9 -24.45 4.25 -26.55 0.5 -26.55 -3.2 -26.55 -5.85 -24.45 -8.5 -22.25 -8.5 -19.25 -8.5 -16.25 -5.85 -14.2 -3.75 -12.55 -1.0 -12.15 -0.45 -12.9 0.35 -12.9 1.35 -12.9 1.95 -12.15 4.8 -12.5 6.9 -14.2 9.55 -16.25 9.55 -19.25 M-6.5 -13.95 Q-7.55 -13.95 -7.55 -12.95 -7.25 -12.0 -6.5 -12.0 -5.8 -12.0 -5.8 -13.15 -5.8 -13.95 -6.5 -13.95 M0.35 -9.8 Q1.5 -9.8 1.5 -10.6 1.55 -11.9 0.5 -11.9 -0.55 -11.9 -0.55 -10.6 -0.55 -9.8 0.35 -9.8 M9.0 -12.9 L9.25 -13.45 Q9.25 -14.4 8.45 -14.25 7.6 -14.0 7.6 -13.35 L7.7 -12.9 Q7.8 -12.5 8.25 -12.5 L9.0 -12.9" fill="#104657" fill-rule="evenodd" stroke="none"/>
    <path d="M8.75 -19.25 Q8.75 -21.85 6.4 -23.8 3.9 -25.7 0.5 -25.7 -2.85 -25.7 -5.3 -23.8 L-5.35 -23.8 Q-7.7 -21.85 -7.7 -19.25 -7.7 -16.7 -5.35 -14.8 -3.6 -13.45 -1.25 -13.05 -0.55 -13.7 0.35 -13.7 1.5 -13.7 2.2 -12.95 4.55 -13.35 6.4 -14.8 8.75 -16.7 8.75 -19.25 M9.55 -19.25 Q9.55 -16.25 6.9 -14.2 4.8 -12.5 1.95 -12.15 1.35 -12.9 0.35 -12.9 -0.45 -12.9 -1.0 -12.15 -3.75 -12.55 -5.85 -14.2 -8.5 -16.25 -8.5 -19.25 -8.5 -22.25 -5.85 -24.45 -3.2 -26.55 0.5 -26.55 4.25 -26.55 6.9 -24.45 9.55 -22.25 9.55 -19.25" fill="#2396b1" fill-rule="evenodd" stroke="none"/>
    <path d="M8.75 -19.25 Q8.75 -16.7 6.4 -14.8 4.55 -13.35 2.2 -12.95 1.5 -13.7 0.35 -13.7 -0.55 -13.7 -1.25 -13.05 -3.6 -13.45 -5.35 -14.8 -7.7 -16.7 -7.7 -19.25 -7.7 -21.85 -5.35 -23.8 L-5.3 -23.8 Q-2.85 -25.7 0.5 -25.7 3.9 -25.7 6.4 -23.8 8.75 -21.85 8.75 -19.25" fill="#2bb3d5" fill-rule="evenodd" stroke="none"/>
    <path d="M9.0 -12.9 L8.25 -12.5 Q7.8 -12.5 7.7 -12.9 L7.6 -13.35 Q7.6 -14.0 8.45 -14.25 9.25 -14.4 9.25 -13.45 L9.0 -12.9 M0.35 -9.8 Q-0.55 -9.8 -0.55 -10.6 -0.55 -11.9 0.5 -11.9 1.55 -11.9 1.5 -10.6 1.5 -9.8 0.35 -9.8 M-6.5 -13.95 Q-5.8 -13.95 -5.8 -13.15 -5.8 -12.0 -6.5 -12.0 -7.25 -12.0 -7.55 -12.95 -7.55 -13.95 -6.5 -13.95" fill="#0b2f3b" fill-rule="evenodd" stroke="none"/>
    <path d="M10.1 17.9 Q10.1 15.9 11.5 16.0 12.9 16.15 12.9 17.55 12.9 18.2 12.5 18.7 12.05 19.2 11.4 19.2 10.3 19.2 10.1 18.6 L10.1 17.9 M14.45 14.45 Q15.4 14.4 15.4 15.5 15.4 16.4 14.7 16.4 14.05 16.4 13.7 15.85 L13.45 15.25 Q13.45 14.45 14.45 14.45" fill="#baedff" fill-opacity="0.2627451" fill-rule="evenodd" stroke="none"/>
    <path d="M-10.85 -2.7 Q-8.4 -2.15 -8.4 -0.6 -8.4 2.1 -11.0 2.1 -12.55 2.1 -13.1 0.85 L-13.35 -0.45 Q-13.35 -3.3 -10.85 -2.7 M-7.25 -4.7 Q-6.85 -4.05 -5.55 -4.05 -4.1 -4.05 -4.1 -5.6 -4.1 -7.35 -5.7 -7.25 -7.35 -7.15 -7.35 -5.45 L-7.25 -4.7 M-10.45 -0.4 L-10.25 -1.0 Q-10.25 -2.8 -11.0 -2.35 -11.7 -1.9 -12.0 -0.4 -11.6 0.0 -11.2 0.0 -10.7 0.0 -10.45 -0.4 M-9.0 -4.95 Q-9.0 -8.35 -4.85 -8.5 -0.75 -8.6 -0.75 -4.9 -0.75 -1.3 -4.85 -1.3 -7.15 -1.3 -8.3 -3.05 -9.0 -4.15 -9.0 -4.95" fill="#baedff" fill-opacity="0.12156863" fill-rule="evenodd" stroke="none"/>
    <path d="M-10.45 -0.4 Q-10.7 0.0 -11.2 0.0 -11.6 0.0 -12.0 -0.4 -11.7 -1.9 -11.0 -2.35 -10.25 -2.8 -10.25 -1.0 L-10.45 -0.4 M-7.25 -4.7 L-7.35 -5.45 Q-7.35 -7.15 -5.7 -7.25 -4.1 -7.35 -4.1 -5.6 -4.1 -4.05 -5.55 -4.05 -6.85 -4.05 -7.25 -4.7" fill="#baedff" fill-opacity="0.3019608" fill-rule="evenodd" stroke="none"/>
  </g>
</svg>
