<?xml version="1.0" encoding="UTF-8" standalone="no"?>
<svg xmlns:xlink="http://www.w3.org/1999/xlink" height="20.45px" width="23.0px" xmlns="http://www.w3.org/2000/svg">
  <g transform="matrix(1.0, 0.0, 0.0, 1.0, 1.0, 5.45)">
    <path d="M-1.0 7.85 L-1.0 -5.45 22.0 15.0 -1.0 7.85" fill="#ffffff" fill-rule="evenodd" stroke="none"/>
  </g>
</svg>
