<?xml version="1.0" encoding="UTF-8" standalone="no"?>
<svg xmlns:xlink="http://www.w3.org/1999/xlink" height="84.7px" width="84.7px" xmlns="http://www.w3.org/2000/svg">
  <g transform="matrix(1.0, 0.0, 0.0, 1.0, 42.35, 42.35)">
    <path d="M28.2 -31.65 L28.35 -31.55 31.5 -28.4 31.65 -28.15 Q32.05 -27.75 32.05 -27.25 32.05 -26.7 31.65 -26.3 L31.55 -26.15 29.4 -24.0 29.1 -23.35 Q29.05 -22.95 29.3 -22.65 L29.3 -22.7 32.3 -18.4 Q32.5 -18.1 32.85 -17.95 L33.55 -18.0 36.45 -19.2 Q36.9 -19.4 37.4 -19.2 L37.5 -19.15 38.1 -18.6 38.2 -18.45 38.2 -18.4 40.0 -13.9 40.1 -13.75 Q40.25 -13.35 40.05 -12.95 L40.05 -12.9 40.0 -12.85 39.35 -12.2 39.25 -12.1 36.4 -10.95 36.45 -10.95 35.9 -10.5 35.9 -10.45 35.85 -9.75 35.85 -9.8 Q36.5 -7.3 36.8 -4.65 L36.8 -4.6 37.15 -4.0 Q37.45 -3.75 37.8 -3.75 L41.0 -3.75 41.85 -3.5 41.95 -3.35 42.0 -3.3 42.35 -2.45 42.35 2.55 41.95 3.45 Q41.55 3.85 41.0 3.85 L37.8 3.85 Q37.45 3.85 37.15 4.1 36.85 4.35 36.8 4.75 L35.85 9.85 35.9 10.55 36.4 11.05 39.35 12.25 39.45 12.3 40.05 12.95 40.15 13.7 40.0 13.95 38.15 18.55 38.15 18.65 37.45 19.25 Q36.95 19.45 36.45 19.25 L33.55 18.05 32.85 18.0 Q32.5 18.15 32.3 18.45 L29.3 22.8 Q29.05 23.05 29.1 23.45 L29.4 24.1 31.7 26.4 Q32.05 26.75 32.05 27.3 32.05 27.85 31.65 28.25 L31.55 28.4 28.35 31.6 28.2 31.7 Q27.8 32.1 27.25 32.1 26.7 32.1 26.35 31.75 L26.15 31.6 24.05 29.45 23.45 29.15 23.4 29.15 Q23.0 29.1 22.75 29.35 L18.4 32.35 Q18.1 32.55 17.95 32.9 17.85 33.25 18.0 33.6 L19.2 36.5 Q19.4 37.05 19.2 37.55 L19.2 37.65 18.7 38.1 18.45 38.2 13.85 40.15 Q13.4 40.35 12.95 40.15 L12.3 39.55 12.25 39.4 11.05 36.45 10.55 35.95 9.85 35.9 4.65 36.85 Q4.25 36.9 4.05 37.2 3.8 37.5 3.8 37.85 L3.8 41.05 3.55 41.9 3.4 41.95 Q3.0 42.35 2.45 42.35 L-2.5 42.35 Q-3.05 42.35 -3.4 42.0 L-3.5 41.9 -3.8 41.05 -3.8 37.85 Q-3.8 37.5 -4.05 37.2 -4.3 36.9 -4.65 36.85 L-9.8 35.9 -10.5 35.95 -11.0 36.45 -11.05 36.45 -12.25 39.4 -12.25 39.5 -12.95 40.15 -12.9 40.1 -12.95 40.15 -13.9 40.15 -18.5 38.2 -19.2 37.55 -19.2 37.5 Q-19.4 36.95 -19.2 36.45 L-19.15 36.35 -18.0 33.6 Q-17.85 33.25 -17.95 32.9 -18.05 32.55 -18.4 32.35 L-22.75 29.35 -22.7 29.35 Q-23.0 29.1 -23.4 29.15 -23.8 29.2 -24.05 29.45 L-26.2 31.6 -26.35 31.7 Q-26.75 32.1 -27.3 32.1 -27.85 32.1 -28.2 31.75 L-28.45 31.55 -31.75 28.25 -32.1 27.3 Q-32.1 26.75 -31.75 26.4 L-31.55 26.2 -29.45 24.05 -29.15 23.45 -29.15 23.4 Q-29.1 23.0 -29.35 22.75 L-32.3 18.45 -32.25 18.5 -32.8 18.0 Q-33.15 17.85 -33.5 18.0 L-36.5 19.2 -36.75 19.35 -37.4 19.3 -37.55 19.2 -38.2 18.55 -40.05 13.95 -40.1 13.85 Q-40.3 13.4 -40.1 13.0 L-40.05 12.95 -40.05 12.9 -39.4 12.25 -39.25 12.2 -36.45 11.0 -36.45 11.05 -35.95 10.55 -35.9 9.85 -36.8 4.75 Q-36.85 4.35 -37.15 4.1 -37.45 3.85 -37.8 3.85 L-41.1 3.85 Q-41.6 3.85 -41.95 3.5 L-41.95 3.45 -42.35 2.55 -42.35 -2.45 Q-42.35 -3.0 -42.0 -3.35 L-41.85 -3.5 -41.1 -3.75 -37.8 -3.75 Q-37.45 -3.75 -37.15 -4.0 L-36.8 -4.6 -36.8 -4.65 -35.9 -9.75 -35.95 -10.45 -35.95 -10.5 -36.45 -10.95 -39.35 -12.15 -40.1 -12.9 Q-40.3 -13.35 -40.1 -13.8 L-40.05 -13.95 -38.2 -18.45 -37.45 -19.2 -37.45 -19.15 Q-37.0 -19.35 -36.45 -19.15 L-36.3 -19.1 -33.6 -17.95 -32.9 -17.9 -32.35 -18.35 -29.35 -22.7 -29.35 -22.65 Q-29.1 -22.95 -29.15 -23.35 L-29.45 -24.0 -31.6 -26.15 -31.7 -26.3 Q-32.1 -26.7 -32.1 -27.2 L-32.1 -27.25 Q-32.1 -27.75 -31.7 -28.15 L-31.55 -28.4 -28.4 -31.5 -28.2 -31.7 Q-27.85 -32.05 -27.3 -32.05 L-27.25 -32.05 Q-26.75 -32.05 -26.35 -31.65 L-26.2 -31.55 -24.05 -29.4 Q-23.8 -29.15 -23.4 -29.1 L-22.7 -29.3 Q-20.65 -31.0 -18.4 -32.3 -18.05 -32.5 -17.95 -32.85 -17.85 -33.2 -18.0 -33.55 L-19.2 -36.4 -19.2 -36.45 Q-19.4 -37.0 -19.2 -37.5 L-18.55 -38.15 -13.95 -40.0 -13.85 -40.05 -12.9 -40.0 -12.8 -39.95 -12.2 -39.3 -11.0 -36.4 -10.55 -35.9 -10.5 -35.9 -9.85 -35.85 -4.65 -36.8 Q-4.3 -36.85 -4.05 -37.15 -3.8 -37.45 -3.8 -37.8 L-3.8 -41.0 -3.5 -41.8 -3.45 -41.9 -3.5 -41.85 -3.35 -41.95 -3.3 -42.0 Q-3.0 -42.35 -2.5 -42.35 L2.45 -42.35 Q3.0 -42.35 3.35 -42.0 L3.4 -41.95 Q3.8 -41.55 3.8 -41.0 L3.8 -37.8 Q3.8 -37.45 4.05 -37.15 4.3 -36.85 4.65 -36.8 L9.85 -35.85 10.55 -35.9 11.05 -36.4 12.25 -39.35 12.3 -39.45 Q12.45 -39.85 12.9 -40.0 L12.95 -40.0 13.15 -40.15 13.85 -40.05 14.05 -40.0 18.5 -38.15 19.15 -37.5 19.2 -37.4 Q19.35 -36.95 19.15 -36.4 L19.15 -36.25 18.0 -33.55 Q17.85 -33.2 17.95 -32.85 L17.95 -32.8 18.4 -32.3 22.75 -29.3 Q23.0 -29.05 23.4 -29.1 23.8 -29.15 24.05 -29.4 L26.2 -31.55 26.3 -31.65 Q26.7 -32.05 27.25 -32.05 27.8 -32.05 28.2 -31.65 M21.25 -26.75 L21.25 -26.8 21.2 -27.35 20.85 -27.8 17.8 -29.95 17.25 -30.1 16.7 -29.95 16.7 -29.9 16.35 -29.45 16.35 -29.5 12.7 -20.8 12.65 -20.1 13.05 -19.55 13.7 -19.4 14.3 -19.7 20.95 -26.3 21.25 -26.75 M9.15 -33.45 L8.65 -33.7 4.9 -34.4 4.35 -34.3 4.4 -34.3 3.95 -33.95 3.95 -33.9 3.8 -33.4 3.8 -23.95 4.05 -23.35 Q4.25 -23.1 4.6 -23.0 L5.3 -23.1 5.7 -23.6 9.3 -32.35 9.4 -32.9 9.4 -32.95 9.15 -33.45 M19.4 -13.7 Q19.35 -13.35 19.55 -13.05 L19.6 -13.05 20.1 -12.65 20.15 -12.65 20.8 -12.7 29.5 -16.3 29.95 -16.65 29.9 -16.6 30.1 -17.15 29.95 -17.7 27.85 -20.85 27.4 -21.2 27.45 -21.2 26.85 -21.25 26.85 -21.2 26.35 -20.95 19.7 -14.3 19.4 -13.7 M0.0 -9.35 Q3.9 -9.35 6.65 -6.6 9.4 -3.85 9.4 0.05 9.4 3.9 6.65 6.65 3.9 9.4 0.0 9.4 -3.1 9.4 -5.45 7.7 L-6.65 6.65 Q-9.4 3.9 -9.4 0.05 -9.4 -3.85 -6.65 -6.6 L-5.45 -7.65 Q-3.1 -9.35 0.0 -9.35 M0.0 -12.75 Q-4.2 -12.75 -7.4 -10.45 L-9.05 -9.0 Q-12.8 -5.25 -12.8 0.05 -12.8 5.3 -9.05 9.05 L-7.4 10.5 Q-4.2 12.8 0.0 12.8 5.3 12.8 9.05 9.05 12.8 5.3 12.8 0.05 12.8 -5.25 9.05 -9.0 5.3 -12.75 0.0 -12.75 M23.1 -5.2 L23.0 -4.55 Q23.1 -4.2 23.35 -4.0 L23.4 -3.95 24.0 -3.75 33.45 -3.75 Q33.75 -3.75 34.0 -3.9 L34.05 -3.9 34.4 -4.35 34.35 -4.3 34.45 -4.85 34.45 -4.9 33.7 -8.65 33.75 -8.6 33.5 -9.1 33.45 -9.15 32.95 -9.4 32.9 -9.4 32.35 -9.3 23.6 -5.65 23.1 -5.2 M34.0 4.0 Q33.75 3.85 33.45 3.85 L24.0 3.85 Q23.65 3.85 23.4 4.1 L23.35 4.1 Q23.1 4.3 23.0 4.65 L23.1 5.35 23.1 5.3 23.6 5.75 32.35 9.35 32.9 9.45 32.95 9.45 33.45 9.2 33.5 9.2 33.75 8.7 33.7 8.7 34.45 5.0 34.35 4.45 34.4 4.45 34.05 4.05 34.0 4.0 M30.1 17.25 L30.1 17.2 29.9 16.65 29.95 16.75 29.5 16.35 20.75 12.75 20.1 12.7 20.05 12.7 19.55 13.1 19.5 13.1 19.35 13.75 19.65 14.35 26.35 21.0 26.85 21.3 27.4 21.25 27.85 20.9 29.95 17.75 30.1 17.25 M3.8 24.05 L3.8 33.5 3.95 34.05 4.0 34.1 4.4 34.45 4.4 34.4 4.95 34.5 8.65 33.75 8.65 33.8 9.15 33.55 9.15 33.5 9.4 33.0 9.4 32.95 9.3 32.4 5.7 23.65 5.25 23.15 5.3 23.15 4.6 23.05 Q4.25 23.15 4.05 23.4 L4.05 23.45 3.8 24.05 M13.65 19.4 L13.0 19.55 13.0 19.6 12.6 20.1 12.6 20.15 12.65 20.8 16.3 29.55 16.65 30.0 16.65 29.95 Q16.9 30.15 17.2 30.15 L17.75 30.0 17.7 30.0 20.85 27.85 21.2 27.4 21.25 26.85 20.95 26.35 14.25 19.7 13.65 19.4 M-16.7 -29.9 L-16.65 -29.9 -17.2 -30.1 -17.25 -30.1 -17.75 -29.95 -20.85 -27.8 -21.2 -27.35 -21.25 -26.8 -21.2 -26.75 -20.95 -26.3 -14.3 -19.65 -13.7 -19.35 -13.05 -19.5 -12.65 -20.05 -12.7 -20.75 -16.35 -29.5 -16.7 -29.9 M-4.9 -34.4 L-8.65 -33.7 -8.6 -33.7 -9.1 -33.45 -9.15 -33.45 -9.4 -32.95 -9.35 -32.35 -5.75 -23.55 -5.7 -23.5 -5.25 -23.05 -4.6 -22.95 Q-4.25 -23.05 -4.05 -23.3 L-4.0 -23.3 -3.8 -23.9 -3.8 -33.4 -3.95 -33.9 -3.95 -33.95 -4.35 -34.3 -4.9 -34.4 M-26.8 -21.2 L-26.85 -21.25 -27.4 -21.2 -27.85 -20.85 -30.0 -17.7 -30.15 -17.15 -29.95 -16.6 -29.95 -16.65 -29.55 -16.3 -20.8 -12.7 -20.1 -12.65 -19.55 -13.05 Q-19.35 -13.35 -19.4 -13.7 L-19.7 -14.3 -26.35 -20.95 Q-26.55 -21.15 -26.8 -21.2 M-32.9 -9.4 L-33.45 -9.15 -33.45 -9.1 -33.7 -8.6 -33.7 -8.65 -34.45 -4.9 -34.45 -4.85 -34.35 -4.3 -34.35 -4.35 -34.0 -3.9 -33.95 -3.9 -33.45 -3.75 -24.0 -3.75 -23.4 -3.95 -23.4 -4.0 Q-23.15 -4.2 -23.05 -4.55 L-23.15 -5.2 -23.65 -5.65 -32.35 -9.3 -32.9 -9.4 M-19.6 13.1 Q-19.8 12.8 -20.15 12.7 L-20.85 12.75 -29.5 16.35 -29.9 16.7 -30.1 17.2 -30.1 17.25 -29.95 17.75 -27.85 20.9 -27.4 21.25 -26.85 21.3 -26.8 21.3 -26.35 21.0 -19.75 14.35 -19.45 13.75 Q-19.4 13.4 -19.6 13.1 M-12.65 20.1 L-13.05 19.6 -13.05 19.55 -13.7 19.4 -14.3 19.7 -20.95 26.35 -21.2 26.85 -21.25 26.85 -21.2 27.4 -21.2 27.45 -20.85 27.85 -17.75 30.0 -17.25 30.15 -17.2 30.15 Q-16.95 30.15 -16.65 29.95 L-16.7 30.0 -16.35 29.55 -12.7 20.8 -12.65 20.15 -12.65 20.1 M-5.25 23.15 L-5.7 23.65 -9.3 32.4 -9.4 32.95 -9.4 33.0 -9.15 33.5 -9.1 33.55 -8.6 33.8 -8.65 33.75 -4.95 34.5 -4.9 34.5 -4.35 34.4 -4.4 34.45 -3.95 34.1 -3.95 34.05 -3.8 33.5 -3.8 24.05 -4.0 23.45 -4.05 23.4 Q-4.25 23.15 -4.6 23.05 L-5.25 23.15 M-23.2 5.3 L-23.2 5.35 -23.1 4.65 Q-23.2 4.3 -23.45 4.1 L-24.05 3.85 -33.45 3.85 -33.95 4.0 -34.0 4.05 -34.35 4.45 -34.45 5.0 -33.7 8.65 -33.45 9.15 -32.95 9.4 -32.9 9.4 -32.35 9.35 -23.7 5.8 -23.65 5.8 -23.2 5.3" fill="#000000" fill-rule="evenodd" stroke="none"/>
  </g>
</svg>
