<?xml version="1.0" encoding="UTF-8" standalone="no"?>
<svg xmlns:xlink="http://www.w3.org/1999/xlink" height="119.65px" width="136.4px" xmlns="http://www.w3.org/2000/svg">
  <g transform="matrix(1.0, 0.0, 0.0, 1.0, 68.25, 59.8)">
    <path d="M64.75 -25.15 Q68.15 -26.2 68.15 -24.1 68.15 -23.2 63.45 -20.55 61.05 -19.2 59.6 -18.55 L60.05 -15.75 Q60.05 -13.25 54.9 -8.95 49.75 -4.65 49.75 -0.25 49.75 1.0 52.0 3.2 54.25 5.35 54.25 7.4 54.25 10.85 51.05 13.25 47.8 15.65 47.8 18.0 L48.9 20.8 49.85 23.7 Q49.85 26.1 49.5 27.05 48.9 28.2 46.35 30.25 L49.1 34.25 Q51.2 37.6 51.2 38.55 51.2 40.2 47.7 42.85 44.2 45.55 44.2 49.65 44.2 52.9 45.9 52.9 47.75 52.9 49.1 50.2 L47.3 47.7 Q46.15 48.4 46.1 48.5 L45.95 49.2 45.65 49.2 45.5 48.75 45.5 46.7 46.3 46.55 47.7 46.45 Q50.75 46.45 51.45 50.45 51.45 52.2 50.2 53.85 48.75 55.7 46.85 55.7 43.2 55.7 42.1 52.8 41.75 51.8 41.75 49.5 41.75 45.75 44.95 42.6 48.15 39.35 48.15 39.0 48.15 37.15 45.85 35.05 43.5 32.85 43.5 30.65 43.5 28.4 45.15 26.65 46.75 24.85 46.75 23.8 46.75 23.25 45.75 21.15 44.75 19.0 44.75 17.4 44.75 15.5 47.05 12.6 49.3 9.7 49.3 9.0 49.3 8.35 46.65 5.5 44.0 2.6 44.0 -0.15 44.0 -5.2 48.7 -10.7 L53.4 -16.5 49.55 -22.4 Q48.15 -24.5 47.2 -26.5 L46.35 -28.0 44.3 -32.9 44.25 -36.75 Q44.25 -41.45 46.45 -43.5 47.75 -44.7 49.4 -44.65 49.75 -46.9 51.8 -46.7 54.05 -46.45 57.3 -43.65 60.55 -40.9 62.8 -37.35 65.3 -33.4 65.3 -30.5 65.3 -27.2 64.75 -25.15 M-64.5 -58.05 Q-63.45 -57.6 -62.05 -56.1 -61.9 -59.85 -59.65 -59.8 -57.1 -59.75 -53.65 -53.45 L-48.0 -48.05 Q-45.1 -45.3 -47.95 -42.4 L-47.6 -42.3 Q-42.25 -51.2 -42.25 -40.1 -42.25 -37.8 -46.6 -29.6 L-51.0 -21.25 -49.2 -15.1 -47.35 -8.6 -46.6 -4.95 Q-46.55 -2.3 -43.95 3.1 -41.4 8.5 -41.4 10.95 -41.4 13.65 -42.4 14.9 -44.35 17.35 -45.6 20.2 -42.65 21.05 -41.05 22.9 -39.65 24.45 -39.65 26.15 -39.65 28.15 -40.9 29.85 L-44.15 33.9 Q-39.95 37.4 -39.95 39.5 -39.95 42.4 -42.45 45.3 L-45.05 48.3 -44.1 51.2 Q-43.15 54.2 -43.15 54.7 L-43.25 57.05 Q-43.5 58.1 -44.7 59.85 L-45.15 59.85 Q-45.15 54.3 -46.6 51.45 -48.05 48.55 -48.05 47.05 -48.05 45.85 -46.4 43.9 -44.75 42.05 -44.75 41.6 -44.75 41.35 -47.35 38.4 -50.0 35.5 -50.0 33.8 -50.0 31.6 -49.25 30.45 L-45.95 27.05 -45.75 26.65 Q-50.4 25.75 -51.6 24.25 -52.05 23.6 -52.05 21.6 -52.05 18.75 -49.4 15.05 -46.75 11.4 -46.75 10.85 -46.75 10.4 -49.8 3.65 -53.05 -3.45 -53.45 -5.15 -54.25 -8.05 -56.35 -13.95 -57.2 -16.3 -57.3 -20.45 L-59.4 -30.2 Q-59.4 -31.6 -58.8 -32.75 L-57.4 -35.6 Q-59.95 -36.5 -60.0 -39.25 -62.1 -40.95 -64.3 -44.1 -68.25 -49.7 -68.25 -51.2 -68.25 -52.65 -67.4 -53.3 -66.6 -53.9 -66.6 -54.95 -66.6 -58.85 -64.5 -58.05" fill="#d9a500" fill-rule="evenodd" stroke="none"/>
  </g>
</svg>
