<?xml version="1.0" encoding="UTF-8" standalone="no"?>
<svg xmlns:xlink="http://www.w3.org/1999/xlink" height="98.8px" width="99.05px" xmlns="http://www.w3.org/2000/svg">
  <g transform="matrix(1.0, 0.0, 0.0, 1.0, 3.85, 2.0)">
    <path d="M89.2 39.45 L49.95 42.05 49.95 41.75 52.75 39.4 52.75 39.7 56.95 39.45 60.9 39.15 65.3 38.9 79.7 37.95 82.2 37.75 82.2 37.5 89.2 39.45 M82.95 89.4 L83.6 89.4 90.15 91.5 57.25 91.5 51.85 91.5 54.7 89.9 54.7 89.8 64.25 89.7 73.25 89.55 82.95 89.4 M13.5 38.9 L18.95 38.25 22.6 37.8 25.15 37.5 27.3 37.2 27.5 37.2 27.15 39.0 23.15 39.45 19.1 39.9 0.75 41.95 6.45 39.4 6.4 39.7 7.0 39.7 13.5 38.9 M10.55 89.15 L14.85 89.0 19.6 88.8 25.2 88.55 30.1 88.3 30.65 90.15 21.65 90.55 4.1 91.35 10.55 89.15 M9.05 66.9 L10.15 68.25 3.35 66.6 2.2 64.7 2.05 64.45 9.05 66.9" fill="#4c4236" fill-rule="evenodd" stroke="none"/>
    <path d="M53.65 87.8 L53.7 87.8 53.7 87.9 53.65 87.8" fill="#322923" fill-rule="evenodd" stroke="none"/>
    <path d="M68.0 57.35 L68.05 57.25 68.05 57.35 68.0 57.35" fill="#33384d" fill-rule="evenodd" stroke="none"/>
    <path d="M36.55 37.5 L36.95 37.8 36.55 37.75 36.55 37.5" fill="#3e445b" fill-rule="evenodd" stroke="none"/>
    <path d="M30.1 86.3 L30.1 86.2 30.1 86.3" fill="#10111a" fill-rule="evenodd" stroke="none"/>
    <path d="M86.0 7.3 L79.9 14.8 62.4 12.55 51.8 11.2 48.4 3.05 48.3 2.8 48.25 2.45 51.45 2.85 86.0 7.3 M83.5 50.15 L92.05 49.35 84.85 58.1 84.85 57.85 75.1 58.75 83.5 50.15 M34.35 9.45 L31.55 9.6 22.6 10.0 23.35 9.0 22.15 1.9 37.3 1.15 37.3 1.2 34.35 9.45 M19.75 2.0 L22.3 10.0 7.7 10.65 7.7 10.7 0.9 3.1 0.9 2.85 19.75 2.0 M20.55 52.3 L32.1 52.3 42.1 50.6 39.1 59.25 39.1 58.65 8.6 59.9 1.25 52.4 1.25 52.3 2.55 52.3 20.55 52.3 M10.55 73.8 L9.75 77.25 3.05 79.5 4.15 75.2 10.55 73.8 M53.1 52.8 L73.0 51.1 73.15 51.05 69.05 59.25 68.75 59.3 68.6 59.3 68.6 58.25 66.85 59.45 56.1 60.4 53.1 52.8 M68.0 57.35 L68.05 57.35 68.05 57.25 68.0 57.35" fill="#1e1815" fill-rule="evenodd" stroke="none"/>
    <path d="M36.95 37.8 L39.5 39.5 27.15 39.0 27.5 37.2 36.55 37.75 36.95 37.8 M-0.75 40.25 L6.45 39.35 6.45 39.4 0.75 41.95 -0.75 40.45 -0.75 40.25 M39.1 85.45 L42.1 86.2 42.1 86.45 31.2 90.15 30.65 90.15 30.1 88.3 30.1 88.2 39.1 85.45" fill="#453a32" fill-rule="evenodd" stroke="none"/>
    <path d="M48.4 3.05 L48.3 3.1 48.3 2.8 48.4 3.05 M22.15 1.9 L23.35 9.0 22.6 10.0 22.3 10.0 19.75 2.0 19.8 2.0 22.9 0.25 22.15 1.9" fill="#27211d" fill-rule="evenodd" stroke="none"/>
    <path d="M89.2 11.85 L89.2 19.6 89.2 26.0 89.2 31.15 89.2 39.45 82.2 37.5 82.2 17.1 89.2 11.85 M92.05 49.35 L92.05 49.8 91.45 64.15 90.95 77.15 90.75 81.7 90.35 91.6 90.15 91.5 83.6 89.4 83.95 80.55 84.85 58.1 92.05 49.35 M34.35 9.45 L37.3 1.2 37.4 2.7 38.3 15.9 38.95 25.4 39.4 32.15 39.9 39.45 39.5 39.5 36.95 37.8 36.55 37.5 35.85 26.85 35.55 22.55 35.2 17.15 34.65 9.4 34.35 9.45 M42.1 50.6 L42.1 66.4 42.1 76.8 42.1 80.45 42.1 86.2 39.1 85.45 39.1 81.75 39.1 75.45 39.1 71.9 39.1 66.35 39.1 59.25 42.1 50.6 M75.1 51.55 L77.7 52.65 72.5 60.0 69.05 59.35 69.05 59.25 73.15 51.05 73.75 51.0 75.1 51.55" fill="#3a312c" fill-rule="evenodd" stroke="none"/>
    <path d="M87.75 9.55 L89.2 11.85 82.2 17.1 79.9 14.8 86.0 7.3 86.4 7.35 87.75 9.55 M52.75 39.4 L49.95 41.75 49.9 41.2 49.55 32.15 49.3 26.45 48.75 13.3 48.3 3.8 48.3 3.1 48.4 3.05 51.8 11.2 51.5 11.15 51.5 11.2 52.0 22.05 52.2 26.55 52.4 31.15 52.75 39.4 M81.8 50.85 L83.1 50.15 83.5 50.15 75.1 58.75 75.05 58.75 72.7 60.0 72.5 60.0 77.7 52.65 78.0 52.75 81.8 50.85 M54.7 89.9 L51.85 91.5 51.4 91.75 51.75 84.25 52.55 64.65 52.85 58.35 53.05 52.8 53.1 52.8 56.1 60.4 55.9 60.4 55.7 65.2 55.45 70.65 55.25 75.55 54.9 84.6 54.65 89.8 54.7 89.9 M0.9 3.1 L7.7 10.7 6.45 39.35 -0.75 40.25 -0.7 39.2 -0.4 32.65 0.45 13.55 0.9 3.1 M10.3 85.15 L10.55 89.15 4.1 91.35 3.85 91.35 3.75 89.9 3.2 81.4 3.05 79.5 9.75 77.25 10.3 85.15 M8.6 59.9 L8.55 59.9 9.05 66.9 2.05 64.45 1.3 52.75 1.25 52.4 8.6 59.9 M10.15 68.25 L10.55 73.8 4.15 75.2 3.35 66.6 10.15 68.25 M53.65 87.8 L53.7 87.9 53.7 87.8 53.65 87.8" fill="#2c2521" fill-rule="evenodd" stroke="none"/>
    <path d="M41.3 15.5 L41.95 25.1 41.85 25.1 38.95 25.4 38.3 15.9 41.3 15.5 M42.3 30.55 L43.1 42.25 43.0 42.25 23.1 42.85 8.25 44.25 Q13.15 42.1 19.1 39.9 L23.15 39.45 27.15 39.0 39.5 39.5 39.9 39.45 39.4 32.15 42.3 30.55 M-3.8 41.0 L-3.6 36.1 -1.45 33.75 -0.4 32.65 -0.7 39.2 -3.8 41.0 M92.2 19.4 L92.2 25.8 89.2 26.0 89.2 19.6 92.2 19.4 M92.2 30.35 L92.2 42.25 47.1 45.25 46.95 41.9 49.9 41.2 49.95 41.75 49.95 42.05 89.2 39.45 89.2 31.15 92.2 30.35 M48.65 85.3 L49.55 64.8 50.6 64.65 52.55 64.65 51.75 84.25 Q49.85 84.8 48.65 85.3 M94.5 64.25 L94.0 76.95 90.95 77.15 91.45 64.15 94.5 64.25 M93.8 81.0 L93.25 94.8 49.55 94.8 57.25 91.5 90.15 91.5 90.35 91.6 90.75 81.7 93.8 81.0 M49.3 26.45 L49.55 32.15 46.6 33.05 46.45 29.85 49.3 26.45 M42.1 66.4 L45.1 65.7 45.1 76.55 42.1 76.8 42.1 66.4 M45.1 78.85 L45.1 89.0 37.4 92.85 14.5 93.9 20.35 91.15 21.65 90.55 30.65 90.15 31.2 90.15 42.1 86.45 42.1 86.2 42.1 80.45 45.1 78.85 M0.4 84.2 L1.95 82.7 3.2 81.4 3.75 89.9 Q2.3 90.6 0.85 91.4 L0.4 84.2" fill="#816d5c" fill-rule="evenodd" stroke="none"/>
    <path d="M43.0 42.25 L43.1 44.25 24.75 44.8 -2.0 47.2 -3.85 43.75 -3.75 41.9 -2.0 45.2 8.25 44.25 23.1 42.85 43.0 42.25 M92.2 42.25 L92.2 44.25 47.1 47.25 45.1 1.0 45.2 1.0 45.35 4.75 45.8 15.6 46.45 29.85 46.6 33.05 46.95 41.9 47.1 45.25 92.2 42.25 M95.15 48.05 L95.2 48.05 93.25 96.8 48.25 96.8 48.35 94.8 49.55 94.8 93.25 94.8 93.8 81.0 94.0 76.95 94.5 64.25 95.1 49.55 95.15 48.05 M54.7 89.8 L54.7 89.9 54.65 89.8 54.7 89.8 M48.3 2.8 L48.3 3.1 48.25 2.45 48.3 2.8 M45.1 89.0 L45.1 91.0 37.4 94.85 1.05 96.5 -0.1 79.05 0.05 78.8 0.4 84.2 0.85 91.4 1.05 94.5 14.5 93.9 37.4 92.85 45.1 89.0 M69.05 59.25 L69.05 59.35 69.0 59.35 69.05 59.25" fill="#362d27" fill-rule="evenodd" stroke="none"/>
    <path d="M36.55 37.5 L36.55 37.75 36.55 37.5" fill="url(#gradient0)" fill-rule="evenodd" stroke="none"/>
    <path d="M51.8 11.2 L51.5 11.2 51.5 11.15 51.8 11.2" fill="url(#gradient1)" fill-rule="evenodd" stroke="none"/>
    <path d="M84.85 57.85 L84.85 58.1 84.85 57.85 M54.9 84.6 L55.05 84.6 54.9 84.6" fill="url(#gradient2)" fill-rule="evenodd" stroke="none"/>
    <path d="M56.95 39.45 L52.75 39.7 52.75 39.4 52.4 31.15 52.65 31.25 Q54.1 31.85 55.1 32.95 56.95 35.0 57.0 38.6 L57.0 38.8 56.95 39.45 M64.25 89.7 L54.7 89.8 54.65 89.8 54.9 84.6 55.05 84.6 Q58.15 85.0 59.8 85.7 L60.3 85.95 Q62.4 87.15 63.65 88.75 L64.15 89.5 64.25 89.7 M35.85 26.85 L36.55 37.5 36.55 37.75 27.5 37.2 27.3 37.2 25.15 37.5 Q25.2 33.75 28.7 30.2 32.25 26.65 35.85 26.85 M39.1 81.75 L39.1 85.45 30.1 88.2 30.1 88.3 25.2 88.55 25.5 88.05 Q26.25 87.0 27.5 86.0 L29.4 84.6 Q33.7 81.85 39.1 81.75 M30.1 86.3 L30.1 86.2 30.1 86.3" fill="#7b3100" fill-rule="evenodd" stroke="none"/>
    <path d="M65.3 38.9 L60.9 39.15 61.05 37.55 61.05 36.9 Q60.75 33.3 57.55 30.05 L57.2 29.7 Q54.6 27.25 52.2 26.55 L52.0 22.05 52.15 22.05 52.6 22.05 Q58.5 22.2 62.15 26.25 L64.0 28.75 64.2 29.15 Q65.65 32.0 65.75 35.55 L65.75 36.15 Q65.75 37.8 65.3 38.9 M82.95 89.4 L73.25 89.55 71.05 86.3 68.8 83.7 65.95 81.05 63.5 79.2 Q59.7 76.7 55.25 75.55 L55.45 70.65 55.6 70.7 Q61.1 71.3 66.0 73.6 70.65 75.75 74.75 79.45 L78.05 82.75 79.35 84.3 Q81.35 86.75 82.95 89.4 M18.95 38.25 L18.6 36.95 18.15 34.2 Q18.15 32.55 18.45 31.05 19.45 26.0 23.65 22.05 L24.55 21.25 Q29.25 17.35 35.2 17.15 L35.55 22.55 Q28.95 24.25 26.0 26.7 24.6 27.85 23.75 29.35 L23.65 29.45 Q22.25 31.95 22.25 35.35 22.25 36.65 22.6 37.8 L18.95 38.25 M14.85 89.0 Q17.2 85.7 20.25 82.75 L20.55 82.45 22.05 81.1 Q23.9 79.5 25.85 78.1 31.95 73.8 39.1 71.9 L39.1 75.45 Q33.55 76.7 28.85 79.85 L26.5 81.55 23.45 84.3 21.8 86.05 19.6 88.8 14.85 89.0" fill="#431a00" fill-rule="evenodd" stroke="none"/>
    <path d="M60.9 39.15 L56.95 39.45 57.0 38.8 57.0 38.6 Q56.95 35.0 55.1 32.95 54.1 31.85 52.65 31.25 L52.4 31.15 52.2 26.55 Q54.6 27.25 57.2 29.7 L57.55 30.05 Q60.75 33.3 61.05 36.9 L61.05 37.55 60.9 39.15 M73.25 89.55 L64.25 89.7 64.15 89.5 63.65 88.75 Q62.4 87.15 60.3 85.95 L59.8 85.7 Q58.15 85.0 55.05 84.6 L54.9 84.6 55.25 75.55 Q59.7 76.7 63.5 79.2 L65.95 81.05 68.8 83.7 71.05 86.3 73.25 89.55 M35.55 22.55 L35.85 26.85 Q32.25 26.65 28.7 30.2 25.2 33.75 25.15 37.5 L22.6 37.8 Q22.25 36.65 22.25 35.35 22.25 31.95 23.65 29.45 L23.75 29.35 Q24.6 27.85 26.0 26.7 28.95 24.25 35.55 22.55 M39.1 75.45 L39.1 81.75 Q33.7 81.85 29.4 84.6 L27.5 86.0 Q26.25 87.0 25.5 88.05 L25.2 88.55 19.6 88.8 21.8 86.05 23.45 84.3 26.5 81.55 28.85 79.85 Q33.55 76.7 39.1 75.45" fill="#632600" fill-rule="evenodd" stroke="none"/>
    <path d="M79.7 37.95 L65.3 38.9 Q65.75 37.8 65.75 36.15 L65.75 35.55 Q65.65 32.0 64.2 29.15 L64.0 28.75 62.15 26.25 Q58.5 22.2 52.6 22.05 L52.15 22.05 52.0 22.05 51.5 11.2 51.8 11.2 62.4 12.55 65.9 15.15 Q68.1 17.0 70.2 19.35 L71.15 20.45 Q74.0 23.75 75.9 27.25 L76.75 28.8 78.55 33.2 79.7 37.95 M55.7 65.2 L57.1 65.35 Q62.55 66.15 67.85 68.65 74.6 71.8 80.95 77.65 L81.7 78.35 83.95 80.55 83.6 89.4 82.95 89.4 Q81.35 86.75 79.35 84.3 L78.05 82.75 74.75 79.45 Q70.65 75.75 66.0 73.6 61.1 71.3 55.6 70.7 L55.45 70.65 55.7 65.2 M31.55 9.6 L34.35 9.45 34.65 9.4 35.2 17.15 Q29.25 17.35 24.55 21.25 L23.65 22.05 Q19.45 26.0 18.45 31.05 18.15 32.55 18.15 34.2 L18.6 36.95 18.95 38.25 13.5 38.9 13.4 37.65 Q13.4 35.1 13.75 32.7 L14.2 30.05 Q15.3 25.15 17.85 21.0 L19.55 18.5 Q22.35 14.75 26.25 12.25 28.65 10.65 31.55 9.6 M39.1 66.35 L39.1 71.9 Q31.95 73.8 25.85 78.1 23.9 79.5 22.05 81.1 L20.55 82.45 20.25 82.75 Q17.2 85.7 14.85 89.0 L10.55 89.15 10.3 85.15 Q14.3 79.85 19.8 75.95 L20.2 75.7 24.95 72.55 Q28.55 70.3 31.8 68.85 L35.1 67.5 39.1 66.35" fill="#2b1100" fill-rule="evenodd" stroke="none"/>
    <path d="M79.9 14.8 L82.2 17.1 82.2 37.5 82.2 37.75 79.7 37.95 78.55 33.2 76.75 28.8 75.9 27.25 Q74.0 23.75 71.15 20.45 L70.2 19.35 Q68.1 17.0 65.9 15.15 L62.4 12.55 79.9 14.8 M84.85 57.85 L84.85 58.1 83.95 80.55 81.7 78.35 80.95 77.65 Q74.6 71.8 67.85 68.65 62.55 66.15 57.1 65.35 L55.7 65.2 55.9 60.4 56.1 60.4 66.85 59.45 68.6 58.25 68.6 59.3 68.75 59.3 69.05 59.25 69.0 59.35 69.05 59.35 72.5 60.0 72.7 60.0 75.05 58.75 75.1 58.75 84.85 57.85 M22.6 10.0 L31.55 9.6 Q28.65 10.65 26.25 12.25 22.35 14.75 19.55 18.5 L17.85 21.0 Q15.3 25.15 14.2 30.05 L13.75 32.7 Q13.4 35.1 13.4 37.65 L13.5 38.9 7.0 39.7 6.4 39.7 6.45 39.4 6.45 39.35 7.7 10.7 7.7 10.65 22.3 10.0 22.6 10.0 M39.1 66.35 L35.1 67.5 31.8 68.85 Q28.55 70.3 24.95 72.55 L20.2 75.7 19.8 75.95 Q14.3 79.85 10.3 85.15 L9.75 77.25 10.55 73.8 10.15 68.25 9.05 66.9 8.55 59.9 8.6 59.9 39.1 58.65 39.1 59.25 39.1 66.35" fill="#000000" fill-rule="evenodd" stroke="none"/>
    <path d="M40.35 1.85 L41.3 15.5 38.3 15.9 37.4 2.7 40.35 1.85 M-3.6 36.1 L-2.7 16.0 0.0 13.8 0.45 13.55 -0.4 32.65 -1.45 33.75 -3.6 36.1 M91.7 9.4 L92.2 10.05 92.2 19.4 89.2 19.6 89.2 11.85 87.75 9.55 91.7 9.4 M49.55 64.8 L49.75 60.15 Q51.6 59.25 52.85 58.35 L52.55 64.65 50.6 64.65 49.55 64.8 M95.1 49.55 L94.5 64.25 91.45 64.15 92.05 49.8 95.1 49.55 M48.75 13.3 L49.3 26.45 46.45 29.85 45.8 15.6 47.0 14.25 Q47.6 13.75 48.75 13.3 M28.7 49.25 L32.1 49.25 45.1 47.55 45.1 65.7 42.1 66.4 42.1 50.6 32.1 52.3 20.55 52.3 23.3 51.2 28.7 49.25 M0.05 78.8 L-0.1 77.05 1.2 74.2 0.8 68.3 -0.3 66.8 2.2 64.7 3.35 66.6 4.15 75.2 3.05 79.5 3.2 81.4 1.95 82.7 0.4 84.2 0.05 78.8 M81.8 50.85 L78.0 52.75 77.7 52.65 75.1 51.55 81.8 50.85" fill="#8a7461" fill-rule="evenodd" stroke="none"/>
    <path d="M13.3 -0.7 L40.1 -2.0 40.35 1.85 37.4 2.7 37.3 1.2 37.3 1.15 22.15 1.9 22.9 0.25 19.8 2.0 19.75 2.0 0.9 2.85 0.9 3.1 0.45 13.55 0.0 13.8 -2.7 16.0 -2.15 3.55 4.1 1.75 13.3 -0.7 M58.95 0.8 L88.05 4.55 91.7 9.4 87.75 9.55 86.4 7.35 86.0 7.3 51.45 2.85 58.95 0.8 M49.75 60.15 L50.05 53.25 Q52.95 51.95 57.65 50.5 L62.6 48.95 75.05 47.85 79.25 49.0 84.4 47.05 95.2 46.05 95.15 48.05 95.1 49.55 92.05 49.8 92.05 49.35 83.5 50.15 83.1 50.15 81.8 50.85 75.1 51.55 73.75 51.0 73.15 51.05 73.0 51.1 53.1 52.8 53.05 52.8 52.85 58.35 Q51.6 59.25 49.75 60.15 M48.3 3.8 L48.75 13.3 Q47.6 13.75 47.0 14.25 L45.8 15.6 45.35 4.75 48.3 3.8 M28.7 49.25 L23.3 51.2 20.55 52.3 2.55 52.3 11.55 49.25 28.7 49.25 M-0.3 66.8 L-0.85 66.1 -1.7 53.75 1.3 52.75 2.05 64.45 2.2 64.7 -0.3 66.8" fill="#947c69" fill-rule="evenodd" stroke="none"/>
    <path d="M-2.15 3.55 L-2.0 0.0 13.3 -0.7 4.1 1.75 -2.15 3.55 M45.2 1.0 L45.1 -1.0 58.95 0.8 51.45 2.85 48.25 2.45 48.3 3.1 48.3 3.8 45.35 4.75 45.2 1.0 M50.05 53.25 L50.15 50.05 62.6 48.95 57.65 50.5 Q52.95 51.95 50.05 53.25 M-1.7 53.75 L-2.0 49.25 11.55 49.25 2.55 52.3 1.25 52.3 1.25 52.4 1.3 52.75 -1.7 53.75" fill="#a38873" fill-rule="evenodd" stroke="none"/>
    <path d="M41.95 25.1 L42.3 30.55 39.4 32.15 38.95 25.4 41.85 25.1 41.95 25.1 M-3.75 41.9 L-3.85 41.75 -3.8 41.0 -0.7 39.2 -0.75 40.25 -0.75 40.45 0.75 41.95 19.1 39.9 Q13.15 42.1 8.25 44.25 L-2.0 45.2 -3.75 41.9 M92.2 25.8 L92.2 30.35 89.2 31.15 89.2 26.0 92.2 25.8 M49.9 41.2 L46.95 41.9 46.6 33.05 49.55 32.15 49.9 41.2 M48.35 94.8 L48.25 94.8 48.65 85.3 Q49.85 84.8 51.75 84.25 L51.4 91.75 51.85 91.5 57.25 91.5 49.55 94.8 48.35 94.8 M94.0 76.95 L93.8 81.0 90.75 81.7 90.95 77.15 94.0 76.95 M45.1 76.55 L45.1 78.85 42.1 80.45 42.1 76.8 45.1 76.55 M0.85 91.4 Q2.3 90.6 3.75 89.9 L3.85 91.35 4.1 91.35 21.65 90.55 20.35 91.15 14.5 93.9 1.05 94.5 0.85 91.4" fill="#736051" fill-rule="evenodd" stroke="none"/>
  </g>
  <defs>
    <radialGradient cx="0" cy="0" fx="470.40000000000003" fy="0" gradientTransform="matrix(0.0326, -0.0045, 0.0063, 0.0456, 25.05, 42.85)" gradientUnits="userSpaceOnUse" id="gradient0" r="819.2" spreadMethod="pad">
      <stop offset="0.0" stop-color="#d25502"/>
      <stop offset="0.12941176470588237" stop-color="#803300"/>
      <stop offset="1.0" stop-color="#000000"/>
    </radialGradient>
    <radialGradient cx="0" cy="0" fx="-1392.0" fy="0" gradientTransform="matrix(0.0417, 0.0, 0.0, 0.0417, 49.8, 38.15)" gradientUnits="userSpaceOnUse" id="gradient1" r="819.2" spreadMethod="pad">
      <stop offset="0.0" stop-color="#d25502"/>
      <stop offset="0.12941176470588237" stop-color="#803300"/>
      <stop offset="1.0" stop-color="#000000"/>
    </radialGradient>
    <radialGradient cx="0" cy="0" fx="281.6" fy="0" gradientTransform="matrix(0.0429, 0.0, 0.0, 0.0429, 44.75, 99.3)" gradientUnits="userSpaceOnUse" id="gradient2" r="819.2" spreadMethod="pad">
      <stop offset="0.0" stop-color="#d25502"/>
      <stop offset="0.12941176470588237" stop-color="#803300"/>
      <stop offset="1.0" stop-color="#000000"/>
    </radialGradient>
  </defs>
</svg>
