<?xml version="1.0" encoding="UTF-8" standalone="no"?>
<svg xmlns:xlink="http://www.w3.org/1999/xlink" height="31.8px" width="60.6px" xmlns="http://www.w3.org/2000/svg">
  <g transform="matrix(1.0, 0.0, 0.0, 1.0, 30.3, 16.3)">
    <path d="M29.0 -15.0 L27.95 14.2 -29.0 12.2 -26.9 -12.8 29.0 -15.0" fill="#ff9900" fill-rule="evenodd" stroke="none"/>
    <path d="M29.0 -15.0 L27.95 14.2 -29.0 12.2 -26.9 -12.8 29.0 -15.0 Z" fill="none" stroke="#ffff00" stroke-linecap="square" stroke-linejoin="miter" stroke-miterlimit="3.0" stroke-width="2.0"/>
  </g>
</svg>
