<?xml version="1.0" encoding="UTF-8" standalone="no"?>
<svg xmlns:xlink="http://www.w3.org/1999/xlink" height="162.1px" width="101.75px" xmlns="http://www.w3.org/2000/svg">
  <g transform="matrix(1.0, 0.0, 0.0, 1.0, -212.4, -43.25)">
    <path d="M236.65 204.6 L230.1 205.0 223.4 205.35 Q227.45 202.9 233.85 197.4 L247.3 184.95 Q252.3 180.15 256.6 170.95 261.45 160.6 261.45 152.25 261.45 136.1 253.8 125.9 248.85 119.35 236.95 111.85 224.25 103.95 220.05 99.2 212.4 90.5 212.4 76.85 212.4 64.65 218.35 56.25 222.0 51.1 231.5 43.25 L231.95 43.8 227.6 48.6 Q222.8 54.35 222.8 60.45 222.8 70.4 237.05 78.9 242.25 82.0 251.7 86.3 L268.5 93.9 Q289.7 103.9 299.9 114.0 314.15 128.2 314.15 147.8 314.15 158.05 309.35 169.8 L306.0 177.8 Q304.5 181.85 304.5 184.55 304.5 189.25 309.05 194.6 L307.15 194.15 Q297.65 198.45 293.65 199.85 L292.15 196.5 Q288.9 188.5 288.9 184.2 288.9 178.15 291.85 169.3 294.8 160.5 294.8 155.6 294.8 144.15 285.6 132.2 277.3 121.45 266.7 116.25 L266.4 116.8 266.55 117.4 Q271.3 123.1 274.65 129.75 279.25 138.8 279.25 146.3 279.25 163.65 264.85 179.15 259.7 184.65 249.25 193.65 L236.65 204.6" fill="#383020" fill-rule="evenodd" stroke="none"/>
    <path d="M293.65 199.85 L293.0 200.05 292.25 199.95 284.85 199.4 Q280.5 200.95 278.75 201.3 277.75 201.5 274.7 202.75 L271.85 204.0 Q271.1 204.0 270.05 203.4 269.0 202.75 268.6 202.75 L264.5 203.65 260.75 204.45 259.9 204.4 259.3 204.25 259.3 204.4 Q249.45 203.95 236.65 204.6 L249.25 193.65 Q259.7 184.65 264.85 179.15 279.25 163.65 279.25 146.3 279.25 138.8 274.65 129.75 271.3 123.1 266.55 117.4 L266.4 116.8 266.7 116.25 Q277.3 121.45 285.6 132.2 294.8 144.15 294.8 155.6 294.8 160.5 291.85 169.3 288.9 178.15 288.9 184.2 288.9 188.5 292.15 196.5 L293.65 199.85" fill="#201800" fill-rule="evenodd" stroke="none"/>
  </g>
</svg>
