<?xml version="1.0" encoding="UTF-8" standalone="no"?>
<svg xmlns:xlink="http://www.w3.org/1999/xlink" height="357.9px" width="204.0px" xmlns="http://www.w3.org/2000/svg">
  <g transform="matrix(1.0, 0.0, 0.0, 1.0, 0.0, 0.0)">
    <path d="M0.0 236.3 L0.7 236.75 0.0 236.75 0.0 236.3" fill="#000000" fill-rule="evenodd" stroke="none"/>
    <path d="M35.35 0.0 L34.55 1.2 Q17.25 27.8 11.75 36.7 5.15 47.35 0.0 56.55 L0.0 0.0 35.35 0.0" fill="#1e2126" fill-rule="evenodd" stroke="none"/>
    <path d="M0.0 299.7 Q7.35 303.05 17.4 305.3 28.55 307.85 35.0 307.85 L37.35 307.8 36.2 304.65 Q34.8 300.0 34.8 297.75 34.8 293.4 38.8 289.8 42.5 286.5 47.55 285.6 52.8 284.65 56.25 287.15 60.25 290.0 60.25 296.5 60.25 299.65 57.55 304.8 66.05 302.75 75.85 299.35 80.05 292.95 83.9 288.05 L99.15 266.35 Q108.25 253.25 111.35 252.0 103.95 267.95 86.8 290.05 84.2 293.4 81.55 297.3 L88.25 294.7 89.5 294.2 91.05 291.95 97.65 282.8 102.15 273.3 Q105.2 267.1 108.65 266.05 L109.2 266.5 Q107.55 269.0 98.8 284.1 L93.75 292.45 102.25 288.65 Q103.15 286.15 105.45 282.0 109.35 274.8 111.35 274.1 109.65 279.55 108.0 283.3 L106.35 286.7 Q114.5 282.75 122.25 278.35 L121.2 277.05 Q119.0 274.1 119.0 273.5 119.0 269.35 123.55 272.3 125.95 273.85 127.1 275.45 L130.0 273.7 Q143.7 265.1 156.0 255.0 161.55 250.4 169.25 248.9 L173.85 248.15 Q175.7 247.75 176.0 247.0 176.35 245.85 180.9 238.25 L190.0 223.0 204.0 199.75 204.0 324.0 201.75 325.3 Q186.95 333.9 181.45 335.95 L178.05 337.05 177.9 331.0 Q177.65 327.85 177.0 325.85 L160.6 328.5 153.75 329.9 Q145.3 331.85 143.0 333.85 143.65 337.85 146.4 340.45 L148.35 342.3 95.95 348.4 92.15 348.85 77.3 348.15 Q65.15 346.45 45.0 344.85 23.9 343.25 1.65 337.4 L0.0 336.95 0.0 299.7 M84.35 268.75 L74.45 270.25 72.55 269.0 72.1 268.45 Q73.4 266.85 80.05 265.65 87.2 264.3 90.2 266.15 88.1 268.05 84.35 268.75 M81.4 272.3 L81.55 273.5 Q81.55 274.6 79.0 275.5 75.85 276.65 70.4 276.65 L65.15 276.3 65.0 276.05 Q64.8 275.85 64.8 274.8 L64.85 273.85 65.15 273.5 72.0 272.25 Q79.05 271.2 81.2 272.45 L81.4 272.3 M135.85 258.1 Q135.85 259.45 134.0 260.5 132.35 261.45 130.95 261.45 L129.55 261.15 129.25 260.95 129.15 259.85 Q129.15 258.35 130.85 257.5 132.4 256.7 134.75 256.7 L135.6 256.9 135.85 258.1 M130.2 266.85 Q128.9 268.8 127.2 268.8 124.45 268.8 123.9 267.45 L123.9 265.9 Q123.9 262.15 127.55 262.45 131.15 262.7 131.15 264.85 L130.2 266.85 M38.95 283.15 Q38.15 284.0 36.8 284.0 34.85 284.0 34.1 282.1 L33.75 280.6 Q33.75 278.35 36.7 278.3 39.6 278.3 39.6 281.55 39.6 282.4 38.95 283.15 M26.3 295.1 Q23.05 295.1 21.7 292.25 L21.0 289.7 Q21.0 286.0 25.9 285.95 30.8 285.95 30.8 289.85 30.8 291.45 29.95 292.95 28.7 295.1 26.3 295.1 M78.45 259.25 Q78.45 261.35 76.05 262.55 72.05 264.6 70.4 266.15 L69.25 265.75 Q68.85 265.45 68.85 264.3 68.85 263.9 70.3 261.85 71.75 259.8 71.75 259.25 71.75 255.85 75.1 255.85 78.45 255.85 78.45 259.25" fill="#0f1014" fill-rule="evenodd" stroke="none"/>
    <path d="M0.7 236.75 Q16.85 247.0 26.0 247.0 27.15 247.0 34.75 242.2 L34.35 240.8 Q33.65 239.45 33.05 237.55 L32.45 234.9 Q32.45 230.2 35.15 226.5 37.65 223.0 41.1 222.2 44.7 221.3 47.05 224.0 49.5 226.75 49.75 232.6 L55.6 228.9 Q61.85 217.0 70.4 202.55 L71.3 202.95 71.55 204.4 Q71.55 206.2 62.3 223.65 L61.45 225.3 62.5 224.65 Q70.3 211.0 74.6 205.6 L74.7 205.3 74.8 206.3 Q74.8 207.2 74.2 208.5 73.55 209.85 73.55 210.7 73.55 211.85 68.3 221.3 91.75 208.0 102.5 208.0 103.75 208.0 105.5 209.0 107.25 210.0 108.5 210.0 L109.3 210.0 Q115.55 209.75 123.8 206.0 L123.55 203.85 Q123.55 196.8 126.55 196.55 129.2 196.3 129.5 203.1 L133.0 201.05 133.55 200.75 Q133.25 196.3 132.8 193.9 L133.5 193.9 135.1 199.75 142.3 194.7 Q146.0 191.9 146.0 191.5 L141.5 179.25 137.0 167.0 Q137.0 165.8 151.05 156.25 163.85 147.55 170.0 144.0 171.25 143.3 175.95 134.3 181.85 122.95 189.0 114.0 197.5 103.25 204.0 83.6 L204.0 199.75 190.0 223.0 180.9 238.25 Q176.35 245.85 176.0 247.0 175.7 247.75 173.85 248.15 L169.25 248.9 Q161.55 250.4 156.0 255.0 143.7 265.1 130.0 273.7 L127.1 275.45 Q125.95 273.85 123.55 272.3 119.0 269.35 119.0 273.5 119.0 274.1 121.2 277.05 L122.25 278.35 Q114.5 282.75 106.35 286.7 L108.0 283.3 Q109.65 279.55 111.35 274.1 109.35 274.8 105.45 282.0 103.15 286.15 102.25 288.65 L93.75 292.45 98.8 284.1 Q107.55 269.0 109.2 266.5 L108.65 266.05 Q105.2 267.1 102.15 273.3 L97.65 282.8 91.05 291.95 89.5 294.2 88.25 294.7 81.55 297.3 Q84.2 293.4 86.8 290.05 103.95 267.95 111.35 252.0 108.25 253.25 99.15 266.35 L83.9 288.05 Q80.05 292.95 75.85 299.35 66.05 302.75 57.55 304.8 60.25 299.65 60.25 296.5 60.25 290.0 56.25 287.15 52.8 284.65 47.55 285.6 42.5 286.5 38.8 289.8 34.8 293.4 34.8 297.75 34.8 300.0 36.2 304.65 L37.35 307.8 35.0 307.85 Q28.55 307.85 17.4 305.3 7.35 303.05 0.0 299.7 L0.0 236.75 0.7 236.75 M117.05 182.6 Q117.05 181.5 117.25 181.3 L117.75 181.0 Q118.4 181.25 120.5 183.35 122.7 185.55 123.35 186.8 L123.05 187.75 Q122.6 188.35 121.5 188.35 119.55 188.35 118.1 185.5 L117.05 182.6 M112.2 183.35 L112.35 182.85 Q114.95 181.9 117.3 185.5 L121.35 192.05 120.9 193.25 Q120.55 193.7 119.4 193.7 117.75 193.7 114.8 189.2 112.15 185.2 112.15 184.5 L112.2 183.35 M113.05 194.25 Q113.05 195.35 111.35 197.55 L111.45 197.45 113.75 195.65 114.7 195.9 Q115.05 196.1 115.05 197.2 115.05 198.2 113.5 199.8 L111.7 201.6 110.15 201.65 109.9 201.55 Q109.6 201.4 109.6 200.35 109.6 199.8 109.95 199.2 107.65 201.8 106.2 202.35 L105.25 202.1 Q104.9 201.9 104.9 200.8 104.9 199.4 107.35 196.5 110.05 193.25 112.5 193.25 L112.8 193.1 Q113.05 193.15 113.05 194.25 M144.55 154.15 L144.15 153.95 Q144.0 153.9 144.0 152.85 144.0 152.2 147.2 150.05 150.75 147.65 153.1 148.05 152.45 148.3 149.75 151.15 147.35 153.65 144.55 154.15 M136.95 156.55 Q136.55 156.55 136.55 155.45 136.55 153.3 142.35 148.75 148.15 144.15 150.5 144.6 150.1 146.25 145.0 150.45 L137.35 156.35 Q137.15 156.55 136.95 156.55 M95.1 225.0 L94.15 224.75 Q94.15 225.3 92.75 225.85 91.35 226.4 91.35 226.7 91.35 227.8 91.55 227.9 L91.7 227.75 93.45 228.1 94.95 227.8 95.25 227.15 95.45 226.35 Q95.45 225.25 95.1 225.0 M99.45 216.9 L99.1 217.05 Q97.35 217.15 93.75 218.9 89.65 220.95 88.55 223.0 L88.95 223.55 90.35 223.9 Q99.8 219.5 99.8 218.1 99.8 217.0 99.45 216.9 M105.95 219.65 L105.75 219.8 Q99.65 219.8 99.65 222.25 99.65 223.4 99.95 223.6 L100.85 223.9 Q102.05 223.6 103.85 222.7 106.1 221.55 106.1 220.85 L105.95 219.65 M130.2 266.85 L131.15 264.85 Q131.15 262.7 127.55 262.45 123.9 262.15 123.9 265.9 L123.9 267.45 Q124.45 268.8 127.2 268.8 128.9 268.8 130.2 266.85 M135.85 258.1 L135.6 256.9 134.75 256.7 Q132.4 256.7 130.85 257.5 129.15 258.35 129.15 259.85 L129.25 260.95 129.55 261.15 130.95 261.45 Q132.35 261.45 134.0 260.5 135.85 259.45 135.85 258.1 M81.4 272.3 L81.2 272.45 Q79.05 271.2 72.0 272.25 L65.15 273.5 64.85 273.85 64.8 274.8 Q64.8 275.85 65.0 276.05 L65.15 276.3 70.4 276.65 Q75.85 276.65 79.0 275.5 81.55 274.6 81.55 273.5 L81.4 272.3 M84.35 268.75 Q88.1 268.05 90.2 266.15 87.2 264.3 80.05 265.65 73.4 266.85 72.1 268.45 L72.55 269.0 74.45 270.25 84.35 268.75 M34.35 219.5 L34.5 219.75 34.65 221.0 34.6 222.05 34.35 222.6 32.45 223.35 30.85 221.95 30.45 221.45 Q30.45 220.55 31.0 219.8 32.0 218.55 34.35 219.5 M29.15 230.3 Q28.05 231.7 26.65 231.7 24.85 231.7 24.35 230.45 24.15 230.0 24.15 228.95 24.15 226.55 27.15 225.4 30.1 224.3 30.1 228.0 30.1 229.1 29.15 230.3 M78.45 259.25 Q78.45 255.85 75.1 255.85 71.75 255.85 71.75 259.25 71.75 259.8 70.3 261.85 68.85 263.9 68.85 264.3 68.85 265.45 69.25 265.75 L70.4 266.15 Q72.05 264.6 76.05 262.55 78.45 261.35 78.45 259.25 M26.3 295.1 Q28.7 295.1 29.95 292.95 30.8 291.45 30.8 289.85 30.8 285.95 25.9 285.95 21.0 286.0 21.0 289.7 L21.7 292.25 Q23.05 295.1 26.3 295.1 M38.95 283.15 Q39.6 282.4 39.6 281.55 39.6 278.3 36.7 278.3 33.75 278.35 33.75 280.6 L34.1 282.1 Q34.85 284.0 36.8 284.0 38.15 284.0 38.95 283.15" fill="#13141a" fill-rule="evenodd" stroke="none"/>
    <path d="M0.0 135.1 Q4.55 140.15 10.0 145.05 14.8 149.4 19.8 153.15 L23.35 148.1 Q33.2 134.45 38.2 130.1 L38.5 129.95 38.75 131.15 35.7 135.25 32.2 139.7 29.5 144.05 26.65 147.85 Q25.35 149.25 23.45 152.2 L21.45 154.45 Q17.7 159.15 16.5 162.9 L23.0 155.65 23.1 155.55 23.85 156.1 Q27.1 151.3 29.75 149.8 L30.65 150.05 Q30.95 150.25 30.95 151.35 30.95 152.55 26.75 158.05 L28.05 158.85 22.45 167.0 Q26.05 164.25 29.6 159.8 33.85 162.4 38.25 164.55 L35.55 167.1 Q32.8 170.3 32.8 173.4 32.8 175.05 33.7 176.5 35.25 179.0 38.9 179.0 43.45 179.0 47.35 173.05 L49.55 169.3 Q56.7 171.7 63.65 172.55 L63.0 171.05 Q61.9 168.15 61.3 164.65 L60.9 161.7 Q60.9 151.9 67.5 145.5 73.5 139.7 82.1 138.95 90.7 138.15 96.65 143.05 101.9 147.35 103.0 154.8 109.1 150.95 116.0 147.0 L120.1 144.65 119.0 142.45 118.1 138.6 Q118.1 136.3 120.55 134.4 122.9 132.6 126.0 132.2 129.25 131.75 131.4 133.3 132.9 134.4 133.5 136.35 138.75 132.85 141.55 130.4 147.0 125.6 147.0 121.0 L144.5 104.75 Q142.0 88.4 142.0 87.0 142.0 79.7 148.1 72.95 150.05 70.8 154.0 67.5 L151.6 60.2 Q151.6 59.0 152.1 58.5 152.45 58.15 153.3 58.0 154.65 59.95 156.65 65.4 L157.55 64.65 Q155.8 59.45 155.8 58.95 L156.0 57.65 Q158.3 57.65 160.5 62.4 L161.5 61.6 Q171.1 54.4 174.9 49.85 179.5 44.35 180.65 38.4 L183.9 36.45 188.45 32.6 Q187.2 31.5 183.1 34.2 181.9 35.0 181.0 35.75 L181.0 34.5 180.95 33.3 186.6 29.2 Q191.3 25.7 192.9 23.6 190.4 24.2 185.75 27.65 L180.2 32.1 Q175.0 31.7 172.45 27.7 170.8 25.15 170.8 22.8 170.8 17.5 175.7 15.05 176.5 14.65 177.4 14.35 175.9 8.35 174.05 2.5 L173.25 0.0 204.0 0.0 204.0 83.6 Q197.5 103.25 189.0 114.0 181.85 122.95 175.95 134.3 171.25 143.3 170.0 144.0 163.85 147.55 151.05 156.25 137.0 165.8 137.0 167.0 L141.5 179.25 146.0 191.5 Q146.0 191.9 142.3 194.7 L135.1 199.75 133.5 193.9 132.8 193.9 Q133.25 196.3 133.55 200.75 L133.0 201.05 129.5 203.1 Q129.2 196.3 126.55 196.55 123.55 196.8 123.55 203.85 L123.8 206.0 Q115.55 209.75 109.3 210.0 L108.5 210.0 Q107.25 210.0 105.5 209.0 103.75 208.0 102.5 208.0 91.75 208.0 68.3 221.3 73.55 211.85 73.55 210.7 73.55 209.85 74.2 208.5 74.8 207.2 74.8 206.3 L74.7 205.3 74.6 205.6 Q70.3 211.0 62.5 224.65 L61.45 225.3 62.3 223.65 Q71.55 206.2 71.55 204.4 L71.3 202.95 70.4 202.55 Q61.85 217.0 55.6 228.9 L49.75 232.6 Q49.5 226.75 47.05 224.0 44.7 221.3 41.1 222.2 37.65 223.0 35.15 226.5 32.45 230.2 32.45 234.9 L33.05 237.55 Q33.65 239.45 34.35 240.8 L34.75 242.2 Q27.15 247.0 26.0 247.0 16.85 247.0 0.7 236.75 L0.0 236.3 0.0 135.1 M167.7 39.9 Q171.25 37.25 172.25 37.15 L172.8 37.7 Q171.85 39.35 169.15 41.85 165.85 44.8 163.95 44.8 L163.45 44.25 Q163.95 42.7 167.7 39.9 M171.9 44.6 L166.35 49.0 159.95 53.45 Q159.6 54.4 159.6 52.65 159.6 51.05 163.85 47.4 168.4 43.45 171.5 43.55 L171.7 43.4 Q171.9 43.5 171.9 44.6 M189.3 53.6 L189.05 53.8 Q186.05 55.45 180.0 61.7 174.3 67.55 174.3 68.3 174.3 69.4 174.5 69.4 L174.65 69.2 Q177.3 65.45 183.7 59.8 L189.5 54.75 Q189.5 53.65 189.3 53.6 M191.1 56.5 Q187.1 59.9 184.75 62.2 180.45 66.45 180.05 69.2 L180.75 69.45 187.25 63.1 Q191.35 58.7 191.1 56.5 M131.0 97.25 L131.15 96.95 Q133.4 97.0 134.9 101.45 135.75 103.95 137.0 109.45 L136.4 110.5 Q135.25 109.85 133.0 104.45 130.95 99.4 130.95 98.25 L131.0 97.25 M153.6 94.85 L151.1 83.55 Q150.15 83.8 150.15 86.5 150.15 88.55 152.2 98.75 154.1 108.5 154.7 110.15 L155.45 109.95 155.7 109.9 155.75 108.9 Q155.75 105.35 153.6 94.85 M157.7 95.75 Q155.5 85.55 155.2 82.4 L154.7 82.4 154.35 84.05 154.15 86.1 Q154.15 89.3 158.7 107.45 L159.6 107.25 Q159.65 107.1 159.75 107.2 L159.75 106.2 157.7 95.75 M21.4 90.8 Q23.35 90.5 25.55 94.45 27.55 98.0 27.55 99.9 L27.45 100.95 27.2 100.95 27.4 101.15 26.3 101.3 Q25.55 101.3 21.35 91.85 L21.4 90.8 M21.95 102.2 Q24.05 100.9 26.05 103.9 27.7 106.4 27.7 107.85 L27.6 108.95 27.35 109.2 27.5 109.4 26.3 109.6 Q25.15 109.6 23.35 106.45 21.75 103.7 21.75 103.15 L21.8 102.2 Q21.9 102.4 21.95 102.2 M45.15 177.1 Q45.15 177.9 45.5 178.5 46.2 179.7 48.0 179.7 50.9 179.7 50.9 177.5 L50.75 175.75 50.55 175.0 46.35 175.1 Q45.15 175.4 45.15 177.1 M36.2 194.75 Q37.25 193.9 39.1 191.3 L42.05 186.6 Q41.3 186.8 39.05 190.15 37.1 193.0 36.2 194.75 M31.15 195.8 L31.85 196.05 Q33.55 194.85 35.4 191.5 37.25 187.8 38.05 186.6 36.95 187.15 34.9 190.35 L31.15 195.8 M34.0 184.6 L32.8 183.55 Q31.15 183.75 28.55 187.3 26.3 190.45 26.3 190.9 26.3 192.0 27.0 191.85 L27.7 191.5 31.25 188.3 Q33.15 186.35 34.0 184.6 M39.25 171.75 Q40.05 169.75 40.4 169.2 L40.6 169.05 Q40.85 169.55 40.35 170.45 39.9 171.3 39.25 171.75 M142.35 121.35 Q140.85 124.4 138.95 124.6 L138.8 124.7 Q138.6 124.55 138.6 123.45 138.6 122.65 139.35 120.8 140.45 118.1 142.25 116.9 L142.9 116.65 Q143.5 116.65 143.5 117.75 143.5 118.9 142.35 121.35 M139.65 115.9 Q139.65 117.15 137.75 120.45 135.85 123.65 134.4 125.0 133.7 125.0 133.35 124.6 134.75 121.0 135.7 118.9 137.45 115.0 138.95 114.85 L139.3 114.7 Q139.65 114.8 139.65 115.9 M134.05 117.05 Q132.5 115.5 131.2 111.75 L129.3 106.1 Q131.75 105.7 133.35 109.45 134.25 111.5 135.15 115.75 135.05 116.55 134.05 117.05 M150.9 129.2 L148.45 129.15 Q147.15 129.6 147.15 130.45 147.15 131.5 147.35 131.65 L147.85 132.0 149.25 132.3 150.75 132.05 151.1 131.75 151.25 130.55 151.1 129.45 150.9 129.2 M155.2 126.75 L155.05 125.0 154.85 124.25 Q151.75 123.75 150.7 124.25 149.8 124.7 149.8 126.25 L150.0 127.9 150.15 128.6 151.95 128.95 Q155.2 128.8 155.2 126.75 M108.95 130.9 Q112.0 131.15 112.0 134.05 112.0 135.8 111.4 136.4 110.8 137.0 109.25 137.0 105.85 137.0 105.85 133.7 105.85 130.7 108.95 130.9 M136.95 156.55 Q137.15 156.55 137.35 156.35 L145.0 150.45 Q150.1 146.25 150.5 144.6 148.15 144.15 142.35 148.75 136.55 153.3 136.55 155.45 136.55 156.55 136.95 156.55 M144.55 154.15 Q147.35 153.65 149.75 151.15 152.45 148.3 153.1 148.05 150.75 147.65 147.2 150.05 144.0 152.2 144.0 152.85 144.0 153.9 144.15 153.95 L144.55 154.15 M113.05 194.25 Q113.05 193.15 112.8 193.1 L112.5 193.25 Q110.05 193.25 107.35 196.5 104.9 199.4 104.9 200.8 104.9 201.9 105.25 202.1 L106.2 202.35 Q107.65 201.8 109.95 199.2 109.6 199.8 109.6 200.35 109.6 201.4 109.9 201.55 L110.15 201.65 111.7 201.6 113.5 199.8 Q115.05 198.2 115.05 197.2 115.05 196.1 114.7 195.9 L113.75 195.65 111.45 197.45 111.35 197.55 Q113.05 195.35 113.05 194.25 M112.2 183.35 L112.15 184.5 Q112.15 185.2 114.8 189.2 117.75 193.7 119.4 193.7 120.55 193.7 120.9 193.25 L121.35 192.05 117.3 185.5 Q114.95 181.9 112.35 182.85 L112.2 183.35 M117.05 182.6 L118.1 185.5 Q119.55 188.35 121.5 188.35 122.6 188.35 123.05 187.75 L123.35 186.8 Q122.7 185.55 120.5 183.35 118.4 181.25 117.75 181.0 L117.25 181.3 Q117.05 181.5 117.05 182.6 M105.95 219.65 L106.1 220.85 Q106.1 221.55 103.85 222.7 102.05 223.6 100.85 223.9 L99.95 223.6 Q99.65 223.4 99.65 222.25 99.65 219.8 105.75 219.8 L105.95 219.65 M99.45 216.9 Q99.8 217.0 99.8 218.1 99.8 219.5 90.35 223.9 L88.95 223.55 88.55 223.0 Q89.65 220.95 93.75 218.9 97.35 217.15 99.1 217.05 L99.45 216.9 M95.1 225.0 Q95.45 225.25 95.45 226.35 L95.25 227.15 94.95 227.8 93.45 228.1 91.7 227.75 91.55 227.9 Q91.35 227.8 91.35 226.7 91.35 226.4 92.75 225.85 94.15 225.3 94.15 224.75 L95.1 225.0 M34.35 219.5 Q32.0 218.55 31.0 219.8 30.45 220.55 30.45 221.45 L30.85 221.95 32.45 223.35 34.35 222.6 34.6 222.05 34.65 221.0 34.5 219.75 34.35 219.5 M29.15 230.3 Q30.1 229.1 30.1 228.0 30.1 224.3 27.15 225.4 24.15 226.55 24.15 228.95 24.15 230.0 24.35 230.45 24.85 231.7 26.65 231.7 28.05 231.7 29.15 230.3" fill="#17181f" fill-rule="evenodd" stroke="none"/>
    <path d="M173.25 0.0 L174.05 2.5 Q175.9 8.35 177.4 14.35 176.5 14.65 175.7 15.05 170.8 17.5 170.8 22.8 170.8 25.15 172.45 27.7 175.0 31.7 180.2 32.1 L185.75 27.65 Q190.4 24.2 192.9 23.6 191.3 25.7 186.6 29.2 L180.95 33.3 181.0 34.5 181.0 35.75 Q181.9 35.0 183.1 34.2 187.2 31.5 188.45 32.6 L183.9 36.45 180.65 38.4 Q179.5 44.35 174.9 49.85 171.1 54.4 161.5 61.6 L160.5 62.4 Q158.3 57.65 156.0 57.65 L155.8 58.95 Q155.8 59.45 157.55 64.65 L156.65 65.4 Q154.65 59.95 153.3 58.0 152.45 58.15 152.1 58.5 151.6 59.0 151.6 60.2 L154.0 67.5 Q150.05 70.8 148.1 72.95 142.0 79.7 142.0 87.0 142.0 88.4 144.5 104.75 L147.0 121.0 Q147.0 125.6 141.55 130.4 138.75 132.85 133.5 136.35 132.9 134.4 131.4 133.3 129.25 131.75 126.0 132.2 122.9 132.6 120.55 134.4 118.1 136.3 118.1 138.6 L119.0 142.45 120.1 144.65 116.0 147.0 Q109.1 150.95 103.0 154.8 101.9 147.35 96.65 143.05 90.7 138.15 82.1 138.95 73.5 139.7 67.5 145.5 60.9 151.9 60.9 161.7 L61.3 164.65 Q61.9 168.15 63.0 171.05 L63.65 172.55 Q56.7 171.7 49.55 169.3 L47.35 173.05 Q43.45 179.0 38.9 179.0 35.25 179.0 33.7 176.5 32.8 175.05 32.8 173.4 32.8 170.3 35.55 167.1 L38.25 164.55 Q33.85 162.4 29.6 159.8 26.05 164.25 22.45 167.0 L28.05 158.85 26.75 158.05 Q30.95 152.55 30.95 151.35 30.95 150.25 30.65 150.05 L29.75 149.8 Q27.1 151.3 23.85 156.1 L23.1 155.55 23.0 155.65 16.5 162.9 Q17.7 159.15 21.45 154.45 L23.45 152.2 Q25.35 149.25 26.65 147.85 L29.5 144.05 32.2 139.7 35.7 135.25 38.75 131.15 38.5 129.95 38.2 130.1 Q33.2 134.45 23.35 148.1 L19.8 153.15 Q14.8 149.4 10.0 145.05 4.55 140.15 0.0 135.1 L0.0 56.55 Q5.15 47.35 11.75 36.7 17.25 27.8 34.55 1.2 L35.35 0.0 72.5 0.0 65.95 8.15 63.45 11.3 65.15 8.55 Q62.95 9.0 60.45 11.4 63.55 8.05 65.15 5.65 58.1 10.8 51.9 16.5 44.05 23.65 41.65 28.15 L42.0 28.5 54.1 17.6 59.15 12.75 58.3 13.7 Q53.0 20.05 51.1 21.6 48.9 23.4 43.6 29.45 38.2 35.6 38.2 36.55 38.2 37.65 38.6 37.65 L39.9 37.5 53.3 23.7 56.2 20.5 Q43.8 36.55 38.0 46.0 42.75 47.35 47.35 52.1 50.0 54.85 55.05 60.9 59.8 65.95 64.5 67.75 69.25 69.55 75.3 68.75 L75.1 69.1 73.55 72.15 67.35 80.2 60.0 89.45 Q54.15 97.05 54.15 99.45 54.15 100.55 54.8 100.45 L55.45 100.15 Q58.65 94.0 67.7 81.9 L70.75 77.85 70.5 78.3 Q61.25 94.5 61.25 96.85 61.25 97.95 60.75 99.05 L59.9 100.6 Q62.7 97.7 66.3 92.1 63.0 100.3 63.0 107.0 63.0 110.65 66.05 113.0 68.6 115.0 71.5 115.0 76.3 115.0 83.9 112.35 86.3 116.25 91.0 116.25 96.95 116.25 100.0 111.35 102.0 108.15 102.0 105.25 L102.0 104.5 Q107.95 101.55 110.5 100.0 114.15 97.75 115.0 96.0 115.0 95.2 123.0 77.5 131.0 59.8 131.0 52.0 131.0 44.55 127.5 40.8 L125.1 38.05 Q124.2 36.6 124.05 34.45 L125.2 33.25 Q132.65 25.5 132.65 24.85 132.65 22.9 132.15 21.6 L133.0 20.5 Q141.15 9.65 141.95 0.0 L173.25 0.0 M171.9 44.6 Q171.9 43.5 171.7 43.4 L171.5 43.55 Q168.4 43.45 163.85 47.4 159.6 51.05 159.6 52.65 159.6 54.4 159.95 53.45 L166.35 49.0 171.9 44.6 M167.7 39.9 Q163.95 42.7 163.45 44.25 L163.95 44.8 Q165.85 44.8 169.15 41.85 171.85 39.35 172.8 37.7 L172.25 37.15 Q171.25 37.25 167.7 39.9 M191.1 56.5 Q191.35 58.7 187.25 63.1 L180.75 69.45 180.05 69.2 Q180.45 66.45 184.75 62.2 187.1 59.9 191.1 56.5 M189.3 53.6 Q189.5 53.65 189.5 54.75 L183.7 59.8 Q177.3 65.45 174.65 69.2 L174.5 69.4 Q174.3 69.4 174.3 68.3 174.3 67.55 180.0 61.7 186.05 55.45 189.05 53.8 L189.3 53.6 M146.55 42.85 L145.6 42.6 Q144.9 43.05 142.55 46.1 140.05 49.4 140.05 50.45 140.05 51.55 140.45 51.85 L141.45 52.15 144.5 48.55 Q146.9 45.55 146.9 44.15 146.9 43.05 146.55 42.85 M140.9 38.7 Q138.05 43.4 138.05 45.3 138.05 46.35 138.35 46.5 L138.6 46.6 140.05 46.55 Q141.4 45.2 144.0 40.95 146.9 36.25 146.9 34.7 146.9 33.6 146.55 33.35 L145.6 33.15 Q143.8 33.9 140.9 38.7 M131.0 97.25 L130.95 98.25 Q130.95 99.4 133.0 104.45 135.25 109.85 136.4 110.5 L137.0 109.45 Q135.75 103.95 134.9 101.45 133.4 97.0 131.15 96.95 L131.0 97.25 M157.7 95.75 L159.75 106.2 159.75 107.2 Q159.65 107.1 159.6 107.25 L158.7 107.45 Q154.15 89.3 154.15 86.1 L154.35 84.05 154.7 82.4 155.2 82.4 Q155.5 85.55 157.7 95.75 M153.6 94.85 Q155.75 105.35 155.75 108.9 L155.7 109.9 155.45 109.95 154.7 110.15 Q154.1 108.5 152.2 98.75 150.15 88.55 150.15 86.5 150.15 83.8 151.1 83.55 L153.6 94.85 M37.1 62.65 L37.15 60.55 Q37.15 58.35 35.15 57.65 L34.6 57.85 Q34.0 58.15 34.0 59.2 34.0 59.9 34.75 61.3 L35.85 63.4 36.7 62.9 37.1 62.65 M21.4 90.8 L21.35 91.85 Q25.55 101.3 26.3 101.3 L27.4 101.15 27.2 100.95 27.45 100.95 27.55 99.9 Q27.55 98.0 25.55 94.45 23.35 90.5 21.4 90.8 M46.3 75.7 Q46.6 75.35 46.7 74.6 45.45 69.35 44.45 66.5 42.65 61.35 39.35 61.4 L41.4 69.4 Q42.75 73.85 45.3 76.3 L46.3 75.7 M46.7 61.85 Q46.7 60.15 45.25 57.35 43.4 53.75 40.75 53.8 L40.6 54.1 40.6 55.1 Q40.6 56.05 42.0 59.45 43.7 63.6 45.3 63.6 L46.4 63.45 46.2 63.25 46.5 63.1 Q46.7 62.9 46.7 61.85 M21.95 102.2 Q21.9 102.4 21.8 102.2 L21.75 103.15 Q21.75 103.7 23.35 106.45 25.15 109.6 26.3 109.6 L27.5 109.4 27.35 109.2 27.6 108.95 27.7 107.85 Q27.7 106.4 26.05 103.9 24.05 100.9 21.95 102.2 M39.25 171.75 Q39.9 171.3 40.35 170.45 40.85 169.55 40.6 169.05 L40.4 169.2 Q40.05 169.75 39.25 171.75 M34.0 184.6 Q33.15 186.35 31.25 188.3 L27.7 191.5 27.0 191.85 Q26.3 192.0 26.3 190.9 26.3 190.45 28.55 187.3 31.15 183.75 32.8 183.55 L34.0 184.6 M31.15 195.8 L34.9 190.35 Q36.95 187.15 38.05 186.6 37.25 187.8 35.4 191.5 33.55 194.85 31.85 196.05 L31.15 195.8 M36.2 194.75 Q37.1 193.0 39.05 190.15 41.3 186.8 42.05 186.6 L39.1 191.3 Q37.25 193.9 36.2 194.75 M45.15 177.1 Q45.15 175.4 46.35 175.1 L50.55 175.0 50.75 175.75 50.9 177.5 Q50.9 179.7 48.0 179.7 46.2 179.7 45.5 178.5 45.15 177.9 45.15 177.1 M134.05 117.05 Q135.05 116.55 135.15 115.75 134.25 111.5 133.35 109.45 131.75 105.7 129.3 106.1 L131.2 111.75 Q132.5 115.5 134.05 117.05 M139.65 115.9 Q139.65 114.8 139.3 114.7 L138.95 114.85 Q137.45 115.0 135.7 118.9 134.75 121.0 133.35 124.6 133.7 125.0 134.4 125.0 135.85 123.65 137.75 120.45 139.65 117.15 139.65 115.9 M142.35 121.35 Q143.5 118.9 143.5 117.75 143.5 116.65 142.9 116.65 L142.25 116.9 Q140.45 118.1 139.35 120.8 138.6 122.65 138.6 123.45 138.6 124.55 138.8 124.7 L138.95 124.6 Q140.85 124.4 142.35 121.35 M155.2 126.75 Q155.2 128.8 151.95 128.95 L150.15 128.6 150.0 127.9 149.8 126.25 Q149.8 124.7 150.7 124.25 151.75 123.75 154.85 124.25 L155.05 125.0 155.2 126.75 M150.9 129.2 L151.1 129.45 151.25 130.55 151.1 131.75 150.75 132.05 149.25 132.3 147.85 132.0 147.35 131.65 Q147.15 131.5 147.15 130.45 147.15 129.6 148.45 129.15 L150.9 129.2 M112.15 108.55 Q113.05 107.55 113.05 106.55 113.05 104.2 110.35 104.35 107.6 104.55 107.6 107.25 L107.8 108.75 107.95 109.25 109.95 109.6 Q111.2 109.6 112.15 108.55 M108.95 130.9 Q105.85 130.7 105.85 133.7 105.85 137.0 109.25 137.0 110.8 137.0 111.4 136.4 112.0 135.8 112.0 134.05 112.0 131.15 108.95 130.9" fill="#1a1c24" fill-rule="evenodd" stroke="none"/>
    <path d="M141.95 0.0 Q141.15 9.65 133.0 20.5 L132.15 21.6 Q132.65 22.9 132.65 24.85 132.65 25.5 125.2 33.25 L124.05 34.45 Q124.2 36.6 125.1 38.05 L127.5 40.8 Q131.0 44.55 131.0 52.0 131.0 59.8 123.0 77.5 115.0 95.2 115.0 96.0 114.15 97.75 110.5 100.0 107.95 101.55 102.0 104.5 L102.0 105.25 Q102.0 108.15 100.0 111.35 96.95 116.25 91.0 116.25 86.3 116.25 83.9 112.35 76.3 115.0 71.5 115.0 68.6 115.0 66.05 113.0 63.0 110.65 63.0 107.0 63.0 100.3 66.3 92.1 62.7 97.7 59.9 100.6 L60.75 99.05 Q61.25 97.95 61.25 96.85 61.25 94.5 70.5 78.3 L70.75 77.85 67.7 81.9 Q58.65 94.0 55.45 100.15 L54.8 100.45 Q54.15 100.55 54.15 99.45 54.15 97.05 60.0 89.45 L67.35 80.2 73.55 72.15 75.1 69.1 75.3 68.75 Q69.25 69.55 64.5 67.75 59.8 65.95 55.05 60.9 50.0 54.85 47.35 52.1 42.75 47.35 38.0 46.0 43.8 36.55 56.2 20.5 L53.3 23.7 39.9 37.5 38.6 37.65 Q38.2 37.65 38.2 36.55 38.2 35.6 43.6 29.45 48.9 23.4 51.1 21.6 53.0 20.05 58.3 13.7 L59.15 12.75 54.1 17.6 42.0 28.5 41.65 28.15 Q44.05 23.65 51.9 16.5 58.1 10.8 65.15 5.65 63.55 8.05 60.45 11.4 62.95 9.0 65.15 8.55 L63.45 11.3 65.95 8.15 72.5 0.0 96.95 0.0 93.7 4.9 92.45 6.9 Q90.65 6.9 88.5 7.6 84.9 8.75 82.55 11.1 79.85 13.85 79.85 17.2 79.85 18.25 80.6 19.8 81.7 22.05 83.8 22.1 83.0 24.05 83.0 25.0 84.8 24.55 87.35 26.15 89.05 27.15 91.2 27.65 L88.55 30.8 81.9 37.7 Q78.5 41.55 77.85 44.45 L79.15 45.3 90.35 32.6 94.35 28.0 95.0 28.0 95.3 28.0 90.8 34.1 Q84.05 43.6 84.05 44.7 84.05 45.75 84.35 45.8 L85.3 45.85 Q88.15 42.95 93.8 35.65 L93.85 36.4 94.75 36.75 98.25 33.45 Q93.8 38.5 93.8 39.25 93.8 40.3 94.15 40.35 L95.45 40.25 Q108.65 26.75 108.65 25.45 L108.65 24.7 Q111.1 23.2 113.0 21.0 117.35 15.9 121.45 9.6 126.0 2.65 126.0 0.5 L126.0 0.0 141.95 0.0 M140.9 38.7 Q143.8 33.9 145.6 33.15 L146.55 33.35 Q146.9 33.6 146.9 34.7 146.9 36.25 144.0 40.95 141.4 45.2 140.05 46.55 L138.6 46.6 138.35 46.5 Q138.05 46.35 138.05 45.3 138.05 43.4 140.9 38.7 M146.55 42.85 Q146.9 43.05 146.9 44.15 146.9 45.55 144.5 48.55 L141.45 52.15 140.45 51.85 Q140.05 51.55 140.05 50.45 140.05 49.4 142.55 46.1 144.9 43.05 145.6 42.6 L146.55 42.85 M98.0 77.75 L100.0 78.25 102.2 78.45 Q104.0 78.45 104.9 77.15 105.6 76.2 105.6 75.05 105.6 71.25 101.7 72.05 97.8 72.8 97.8 76.3 L97.9 77.55 98.0 77.75 M91.55 68.55 L91.5 69.8 Q91.5 70.75 92.2 72.1 93.35 74.25 95.45 74.25 L96.75 74.0 96.95 73.75 97.25 73.3 97.3 72.25 Q97.3 70.8 95.5 69.1 93.5 67.25 91.7 67.95 L91.55 68.55 M105.05 61.15 Q105.05 58.5 102.9 57.45 L98.1 57.15 Q95.3 57.7 93.3 59.3 91.15 61.05 91.15 63.15 91.15 64.4 94.75 66.5 98.1 68.5 99.1 68.5 L100.95 68.0 Q101.0 68.75 101.15 68.9 L101.65 69.2 103.25 69.55 Q104.25 69.55 105.8 68.25 107.45 66.8 107.45 65.6 L107.3 64.35 107.1 64.1 104.15 64.2 Q105.05 62.45 105.05 61.15 M113.05 46.95 L111.75 48.45 Q111.1 49.45 111.1 49.95 111.1 51.1 111.45 51.3 L113.05 51.6 114.3 50.35 Q114.8 49.65 114.8 48.45 114.8 47.35 114.3 47.15 L113.05 46.95 M105.25 36.45 Q106.6 35.7 107.05 34.3 L107.25 32.45 Q105.55 32.45 104.45 33.5 103.4 34.45 103.4 35.75 103.4 37.5 103.65 36.45 L105.25 36.45 M100.0 27.7 L98.9 28.9 99.75 27.7 100.0 27.7 M73.15 27.1 L73.15 28.45 Q73.4 29.75 75.05 29.75 76.35 29.75 77.3 28.5 78.1 27.5 78.1 26.5 78.1 23.65 75.65 24.0 73.15 24.35 73.15 27.1 M64.65 42.95 Q64.85 44.0 66.65 46.6 68.85 49.85 70.7 49.85 72.45 49.85 71.9 49.5 L72.25 48.55 68.9 44.55 Q66.8 42.2 64.65 42.95 M72.6 23.0 L73.75 23.15 74.85 22.4 75.65 21.35 Q73.65 17.7 72.2 18.45 71.05 19.05 71.05 21.05 71.05 22.1 71.25 22.3 L71.4 22.65 72.6 23.0 M37.1 62.65 L36.7 62.9 35.85 63.4 34.75 61.3 Q34.0 59.9 34.0 59.2 34.0 58.15 34.6 57.85 L35.15 57.65 Q37.15 58.35 37.15 60.55 L37.1 62.65 M70.1 54.85 L70.4 53.95 Q69.2 51.7 68.6 51.05 67.6 50.0 65.25 50.55 L65.15 51.35 Q65.15 51.8 66.3 53.5 67.65 55.45 68.65 55.45 69.75 55.45 70.1 54.85 M46.7 61.85 Q46.7 62.9 46.5 63.1 L46.2 63.25 46.4 63.45 45.3 63.6 Q43.7 63.6 42.0 59.45 40.6 56.05 40.6 55.1 L40.6 54.1 40.75 53.8 Q43.4 53.75 45.25 57.35 46.7 60.15 46.7 61.85 M46.3 75.7 L45.3 76.3 Q42.75 73.85 41.4 69.4 L39.35 61.4 Q42.65 61.35 44.45 66.5 45.45 69.35 46.7 74.6 46.6 75.35 46.3 75.7 M112.15 108.55 Q111.2 109.6 109.95 109.6 L107.95 109.25 107.8 108.75 107.6 107.25 Q107.6 104.55 110.35 104.35 113.05 104.2 113.05 106.55 113.05 107.55 112.15 108.55" fill="#1e2029" fill-rule="evenodd" stroke="none"/>
    <path d="M126.0 0.0 L126.0 0.5 Q126.0 2.65 121.45 9.6 117.35 15.9 113.0 21.0 111.1 23.2 108.65 24.7 L108.65 25.45 Q108.65 26.75 95.45 40.25 L94.15 40.35 Q93.8 40.3 93.8 39.25 93.8 38.5 98.25 33.45 L94.75 36.75 93.85 36.4 93.8 35.65 Q88.15 42.95 85.3 45.85 L84.35 45.8 Q84.05 45.75 84.05 44.7 84.05 43.6 90.8 34.1 L95.3 28.0 95.0 28.0 94.35 28.0 90.35 32.6 79.15 45.3 77.85 44.45 Q78.5 41.55 81.9 37.7 L88.55 30.8 91.2 27.65 Q89.05 27.15 87.35 26.15 84.8 24.55 83.0 25.0 83.0 24.05 83.8 22.1 81.7 22.05 80.6 19.8 79.85 18.25 79.85 17.2 79.85 13.85 82.55 11.1 84.9 8.75 88.5 7.6 90.65 6.9 92.45 6.9 L93.7 4.9 96.95 0.0 126.0 0.0 M100.0 27.7 L99.75 27.7 98.9 28.9 100.0 27.7 M105.25 36.45 L103.65 36.45 Q103.4 37.5 103.4 35.75 103.4 34.45 104.45 33.5 105.55 32.45 107.25 32.45 L107.05 34.3 Q106.6 35.7 105.25 36.45 M113.05 46.95 L114.3 47.15 Q114.8 47.35 114.8 48.45 114.8 49.65 114.3 50.35 L113.05 51.6 111.45 51.3 Q111.1 51.1 111.1 49.95 111.1 49.45 111.75 48.45 L113.05 46.95 M105.05 61.15 Q105.05 62.45 104.15 64.2 L107.1 64.1 107.3 64.35 107.45 65.6 Q107.45 66.8 105.8 68.25 104.25 69.55 103.25 69.55 L101.65 69.2 101.15 68.9 Q101.0 68.75 100.95 68.0 L99.1 68.5 Q98.1 68.5 94.75 66.5 91.15 64.4 91.15 63.15 91.15 61.05 93.3 59.3 95.3 57.7 98.1 57.15 L102.9 57.45 Q105.05 58.5 105.05 61.15 M91.55 68.55 L91.7 67.95 Q93.5 67.25 95.5 69.1 97.3 70.8 97.3 72.25 L97.25 73.3 96.95 73.75 96.75 74.0 95.45 74.25 Q93.35 74.25 92.2 72.1 91.5 70.75 91.5 69.8 L91.55 68.55 M98.0 77.75 L97.9 77.55 97.8 76.3 Q97.8 72.8 101.7 72.05 105.6 71.25 105.6 75.05 105.6 76.2 104.9 77.15 104.0 78.45 102.2 78.45 L100.0 78.25 98.0 77.75 M72.6 23.0 L71.4 22.65 71.25 22.3 Q71.05 22.1 71.05 21.05 71.05 19.05 72.2 18.45 73.65 17.7 75.65 21.35 L74.85 22.4 73.75 23.15 72.6 23.0 M64.65 42.95 Q66.8 42.2 68.9 44.55 L72.25 48.55 71.9 49.5 Q72.45 49.85 70.7 49.85 68.85 49.85 66.65 46.6 64.85 44.0 64.65 42.95 M73.15 27.1 Q73.15 24.35 75.65 24.0 78.1 23.65 78.1 26.5 78.1 27.5 77.3 28.5 76.35 29.75 75.05 29.75 73.4 29.75 73.15 28.45 L73.15 27.1 M70.1 54.85 Q69.75 55.45 68.65 55.45 67.65 55.45 66.3 53.5 65.15 51.8 65.15 51.35 L65.25 50.55 Q67.6 50.0 68.6 51.05 69.2 51.7 70.4 53.95 L70.1 54.85" fill="#22242e" fill-rule="evenodd" stroke="none"/>
    <path d="M0.0 336.95 L1.65 337.4 Q23.9 343.25 45.0 344.85 65.15 346.45 77.3 348.15 L92.15 348.85 95.95 348.4 148.35 342.3 146.4 340.45 Q143.65 337.85 143.0 333.85 145.3 331.85 153.75 329.9 L160.6 328.5 177.0 325.85 Q177.65 327.85 177.9 331.0 L178.05 337.05 181.45 335.95 Q186.95 333.9 201.75 325.3 L204.0 324.0 204.0 357.9 0.0 357.9 0.0 336.95" fill="#07070a" fill-rule="evenodd" stroke="none"/>
    <path d="M0.0 357.9 L0.0 0.0 204.0 0.0 204.0 357.9 0.0 357.9" fill="#66c9ff" fill-opacity="0.09803922" fill-rule="evenodd" stroke="none"/>
  </g>
</svg>
