{ "locations": [
	{
	  "chain": [
		0,
		1,
		2,
		3,
		4,
		5,
		6,
		7,
		8,
		9,
		10,
		11
	  ],
	  "items_allowed": false,
	  "music": "gu1",
	  "tuples": [
		{
		  "weight": 5000,
		  "elemental":true,
		  "size":2,
		  "item": ""
		},
		{
		  "weight": 20,
		  "elemental":false,
		  "size":1,
		  "item":"dyna_hori"
		},
		{
		  "weight": 20,
		  "elemental":false,
		  "size":1,
		  "item":"dyna_vert"
		},
		{
		  "weight": 10,
		  "elemental":false,
		  "size":1,
		  "item":"alchimoth"
		},
		{
		  "weight": 15,
		  "elemental":false,
		  "size":1,
		  "item":"distorsion_bone"
		},
		{
		  "weight": 20,
		  "elemental":false,
		  "size":1,
		  "item":"distorsion_ribcage"
		}
	  ],
	  "name": "B.A.F.A",
	  "id": 0
	},
	{
	  "chain": [
		0,
		1,
		2,
		3,
		4,
		5,
		6,
		7,
		24,
		13,
		26,
		27
	  ],
	  "items_allowed": false,
	  "music": "ap3",
	  "tuples": [
		{
		  "weight": 4500,
		  "elemental":true,
		  "size":2,
		  "item": ""
		},
		{
		  "weight": 500,
		  "elemental":true,
		  "size":2,
		  "item":"skat"
		},
		{
		  "weight": 350,
		  "elemental":false,
		  "size":1,
		  "item":"pistonide"
		},
		{
		  "weight": 45,
		  "elemental":false,
		  "size":1,
		  "item":"alchimoth"
		}
	  ],
	  "name": "Bibliothèque de glace",
	  "id": 1
	},
	{
	  "chain": [
		0,
		1,
		2,
		3,
		4,
		5,
		6,
		7,
		16,
		9,
		10,
		11
	  ],
	  "items_allowed": true,
	  "music": "jz1",
	  "tuples": [
		{
		  "weight": 4500,
		  "elemental":true,
		  "size":2,
		  "item": ""
		},
		{
		  "weight": 500,
		  "elemental":true,
		  "size":2,
		  "item":"skat"
		},
		{
		  "weight": 30,
		  "elemental":false,
		  "size":1,
		  "item":"charcleur"
		},
		{
		  "weight": 20,
		  "elemental":false,
		  "size":1,
		  "item":"charcleur_button"
		},
		{
		  "weight": 10,
		  "elemental":false,
		  "size":1,
		  "item":"alchimoth"
		}
	  ],
	  "name": "Bourg de Tirésias",
	  "id": 2
	},
	{
	  "chain": [
		0,
		1,
		2,
		3,
		4,
		5,
		6,
		7,
		16,
		13,
		10,
		11
	  ],
	  "items_allowed": false,
	  "music": "jz2",
	  "tuples": [
		{
		  "weight": 4500,
		  "elemental":true,
		  "size":2,
		  "item": ""
		},
		{
		  "weight": 500,
		  "elemental":true,
		  "size":2,
		  "item":"skat"
		},
		{
		  "weight": 30,
		  "elemental":false,
		  "size":1,
		  "item":"dyna_hori"
		},
		{
		  "weight": 15,
		  "elemental":false,
		  "size":1,
		  "item":"dyna_vert"
		},
		{
		  "weight": 10,
		  "elemental":false,
		  "size":1,
		  "item":"charcleur_button"
		},
		{
		  "weight": 2,
		  "elemental":false,
		  "size":1,
		  "item":"mentor_hand"
		},
		{
		  "weight": 15,
		  "elemental":false,
		  "size":1,
		  "item":"protoplop_v2"
		},
		{
		  "weight": 15,
		  "elemental":false,
		  "size":1,
		  "item":"charcleur"
		}
	  ],
	  "name": "Boyau central",
	  "id": 3
	},
	{
	  "chain": [
		0,
		1,
		2,
		3,
		4,
		5,
		6,
		7,
		8,
		9,
		10,
		15
	  ],
	  "items_allowed": false,
	  "music": "jz3",
	  "tuples": [
		{
		  "weight": 3700,
		  "elemental":true,
		  "size":2,
		  "item": ""
		},
		{
		  "weight": 1300,
		  "elemental":true,
		  "size":2,
		  "item":"skat"
		},
		{
		  "weight": 20,
		  "elemental":false,
		  "size":1,
		  "item":"dyna_hori"
		},
		{
		  "weight": 10,
		  "elemental":false,
		  "size":1,
		  "item":"dyna_vert"
		},
		{
		  "weight": 5,
		  "elemental":false,
		  "size":1,
		  "item":"alchimoth"
		},
		{
		  "weight": 20,
		  "elemental":false,
		  "size":1,
		  "item":"charcleur"
		},
		{
		  "weight": 4,
		  "elemental":false,
		  "size":1,
		  "item":"charcleur_button"
		}
	  ],
	  "name": "Catacombes de Marawu",
	  "id": 4
	},
	{
	  "chain": [
		0,
		1,
		2,
		3,
		4,
		5,
		6,
		7,
		8,
		17,
		10,
		11
	  ],
	  "items_allowed": false,
	  "music": "sk2",
	  "tuples": [
		{
		  "weight": 4500,
		  "elemental":true,
		  "size":2,
		  "item": ""
		},
		{
		  "weight": 500,
		  "elemental":true,
		  "size":2,
		  "item":"skat"
		},
		{
		  "weight": 30,
		  "elemental":false,
		  "size":1,
		  "item":"dyna_hori"
		},
		{
		  "weight": 15,
		  "elemental":false,
		  "size":1,
		  "item":"dyna_vert"
		},
		{
		  "weight": 20,
		  "elemental":false,
		  "size":1,
		  "item":"dyna_cross"
		},
		{
		  "weight": 10,
		  "elemental":false,
		  "size":1,
		  "item":"crux_0"
		},
		{
		  "weight": 10,
		  "elemental":false,
		  "size":1,
		  "item":"crux_1"
		}
	  ],
	  "name": "Chambres Shari",
	  "id": 5
	},
	{
	  "chain": [
		0,
		1,
		2,
		3,
		4,
		5,
		6,
		7,
		8,
		9,
		10,
		11
	  ],
	  "items_allowed": false,
	  "music": "gu1",
	  "tuples": [
		{
		  "weight": 3600,
		  "elemental":true,
		  "size":2,
		  "item": ""
		},
		{
		  "weight": 1400,
		  "elemental":true,
		  "size":2,
		  "item":"skat"
		},
		{
		  "weight": 20,
		  "elemental":false,
		  "size":1,
		  "item":"dyna_hori"
		},
		{
		  "weight": 15,
		  "elemental":false,
		  "size":1,
		  "item":"dyna_vert"
		},
		{
		  "weight": 6,
		  "elemental":false,
		  "size":1,
		  "item":"pear_seed"
		},
		{
		  "weight": 3,
		  "elemental":false,
		  "size":1,
		  "item":"protoplop_v2"
		},
		{
		  "weight": 8,
		  "elemental":false,
		  "size":1,
		  "item":"crux_0"
		},
		{
		  "weight": 8,
		  "elemental":false,
		  "size":1,
		  "item":"crux_1"
		},
		{
		  "weight": 8,
		  "elemental":false,
		  "size":1,
		  "item":"crux_2"
		},
		{
		  "weight": 8,
		  "elemental":false,
		  "size":1,
		  "item":"crux_3"
		},
		{
		  "weight": 20,
		  "elemental":false,
		  "size":1,
		  "item":"charcleur"
		},
		{
		  "weight": 6,
		  "elemental":false,
		  "size":1,
		  "item":"charcleur_button"
		}
	  ],
	  "name": "Chouettex",
	  "id": 6
	},
	{
	  "chain": [
		0,
		1,
		2,
		3,
		4,
		5,
		6,
		7,
		12,
		13,
		10,
		11
	  ],
	  "items_allowed": false,
	  "music": "jz1",
	  "tuples": [
		{
		  "weight": 5000,
		  "elemental":true,
		  "size":2,
		  "item": ""
		}
	  ],
	  "name": "Clairière X",
	  "id": 7
	},
	{
	  "chain": [
		0,
		1,
		2,
		3,
		4,
		5,
		6,
		7,
		8,
		9,
		22,
		23
	  ],
	  "items_allowed": false,
	  "music": "gm2",
	  "tuples": [
		{
		  "weight": 2500,
		  "elemental":true,
		  "size":2,
		  "item": ""
		},
		{
		  "weight": 2500,
		  "elemental":true,
		  "size":2,
		  "item":"skat"
		},
		{
		  "weight": 30,
		  "elemental":false,
		  "size":1,
		  "item":"dyna_hori"
		},
		{
		  "weight": 15,
		  "elemental":false,
		  "size":1,
		  "item":"dyna_vert"
		},
		{
		  "weight": 10,
		  "elemental":false,
		  "size":1,
		  "item":"alchimoth"
		},
		{
		  "weight": 0,
		  "elemental":false,
		  "size":1,
		  "item":"protoplop_v2"
		},
		{
		  "weight": 7,
		  "elemental":false,
		  "size":1,
		  "item":"tejerkatum"
		}
	  ],
	  "name": "Climatex",
	  "id": 8
	},
	{
	  "chain": [
		0,
		1,
		2,
		3,
		4,
		5,
		6,
		7,
		24,
		25,
		26,
		27
	  ],
	  "items_allowed": false,
	  "music": "ap2",
	  "tuples": [
		{
		  "weight": 2800,
		  "elemental":true,
		  "size":2,
		  "item": ""
		},
		{
		  "weight": 1000,
		  "elemental":true,
		  "size":2,
		  "item":"pyrite_2"
		},
		{
		  "weight": 800,
		  "elemental":true,
		  "size":2,
		  "item":"pyrite_3"
		},
		{
		  "weight": 50,
		  "elemental":true,
		  "size":2,
		  "item":"pyrite_4"
		},
		{
		  "weight": 35,
		  "elemental":false,
		  "size":1,
		  "item":"dyna_hori"
		},
		{
		  "weight": 20,
		  "elemental":false,
		  "size":1,
		  "item":"dyna_vert"
		},
		{
		  "weight": 10,
		  "elemental":false,
		  "size":1,
		  "item":"alchimoth"
		},
		{
		  "weight": 20,
		  "elemental":false,
		  "size":1,
		  "item":"charcleur"
		}
	  ],
	  "name": "Col du Talweg",
	  "id": 9
	},
	{
	  "chain": [
		0,
		1,
		2,
		3,
		4,
		5,
		6,
		7,
		8,
		9,
		10,
		11
	  ],
	  "items_allowed": false,
	  "music": "gu1",
	  "tuples": [
		{
		  "weight": 4500,
		  "elemental":true,
		  "size":2,
		  "item": ""
		},
		{
		  "weight": 500,
		  "elemental":true,
		  "size":2,
		  "item":"skat"
		},
		{
		  "weight": 30,
		  "elemental":false,
		  "size":1,
		  "item":"dyna_hori"
		},
		{
		  "weight": 15,
		  "elemental":false,
		  "size":1,
		  "item":"dyna_vert"
		},
		{
		  "weight": 6,
		  "elemental":false,
		  "size":1,
		  "item":"paradis_dalt"
		}
	  ],
	  "name": "Donjon K",
	  "id": 10
	},
	{
	  "chain": [
		0,
		1,
		2,
		3,
		4,
		5,
		6,
		7,
		12,
		17,
		10,
		11
	  ],
	  "items_allowed": false,
	  "music": "jz2",
	  "tuples": [
		{
		  "weight": 4500,
		  "elemental":true,
		  "size":2,
		  "item": ""
		},
		{
		  "weight": 500,
		  "elemental":true,
		  "size":2,
		  "item":"skat"
		},
		{
		  "weight": 30,
		  "elemental":false,
		  "size":1,
		  "item":"dyna_hori"
		},
		{
		  "weight": 15,
		  "elemental":false,
		  "size":1,
		  "item":"dyna_vert"
		},
		{
		  "weight": 10,
		  "elemental":false,
		  "size":1,
		  "item":"alchimoth"
		},
		{
		  "weight": 15,
		  "elemental":false,
		  "size":1,
		  "item":"protoplop_v2"
		},
		{
		  "weight": 10,
		  "elemental":false,
		  "size":1,
		  "item":"charcleur"
		}
	  ],
	  "name": "Dortoir Commun",
	  "id": 11
	},
	{
	  "chain": [
		0,
		1,
		2,
		3,
		4,
		5,
		6,
		7,
		24,
		9,
		10,
		11
	  ],
	  "items_allowed": false,
	  "music": "ap3",
	  "tuples": [
		{
		  "weight": 2300,
		  "elemental":true,
		  "size":2,
		  "item": ""
		},
		{
		  "weight": 1000,
		  "elemental":true,
		  "size":2,
		  "item":"pyrite_1"
		},
		{
		  "weight": 1200,
		  "elemental":true,
		  "size":2,
		  "item":"pyrite_2"
		},
		{
		  "weight": 500,
		  "elemental":true,
		  "size":2,
		  "item":"pyrite_3"
		},
		{
		  "weight": 40,
		  "elemental":false,
		  "size":1,
		  "item":"dyna_hori"
		},
		{
		  "weight": 25,
		  "elemental":false,
		  "size":1,
		  "item":"dyna_vert"
		},
		{
		  "weight": 10,
		  "elemental":false,
		  "size":1,
		  "item":"alchimoth"
		}
	  ],
	  "name": "Dortoir des internes",
	  "id": 12
	},
	{
	  "chain": [
		0,
		1,
		2,
		3,
		4,
		5,
		6,
		7,
		20,
		13,
		10,
		11
	  ],
	  "items_allowed": false,
	  "music": "gm3",
	  "tuples": [
		{
		  "weight": 3700,
		  "elemental":true,
		  "size":2,
		  "item": ""
		},
		{
		  "weight": 1300,
		  "elemental":true,
		  "size":2,
		  "item":"skat"
		},
		{
		  "weight": 30,
		  "elemental":false,
		  "size":1,
		  "item":"dyna_hori"
		},
		{
		  "weight": 15,
		  "elemental":false,
		  "size":1,
		  "item":"dyna_vert"
		},
		{
		  "weight": 10,
		  "elemental":false,
		  "size":1,
		  "item":"alchimoth"
		},
		{
		  "weight": 35,
		  "elemental":false,
		  "size":1,
		  "item":"pear_seed"
		},
		{
		  "weight": 7,
		  "elemental":false,
		  "size":1,
		  "item":"pear_stump"
		}
	  ],
	  "name": "Dortoir du Ker-pennti",
	  "id": 13
	},
	{
	  "chain": [
		0,
		1,
		2,
		3,
		4,
		5,
		6,
		7,
		16,
		9,
		10,
		11
	  ],
	  "items_allowed": false,
	  "music": "sk1",
	  "tuples": [
		{
		  "weight": 4500,
		  "elemental":true,
		  "size":2,
		  "item": ""
		},
		{
		  "weight": 500,
		  "elemental":true,
		  "size":2,
		  "item":"skat"
		},
		{
		  "weight": 30,
		  "elemental":false,
		  "size":1,
		  "item":"dyna_hori"
		},
		{
		  "weight": 15,
		  "elemental":false,
		  "size":1,
		  "item":"dyna_vert"
		},
		{
		  "weight": 10,
		  "elemental":false,
		  "size":1,
		  "item":"alchimoth"
		},
		{
		  "weight": 15,
		  "elemental":false,
		  "size":1,
		  "item":"dyna_cross"
		}
	  ],
	  "name": "Dortoir Tupuri",
	  "id": 14
	},
	{
	  "chain": [
		0,
		1,
		2,
		3,
		4,
		5,
		6,
		7,
		8,
		9,
		10,
		11
	  ],
	  "items_allowed": false,
	  "music": "gu1",
	  "tuples": [
		{
		  "weight": 5000,
		  "elemental":true,
		  "size":2,
		  "item": ""
		},
		{
		  "weight": 20,
		  "elemental":false,
		  "size":1,
		  "item":"charcleur_button"
		},
		{
		  "weight": 25,
		  "elemental":false,
		  "size":1,
		  "item":"dyna_hori"
		},
		{
		  "weight": 10,
		  "elemental":false,
		  "size":1,
		  "item":"dyna_vert"
		},
		{
		  "weight": 5,
		  "elemental":false,
		  "size":1,
		  "item":"alchimoth"
		}
	  ],
	  "name": "E.N.F.A",
	  "id": 15
	},
	{
	  "chain": [
		0,
		1,
		2,
		3,
		4,
		5,
		6,
		7,
		8,
		17,
		10,
		11
	  ],
	  "items_allowed": false,
	  "music": "sk2",
	  "tuples": [
		{
		  "weight": 4500,
		  "elemental":true,
		  "size":2,
		  "item": ""
		},
		{
		  "weight": 500,
		  "elemental":true,
		  "size":2,
		  "item":"skat"
		},
		{
		  "weight": 30,
		  "elemental":false,
		  "size":1,
		  "item":"dyna_hori"
		},
		{
		  "weight": 15,
		  "elemental":false,
		  "size":1,
		  "item":"dyna_vert"
		},
		{
		  "weight": 20,
		  "elemental":false,
		  "size":1,
		  "item":"dyna_cross"
		},
		{
		  "weight": 10,
		  "elemental":false,
		  "size":1,
		  "item":"crux_0"
		},
		{
		  "weight": 10,
		  "elemental":false,
		  "size":1,
		  "item":"crux_1"
		}
	  ],
	  "name": "Ecole communale Shari",
	  "id": 16
	},
	{
	  "chain": [
		0,
		1,
		2,
		3,
		4,
		5,
		6,
		7,
		16,
		9,
		10,
		11
	  ],
	  "items_allowed": false,
	  "music": "sk1",
	  "tuples": [
		{
		  "weight": 4500,
		  "elemental":true,
		  "size":2,
		  "item": ""
		},
		{
		  "weight": 500,
		  "elemental":true,
		  "size":2,
		  "item":"skat"
		},
		{
		  "weight": 30,
		  "elemental":false,
		  "size":1,
		  "item":"dyna_hori"
		},
		{
		  "weight": 15,
		  "elemental":false,
		  "size":1,
		  "item":"dyna_vert"
		},
		{
		  "weight": 10,
		  "elemental":false,
		  "size":1,
		  "item":"alchimoth"
		},
		{
		  "weight": 15,
		  "elemental":false,
		  "size":1,
		  "item":"dyna_cross"
		}
	  ],
	  "name": "Ecole communale Tupuri",
	  "id": 17
	},
	{
	  "chain": [
		0,
		1,
		2,
		3,
		4,
		5,
		6,
		7,
		20,
		13,
		10,
		11
	  ],
	  "items_allowed": false,
	  "music": "gm3",
	  "tuples": [
		{
		  "weight": 3700,
		  "elemental":true,
		  "size":2,
		  "item": ""
		},
		{
		  "weight": 1300,
		  "elemental":true,
		  "size":2,
		  "item":"skat"
		},
		{
		  "weight": 30,
		  "elemental":false,
		  "size":1,
		  "item":"dyna_hori"
		},
		{
		  "weight": 15,
		  "elemental":false,
		  "size":1,
		  "item":"dyna_vert"
		},
		{
		  "weight": 10,
		  "elemental":false,
		  "size":1,
		  "item":"alchimoth"
		},
		{
		  "weight": 35,
		  "elemental":false,
		  "size":1,
		  "item":"pear_seed"
		},
		{
		  "weight": 7,
		  "elemental":false,
		  "size":1,
		  "item":"pear_stump"
		}
	  ],
	  "name": "Ecole Didi-Wan Gemini",
	  "id": 18
	},
	{
	  "chain": [
		0,
		1,
		2,
		3,
		4,
		5,
		6,
		7,
		12,
		9,
		10,
		11
	  ],
	  "items_allowed": false,
	  "music": "jz1",
	  "tuples": [
		{
		  "weight": 4500,
		  "elemental":true,
		  "size":2,
		  "item": ""
		},
		{
		  "weight": 500,
		  "elemental":true,
		  "size":2,
		  "item":"skat"
		},
		{
		  "weight": 30,
		  "elemental":false,
		  "size":1,
		  "item":"dyna_hori"
		},
		{
		  "weight": 15,
		  "elemental":false,
		  "size":1,
		  "item":"dyna_vert"
		},
		{
		  "weight": 10,
		  "elemental":false,
		  "size":1,
		  "item":"alchimoth"
		}
	  ],
	  "name": "Entrée du boyau",
	  "id": 19
	},
	{
	  "chain": [
		0,
		1,
		2,
		3,
		4,
		5,
		6,
		7,
		8,
		13,
		14,
		11
	  ],
	  "items_allowed": true,
	  "music": "gm3",
	  "tuples": [
		{
		  "weight": 3700,
		  "elemental":true,
		  "size":2,
		  "item": ""
		},
		{
		  "weight": 1300,
		  "elemental":true,
		  "size":2,
		  "item":"skat"
		},
		{
		  "weight": 30,
		  "elemental":false,
		  "size":1,
		  "item":"dyna_hori"
		},
		{
		  "weight": 15,
		  "elemental":false,
		  "size":1,
		  "item":"dyna_vert"
		},
		{
		  "weight": 10,
		  "elemental":false,
		  "size":1,
		  "item":"alchimoth"
		},
		{
		  "weight": 20,
		  "elemental":false,
		  "size":1,
		  "item":"paradis_dalt"
		}
	  ],
	  "name": "Falaises Anamentholées",
	  "id": 20
	},
	{
	  "chain": [
		0,
		1,
		2,
		3,
		4,
		5,
		6,
		7,
		8,
		25,
		10,
		11
	  ],
	  "items_allowed": false,
	  "music": "ap1",
	  "tuples": [
		{
		  "weight": 1000,
		  "elemental":true,
		  "size":2,
		  "item": ""
		},
		{
		  "weight": 500,
		  "elemental":true,
		  "size":2,
		  "item":"pyrite_1"
		},
		{
		  "weight": 800,
		  "elemental":true,
		  "size":2,
		  "item":"pyrite_2"
		},
		{
		  "weight": 500,
		  "elemental":true,
		  "size":2,
		  "item":"pyrite_3"
		},
		{
		  "weight": 45,
		  "elemental":false,
		  "size":1,
		  "item":"dyna_hori"
		},
		{
		  "weight": 30,
		  "elemental":false,
		  "size":1,
		  "item":"dyna_vert"
		},
		{
		  "weight": 10,
		  "elemental":false,
		  "size":1,
		  "item":"alchimoth"
		}
	  ],
	  "name": "Faubourg d'Audepint",
	  "id": 21
	},
	{
	  "chain": [
		0,
		1,
		2,
		3,
		4,
		5,
		6,
		7,
		8,
		9,
		10,
		11
	  ],
	  "items_allowed": false,
	  "music": "gu1",
	  "tuples": [
		{
		  "weight": 4500,
		  "elemental":true,
		  "size":2,
		  "item": ""
		},
		{
		  "weight": 500,
		  "elemental":true,
		  "size":2,
		  "item":"skat"
		},
		{
		  "weight": 30,
		  "elemental":false,
		  "size":1,
		  "item":"dyna_hori"
		},
		{
		  "weight": 15,
		  "elemental":false,
		  "size":1,
		  "item":"dyna_vert"
		},
		{
		  "weight": 10,
		  "elemental":false,
		  "size":1,
		  "item":"alchimoth"
		}
	  ],
	  "name": "Grande Place",
	  "id": 22
	},
	{
	  "chain": [
		0,
		1,
		2,
		3,
		4,
		5,
		6,
		7,
		8,
		9,
		10,
		11
	  ],
	  "items_allowed": false,
	  "music": "gu1",
	  "tuples": [
		{
		  "weight": 5000,
		  "elemental":true,
		  "size":2,
		  "item": ""
		},
		{
		  "weight": 30,
		  "elemental":false,
		  "size":1,
		  "item":"dyna_hori"
		},
		{
		  "weight": 15,
		  "elemental":false,
		  "size":1,
		  "item":"dyna_vert"
		},
		{
		  "weight": 20,
		  "elemental":false,
		  "size":1,
		  "item":"alchimoth"
		}
	  ],
	  "name": "Grenier aux Alchimites",
	  "id": 23
	},
	{
	  "chain": [
		0,
		1,
		2,
		3,
		4,
		5,
		6,
		7,
		8,
		17,
		10,
		11
	  ],
	  "items_allowed": false,
	  "music": "sk2",
	  "tuples": [
		{
		  "weight": 1850,
		  "elemental":true,
		  "size":2,
		  "item": ""
		},
		{
		  "weight": 1850,
		  "elemental":true,
		  "size":2,
		  "item":"skat"
		},
		{
		  "weight": 650,
		  "elemental":true,
		  "size":3,
		  "item": ""
		},
		{
		  "weight": 650,
		  "elemental":true,
		  "size":3,
		  "item":"skat"
		},
		{
		  "weight": 25,
		  "elemental":false,
		  "size":1,
		  "item":"charcleur"
		},
		{
		  "weight": 10,
		  "elemental":false,
		  "size":1,
		  "item":"charcleur_button"
		},
		{
		  "weight": 3,
		  "elemental":false,
		  "size":1,
		  "item":"patchinkrop"
		},
		{
		  "weight": 17,
		  "elemental":false,
		  "size":1,
		  "item":"dyna_cross"
		}
	  ],
	  "name": "Guichet emprunts et retours",
	  "id": 24
	},
	{
	  "chain": [
		0,
		1,
		2,
		3,
		4,
		5,
		6,
		7,
		8,
		9,
		10,
		11
	  ],
	  "items_allowed": true,
	  "music": "gu1",
	  "tuples": [
		{
		  "weight": 3700,
		  "elemental":true,
		  "size":2,
		  "item": ""
		},
		{
		  "weight": 1300,
		  "elemental":true,
		  "size":3,
		  "item": ""
		},
		{
		  "weight": 20,
		  "elemental":false,
		  "size":1,
		  "item":"charcleur_button"
		},
		{
		  "weight": 30,
		  "elemental":false,
		  "size":1,
		  "item":"dyna_hori"
		},
		{
		  "weight": 15,
		  "elemental":false,
		  "size":1,
		  "item":"dyna_vert"
		},
		{
		  "weight": 10,
		  "elemental":false,
		  "size":1,
		  "item":"alchimoth"
		}
	  ],
	  "name": "Guildian Express",
	  "id": 25
	},
	{
	  "chain": [
		0,
		1,
		2,
		3,
		4,
		5,
		6,
		7,
		12,
		21,
		10,
		11
	  ],
	  "items_allowed": true,
	  "music": "gm1",
	  "tuples": [
		{
		  "weight": 4500,
		  "elemental":true,
		  "size":2,
		  "item": ""
		},
		{
		  "weight": 500,
		  "elemental":true,
		  "size":2,
		  "item":"skat"
		},
		{
		  "weight": 30,
		  "elemental":false,
		  "size":1,
		  "item":"dyna_hori"
		},
		{
		  "weight": 15,
		  "elemental":false,
		  "size":1,
		  "item":"dyna_vert"
		},
		{
		  "weight": 10,
		  "elemental":false,
		  "size":1,
		  "item":"alchimoth"
		}
	  ],
	  "name": "Kromlech du Penkrack",
	  "id": 26
	},
	{
	  "chain": [
		0,
		1,
		2,
		3,
		4,
		5,
		6,
		7,
		20,
		9,
		10,
		11
	  ],
	  "items_allowed": false,
	  "music": "gm1",
	  "tuples": [
		{
		  "weight": 3700,
		  "elemental":true,
		  "size":2,
		  "item": ""
		},
		{
		  "weight": 1300,
		  "elemental":true,
		  "size":2,
		  "item":"skat"
		},
		{
		  "weight": 30,
		  "elemental":false,
		  "size":1,
		  "item":"dyna_hori"
		},
		{
		  "weight": 15,
		  "elemental":false,
		  "size":1,
		  "item":"dyna_vert"
		},
		{
		  "weight": 10,
		  "elemental":false,
		  "size":1,
		  "item":"alchimoth"
		},
		{
		  "weight": 25,
		  "elemental":false,
		  "size":1,
		  "item":"pear_seed"
		},
		{
		  "weight": 1,
		  "elemental":false,
		  "size":1,
		  "item":"pear_stump"
		}
	  ],
	  "name": "L'orée du bois",
	  "id": 27
	},
	{
	  "chain": [
		0,
		1,
		2,
		3,
		4,
		5,
		6,
		7,
		16,
		13,
		18,
		15
	  ],
	  "items_allowed": true,
	  "music": "jz2",
	  "tuples": [
		{
		  "weight": 3700,
		  "elemental":true,
		  "size":2,
		  "item": ""
		},
		{
		  "weight": 1300,
		  "elemental":true,
		  "size":2,
		  "item":"skat"
		},
		{
		  "weight": 20,
		  "elemental":false,
		  "size":1,
		  "item":"dyna_hori"
		},
		{
		  "weight": 15,
		  "elemental":false,
		  "size":1,
		  "item":"dyna_vert"
		},
		{
		  "weight": 5,
		  "elemental":false,
		  "size":1,
		  "item":"alchimoth"
		},
		{
		  "weight": 10,
		  "elemental":false,
		  "size":1,
		  "item":"crux_random"
		},
		{
		  "weight": 10,
		  "elemental":false,
		  "size":1,
		  "item":"dyna_cross"
		},
		{
		  "weight": 10,
		  "elemental":false,
		  "size":1,
		  "item":"pear_seed"
		},
		{
		  "weight": 5,
		  "elemental":false,
		  "size":1,
		  "item":"protoplop_v1"
		},
		{
		  "weight": 5,
		  "elemental":false,
		  "size":1,
		  "item":"paradis_dalt"
		},
		{
		  "weight": 7,
		  "elemental":false,
		  "size":1,
		  "item":"wombat"
		},
		{
		  "weight": 1,
		  "elemental":false,
		  "size":1,
		  "item":"mentor_hand"
		},
		{
		  "weight": 6,
		  "elemental":false,
		  "size":1,
		  "item":"distorsion_bone"
		},
		{
		  "weight": 4,
		  "elemental":false,
		  "size":1,
		  "item":"distorsion_ribcage"
		},
		{
		  "weight": 8,
		  "elemental":false,
		  "size":1,
		  "item":"licorice"
		},
		{
		  "weight": 8,
		  "elemental":false,
		  "size":1,
		  "item":"dollyxir"
		},
		{
		  "weight": 6,
		  "elemental":false,
		  "size":1,
		  "item":"broom"
		},
		{
		  "weight": 15,
		  "elemental":false,
		  "size":1,
		  "item":"charcleur"
		},
		{
		  "weight": 10,
		  "elemental":false,
		  "size":1,
		  "item":"charcleur_button"
		},
		{
		  "weight": 7,
		  "elemental":false,
		  "size":1,
		  "item":"aztec"
		},
		{
		  "weight": 5,
		  "elemental":false,
		  "size":1,
		  "item":"tejerkatum"
		},
		{
		  "weight": 7,
		  "elemental":false,
		  "size":1,
		  "item":"pistonide"
		}
	  ],
	  "name": "Labolodun",
	  "id": 28
	},
	{
	  "chain": [
		0,
		1,
		2,
		3,
		4,
		5,
		6,
		7,
		24,
		25,
		10,
		11
	  ],
	  "items_allowed": false,
	  "music": "ap3",
	  "tuples": [
		{
		  "weight": 1000,
		  "elemental":true,
		  "size":2,
		  "item": ""
		},
		{
		  "weight": 1300,
		  "elemental":true,
		  "size":2,
		  "item":"pyrite_1"
		},
		{
		  "weight": 1700,
		  "elemental":true,
		  "size":2,
		  "item":"pyrite_2"
		},
		{
		  "weight": 1000,
		  "elemental":true,
		  "size":2,
		  "item":"pyrite_3"
		},
		{
		  "weight": 45,
		  "elemental":false,
		  "size":1,
		  "item":"dyna_hori"
		},
		{
		  "weight": 30,
		  "elemental":false,
		  "size":1,
		  "item":"dyna_vert"
		},
		{
		  "weight": 10,
		  "elemental":false,
		  "size":1,
		  "item":"alchimoth"
		}
	  ],
	  "name": "Manoir Audepint grand hall",
	  "id": 29
	},
	{
	  "chain": [
		0,
		1,
		2,
		3,
		4,
		5,
		6,
		7,
		8,
		9,
		10,
		11
	  ],
	  "items_allowed": false,
	  "music": "sk1",
	  "tuples": [
		{
		  "weight": 4500,
		  "elemental":true,
		  "size":2,
		  "item": ""
		},
		{
		  "weight": 500,
		  "elemental":true,
		  "size":2,
		  "item":"skat"
		},
		{
		  "weight": 30,
		  "elemental":false,
		  "size":1,
		  "item":"dyna_hori"
		},
		{
		  "weight": 15,
		  "elemental":false,
		  "size":1,
		  "item":"dyna_vert"
		},
		{
		  "weight": 6,
		  "elemental":false,
		  "size":1,
		  "item":"wombat"
		}
	  ],
	  "name": "Medina Shaka Shaka",
	  "id": 30
	},
	{
	  "chain": [
		0,
		1,
		2,
		3,
		4,
		5,
		6,
		7,
		8,
		9,
		18,
		19
	  ],
	  "items_allowed": false,
	  "music": "sk3",
	  "tuples": [
		{
		  "weight": 4500,
		  "elemental":true,
		  "size":2,
		  "item": ""
		},
		{
		  "weight": 500,
		  "elemental":true,
		  "size":2,
		  "item":"skat"
		},
		{
		  "weight": 20,
		  "elemental":false,
		  "size":1,
		  "item":"dyna_cross"
		},
		{
		  "weight": 450,
		  "elemental":false,
		  "size":1,
		  "item":"charcleur_button"
		}
	  ],
	  "name": "Mines du Volkor",
	  "id": 31
	},
	{
	  "chain": [
		0,
		1,
		2,
		3,
		4,
		5,
		6,
		7,
		12,
		17,
		18,
		11
	  ],
	  "items_allowed": false,
	  "music": "sk2",
	  "tuples": [
		{
		  "weight": 4500,
		  "elemental":true,
		  "size":2,
		  "item": ""
		},
		{
		  "weight": 500,
		  "elemental":true,
		  "size":2,
		  "item":"skat"
		},
		{
		  "weight": 15,
		  "elemental":false,
		  "size":1,
		  "item":"dyna_hori"
		},
		{
		  "weight": 10,
		  "elemental":false,
		  "size":1,
		  "item":"dyna_vert"
		},
		{
		  "weight": 10,
		  "elemental":false,
		  "size":1,
		  "item":"alchimoth"
		},
		{
		  "weight": 22,
		  "elemental":false,
		  "size":1,
		  "item":"wombat"
		}
	  ],
	  "name": "Oasis Bogdan",
	  "id": 32
	},
	{
	  "chain": [
		0,
		1,
		2,
		3,
		4,
		5,
		6,
		7,
		16,
		9,
		10,
		19
	  ],
	  "items_allowed": false,
	  "music": "sk3",
	  "tuples": [
		{
		  "weight": 4500,
		  "elemental":true,
		  "size":2,
		  "item": ""
		},
		{
		  "weight": 500,
		  "elemental":true,
		  "size":2,
		  "item":"skat"
		},
		{
		  "weight": 25,
		  "elemental":false,
		  "size":1,
		  "item":"aztec"
		},
		{
		  "weight": 25,
		  "elemental":false,
		  "size":1,
		  "item":"pistonide"
		}
	  ],
	  "name": "Observatoire d'Arun Daworld",
	  "id": 33
	},
	{
	  "chain": [
		0,
		1,
		2,
		3,
		4,
		5,
		6,
		7,
		8,
		9,
		10,
		11
	  ],
	  "items_allowed": false,
	  "music": "gu1",
	  "tuples": [
		{
		  "weight": 4500,
		  "elemental":true,
		  "size":2,
		  "item": ""
		},
		{
		  "weight": 500,
		  "elemental":true,
		  "size":2,
		  "item":"skat"
		},
		{
		  "weight": 30,
		  "elemental":false,
		  "size":1,
		  "item":"dyna_hori"
		},
		{
		  "weight": 15,
		  "elemental":false,
		  "size":1,
		  "item":"dyna_vert"
		},
		{
		  "weight": 10,
		  "elemental":false,
		  "size":1,
		  "item":"alchimoth"
		}
	  ],
	  "name": "Palais de Stime Pounk",
	  "id": 34
	},
	{
	  "chain": [
		0,
		1,
		2,
		3,
		4,
		5,
		6,
		7,
		24,
		25,
		10,
		11
	  ],
	  "items_allowed": false,
	  "music": "ap3",
	  "tuples": [
		{
		  "weight": 3600,
		  "elemental":true,
		  "size":2,
		  "item": ""
		},
		{
		  "weight": 1400,
		  "elemental":true,
		  "size":2,
		  "item":"polarized_bomb"
		},
		{
		  "weight": 40,
		  "elemental":false,
		  "size":1,
		  "item":"polarised_bomb"
		},
		{
		  "weight": 10,
		  "elemental":false,
		  "size":1,
		  "item":"alchimoth"
		}
	  ],
	  "name": "Plaine de l'Armée",
	  "id": 35
	},
	{
	  "chain": [
		0,
		1,
		2,
		3,
		4,
		5,
		6,
		7,
		8,
		9,
		14,
		15
	  ],
	  "items_allowed": false,
	  "music": "jz3",
	  "tuples": [
		{
		  "weight": 4500,
		  "elemental":true,
		  "size":2,
		  "item": ""
		},
		{
		  "weight": 500,
		  "elemental":true,
		  "size":2,
		  "item":"skat"
		},
		{
		  "weight": 325,
		  "elemental":false,
		  "size":1,
		  "item":"dollyxir"
		},
		{
		  "weight": 35,
		  "elemental":false,
		  "size":1,
		  "item":"dyna_vert"
		}
	  ],
	  "name": "Plateau des Thèses",
	  "id": 36
	},
	{
	  "chain": [
		0,
		1,
		2,
		3,
		4,
		5,
		6,
		7,
		12,
		9,
		10,
		11
	  ],
	  "items_allowed": false,
	  "music": "gm1",
	  "tuples": [
		{
		  "weight": 2400,
		  "elemental":true,
		  "size":2,
		  "item": ""
		},
		{
		  "weight": 2600,
		  "elemental":true,
		  "size":2,
		  "item":"skat"
		},
		{
		  "weight": 30,
		  "elemental":false,
		  "size":1,
		  "item":"dyna_hori"
		},
		{
		  "weight": 15,
		  "elemental":false,
		  "size":1,
		  "item":"dyna_vert"
		},
		{
		  "weight": 10,
		  "elemental":false,
		  "size":1,
		  "item":"alchimoth"
		}
	  ],
	  "name": "Prairie infinie",
	  "id": 37
	},
	{
	  "chain": [
		0,
		1,
		2,
		3,
		4,
		5,
		6,
		7,
		20,
		21,
		22,
		23
	  ],
	  "items_allowed": false,
	  "music": "gm2",
	  "tuples": [
		{
		  "weight": 4500,
		  "elemental":true,
		  "size":2,
		  "item": ""
		},
		{
		  "weight": 500,
		  "elemental":true,
		  "size":2,
		  "item":"skat"
		},
		{
		  "weight": 350,
		  "elemental":false,
		  "size":1,
		  "item":"aztec"
		},
		{
		  "weight": 50,
		  "elemental":false,
		  "size":1,
		  "item":"charcleur"
		}
	  ],
	  "name": "Prieuré Korki",
	  "id": 38
	},
	{
	  "chain": [
		0,
		1,
		2,
		3,
		4,
		5,
		6,
		7,
		24,
		9,
		10,
		11
	  ],
	  "items_allowed": true,
	  "music": "ap1",
	  "tuples": [
		{
		  "weight": 4500,
		  "elemental":true,
		  "size":2,
		  "item": ""
		},
		{
		  "weight": 500,
		  "elemental":true,
		  "size":2,
		  "item":"skat"
		},
		{
		  "weight": 30,
		  "elemental":false,
		  "size":1,
		  "item":"dyna_hori"
		},
		{
		  "weight": 15,
		  "elemental":false,
		  "size":1,
		  "item":"dyna_vert"
		},
		{
		  "weight": 10,
		  "elemental":false,
		  "size":1,
		  "item":"alchimoth"
		},
		{
		  "weight": 35,
		  "elemental":false,
		  "size":1,
		  "item":"broom"
		}
	  ],
	  "name": "Route scintillante",
	  "id": 39
	},
	{
	  "chain": [
		0,
		1,
		2,
		3,
		4,
		5,
		6,
		7,
		8,
		9,
		14,
		11
	  ],
	  "items_allowed": false,
	  "music": "jz2",
	  "tuples": [
		{
		  "weight": 4500,
		  "elemental":true,
		  "size":2,
		  "item": ""
		},
		{
		  "weight": 500,
		  "elemental":true,
		  "size":2,
		  "item":"skat"
		},
		{
		  "weight": 30,
		  "elemental":false,
		  "size":1,
		  "item":"dyna_hori"
		},
		{
		  "weight": 15,
		  "elemental":false,
		  "size":1,
		  "item":"dyna_vert"
		},
		{
		  "weight": 10,
		  "elemental":false,
		  "size":1,
		  "item":"alchimoth"
		},
		{
		  "weight": 20,
		  "elemental":false,
		  "size":1,
		  "item":"distorsion_bone"
		},
		{
		  "weight": 15,
		  "elemental":false,
		  "size":1,
		  "item":"distorsion_ribcage"
		}
	  ],
	  "name": "Sakapata",
	  "id": 40
	},
	{
	  "chain": [
		0,
		1,
		2,
		3,
		4,
		5,
		6,
		7,
		8,
		9,
		10,
		11
	  ],
	  "items_allowed": false,
	  "music": "gu1",
	  "tuples": [
		{
		  "weight": 4500,
		  "elemental":true,
		  "size":2,
		  "item": ""
		},
		{
		  "weight": 500,
		  "elemental":true,
		  "size":2,
		  "item":"skat"
		},
		{
		  "weight": 30,
		  "elemental":false,
		  "size":1,
		  "item":"dyna_hori"
		},
		{
		  "weight": 15,
		  "elemental":false,
		  "size":1,
		  "item":"dyna_vert"
		},
		{
		  "weight": 7,
		  "elemental":false,
		  "size":1,
		  "item":"alchimoth"
		}
	  ],
	  "name": "Salle des chaudron",
	  "id": 41
	},
	{
	  "chain": [
		0,
		1,
		2,
		3,
		4,
		5,
		6,
		7,
		24,
		9,
		26,
		11
	  ],
	  "items_allowed": false,
	  "music": "ap2",
	  "tuples": [
		{
		  "weight": 4500,
		  "elemental":true,
		  "size":2,
		  "item": ""
		},
		{
		  "weight": 500,
		  "elemental":true,
		  "size":2,
		  "item":"skat"
		},
		{
		  "weight": 30,
		  "elemental":false,
		  "size":1,
		  "item":"dyna_hori"
		},
		{
		  "weight": 15,
		  "elemental":false,
		  "size":1,
		  "item":"dyna_vert"
		},
		{
		  "weight": 10,
		  "elemental":false,
		  "size":1,
		  "item":"alchimoth"
		},
		{
		  "weight": 35,
		  "elemental":false,
		  "size":1,
		  "item":"pistonide"
		},
		{
		  "weight": 30,
		  "elemental":false,
		  "size":1,
		  "item":"licorice"
		}
	  ],
	  "name": "Terrasse du troisième",
	  "id": 42
	},
	{
	  "chain": [
		0,
		1,
		2,
		3,
		4,
		5,
		6,
		7,
		8,
		9,
		10,
		11
	  ],
	  "items_allowed": false,
	  "music": "ap1",
	  "tuples": [
		{
		  "weight": 4500,
		  "elemental":true,
		  "size":2,
		  "item": ""
		},
		{
		  "weight": 500,
		  "elemental":true,
		  "size":2,
		  "item":"skat"
		},
		{
		  "weight": 30,
		  "elemental":false,
		  "size":1,
		  "item":"dyna_hori"
		},
		{
		  "weight": 15,
		  "elemental":false,
		  "size":1,
		  "item":"dyna_vert"
		},
		{
		  "weight": 10,
		  "elemental":false,
		  "size":1,
		  "item":"alchimoth"
		},
		{
		  "weight": 7,
		  "elemental":false,
		  "size":1,
		  "item":"licorice"
		}
	  ],
	  "name": "Vostok",
	  "id": 43
	},
	{
	  "chain": [
		0,
		1,
		2,
		3,
		4,
		5,
		6,
		7,
		16,
		17,
		10,
		11
	  ],
	  "items_allowed": false,
	  "music": "jz1",
	  "tuples": [
		{
		  "weight": 4500,
		  "elemental":true,
		  "size":2,
		  "item": ""
		},
		{
		  "weight": 500,
		  "elemental":true,
		  "size":2,
		  "item":"skat"
		},
		{
		  "weight": 15,
		  "elemental":false,
		  "size":1,
		  "item":"dyna_hori"
		},
		{
		  "weight": 10,
		  "elemental":false,
		  "size":1,
		  "item":"dyna_vert"
		},
		{
		  "weight": 20,
		  "elemental":false,
		  "size":1,
		  "item":"aztec"
		},
		{
		  "weight": 4,
		  "elemental":false,
		  "size":1,
		  "item":"catz"
		}
	  ],
	  "name": "Ziggourat d'or",
	  "id": 44
	}
  ]
}