<?xml version="1.0" encoding="UTF-8" standalone="no"?>
<svg xmlns:xlink="http://www.w3.org/1999/xlink" height="48.0px" width="96.0px" xmlns="http://www.w3.org/2000/svg">
  <g transform="matrix(1.0, 0.0, 0.0, 1.0, 48.05, 6.05)">
    <path d="M-48.05 17.95 L-0.05 -6.05 47.95 17.95 -0.05 41.95 -48.05 17.95" fill="#a18e89" fill-rule="evenodd" stroke="none"/>
    <path d="M-29.9 14.2 L-35.3 16.9 -42.05 20.25 M-35.3 16.9 L-31.3 18.9 -38.05 22.25 M-25.9 16.2 L-31.3 18.9 -27.3 20.9 -34.05 24.25 M-21.9 18.2 L-27.3 20.9 -23.3 22.9 -30.05 26.25 M-23.3 22.9 L-19.3 24.9 -26.05 28.25 M-17.9 20.2 L-23.3 22.9 M-13.9 22.2 L-19.3 24.9" fill="none" stroke="#ffffff" stroke-linecap="round" stroke-linejoin="round" stroke-opacity="0.5019608" stroke-width="0.05"/>
  </g>
</svg>
