<?xml version="1.0" encoding="UTF-8" standalone="no"?>
<svg xmlns:xlink="http://www.w3.org/1999/xlink" height="139.45px" width="60.0px" xmlns="http://www.w3.org/2000/svg">
  <g transform="matrix(1.0, 0.0, 0.0, 1.0, 30.0, 3.45)">
    <path d="M23.8 0.4 L30.0 -3.45 30.0 25.95 19.4 31.25 19.4 25.05 23.4 22.6 23.8 0.4 M12.5 19.0 L12.5 34.7 11.25 35.35 9.05 36.45 8.75 36.6 -2.65 42.35 -2.85 37.15 2.8 33.95 2.0 24.65 12.5 19.0 M10.0 43.95 L10.0 44.0 12.5 42.75 12.5 48.9 19.4 44.85 19.4 39.3 30.0 33.95 30.0 105.95 -29.95 136.0 -30.0 135.95 -30.0 63.95 -29.95 64.0 -10.0 54.0 -9.3 53.65 -8.9 65.45 -2.05 61.0 -2.4 50.2 8.45 44.75 10.0 43.95 M-10.55 14.95 L-9.55 45.75 -10.0 46.0 -29.95 56.0 -30.0 55.95 -30.0 31.5 -23.85 28.3 -23.45 46.45 -15.8 42.45 -16.2 18.6 -10.55 14.95" fill="#000000" fill-rule="evenodd" stroke="none"/>
  </g>
</svg>
