<?xml version="1.0" encoding="UTF-8" standalone="no"?>
<svg xmlns:xlink="http://www.w3.org/1999/xlink" height="40.05px" width="12.0px" xmlns="http://www.w3.org/2000/svg">
  <g transform="matrix(1.0, 0.0, 0.0, 1.0, 6.0, 20.05)">
    <path d="M5.05 -19.25 L5.05 -4.3 5.05 2.75 4.05 2.25 4.05 -7.1 3.45 -7.4 3.45 -20.05 5.05 -19.25 M2.0 -6.1 L2.0 -5.25 2.0 -0.35 2.0 4.4 0.0 3.4 0.0 -7.1 2.0 -6.1 M2.6 5.7 L2.6 13.2 -2.35 10.75 -2.35 3.25 2.6 5.7 M6.0 17.0 L6.0 20.0 -6.0 14.0 -6.0 11.0 6.0 17.0" fill="#ffffff" fill-rule="evenodd" stroke="none"/>
  </g>
</svg>
