<?xml version="1.0" encoding="UTF-8" standalone="no"?>
<svg xmlns:xlink="http://www.w3.org/1999/xlink" height="102.15px" width="20.0px" xmlns="http://www.w3.org/2000/svg">
  <g transform="matrix(1.0, 0.0, 0.0, 1.0, 10.0, 75.0)">
    <path d="M10.0 -9.55 L7.05 -11.9 7.55 27.15 3.25 24.45 3.25 -7.05 -2.2 -10.3 -2.2 6.0 -6.0 5.45 -5.45 -23.3 -10.0 -25.95 -10.0 -75.0 10.0 -65.0 10.0 -9.55" fill="url(#gradient0)" fill-rule="evenodd" stroke="none"/>
  </g>
  <defs>
    <linearGradient gradientTransform="matrix(0.0, 0.0899, -0.0122, 0.0, 0.0, -4.1)" gradientUnits="userSpaceOnUse" id="gradient0" spreadMethod="pad" x1="-819.2" x2="819.2">
      <stop offset="0.0" stop-color="#ffffff"/>
      <stop offset="1.0" stop-color="#ffffff" stop-opacity="0.0"/>
    </linearGradient>
  </defs>
</svg>
