<?xml version="1.0" encoding="UTF-8" standalone="no"?>
<svg xmlns:xlink="http://www.w3.org/1999/xlink" height="20.0px" width="20.0px" xmlns="http://www.w3.org/2000/svg">
  <g transform="matrix(1.0, 0.0, 0.0, 1.0, -40.0, 197.0)">
    <path d="M40.0 -197.0 L60.0 -187.0 40.0 -177.0 40.0 -197.0" fill="#00ff00" fill-rule="evenodd" stroke="none"/>
  </g>
</svg>
