<?xml version="1.0" encoding="UTF-8" standalone="no"?>
<svg xmlns:xlink="http://www.w3.org/1999/xlink" height="48.85px" width="42.1px" xmlns="http://www.w3.org/2000/svg">
  <g transform="matrix(1.0, 0.0, 0.0, 1.0, 81.15, 23.45)">
    <path d="M-65.4 -7.4 Q-64.55 -9.45 -62.35 -9.2 L-59.0 -8.65 -57.0 -9.75 -55.3 -9.55 Q-54.35 -9.3 -53.8 -8.55 -53.5 -8.1 -53.5 -7.6 -53.55 -4.95 -53.85 -2.25 L-53.9 -1.85 -54.25 -1.8 -54.25 -1.85 -55.8 -1.75 -60.65 -1.45 -62.2 -1.35 -65.2 -1.9 -65.2 -1.75 -66.35 -1.9 -66.35 -2.05 Q-66.45 -4.85 -65.4 -7.4" fill="#830400" fill-rule="evenodd" stroke="none"/>
    <path d="M-66.6 8.9 L-59.5 9.25 Q-52.35 9.25 -52.35 8.0 -52.35 7.1 -54.2 6.95 L-55.05 6.95 -55.0 6.6 -55.05 5.05 Q-50.1 5.75 -50.1 8.0 -50.1 9.55 -51.3 10.1 -53.75 11.2 -62.6 11.2 -70.6 11.2 -70.6 8.15 -70.6 5.65 -65.3 5.0 L-65.4 6.75 -65.35 7.15 Q-67.3 7.5 -68.05 8.05 -67.45 8.75 -66.6 8.9" fill="#830400" fill-rule="evenodd" stroke="none"/>
    <path d="M-55.9 12.65 L-61.15 12.9 -64.6 12.65 -64.55 10.9 -64.55 10.75 -64.15 10.75 -56.1 10.15 -55.9 10.15 -55.9 12.65 M-64.45 6.5 L-64.45 0.35 -64.45 -1.75 -64.45 -1.9 -62.0 -1.35 -61.9 -1.35 -60.7 -1.45 -56.75 -1.75 -55.45 -1.85 -55.45 -1.8 -55.75 3.0 -55.8 3.9 -55.9 7.6 -61.75 4.3 Q-62.7 4.3 -64.35 6.3 L-64.45 6.5" fill="#650101" fill-rule="evenodd" stroke="none"/>
    <path d="M-55.9 12.65 L-55.9 12.95 -55.65 15.35 -54.45 19.65 -52.9 21.2 Q-52.4 21.7 -52.3 22.45 -52.1 24.25 -53.3 24.3 L-54.15 23.9 -56.45 24.05 -57.4 24.65 -59.1 23.85 -59.8 23.55 -61.4 24.45 -62.1 24.2 -62.3 25.1 -62.9 25.4 -65.3 23.4 -65.7 23.6 -66.75 23.4 -67.5 22.85 Q-68.1 22.05 -67.95 20.95 L-67.45 20.05 -67.5 19.4 Q-66.95 18.0 -66.0 16.85 -64.8 15.3 -64.65 12.9 L-64.6 12.65 -61.15 12.9 -55.9 12.65 M-64.55 10.75 L-64.45 6.5 -64.35 6.3 Q-62.7 4.3 -61.75 4.3 L-55.9 7.6 -55.9 10.15 -56.1 10.15 -64.15 10.75 -64.55 10.75" fill="#830400" fill-rule="evenodd" stroke="none"/>
    <path d="M-78.5 -4.55 Q-82.0 -5.7 -80.9 -9.25 -79.8 -12.9 -77.25 -15.45 L-77.4 -16.9 Q-77.4 -18.2 -76.1 -20.0 -74.3 -22.55 -71.35 -22.55 -69.25 -22.55 -67.35 -21.0 -63.1 -23.3 -57.85 -21.6 -57.55 -21.5 -57.15 -21.75 -50.25 -25.8 -45.6 -20.1 L-45.05 -19.35 Q-41.35 -19.25 -40.85 -15.3 -40.85 -14.25 -41.35 -13.05 L-41.55 -12.6 Q-39.1 -12.15 -39.05 -9.7 -39.05 -5.6 -42.2 -5.45 L-43.6 -5.65 Q-44.9 -3.9 -46.9 -2.85 -50.05 -1.2 -53.45 -1.0 L-57.85 -1.45 Q-58.75 -1.7 -59.55 -2.2 L-60.0 -3.05 -60.1 -2.95 Q-60.55 -4.4 -59.5 -5.45 L-59.0 -6.0 -53.0 -5.25 -50.25 -8.1 -52.95 -7.7 Q-55.3 -7.55 -57.4 -8.65 -58.9 -9.4 -59.15 -11.2 L-59.45 -10.75 -59.85 -11.55 -60.9 -11.35 Q-61.4 -10.65 -61.1 -9.9 L-60.85 -8.6 Q-60.8 -7.9 -61.05 -7.25 L-61.85 -6.15 -63.25 -5.3 Q-65.0 -4.6 -66.95 -4.5 -68.9 -4.3 -70.45 -5.3 L-71.15 -4.8 Q-70.6 -3.4 -69.15 -3.05 L-63.05 -2.3 -63.25 -1.7 Q-67.9 0.0 -72.65 -0.8 -74.35 -1.25 -75.7 -2.35 -77.0 -3.45 -77.15 -5.5 L-76.2 -7.05 Q-77.5 -7.3 -78.05 -6.35 -78.45 -5.7 -78.5 -4.75 L-78.5 -4.55 M-43.85 -8.25 Q-43.45 -8.65 -43.35 -9.45 L-43.8 -9.85 -44.1 -9.75 Q-44.4 -7.75 -43.85 -8.25 M-75.25 -12.3 L-75.8 -11.85 Q-75.4 -10.4 -73.35 -8.95 -71.6 -7.75 -71.0 -7.75 -70.85 -7.75 -69.85 -9.9 -68.9 -12.05 -68.9 -12.45 -69.05 -13.2 -69.6 -13.2 L-70.4 -12.05 Q-71.25 -10.95 -73.55 -10.95 -75.0 -12.3 -75.25 -12.3" fill="#830400" fill-rule="evenodd" stroke="none"/>
    <path d="M-42.2 -5.45 L-42.2 -5.4 -42.6 -4.6 -43.55 -3.2 -45.75 -0.95 Q-47.0 0.05 -48.35 0.7 -51.8 2.05 -55.2 1.85 L-62.25 1.2 -64.9 1.65 Q-68.1 2.4 -71.3 1.55 -74.2 0.65 -76.3 -1.75 L-78.5 -4.55 -78.5 -4.75 Q-78.45 -5.7 -78.05 -6.35 -77.5 -7.3 -76.2 -7.05 L-77.15 -5.5 Q-77.0 -3.45 -75.7 -2.35 -74.35 -1.25 -72.65 -0.8 -67.9 0.0 -63.25 -1.7 L-63.05 -2.3 -69.15 -3.05 Q-70.6 -3.4 -71.15 -4.8 L-70.45 -5.3 Q-68.9 -4.3 -66.95 -4.5 -65.0 -4.6 -63.25 -5.3 L-61.85 -6.15 -61.05 -7.25 Q-60.8 -7.9 -60.85 -8.6 L-61.1 -9.9 Q-61.4 -10.65 -60.9 -11.35 L-59.85 -11.55 -59.45 -10.75 -59.15 -11.2 Q-58.9 -9.4 -57.4 -8.65 -55.3 -7.55 -52.95 -7.7 L-50.25 -8.1 -53.0 -5.25 -59.0 -6.0 -59.5 -5.45 Q-60.55 -4.4 -60.1 -2.95 L-60.0 -3.05 -59.55 -2.2 Q-58.75 -1.7 -57.85 -1.45 L-53.45 -1.0 Q-50.05 -1.2 -46.9 -2.85 -44.9 -3.9 -43.6 -5.65 L-42.2 -5.45 M-43.85 -8.25 Q-44.4 -7.75 -44.1 -9.75 L-43.8 -9.85 -43.35 -9.45 Q-43.45 -8.65 -43.85 -8.25 M-75.25 -12.3 Q-75.0 -12.3 -73.55 -10.95 -71.25 -10.95 -70.4 -12.05 L-69.6 -13.2 Q-69.05 -13.2 -68.9 -12.45 -68.9 -12.05 -69.85 -9.9 -70.85 -7.75 -71.0 -7.75 -71.6 -7.75 -73.35 -8.95 -75.4 -10.4 -75.8 -11.85 L-75.25 -12.3" fill="#650101" fill-rule="evenodd" stroke="none"/>
  </g>
</svg>
