<?xml version="1.0" encoding="UTF-8" standalone="no"?>
<svg xmlns:xlink="http://www.w3.org/1999/xlink" height="35.95px" width="56.05px" xmlns="http://www.w3.org/2000/svg">
  <g transform="matrix(1.0, 0.0, 0.0, 1.0, 28.05, 17.95)">
    <path d="M15.85 -5.85 L21.3 -3.1 18.5 -0.45 13.05 -3.15 12.6 -0.15 18.65 2.9 21.8 -0.1 21.5 -1.85 28.0 1.4 10.65 18.0 -28.05 -1.35 -10.7 -17.95 15.05 -5.05 15.85 -5.85 M11.3 6.9 L8.5 9.55 3.05 6.85 2.6 9.85 8.65 12.9 11.8 9.9 11.3 6.9 M-16.8 -6.65 L-17.9 -3.75 -12.9 -1.25 -6.05 -7.75 -7.2 -9.9 -12.75 -4.6 -16.8 -6.65" fill="url(#gradient0)" fill-rule="evenodd" stroke="none"/>
  </g>
  <defs>
    <linearGradient gradientTransform="matrix(0.0, 0.0211, -0.0342, 0.0, 0.0, 0.0)" gradientUnits="userSpaceOnUse" id="gradient0" spreadMethod="pad" x1="-819.2" x2="819.2">
      <stop offset="0.0" stop-color="#ffffff"/>
      <stop offset="1.0" stop-color="#ffffff" stop-opacity="0.0"/>
    </linearGradient>
  </defs>
</svg>
