<?xml version="1.0" encoding="UTF-8" standalone="no"?>
<svg xmlns:xlink="http://www.w3.org/1999/xlink" height="23.5px" width="7.0px" xmlns="http://www.w3.org/2000/svg">
  <g transform="matrix(1.0, 0.0, 0.0, 1.0, 3.5, 11.75)">
    <path d="M3.5 -9.75 L3.5 -2.6 1.6 11.2 0.5 11.75 3.5 -9.75" fill="#ebbc8b" fill-rule="evenodd" stroke="none"/>
    <path d="M3.5 -9.75 L0.5 11.75 -3.5 9.75 -0.5 -11.75 3.5 -9.75" fill="url(#gradient0)" fill-rule="evenodd" stroke="none"/>
    <path d="M0.5 11.75 L1.6 11.2 3.5 -2.6 3.5 -9.75 0.5 11.75 -3.5 9.75 -0.5 -11.75 3.5 -9.75" fill="none" stroke="#660000" stroke-linecap="round" stroke-linejoin="miter" stroke-miterlimit="3.0" stroke-opacity="0.3019608" stroke-width="0.05"/>
  </g>
  <defs>
    <linearGradient gradientTransform="matrix(0.0, 0.0138, -0.0043, 0.0, 0.0, -0.15)" gradientUnits="userSpaceOnUse" id="gradient0" spreadMethod="pad" x1="-819.2" x2="819.2">
      <stop offset="0.0" stop-color="#b59828"/>
      <stop offset="1.0" stop-color="#807d22"/>
    </linearGradient>
  </defs>
</svg>
