<?xml version="1.0" encoding="UTF-8" standalone="no"?>
<svg xmlns:xlink="http://www.w3.org/1999/xlink" height="33.55px" width="28.75px" xmlns="http://www.w3.org/2000/svg">
  <g transform="matrix(1.0, 0.0, 0.0, 1.0, 14.35, 16.8)">
    <path d="M5.05 2.05 L4.7 1.85 3.8 2.35 4.15 2.5 5.05 2.05 M-1.4 -4.9 L-1.65 -5.0 -2.85 -5.6 -2.8 -4.75 -2.5 -3.0 -0.25 -4.2 -1.4 -4.9 M6.25 -12.5 L7.7 -11.45 8.3 -10.85 8.95 -10.1 10.35 -8.55 11.05 -7.65 11.25 -7.35 11.75 -6.55 12.3 -5.55 12.8 -4.7 13.2 -3.7 13.55 -2.8 13.9 -1.75 Q14.4 -0.15 14.4 1.45 L14.4 1.8 14.15 2.0 12.25 2.9 13.85 3.65 14.35 4.25 14.4 14.1 14.2 14.5 9.7 16.75 9.55 16.75 9.35 16.7 8.9 16.4 3.65 8.6 -2.15 11.2 -2.2 11.1 -2.65 10.75 -8.0 2.8 -13.55 5.45 -14.2 4.95 -14.35 4.35 -14.35 -7.5 -14.35 -7.7 -14.15 -8.95 -13.9 -10.05 -13.15 -11.85 -12.2 -13.1 -11.0 -14.0 -10.15 -14.4 -8.15 -15.5 -7.6 -15.85 -7.1 -16.0 -6.3 -16.35 -5.4 -16.55 -4.6 -16.7 -3.8 -16.75 -3.0 -16.8 -1.15 -16.4 -0.05 -15.95 4.75 -13.6 6.25 -12.5 M-9.55 -13.2 L-9.5 -13.25 -9.6 -13.25 -9.55 -13.2" fill="url(#gradient0)" fill-rule="evenodd" stroke="none"/>
  </g>
  <defs>
    <linearGradient gradientTransform="matrix(0.0, 0.1648, -0.0364, 0.0, -2.05, 64.35)" gradientUnits="userSpaceOnUse" id="gradient0" spreadMethod="pad" x1="-819.2" x2="819.2">
      <stop offset="0.0" stop-color="#ffffff"/>
      <stop offset="1.0" stop-color="#ffffff" stop-opacity="0.0"/>
    </linearGradient>
  </defs>
</svg>
