<?xml version="1.0" encoding="UTF-8" standalone="no"?>
<svg xmlns:xlink="http://www.w3.org/1999/xlink" height="34.6px" width="14.45px" xmlns="http://www.w3.org/2000/svg">
  <g transform="matrix(1.0, 0.0, 0.0, 1.0, 7.25, 17.3)">
    <path d="M7.2 -17.25 Q2.05 -16.95 -1.6 -12.25 L-3.5 -9.3 Q-5.6 -5.2 -5.6 0.0 -5.6 7.15 -1.6 12.25 2.05 16.9 7.2 17.3 L6.4 17.3 Q0.7 17.3 -3.25 12.25 -7.25 7.15 -7.25 0.0 -7.25 -7.2 -3.25 -12.25 0.7 -17.3 6.4 -17.3 L7.2 -17.25" fill="url(#gradient0)" fill-rule="evenodd" stroke="none"/>
  </g>
  <defs>
    <linearGradient gradientTransform="matrix(0.0, 0.0188, -0.0088, 0.0, 0.0, 0.25)" gradientUnits="userSpaceOnUse" id="gradient0" spreadMethod="pad" x1="-819.2" x2="819.2">
      <stop offset="0.0" stop-color="#ffffff"/>
      <stop offset="1.0" stop-color="#ffffff" stop-opacity="0.0"/>
    </linearGradient>
  </defs>
</svg>
