<?xml version="1.0" encoding="UTF-8" standalone="no"?>
<svg xmlns:xlink="http://www.w3.org/1999/xlink" height="51.0px" width="24.45px" xmlns="http://www.w3.org/2000/svg">
  <g transform="matrix(1.0, 0.0, 0.0, 1.0, 11.45, 25.5)">
    <path d="M10.25 -22.6 L10.55 -10.35 13.0 1.8 9.1 7.85 8.15 19.85 3.55 25.5 -4.0 21.15 -11.45 -3.2 -8.75 -9.95 2.3 -15.4 5.1 -13.85 6.35 -25.5 10.25 -22.6" fill="#bcd7fe" fill-rule="evenodd" stroke="none"/>
    <path d="M10.25 -22.6 L6.35 -25.5 5.1 -13.85 2.3 -15.4 -8.75 -9.95 -11.45 -3.2 -4.0 21.15 3.55 25.5 8.15 19.85 9.1 7.85 13.0 1.8 10.55 -10.35 10.25 -22.6 Z" fill="none" stroke="#ffffff" stroke-linecap="round" stroke-linejoin="round" stroke-width="0.05"/>
  </g>
</svg>
