<?xml version="1.0" encoding="UTF-8" standalone="no"?>
<svg xmlns:xlink="http://www.w3.org/1999/xlink" height="17.25px" width="12.5px" xmlns="http://www.w3.org/2000/svg">
  <g transform="matrix(1.0, 0.0, 0.0, 1.0, 6.25, 8.65)">
    <path d="M2.35 -4.25 L1.8 -4.1 1.7 -3.95 2.0 -3.25 Q2.3 -2.85 2.7 -3.15 3.35 -3.8 2.45 -4.25 L2.35 -4.25 M0.6 -4.85 Q0.9 -4.8 0.85 -5.0 0.55 -6.65 -1.55 -7.3 L-1.85 -7.25 -2.0 -7.05 Q-1.55 -5.35 0.6 -4.85 M5.6 -0.7 Q5.4 0.0 4.7 0.55 L3.35 0.7 Q1.8 -0.1 1.15 -1.8 L0.7 -2.55 Q-2.3 -5.3 -5.8 -7.15 -5.25 -8.15 -4.15 -8.5 L-1.95 -8.3 1.25 -6.45 Q3.3 -5.2 4.45 -3.15 L5.6 -0.7" fill="#dda988" fill-rule="evenodd" stroke="none"/>
    <path d="M-5.8 -7.15 Q-2.3 -5.3 0.7 -2.55 L1.15 -1.8 Q1.8 -0.1 3.35 0.7 L4.7 0.55 Q5.4 0.0 5.6 -0.7 L6.05 1.15 Q6.45 3.5 6.1 6.1 5.9 7.25 4.95 8.0 3.95 8.75 2.8 8.6 1.6 8.4 0.85 7.45 0.1 6.45 0.3 5.25 0.7 2.2 -0.65 -0.25 -1.1 -1.0 -1.85 -1.45 L-1.9 -1.45 -4.65 -3.1 Q-5.65 -3.65 -6.05 -4.65 L-6.05 -4.7 -6.1 -4.8 -6.1 -4.85 Q-6.45 -6.0 -5.9 -7.05 L-5.8 -7.15" fill="#a16071" fill-rule="evenodd" stroke="none"/>
    <path d="M0.6 -4.85 Q-1.55 -5.35 -2.0 -7.05 L-1.85 -7.25 -1.55 -7.3 Q0.55 -6.65 0.85 -5.0 0.9 -4.8 0.6 -4.85 M2.35 -4.25 L2.45 -4.25 Q3.35 -3.8 2.7 -3.15 2.3 -2.85 2.0 -3.25 L1.7 -3.95 1.8 -4.1 2.35 -4.25" fill="#fac896" fill-rule="evenodd" stroke="none"/>
    <path d="M5.6 -0.7 L4.45 -3.15 Q3.3 -5.2 1.25 -6.45 L-1.95 -8.3 -4.15 -8.5 Q-5.25 -8.15 -5.8 -7.15 L-5.9 -7.05 Q-6.45 -6.0 -6.1 -4.85 L-6.1 -4.8 -6.05 -4.7 -6.05 -4.65 Q-5.65 -3.65 -4.65 -3.1 L-1.9 -1.45 -1.85 -1.45 Q-1.1 -1.0 -0.65 -0.25 0.7 2.2 0.3 5.25 0.1 6.45 0.85 7.45 1.6 8.4 2.8 8.6 3.95 8.75 4.95 8.0 5.9 7.25 6.1 6.1 6.45 3.5 6.05 1.15 L5.6 -0.7 Z" fill="none" stroke="#660000" stroke-linecap="round" stroke-linejoin="miter" stroke-miterlimit="3.0" stroke-opacity="0.3019608" stroke-width="0.05"/>
  </g>
</svg>
