<?xml version="1.0" encoding="UTF-8" standalone="no"?>
<svg xmlns:xlink="http://www.w3.org/1999/xlink" height="100.0px" width="172.2px" xmlns="http://www.w3.org/2000/svg">
  <g transform="matrix(1.0, 0.0, 0.0, 1.0, 0.0, 0.0)">
    <path d="M170.2 0.0 L172.2 0.0 172.2 100.0 170.2 100.0 170.2 0.0 M2.0 100.0 L0.0 100.0 0.0 0.0 2.0 0.0 2.0 100.0" fill="#deecfe" fill-rule="evenodd" stroke="none"/>
    <path d="M170.2 100.0 L2.0 100.0 2.0 0.0 170.2 0.0 170.2 100.0" fill="#b4d2fe" fill-rule="evenodd" stroke="none"/>
  </g>
</svg>
