<?xml version="1.0" encoding="UTF-8" standalone="no"?>
<svg xmlns:xlink="http://www.w3.org/1999/xlink" height="29.0px" width="29.0px" xmlns="http://www.w3.org/2000/svg">
  <g transform="matrix(1.0, 0.0, 0.0, 1.0, 14.5, 14.5)">
    <path d="M0.0 -14.0 Q5.8 -14.0 9.9 -9.9 14.0 -5.8 14.0 0.0 14.0 5.8 9.9 9.9 5.8 14.0 0.0 14.0 -5.8 14.0 -9.9 9.9 -14.0 5.8 -14.0 0.0 -14.0 -5.8 -9.9 -9.9 -5.8 -14.0 0.0 -14.0" fill="#1e4062" fill-rule="evenodd" stroke="none"/>
    <path d="M-5.0 -4.85 L-4.6 -5.25 Q-2.7 -7.0 -0.05 -7.0 2.85 -7.0 4.95 -4.95 6.95 -2.9 6.95 0.0 6.95 2.7 5.25 4.65 L5.2 4.65 5.05 4.9 4.95 4.95 Q2.85 7.0 -0.05 7.0 -2.95 7.0 -4.95 4.95 -7.05 2.9 -7.05 0.0 -7.05 -2.85 -5.0 -4.85 M-0.05 -6.0 Q-2.3 -6.0 -3.95 -4.45 L-4.05 -4.4 -4.15 -4.3 -4.25 -4.25 Q-6.05 -2.5 -6.05 0.0 -6.05 2.5 -4.25 4.25 -2.55 6.0 -0.05 6.0 2.4 6.0 4.2 4.35 L4.5 4.0 4.5 3.95 Q5.95 2.3 5.95 0.0 5.95 -2.5 4.25 -4.25 2.45 -6.0 -0.05 -6.0 M-5.65 -6.35 L-5.75 -6.3 -6.1 -6.05 Q-8.6 -3.55 -8.6 0.0 -8.6 3.55 -6.1 6.05 -3.6 8.5 -0.1 8.5 3.4 8.5 5.9 6.1 L6.3 5.7 6.3 5.65 Q8.4 3.25 8.4 0.0 8.45 -3.55 5.95 -6.05 3.45 -8.5 -0.1 -8.5 -3.35 -8.5 -5.65 -6.35 M-6.8 -6.75 L-6.25 -7.15 -6.35 -7.1 Q-3.75 -9.5 -0.1 -9.5 3.85 -9.5 6.65 -6.75 9.45 -3.95 9.4 0.0 9.4 3.65 7.05 6.35 L7.0 6.35 6.7 6.7 6.65 6.75 Q3.85 9.5 -0.1 9.5 -4.0 9.5 -6.8 6.75 -9.6 3.95 -9.6 0.0 -9.6 -3.95 -6.8 -6.75 M0.0 -14.5 Q6.0 -14.5 10.25 -10.25 14.5 -6.0 14.5 0.0 14.5 6.0 10.25 10.25 6.0 14.5 0.0 14.5 -6.0 14.5 -10.25 10.25 -14.5 6.0 -14.5 0.0 -14.5 -6.0 -10.25 -10.25 -6.0 -14.5 0.0 -14.5 M9.55 -9.55 Q5.6 -13.5 0.0 -13.5 -5.6 -13.5 -9.55 -9.55 -13.5 -5.6 -13.5 0.0 -13.5 5.6 -9.55 9.55 -5.6 13.5 0.0 13.5 5.6 13.5 9.55 9.55 13.5 5.6 13.5 0.0 13.5 -5.6 9.55 -9.55 M0.0 -12.0 Q4.95 -12.0 8.5 -8.5 12.0 -4.95 12.0 0.0 12.0 4.95 8.5 8.5 L8.5 8.55 7.95 9.0 7.95 9.05 Q4.6 12.0 0.0 12.0 -4.95 12.0 -8.5 8.5 -12.0 4.95 -12.0 0.0 -12.0 -4.55 -9.0 -7.85 L-8.5 -8.5 Q-4.95 -12.0 0.0 -12.0 M7.8 -7.8 Q4.55 -11.0 0.0 -11.0 -4.55 -11.0 -7.8 -7.8 L-8.15 -7.3 -8.2 -7.25 Q-11.0 -4.2 -11.0 0.0 -11.0 4.55 -7.8 7.8 -4.55 11.0 0.0 11.0 4.2 11.0 7.25 8.3 L7.3 8.3 7.8 7.8 7.85 7.8 Q11.0 4.55 11.0 0.0 11.0 -4.55 7.8 -7.8" fill="url(#gradient0)" fill-rule="evenodd" stroke="none"/>
  </g>
  <defs>
    <radialGradient cx="0" cy="0" gradientTransform="matrix(0.035, 0.0, 0.0, 0.035, -9.3, -10.7)" gradientUnits="userSpaceOnUse" id="gradient0" r="819.2" spreadMethod="pad">
      <stop offset="0.0" stop-color="#1e5ebd"/>
      <stop offset="0.9921568627450981" stop-color="#0c141f"/>
    </radialGradient>
  </defs>
</svg>
