<?xml version="1.0" encoding="UTF-8" standalone="no"?>
<svg xmlns:xlink="http://www.w3.org/1999/xlink" height="49.8px" width="59.55px" xmlns="http://www.w3.org/2000/svg">
  <g transform="matrix(1.0, 0.0, 0.0, 1.0, 29.8, 24.9)">
    <path d="M29.75 8.9 L-29.8 -20.9 M29.75 4.9 L-29.8 -24.9 M29.75 24.9 L-29.8 -4.9 M29.75 20.9 L-29.8 -8.9 M29.75 16.9 L-29.8 -12.9 M29.75 12.9 L-29.8 -16.9" fill="none" stroke="#5b60a3" stroke-linecap="round" stroke-linejoin="round" stroke-opacity="0.7137255" stroke-width="0.05"/>
  </g>
</svg>
