<?xml version="1.0" encoding="UTF-8" standalone="no"?>
<svg xmlns:xlink="http://www.w3.org/1999/xlink" height="18.0px" width="18.0px" xmlns="http://www.w3.org/2000/svg">
  <g transform="matrix(1.0, 0.0, 0.0, 1.0, 9.0, 9.0)">
    <path d="M6.0 -6.0 Q8.5 -3.5 8.5 0.0 8.5 3.5 6.0 6.0 L4.75 7.05 4.4 7.3 Q2.4 8.5 0.0 8.5 -2.4 8.5 -4.35 7.3 L-6.0 6.0 Q-8.5 3.5 -8.5 0.0 -8.5 -3.5 -6.0 -6.0 -3.5 -8.5 0.0 -8.5 2.65 -8.5 4.75 -7.05 L6.0 -6.0 Z" fill="none" stroke="#ffffff" stroke-linecap="round" stroke-linejoin="miter" stroke-miterlimit="3.0" stroke-opacity="0.5019608" stroke-width="1.0"/>
    <path d="M3.6 -3.95 L3.6 3.95 1.6 3.95 1.6 0.45 -1.4 0.45 -1.4 3.95 -3.4 3.95 -3.4 -3.95 -1.4 -3.95 -1.4 -1.05 1.6 -1.05 1.6 -3.95 3.6 -3.95" fill="#ffffff" fill-opacity="0.5019608" fill-rule="evenodd" stroke="none"/>
  </g>
</svg>
