<?xml version="1.0" encoding="UTF-8" standalone="no"?>
<svg xmlns:xlink="http://www.w3.org/1999/xlink" height="25.1px" width="14.7px" xmlns="http://www.w3.org/2000/svg">
  <g transform="matrix(1.0, 0.0, 0.0, 1.0, 8.6, 23.1)">
    <path d="M0.8 -17.25 L0.2 -14.15 0.05 -14.15 0.0 -14.3 Q0.0 -15.5 0.55 -17.7 L0.65 -17.7 0.8 -17.25 M1.3 -13.8 L1.4 -13.8 1.45 -13.4 1.3 -12.6 1.2 -12.65 1.3 -13.8 M0.4 -8.5 Q0.4 -7.4 -0.35 -6.95 L-0.4 -7.25 0.25 -8.8 0.4 -8.5 M1.75 -10.15 L0.85 -6.9 0.6 -6.9 0.55 -7.1 Q0.55 -9.6 1.55 -10.6 L1.75 -10.15 M0.0 -12.0 L0.35 -11.75 -0.75 -8.55 -1.9 -8.7 -2.05 -8.75 Q-2.15 -9.2 -2.45 -8.75 L-3.1 -7.25 -1.55 -6.3 -0.75 -6.55 1.25 -6.45 1.35 -5.85 0.55 -3.15 0.1 -3.35 -0.95 -3.35 -1.15 -5.3 -2.1 -2.75 -2.5 -2.8 Q-1.8 -3.6 -1.8 -5.05 L-1.65 -6.25 -1.8 -6.25 -2.8 -2.8 Q-2.95 -3.35 -3.15 -3.25 L-3.9 -3.2 -4.1 -4.35 -4.45 -4.2 -5.0 -4.6 -6.05 -3.7 -6.75 -3.9 -3.15 -8.55 -3.8 -8.8 -3.9 -9.9 -4.6 -10.1 -0.6 -20.0 -0.65 -18.35 Q-0.1 -17.5 -0.2 -16.55 -0.4 -15.15 -0.95 -14.05 L-1.45 -13.1 -3.0 -11.0 -0.85 -13.4 -0.9 -12.9 -0.5 -12.6 -0.35 -12.25 -0.2 -12.15 Q-1.05 -10.9 -1.05 -9.95 L-0.95 -9.45 -0.8 -9.45 0.0 -12.0 M1.8 -1.5 L1.8 -1.45 1.8 -1.4 1.7 -1.4 1.6 -3.0 Q1.6 -4.7 2.25 -5.05 L2.45 -4.8 1.8 -1.5 M-1.7 -13.9 L-1.45 -14.0 Q-1.65 -14.8 -0.75 -16.75 -1.8 -16.75 -1.8 -14.1 L-1.7 -13.9 M0.25 -4.3 Q0.7 -4.75 0.7 -5.8 L0.6 -6.0 Q0.05 -5.65 0.05 -4.6 L0.25 -4.3" fill="#519579" fill-rule="evenodd" stroke="none"/>
    <path d="M0.8 -17.25 L0.65 -17.7 0.55 -17.7 Q0.0 -15.5 0.0 -14.3 L0.05 -14.15 0.2 -14.15 0.8 -17.25 M1.4 -14.3 L1.3 -14.7 1.4 -14.3 M1.75 -10.15 L1.55 -10.6 Q0.55 -9.6 0.55 -7.1 L0.6 -6.9 0.85 -6.9 1.75 -10.15 M0.4 -8.5 L0.25 -8.8 -0.4 -7.25 -0.35 -6.95 Q0.4 -7.4 0.4 -8.5 M1.3 -13.8 L1.2 -12.65 1.3 -12.6 1.45 -13.4 1.4 -13.8 1.3 -13.8 M-2.5 -2.8 L-2.1 -2.75 -1.15 -5.3 -0.95 -3.35 0.1 -3.35 0.55 -3.15 1.35 -5.85 1.25 -6.45 -0.75 -6.55 -1.55 -6.3 -3.1 -7.25 -2.45 -8.75 Q-2.15 -9.2 -2.05 -8.75 L-1.9 -8.7 -0.75 -8.55 0.35 -11.75 0.0 -12.0 -0.8 -9.45 -0.95 -9.45 -1.05 -9.95 Q-1.05 -10.9 -0.2 -12.15 L-0.35 -12.25 -0.5 -12.6 -0.9 -12.9 -0.85 -13.4 -3.0 -11.0 -1.45 -13.1 -0.95 -14.05 Q-0.4 -15.15 -0.2 -16.55 -0.1 -17.5 -0.65 -18.35 L-0.6 -20.0 -4.6 -10.1 -3.9 -9.9 -3.8 -8.8 -3.15 -8.55 -6.75 -3.9 -6.05 -3.7 -5.0 -4.6 -4.45 -4.2 -4.1 -4.35 -3.9 -3.2 -3.15 -3.25 Q-2.95 -3.35 -2.8 -2.8 L-1.8 -6.25 -1.65 -6.25 -1.8 -5.05 Q-1.8 -3.6 -2.5 -2.8 M1.8 -1.4 L0.8 2.0 -0.4 2.0 -0.75 -2.2 -2.15 0.2 -3.4 0.3 -3.9 -0.5 -6.6 0.95 -5.85 -2.6 -8.2 -1.7 -8.6 -2.35 -7.75 -4.05 -8.3 -4.75 -5.7 -7.65 -6.75 -8.35 -4.2 -12.0 -2.35 -17.05 -2.6 -17.7 0.0 -23.1 3.8 -10.1 3.15 -9.55 6.1 -3.4 5.7 -2.95 6.1 -1.3 4.1 -1.85 3.8 0.55 3.0 0.5 1.8 -1.5 2.45 -4.8 2.25 -5.05 Q1.6 -4.7 1.6 -3.0 L1.7 -1.4 1.8 -1.4 M2.8 -4.65 L2.6 -5.4 2.25 -6.75 2.6 -5.4 2.8 -4.65 M3.75 -4.2 L3.65 -4.75 3.65 -5.15 3.65 -4.75 3.75 -4.2 M0.25 -4.3 L0.05 -4.6 Q0.05 -5.65 0.6 -6.0 L0.7 -5.8 Q0.7 -4.75 0.25 -4.3 M-1.7 -13.9 L-1.8 -14.1 Q-1.8 -16.75 -0.75 -16.75 -1.65 -14.8 -1.45 -14.0 L-1.7 -13.9" fill="#306756" fill-rule="evenodd" stroke="none"/>
    <path d="M-2.5 -2.8 L-2.1 -2.75 -1.15 -5.3 -0.95 -3.35 0.1 -3.35 0.55 -3.15 1.35 -5.85 1.25 -6.45 -0.75 -6.55 -1.55 -6.3 -3.1 -7.25 -2.45 -8.75 Q-2.15 -9.2 -2.05 -8.75 L-1.9 -8.7 -0.75 -8.55 0.35 -11.75 0.0 -12.0 M-0.2 -12.15 L-0.35 -12.25 -0.5 -12.6 -0.9 -12.9 -0.85 -13.4 -3.0 -11.0 -1.45 -13.1 -0.95 -14.05 Q-0.4 -15.15 -0.2 -16.55 -0.1 -17.5 -0.65 -18.35 L-0.6 -20.0 -4.6 -10.1 -3.9 -9.9 -3.8 -8.8 -3.15 -8.55 -6.75 -3.9 -6.05 -3.7 -5.0 -4.6 -4.45 -4.2 -4.1 -4.35 -3.9 -3.2 -3.15 -3.25 Q-2.95 -3.35 -2.8 -2.8 M1.8 -1.4 L0.8 2.0 -0.4 2.0 -0.75 -2.2 -2.15 0.2 -3.4 0.3 -3.9 -0.5 -6.6 0.95 -5.85 -2.6 -8.2 -1.7 -8.6 -2.35 -7.75 -4.05 -8.3 -4.75 -5.7 -7.65 -6.75 -8.35 -4.2 -12.0 -2.35 -17.05 -2.6 -17.7 0.0 -23.1 3.8 -10.1 3.15 -9.55 6.1 -3.4 5.7 -2.95 6.1 -1.3 4.1 -1.85 3.8 0.55 3.0 0.5 1.8 -1.5" fill="none" stroke="#660000" stroke-linecap="round" stroke-linejoin="round" stroke-opacity="0.2" stroke-width="0.05"/>
    <path d="M1.3 -14.7 L1.4 -14.3 M3.65 -5.15 L3.65 -4.75 3.75 -4.2 M2.25 -6.75 L2.6 -5.4 2.8 -4.65" fill="none" stroke="#660000" stroke-linecap="round" stroke-linejoin="round" stroke-opacity="0.3019608" stroke-width="0.05"/>
  </g>
</svg>
