<?xml version="1.0" encoding="UTF-8" standalone="no"?>
<svg xmlns:xlink="http://www.w3.org/1999/xlink" height="11.3px" width="4.0px" xmlns="http://www.w3.org/2000/svg">
  <g transform="matrix(1.0, 0.0, 0.0, 1.0, 2.6, 2.6)">
    <path d="M0.7 -0.6 L-0.2 -0.4 -1.15 -0.6 -1.5 -1.05 -1.15 -1.5 -0.2 -1.7 0.7 -1.5 1.1 -1.05 0.7 -0.6" fill="#ffffff" fill-rule="evenodd" stroke="none"/>
    <path d="M-0.95 -1.8 Q-1.4 -1.75 -1.4 -2.05 -1.35 -2.35 -0.35 -2.3 L-0.05 -2.15 -0.95 -1.8" fill="#e6b8b5" fill-rule="evenodd" stroke="none"/>
    <path d="M0.95 -2.5 L1.3 -2.2 1.4 -1.7 1.1 -1.35 0.6 -1.3 -1.0 -1.05 -1.5 -1.0 -1.6 -1.05 -1.95 -0.9 -1.95 -0.7 -1.95 8.4 -2.05 8.6 -2.3 8.7 -2.5 8.6 -2.6 8.4 -2.6 -0.7 -2.6 -0.8 -2.5 -1.2 -2.35 -1.35 -1.9 -1.6 -1.9 -1.8 -1.6 -2.15 Q-0.3 -2.85 0.95 -2.5 M-0.95 -1.8 L-0.05 -2.15 -0.35 -2.3 Q-1.35 -2.35 -1.4 -2.05 -1.4 -1.75 -0.95 -1.8" fill="url(#gradient0)" fill-rule="evenodd" stroke="none"/>
  </g>
  <defs>
    <linearGradient gradientTransform="matrix(4.0E-4, 0.0072, -0.0069, 4.0E-4, -0.6, 3.05)" gradientUnits="userSpaceOnUse" id="gradient0" spreadMethod="pad" x1="-819.2" x2="819.2">
      <stop offset="0.0" stop-color="#5e4b4a"/>
      <stop offset="1.0" stop-color="#1f1818"/>
    </linearGradient>
  </defs>
</svg>
