<?xml version="1.0" encoding="UTF-8" standalone="no"?>
<svg xmlns:xlink="http://www.w3.org/1999/xlink" height="83.35px" width="70.15px" xmlns="http://www.w3.org/2000/svg">
  <g transform="matrix(1.0, 0.0, 0.0, 1.0, 35.05, 41.65)">
    <path d="M29.15 -21.95 L35.1 -11.35 22.25 4.8 18.05 1.75 -4.5 17.85 -4.5 32.8 -1.85 36.65 -16.25 41.7 -33.25 35.15 -23.2 30.25 -35.05 13.9 -32.2 8.55 -12.85 7.0 -14.65 0.3 -6.75 0.3 5.05 -11.85 -6.0 -30.45 -3.85 -38.05 3.05 -41.65 3.55 -37.95 11.55 -35.95 17.85 -20.5 29.15 -21.95" fill="#bcd7fe" fill-rule="evenodd" stroke="none"/>
    <path d="M29.15 -21.95 L35.1 -11.35 22.25 4.8 18.05 1.75 -4.5 17.85 -4.5 32.8 -1.85 36.65 -16.25 41.7 -33.25 35.15 -23.2 30.25 -35.05 13.9 -32.2 8.55 -12.85 7.0 -14.65 0.3 -6.75 0.3 5.05 -11.85 -6.0 -30.45 -3.85 -38.05 3.05 -41.65 3.55 -37.95 11.55 -35.95 17.85 -20.5 29.15 -21.95 Z" fill="none" stroke="#ffffff" stroke-linecap="round" stroke-linejoin="round" stroke-width="0.05"/>
  </g>
</svg>
