<?xml version="1.0" encoding="UTF-8" standalone="no"?>
<svg xmlns:xlink="http://www.w3.org/1999/xlink" height="359.7px" width="148.8px" xmlns="http://www.w3.org/2000/svg">
  <g transform="matrix(1.0, 0.0, 0.0, 1.0, 65.95, 314.05)">
    <path d="M82.85 11.35 L14.2 45.65 -29.95 24.95 48.55 -5.85 82.85 11.35" fill="#663e3e" fill-opacity="0.3019608" fill-rule="evenodd" stroke="none"/>
    <path d="M-1.95 -211.05 L50.05 -237.05 50.05 -203.05 50.05 -197.05 -1.8 -171.1 -1.95 -211.05 M58.05 4.95 L2.05 32.95 2.05 -167.05 9.75 -170.9 42.05 -187.05 58.05 -195.05 58.05 4.95 M42.05 -187.05 L42.0 -187.0 42.05 -186.95 42.05 -187.05" fill="url(#gradient0)" fill-rule="evenodd" stroke="none"/>
    <path d="M-5.95 32.95 L-61.95 4.95 -61.9 -195.05 -45.95 -187.05 -5.95 -167.05 -5.95 32.95 M-53.9 -203.1 L-53.9 -207.05 -53.9 -211.05 -53.9 -217.05 -53.9 -221.05 -53.9 -227.05 -53.9 -231.05 -53.9 -237.05 -1.95 -211.05 -1.8 -171.1 -1.95 -171.05 -2.0 -171.1 -53.9 -197.05 -53.9 -201.05 -53.9 -203.1 M-45.85 -187.0 L-45.95 -187.05 -45.95 -186.95 -45.85 -187.0" fill="url(#gradient1)" fill-rule="evenodd" stroke="none"/>
    <path d="M62.05 -197.05 L62.05 2.95 58.05 4.95 58.05 -195.05 62.05 -197.05 M2.05 32.95 L-1.95 34.95 -1.95 -165.05 2.05 -167.05 2.05 32.95" fill="#6f7596" fill-rule="evenodd" stroke="none"/>
    <path d="M-1.95 34.95 L-5.95 32.95 -5.95 -167.05 -1.95 -165.05 -1.95 34.95 M-61.95 4.95 L-65.95 2.95 -65.95 -197.05 -65.9 -197.05 -61.9 -195.05 -61.95 4.95" fill="url(#gradient2)" fill-rule="evenodd" stroke="none"/>
    <path d="M-1.95 -228.6 L-1.95 -211.05 -53.9 -237.05 -53.85 -237.1 -46.75 -251.05 -1.95 -228.6" fill="#c0d6d6" fill-rule="evenodd" stroke="none"/>
    <path d="M42.85 -251.0 L42.85 -251.05 50.05 -237.05 -1.95 -211.05 -1.95 -228.6 42.85 -251.0" fill="#7c9cdb" fill-rule="evenodd" stroke="none"/>
    <path d="M-65.9 -197.05 L-53.9 -203.1 -53.9 -201.05 -53.9 -197.05 -2.0 -171.1 -1.95 -171.05 9.75 -170.9 2.05 -167.05 -1.95 -165.05 -5.95 -167.05 -45.95 -187.05 -61.9 -195.05 -65.9 -197.05" fill="#b5bdb9" fill-rule="evenodd" stroke="none"/>
    <path d="M42.85 -251.05 L42.85 -251.0 31.8 -256.55 42.85 -251.05 M50.05 -203.05 L62.05 -197.05 58.05 -195.05 42.05 -187.05 9.75 -170.9 -1.95 -171.05 -1.8 -171.1 50.05 -197.05 50.05 -203.05" fill="#909693" fill-rule="evenodd" stroke="none"/>
    <path d="M31.8 -256.55 L42.85 -251.0 -1.95 -228.6 -46.75 -251.05 -46.05 -251.4 -35.9 -256.5 -2.1 -273.5 31.8 -256.55 M-1.9 -234.15 L-1.7 -234.25 -1.9 -234.15" fill="#9eb0b0" fill-rule="evenodd" stroke="none"/>
    <path d="M50.05 -237.05 L42.85 -251.05 M50.05 -237.05 L50.05 -203.05 50.05 -197.05 M-53.9 -203.1 L-53.9 -207.05 -53.9 -211.05 -53.9 -217.05 -53.9 -221.05 M-53.9 -227.05 L-53.9 -231.05 -53.9 -237.05 M-53.85 -237.1 L-46.75 -251.05 M-53.85 -237.1 L-53.9 -237.05" fill="none" stroke="#660000" stroke-linecap="round" stroke-linejoin="round" stroke-opacity="0.3019608" stroke-width="0.05"/>
    <path d="M42.85 -251.0 L-1.95 -228.6 -46.75 -251.05 M-1.95 -211.05 L50.05 -237.05 M50.05 -203.05 L62.05 -197.05 62.05 2.95 58.05 4.95 2.05 32.95 -1.95 34.95 -5.95 32.95 -61.95 4.95 -65.95 2.95 -65.95 -197.05 -65.9 -197.05 -53.9 -203.1 M42.05 -187.05 L42.05 -186.95 42.0 -187.0 42.05 -187.05 9.75 -170.9 2.05 -167.05 2.05 32.95 M42.05 -187.05 L58.05 -195.05 62.05 -197.05 M50.05 -197.05 L-1.8 -171.1 -1.95 -171.05 M58.05 -195.05 L58.05 4.95 M-53.9 -237.05 L-1.95 -211.05 M-53.9 -201.05 L-53.9 -197.05 -2.0 -171.1 -1.95 -171.05 M-53.9 -201.05 L-53.9 -203.1 M-5.95 -167.05 L-1.95 -165.05 2.05 -167.05 M-45.85 -187.0 L-45.95 -187.05 -45.95 -186.95 -45.85 -187.0 M-65.9 -197.05 L-61.9 -195.05 -45.95 -187.05 -5.95 -167.05 -5.95 32.95 M-65.95 -197.05 L-65.9 -197.05 M-1.95 -165.05 L-1.95 34.95 M-61.9 -195.05 L-61.95 4.95" fill="none" stroke="#660000" stroke-linecap="round" stroke-linejoin="miter" stroke-miterlimit="3.0" stroke-opacity="0.3019608" stroke-width="0.05"/>
    <path d="M42.85 -251.0 L42.85 -251.05 M-53.9 -237.05 L-53.85 -237.1" fill="none" stroke="#660000" stroke-linecap="round" stroke-linejoin="miter" stroke-miterlimit="3.0" stroke-opacity="0.3019608" stroke-width="0.05"/>
    <path d="M-1.95 -228.6 L-1.95 -211.05 -1.8 -171.1 M-53.9 -221.05 L-53.9 -227.05" fill="none" stroke="#660000" stroke-linecap="round" stroke-linejoin="round" stroke-opacity="0.3019608" stroke-width="0.05"/>
    <path d="M31.8 -256.55 L42.85 -251.0 M-46.75 -251.05 L-46.05 -251.4 -35.9 -256.5 -2.1 -273.5 31.8 -256.55" fill="none" stroke="#660000" stroke-linecap="round" stroke-linejoin="miter" stroke-miterlimit="3.0" stroke-opacity="0.3019608" stroke-width="0.05"/>
    <path d="M4.95 -305.55 L5.0 -305.55 7.6 -291.9 7.2 -291.4 7.15 -291.4 6.8 -278.95 4.95 -290.3 -2.05 -292.8 -2.05 -296.05 4.95 -305.55 M30.6 -268.8 L38.5 -267.1 38.55 -267.0 38.6 -267.0 38.7 -267.1 42.65 -251.1 24.75 -242.05 24.75 -245.65 24.75 -256.05 24.8 -256.1 32.75 -262.4 32.05 -264.4 30.6 -268.8 M13.35 -247.75 L15.85 -237.7 -2.0 -228.65 -2.05 -246.65 -1.05 -246.9 9.9 -249.45 10.0 -249.45 11.5 -249.8 12.65 -250.05 12.75 -250.1 13.35 -247.75 M-17.4 -247.7 Q-21.35 -245.8 -25.25 -243.85 L-25.05 -245.55 -25.0 -245.85 -24.75 -248.0 -24.45 -250.65 -23.7 -257.05 -23.55 -258.2 -23.55 -258.25 Q-21.4 -275.35 -19.4 -287.9 L-19.15 -289.4 -18.45 -293.8 -18.4 -293.85 -11.75 -291.55 -11.3 -291.4 -11.25 -291.4 -10.85 -278.95 -12.6 -268.15 -14.9 -253.9 -15.55 -249.8 -16.75 -250.05 -16.85 -250.1 -17.4 -247.75 -17.4 -247.7 M-42.6 -267.15 L-34.7 -268.8 -35.8 -265.5 -36.8 -262.4 -42.7 -267.0 -42.6 -267.15 M32.75 -262.4 L38.55 -267.0 32.75 -262.4 M-17.4 -247.75 L-17.8 -247.55 -17.4 -247.75" fill="url(#gradient3)" fill-rule="evenodd" stroke="none"/>
    <path d="M19.15 -303.45 L30.6 -268.8 32.05 -264.4 19.7 -256.3 19.45 -258.2 19.45 -258.25 Q17.3 -275.35 15.35 -287.9 L14.35 -293.8 14.4 -293.8 19.15 -303.45 M6.8 -278.95 L8.55 -268.15 10.85 -253.9 11.5 -249.8 10.0 -249.45 9.9 -249.45 -1.05 -246.9 -2.05 -246.65 -2.05 -247.4 -2.05 -292.8 4.95 -290.3 6.8 -278.95" fill="#7c9cdb" fill-rule="evenodd" stroke="none"/>
    <path d="M-9.05 -305.55 L-2.05 -296.05 -2.05 -292.8 -2.05 -247.4 -2.05 -246.65 -3.0 -246.9 -3.05 -246.9 -14.0 -249.45 -14.1 -249.45 -15.55 -249.8 -14.9 -253.9 -12.6 -268.15 -10.85 -278.95 -11.25 -291.4 -11.3 -291.4 -11.7 -291.9 -9.05 -305.55 M-34.7 -268.8 L-23.2 -303.45 -18.45 -293.8 -19.15 -289.4 -19.4 -287.9 Q-21.4 -275.35 -23.55 -258.25 L-23.55 -258.2 -23.7 -257.05 -35.8 -265.5 -34.7 -268.8 M-2.05 -292.8 L-9.0 -290.3 -9.05 -290.3 -10.85 -278.95 -9.05 -290.3 -9.0 -290.3 -2.05 -292.8" fill="url(#gradient4)" fill-rule="evenodd" stroke="none"/>
    <path d="M21.15 -243.85 L13.7 -247.55 13.35 -247.75 12.75 -250.1 12.65 -250.05 11.5 -249.8 10.85 -253.9 8.55 -268.15 6.8 -278.95 7.15 -291.4 7.2 -291.4 7.7 -291.55 14.35 -293.85 14.35 -293.8 15.35 -287.9 Q17.3 -275.35 19.45 -258.25 L19.45 -258.2 19.7 -256.3 20.7 -248.0 20.95 -245.85 21.15 -243.85" fill="url(#gradient5)" fill-rule="evenodd" stroke="none"/>
    <path d="M-2.0 -228.65 L-2.05 -228.65 -6.9 -231.05 -6.9 -231.1 -19.9 -237.7 -17.4 -247.7 -17.4 -247.75 -16.85 -250.1 -16.75 -250.05 -15.55 -249.8 -14.1 -249.45 -14.0 -249.45 -3.05 -246.9 -3.0 -246.9 -2.05 -246.65 -2.0 -228.65 M-28.8 -245.65 L-28.8 -242.2 -40.8 -248.1 -41.6 -248.5 -45.65 -250.55 -46.7 -251.1 -42.75 -267.1 -42.7 -267.0 -36.8 -262.4 -28.85 -256.1 -28.8 -256.05 -28.8 -245.65 M-2.05 -228.65 L-2.05 -228.7 -2.05 -228.65" fill="url(#gradient6)" fill-rule="evenodd" stroke="none"/>
    <path d="M7.6 -291.9 L14.25 -299.9 19.15 -303.45 14.4 -293.8 14.35 -293.85 7.7 -291.55 7.6 -291.9" fill="#ffffff" fill-rule="evenodd" stroke="none"/>
    <path d="M-25.25 -243.85 L-28.8 -245.65 -28.8 -256.05 -28.8 -256.1 -28.85 -256.1 -36.8 -262.4 -35.8 -265.5 -23.7 -257.05 -24.45 -250.65 -24.75 -248.0 -25.0 -245.85 -25.05 -245.55 -25.25 -243.85" fill="#9eb0b0" fill-rule="evenodd" stroke="none"/>
    <path d="M24.75 -245.65 L21.15 -243.85 20.95 -245.85 20.7 -248.0 19.7 -256.3 32.05 -264.4 32.75 -262.4 24.8 -256.1 24.75 -256.1 24.7 -256.05 24.75 -256.05 24.75 -245.65" fill="#6b85bd" fill-rule="evenodd" stroke="none"/>
    <path d="M-23.2 -303.45 L-18.35 -299.9 -11.7 -291.9 -11.75 -291.55 -18.4 -293.85 -18.45 -293.8 -23.2 -303.45" fill="#bcd7fe" fill-rule="evenodd" stroke="none"/>
    <path d="M5.0 -305.55 L4.95 -305.55 -2.05 -296.05 -9.05 -305.55 -2.05 -314.05 5.0 -305.55" fill="#ebf1f0" fill-rule="evenodd" stroke="none"/>
    <path d="M5.0 -305.55 L4.95 -305.55 5.0 -305.55 -2.05 -314.05 -9.05 -305.55 -2.05 -296.05 4.95 -305.55 M7.6 -291.9 L14.25 -299.9 19.15 -303.45 30.6 -268.8 38.5 -267.1 38.55 -267.1 38.7 -267.1 42.65 -251.1 24.75 -242.05 24.75 -245.65 21.15 -243.85 13.7 -247.55 13.35 -247.75 15.85 -237.7 -2.0 -228.65 -2.05 -228.65 -6.9 -231.05 -6.9 -231.1 -19.9 -237.7 -17.4 -247.7 Q-21.35 -245.8 -25.25 -243.85 L-28.8 -245.65 -28.8 -242.2 -40.8 -248.1 -41.6 -248.5 -45.65 -250.55 -46.7 -251.1 -42.75 -267.1 -42.6 -267.15 -34.7 -268.8 -23.2 -303.45 -18.35 -299.9 -11.7 -291.9 -9.05 -305.55 -9.1 -305.55 -9.05 -305.55 M14.35 -293.8 L15.35 -287.9 Q17.3 -275.35 19.45 -258.25 L19.45 -258.2 19.7 -256.3 20.7 -248.0 20.95 -245.85 21.15 -243.85 M32.05 -264.4 L30.6 -268.8 M14.4 -293.8 L14.35 -293.8 14.35 -293.85 7.7 -291.55 7.2 -291.4 7.15 -291.4 6.8 -278.95 8.55 -268.15 10.85 -253.9 11.5 -249.8 12.65 -250.05 12.75 -250.1 13.35 -247.75 13.7 -247.55 M14.4 -293.8 L19.15 -303.45 M14.35 -293.8 L14.35 -293.85 M14.4 -293.8 L14.35 -293.8 M7.2 -291.4 L7.6 -291.9 5.0 -305.55 M7.15 -291.4 L7.2 -291.4 M7.6 -291.9 L7.7 -291.55 M6.8 -278.95 L4.95 -290.3 -2.05 -292.8 -2.05 -247.4 -2.05 -246.65 -1.05 -246.9 9.9 -249.45 10.0 -249.45 11.5 -249.8 M12.75 -250.1 L12.65 -250.05 M38.55 -267.0 L38.6 -267.0 38.7 -267.1 M38.55 -267.0 L32.75 -262.4 24.8 -256.1 24.75 -256.05 24.75 -245.65 M32.05 -264.4 L32.75 -262.4 M24.75 -256.1 L24.75 -256.05 24.7 -256.05 24.75 -256.1 24.8 -256.1 M-10.85 -278.95 L-9.05 -290.3 -9.0 -290.3 -2.05 -292.8 -2.05 -296.05 M-11.7 -291.9 L-11.75 -291.55 -11.3 -291.4 -11.7 -291.9 M-11.25 -291.4 L-10.85 -278.95 -12.6 -268.15 -14.9 -253.9 -15.55 -249.8 -14.1 -249.45 -14.0 -249.45 -3.05 -246.9 -3.0 -246.9 -2.05 -246.65 -2.05 -247.4 M-11.3 -291.4 L-11.25 -291.4 M-18.45 -293.8 L-18.4 -293.85 -11.75 -291.55 M-18.4 -293.85 L-18.45 -293.8 -19.15 -289.4 -19.4 -287.9 Q-21.4 -275.35 -23.55 -258.25 L-23.55 -258.2 -23.7 -257.05 -24.45 -250.65 -24.75 -248.0 -25.0 -245.85 -25.05 -245.55 -25.25 -243.85 M-35.8 -265.5 L-34.7 -268.8 M-36.8 -262.4 L-35.8 -265.5 M-28.8 -256.1 L-28.85 -256.1 -28.8 -256.05 -28.8 -256.1 -28.8 -256.05 -28.8 -245.65 M-28.85 -256.1 L-36.8 -262.4 -42.7 -267.0 -42.75 -267.1 M-16.75 -250.05 L-16.85 -250.1 -17.4 -247.75 -17.4 -247.7 M-16.75 -250.05 L-15.55 -249.8 M-16.85 -250.1 L-16.75 -250.05 M-17.4 -247.75 L-17.8 -247.55 -17.4 -247.75 M-2.05 -228.65 L-2.05 -228.7 -2.05 -228.65 M-2.05 -246.65 L-2.0 -228.65 M-23.2 -303.45 L-18.45 -293.8" fill="none" stroke="#660000" stroke-linecap="round" stroke-linejoin="miter" stroke-miterlimit="3.0" stroke-opacity="0.3019608" stroke-width="0.05"/>
  </g>
  <defs>
    <linearGradient gradientTransform="matrix(0.0, 0.1392, -0.0342, 0.0, 30.05, -81.05)" gradientUnits="userSpaceOnUse" id="gradient0" spreadMethod="pad" x1="-819.2" x2="819.2">
      <stop offset="0.34509803921568627" stop-color="#6f8ec4"/>
      <stop offset="1.0" stop-color="#015773"/>
    </linearGradient>
    <linearGradient gradientTransform="matrix(0.0, 0.1211, -0.0342, 0.0, -33.95, -92.25)" gradientUnits="userSpaceOnUse" id="gradient1" spreadMethod="pad" x1="-819.2" x2="819.2">
      <stop offset="0.0" stop-color="#b0c4c4"/>
      <stop offset="0.0392156862745098" stop-color="#73959e"/>
      <stop offset="0.12941176470588237" stop-color="#c4c4c4"/>
      <stop offset="0.34509803921568627" stop-color="#818ea6"/>
      <stop offset="1.0" stop-color="#016c87"/>
    </linearGradient>
    <linearGradient gradientTransform="matrix(0.0, 0.0556, -0.0159, 0.0, -67.5, -102.0)" gradientUnits="userSpaceOnUse" id="gradient2" spreadMethod="pad" x1="-819.2" x2="819.2">
      <stop offset="0.1607843137254902" stop-color="#a4aca8"/>
      <stop offset="0.5568627450980392" stop-color="#7e988d"/>
    </linearGradient>
    <linearGradient gradientTransform="matrix(0.0, 0.1392, -0.0342, 0.0, 30.05, -81.05)" gradientUnits="userSpaceOnUse" id="gradient3" spreadMethod="pad" x1="-819.2" x2="819.2">
      <stop offset="0.34509803921568627" stop-color="#6f8ec4"/>
      <stop offset="1.0" stop-color="#015773"/>
    </linearGradient>
    <linearGradient gradientTransform="matrix(0.0, 0.0347, -0.0364, 0.0, -27.7, -264.65)" gradientUnits="userSpaceOnUse" id="gradient4" spreadMethod="pad" x1="-819.2" x2="819.2">
      <stop offset="0.0" stop-color="#c0d6d6"/>
      <stop offset="1.0" stop-color="#a2b5b5"/>
    </linearGradient>
    <linearGradient gradientTransform="matrix(1.0, 0.0, 0.0, 1.0, 0.0, 0.0)" gradientUnits="userSpaceOnUse" id="gradient5" spreadMethod="pad" x1="-819.2" x2="819.2">
      <stop offset="0.0" stop-color="#c0d6d6"/>
      <stop offset="1.0" stop-color="#a2b5b5"/>
    </linearGradient>
    <linearGradient gradientTransform="matrix(0.0, 0.0222, -0.0109, 0.0, -37.15, -252.25)" gradientUnits="userSpaceOnUse" id="gradient6" spreadMethod="pad" x1="-819.2" x2="819.2">
      <stop offset="0.0" stop-color="#c0d6d6"/>
      <stop offset="1.0" stop-color="#a2b5b5"/>
    </linearGradient>
  </defs>
</svg>
