<?xml version="1.0" encoding="UTF-8" standalone="no"?>
<svg xmlns:xlink="http://www.w3.org/1999/xlink" height="15.6px" width="6.0px" xmlns="http://www.w3.org/2000/svg">
  <g transform="matrix(1.0, 0.0, 0.0, 1.0, 3.0, 14.1)">
    <path d="M1.1 -0.55 L0.0 -0.75 -1.05 -0.55 -1.45 -0.2 -1.5 0.0 -1.45 0.2 -1.05 0.55 0.0 0.75 1.1 0.55 1.5 0.0 1.1 -0.55 M2.15 -1.1 Q3.0 -0.65 3.0 0.0 3.0 0.6 2.15 1.05 L0.0 1.5 -1.45 1.3 -2.1 1.05 Q-3.0 0.6 -3.0 0.0 -3.0 -0.65 -2.1 -1.1 L-1.45 -1.35 0.0 -1.5 2.15 -1.1" fill="#ffffff" fill-rule="evenodd" stroke="none"/>
    <path d="M1.1 -0.55 L1.5 0.0 1.1 0.55 0.0 0.75 -1.05 0.55 -1.45 0.2 -1.5 0.0 -1.45 -0.2 -1.05 -0.55 0.0 -0.75 1.1 -0.55" fill="#cebb9f" fill-rule="evenodd" stroke="none"/>
    <path d="M1.1 -0.55 L1.5 0.0 1.1 0.55 0.0 0.75 -1.05 0.55 -1.45 0.2 -1.5 0.0 -1.45 -0.2 -1.05 -0.55 0.0 -0.75 1.1 -0.55 M2.15 -1.1 Q3.0 -0.65 3.0 0.0 3.0 0.6 2.15 1.05 L0.0 1.5 -1.45 1.3 -2.1 1.05 Q-3.0 0.6 -3.0 0.0 -3.0 -0.65 -2.1 -1.1 L-1.45 -1.35 0.0 -1.5 2.15 -1.1" fill="none" stroke="#660000" stroke-linecap="round" stroke-linejoin="miter" stroke-miterlimit="3.0" stroke-opacity="0.15294118" stroke-width="0.05"/>
    <path d="M-0.75 -8.05 L-0.05 -8.05 1.05 -8.05" fill="none" stroke="#ffffff" stroke-linecap="round" stroke-linejoin="miter" stroke-miterlimit="3.0" stroke-width="0.05"/>
    <path d="M-0.05 -8.05 L-0.05 -14.1 M-0.05 0.3 L-0.05 -8.05" fill="none" stroke="#573a27" stroke-linecap="round" stroke-linejoin="miter" stroke-miterlimit="3.0" stroke-opacity="0.5019608" stroke-width="0.05"/>
  </g>
</svg>
