<?xml version="1.0" encoding="UTF-8" standalone="no"?>
<svg xmlns:xlink="http://www.w3.org/1999/xlink" height="12.55px" width="19.2px" xmlns="http://www.w3.org/2000/svg">
  <g transform="matrix(1.0, 0.0, 0.0, 1.0, 9.6, 6.3)">
    <path d="M-9.6 -2.35 L-1.65 -6.3 -1.6 -6.3 9.55 -0.7 1.55 3.25 -9.6 -2.35 M-5.6 -1.35 L1.55 2.25 5.5 0.3 7.55 -0.7 -1.6 -5.25 -1.6 -5.3 -1.65 -5.3 -7.6 -2.35 -5.6 -1.35" fill="#f7f4ee" fill-rule="evenodd" stroke="none"/>
    <path d="M-9.6 -2.35 L1.55 3.25 1.55 6.25 -9.6 0.65 -9.6 -2.35 M5.5 0.3 L-1.65 -3.3 -1.65 -5.3 -1.6 -5.3 -1.6 -5.25 7.55 -0.7 5.5 0.3" fill="#faf9f3" fill-rule="evenodd" stroke="none"/>
    <path d="M1.55 3.25 L9.55 -0.7 9.55 2.25 9.6 2.25 9.5 2.3 1.55 6.25 1.55 3.25 M-1.65 -3.3 L-5.6 -1.35 -7.6 -2.35 -1.65 -5.3 -1.65 -3.3" fill="#97bcbc" fill-rule="evenodd" stroke="none"/>
    <path d="M9.55 -0.7 L9.55 -0.75 9.55 -0.7 -1.6 -6.3 -1.65 -6.3 -9.6 -2.35 1.55 3.25 9.55 -0.7 M-5.6 -1.35 L1.55 2.25 5.5 0.3 -1.65 -3.3 -5.6 -1.35 -7.6 -2.35 -1.65 -5.3 -1.6 -5.3 -1.6 -5.25 7.55 -0.7 5.5 0.3 M1.55 3.25 L1.55 6.25 M9.5 2.3 L9.6 2.25 9.55 2.25 9.55 -0.7 M-1.65 -5.3 L-1.65 -3.3 M-9.6 -2.35 L-9.6 0.65" fill="none" stroke="#660000" stroke-linecap="round" stroke-linejoin="miter" stroke-miterlimit="3.0" stroke-opacity="0.3019608" stroke-width="0.05"/>
    <path d="M1.55 6.25 L9.5 2.3 M-9.6 0.65 L1.55 6.25" fill="none" stroke="#660000" stroke-linecap="round" stroke-linejoin="miter" stroke-miterlimit="3.0" stroke-opacity="0.101960786" stroke-width="0.05"/>
  </g>
</svg>
