<?xml version="1.0" encoding="UTF-8" standalone="no"?>
<svg xmlns:xlink="http://www.w3.org/1999/xlink" height="79.7px" width="52.15px" xmlns="http://www.w3.org/2000/svg">
  <g transform="matrix(1.0, 0.0, 0.0, 1.0, 26.05, 39.85)">
    <path d="M2.8 -29.6 L13.8 -22.75 11.8 -20.85 8.45 -21.5 6.9 -18.85 6.25 5.55 21.15 20.05 20.15 23.65 26.1 29.85 16.6 39.85 6.2 36.6 6.2 32.7 0.15 27.55 -15.6 29.15 -26.05 16.05 -25.5 2.05 -21.75 -3.9 -21.75 -12.95 -14.05 -15.25 -13.4 -22.05 -10.05 -26.9 -10.05 -34.05 -3.9 -33.4 2.8 -39.85 2.8 -29.6" fill="#bcd7fe" fill-rule="evenodd" stroke="none"/>
    <path d="M2.8 -29.6 L13.8 -22.75 11.8 -20.85 8.45 -21.5 6.9 -18.85 6.25 5.55 21.15 20.05 20.15 23.65 26.1 29.85 16.6 39.85 6.2 36.6 6.2 32.7 0.15 27.55 -15.6 29.15 -26.05 16.05 -25.5 2.05 -21.75 -3.9 -21.75 -12.95 -14.05 -15.25 -13.4 -22.05 -10.05 -26.9 -10.05 -34.05 -3.9 -33.4 2.8 -39.85 2.8 -29.6 Z" fill="none" stroke="#ffffff" stroke-linecap="round" stroke-linejoin="round" stroke-width="0.05"/>
  </g>
</svg>
