<?xml version="1.0" encoding="UTF-8" standalone="no"?>
<svg xmlns:xlink="http://www.w3.org/1999/xlink" height="164.8px" width="60.0px" xmlns="http://www.w3.org/2000/svg">
  <g transform="matrix(1.0, 0.0, 0.0, 1.0, 30.0, 82.4)">
    <path d="M-16.15 -82.4 L-9.1 -78.2 -9.1 -66.95 -16.15 -70.45 -16.15 -82.4 M-9.1 -61.95 L-9.1 -46.0 0.0 -41.1 0.0 -50.2 13.3 -43.2 13.3 -29.9 23.8 -25.7 23.4 -45.7 29.55 -42.6 29.8 -42.6 30.0 82.15 29.55 82.4 -30.0 52.6 -30.0 -53.85 -23.15 -50.2 -23.85 -29.9 -16.15 -25.7 -16.15 -65.45 -9.1 -61.95 M29.75 -54.55 L29.8 -47.75 29.55 -47.6 23.25 -50.75 23.1 -57.9 29.75 -54.55" fill="url(#gradient0)" fill-rule="evenodd" stroke="none"/>
  </g>
  <defs>
    <linearGradient gradientTransform="matrix(0.0, 0.1648, -0.0364, 0.0, -0.2, -59.6)" gradientUnits="userSpaceOnUse" id="gradient0" spreadMethod="pad" x1="-819.2" x2="819.2">
      <stop offset="0.0" stop-color="#ffffff"/>
      <stop offset="1.0" stop-color="#ffffff" stop-opacity="0.0"/>
    </linearGradient>
  </defs>
</svg>
