<?xml version="1.0" encoding="UTF-8" standalone="no"?>
<svg xmlns:xlink="http://www.w3.org/1999/xlink" height="19.9px" width="33.55px" xmlns="http://www.w3.org/2000/svg">
  <g transform="matrix(1.0, 0.0, 0.0, 1.0, 10.85, 8.8)">
    <path d="M22.7 5.85 L12.15 11.1 -1.35 4.3 9.15 -0.95 22.7 5.85" fill="#663e3e" fill-opacity="0.5019608" fill-rule="evenodd" stroke="none"/>
    <path d="M-3.85 3.0 Q-3.85 3.8 -4.7 3.8 L-5.3 3.6 -5.75 3.9 -6.25 3.75 -7.4 4.3 Q-7.8 4.3 -7.95 4.0 L-8.3 4.1 -8.65 3.95 -8.85 4.1 -9.4 3.2 Q-9.4 1.7 -8.6 1.7 -8.15 1.7 -8.15 2.65 L-8.1 2.7 Q-7.4 2.7 -7.4 3.1 L-6.3 2.0 -5.8 2.6 Q-5.9 1.45 -5.05 1.45 -4.65 1.45 -4.65 2.7 L-4.65 2.75 -4.25 2.55 Q-3.85 2.55 -3.85 3.0 M-2.6 4.6 L-2.6 4.7 -2.2 4.6 -2.3 4.6 -1.35 3.9 -1.1 4.15 -1.3 4.55 -0.05 5.4 Q-0.05 5.85 -0.4 5.85 L-1.1 5.8 Q-1.55 6.25 -2.5 6.25 -2.9 6.25 -2.9 5.6 L-3.3 5.55 -3.25 5.75 -4.2 6.7 Q-4.9 6.7 -5.35 5.25 L-4.65 4.4 Q-3.85 3.8 -3.15 3.8 -2.35 3.8 -2.6 4.6 M-8.4 5.6 Q-7.15 5.6 -7.15 6.6 -7.15 7.1 -7.55 7.1 L-8.0 6.9 Q-8.55 6.9 -9.1 7.55 -9.75 7.55 -9.75 6.25 L-9.75 6.2 -10.2 6.4 -10.85 5.75 -9.55 4.95 Q-8.9 4.95 -8.9 5.75 L-8.85 5.85 -8.4 5.6" fill="#996600" fill-opacity="0.47058824" fill-rule="evenodd" stroke="none"/>
    <path d="M2.55 -2.95 L6.6 1.45 6.8 1.65 6.75 8.35 -0.2 4.95 -0.15 -2.75 0.3 -2.8 0.5 -2.8 2.55 -2.95" fill="#edcca0" fill-rule="evenodd" stroke="none"/>
    <path d="M6.6 1.45 L6.8 1.6 6.8 1.65 7.25 2.15 17.6 -3.05 17.6 -3.0 17.6 3.35 7.2 8.6 6.75 8.35 6.8 1.65 6.6 1.45" fill="#c28394" fill-rule="evenodd" stroke="none"/>
    <path d="M14.2 -8.8 L14.25 -8.8 18.9 -3.7 17.6 -3.05 7.25 2.15 6.8 1.65 6.8 1.6 6.6 1.45 2.55 -2.95 14.2 -8.8 2.55 -2.95 0.5 -2.8 0.3 -2.8 -0.15 -2.75 -1.8 -2.6 9.85 -8.4 14.2 -8.8" fill="url(#gradient0)" fill-rule="evenodd" stroke="none"/>
    <path d="M17.6 -3.05 L18.9 -3.7 14.25 -8.8 14.2 -8.8 2.55 -2.95 6.6 1.45 M6.8 1.65 L7.25 2.15 17.6 -3.05 M-0.2 4.95 L-0.15 -2.75 -1.8 -2.6 9.85 -8.4 14.2 -8.8 M0.5 -2.8 L2.55 -2.95 M6.8 1.65 L6.6 1.45 M-0.15 -2.75 L0.3 -2.8" fill="none" stroke="#660000" stroke-linecap="round" stroke-linejoin="round" stroke-opacity="0.3019608" stroke-width="0.05"/>
    <path d="M17.6 -3.0 L17.6 3.35" fill="none" stroke="#660000" stroke-linecap="round" stroke-linejoin="round" stroke-opacity="0.3019608" stroke-width="0.05"/>
    <path d="M17.6 3.35 L7.2 8.6 6.75 8.35 -0.2 4.95" fill="none" stroke="#660000" stroke-linecap="round" stroke-linejoin="round" stroke-opacity="0.101960786" stroke-width="0.05"/>
    <path d="M14.55 1.75 L14.55 4.9 16.65 3.85 16.65 0.75 14.55 1.75" fill="#c27713" fill-rule="evenodd" stroke="none"/>
    <path d="M14.55 1.75 L14.55 4.9 16.65 3.85 16.65 0.75 14.55 1.75 Z" fill="none" stroke="#660000" stroke-linecap="round" stroke-linejoin="round" stroke-opacity="0.3019608" stroke-width="0.05"/>
    <path d="M10.9 3.6 L10.9 5.15 12.45 4.4 12.45 2.8 10.9 3.6" fill="#990000" fill-rule="evenodd" stroke="none"/>
    <path d="M10.9 3.6 L12.45 2.8 12.45 4.4 10.9 5.15 10.9 3.6 Z" fill="none" stroke="#660000" stroke-linecap="round" stroke-linejoin="round" stroke-opacity="0.3019608" stroke-width="0.05"/>
    <path d="M3.7 -0.45 L3.7 1.1 2.15 0.35 2.15 -1.25 3.7 -0.45" fill="#990000" fill-rule="evenodd" stroke="none"/>
    <path d="M3.7 -0.45 L2.15 -1.25 2.15 0.35 3.7 1.1 3.7 -0.45 Z" fill="none" stroke="#660000" stroke-linecap="round" stroke-linejoin="round" stroke-opacity="0.3019608" stroke-width="0.05"/>
    <path d="M3.9 3.95 L3.9 7.1 1.8 6.05 1.85 2.85 3.9 3.95" fill="#965c0e" fill-rule="evenodd" stroke="none"/>
    <path d="M3.9 3.95 L3.9 7.1 1.8 6.05 1.85 2.85 3.9 3.95 Z" fill="none" stroke="#660000" stroke-linecap="round" stroke-linejoin="round" stroke-opacity="0.3019608" stroke-width="0.05"/>
  </g>
  <defs>
    <linearGradient gradientTransform="matrix(0.0098, 0.0, 0.0, 0.0038, 6.2, -5.7)" gradientUnits="userSpaceOnUse" id="gradient0" spreadMethod="pad" x1="-819.2" x2="819.2">
      <stop offset="0.0" stop-color="#9c5f0e"/>
      <stop offset="1.0" stop-color="#731f1f"/>
    </linearGradient>
  </defs>
</svg>
