<?xml version="1.0" encoding="UTF-8" standalone="no"?>
<svg xmlns:xlink="http://www.w3.org/1999/xlink" height="49.25px" width="91.8px" xmlns="http://www.w3.org/2000/svg">
  <g transform="matrix(1.0, 0.0, 0.0, 1.0, 46.4, 27.15)">
    <path d="M-36.5 -0.7 Q-38.75 -2.35 -38.75 -3.5 -38.65 -5.1 -37.15 -5.1 L-28.8 -2.45 Q-27.8 -2.95 -26.25 -2.95 -27.1 -3.75 -25.85 -5.6 -28.5 -6.1 -28.5 -7.6 -24.85 -9.9 -23.25 -9.9 L-21.4 -9.65 -21.5 -9.8 Q-21.85 -10.1 -21.7 -10.7 L-21.55 -11.15 Q-21.15 -12.2 -20.0 -12.2 L-14.6 -10.7 -12.65 -10.4 -11.5 -11.55 Q-13.4 -12.45 -14.45 -13.2 -15.75 -14.15 -15.75 -14.8 -15.75 -16.25 -14.55 -16.4 L-14.45 -16.4 -14.15 -16.45 Q-12.4 -15.4 -10.35 -15.4 L-9.05 -16.05 Q-5.85 -14.8 -4.65 -14.8 -4.3 -14.8 -4.35 -14.95 L-4.5 -15.1 -6.75 -16.55 Q-7.55 -17.05 -7.55 -17.65 -7.5 -19.2 -6.05 -19.2 -5.3 -19.2 -2.05 -17.7 L-1.9 -17.6 -0.15 -18.2 -1.6 -20.7 Q-1.6 -22.05 -0.25 -22.05 L1.6 -21.75 4.9 -20.55 Q7.55 -19.35 8.2 -18.6 L7.55 -18.5 8.3 -18.6 Q12.05 -18.6 27.1 -9.1 31.0 -8.25 37.5 -0.05 L37.4 0.55 36.75 0.85 36.65 0.85 36.25 0.75 Q35.1 0.4 31.2 -1.55 L28.25 -3.0 28.8 -3.4 Q27.75 -2.5 26.5 -2.7 L26.8 -2.3 27.7 -1.5 Q29.8 0.6 29.8 1.85 L29.85 1.95 29.8 1.9 29.45 1.6 Q30.0 2.0 30.0 2.55 30.0 3.6 29.4 4.0 L28.65 4.3 28.3 4.3 Q23.45 2.2 20.8 1.4 L21.05 1.6 Q22.15 2.1 22.15 3.3 22.15 5.05 20.5 5.05 18.7 5.05 18.35 6.1 18.0 7.1 16.9 7.1 16.05 7.1 6.0 1.85 L5.9 2.15 10.7 5.35 Q14.0 7.75 14.0 8.9 14.05 10.7 12.1 10.7 10.25 9.55 9.55 9.55 7.6 9.55 5.5 8.55 L5.55 8.7 Q9.95 11.9 10.5 13.4 L10.0 13.6 7.35 14.85 10.0 13.6 10.5 13.4 10.55 13.75 Q10.75 15.55 8.8 15.55 L7.35 14.85 1.1 11.7 -0.55 12.6 0.1 14.0 Q0.1 15.6 -1.5 15.6 L-7.85 13.05 Q-6.15 14.0 -0.25 16.65 L1.15 17.4 -0.65 17.0 -1.45 16.8 Q-2.8 16.45 -4.0 15.65 L-5.05 15.05 -5.8 14.75 -8.05 13.8 -11.45 12.1 -14.05 10.75 -14.6 10.45 -15.05 10.25 -15.8 9.9 -19.3 8.3 -15.8 9.9 -15.05 10.25 -14.6 10.45 -14.05 10.75 -11.45 12.1 -8.05 13.8 -5.8 14.75 -5.05 15.05 -4.0 15.65 Q-2.8 16.45 -1.45 16.8 L-0.65 17.0 1.15 17.4 Q4.8 19.45 4.8 20.75 5.0 22.1 3.5 22.1 1.55 22.1 -19.9 9.4 L-19.3 8.3 -19.25 8.2 Q-21.4 6.9 -28.05 3.8 L-28.7 3.45 -30.45 2.55 -31.6 1.8 Q-32.5 1.3 -33.45 0.85 L-34.35 0.45 -34.95 0.15 -36.45 -0.7 -36.5 -0.7 -36.45 -0.7 -34.95 0.15 -34.35 0.45 -33.45 0.85 Q-32.5 1.3 -31.6 1.8 L-30.45 2.55 -28.7 3.45 -28.05 3.8 -30.9 2.5 -32.15 1.9 -35.6 -0.1 -36.5 -0.7 M5.05 -11.1 Q9.85 -7.3 15.55 -6.25 L16.3 -6.25 17.35 -7.9 17.1 -8.15 Q11.75 -10.9 5.85 -11.35 L5.05 -11.1 M17.15 -0.6 L21.35 0.35 23.25 0.2 23.4 -0.55 Q23.4 -0.95 14.05 -3.2 L11.4 -2.15 Q11.3 -2.15 -1.1 -9.65 -2.05 -9.65 -2.0 -8.55 -2.0 -7.45 2.35 -3.45 7.05 0.85 9.5 0.85 11.05 0.85 11.05 -0.7 L13.0 0.3 Q14.65 1.25 15.5 1.3 16.05 1.1 16.05 0.7 L14.85 -0.2 Q16.8 -0.05 17.15 -0.6 M27.15 -7.2 Q27.15 -9.2 1.6 -20.25 L-0.4 -21.1 -0.9 -20.6 1.6 -19.4 Q8.05 -16.2 26.35 -6.35 L27.15 -7.2 M-34.95 0.15 L-35.6 -0.1 -34.95 0.15 M-14.25 -0.45 Q-14.25 -0.05 -13.3 0.15 L-13.3 0.2 -14.75 -0.05 -15.35 0.05 -15.55 1.4 Q-15.55 2.05 -14.65 2.4 L-15.0 2.55 Q-15.0 3.2 -13.8 4.1 -12.5 5.05 -11.35 5.05 L-9.75 3.1 Q-9.75 1.5 -13.35 0.6 L-12.15 0.45 Q-11.4 0.45 -6.95 3.35 -2.45 6.2 -1.6 6.2 -0.65 6.2 -0.65 5.2 -0.65 4.55 -2.6 3.4 L-0.65 4.3 Q0.9 4.3 0.75 2.25 0.75 1.55 -0.1 0.2 -1.0 -1.3 -1.8 -1.3 L-3.5 -0.8 -6.65 -1.2 Q-7.9 -1.2 -20.25 -6.9 -21.3 -6.9 -21.4 -5.7 -21.4 -5.0 -17.85 -3.2 -14.25 -1.35 -14.25 -0.45 M-5.65 -7.6 Q-7.25 -8.8 -9.15 -9.2 L-9.95 -6.8 Q-8.35 -5.2 -6.2 -4.95 L-7.55 -7.1 -4.6 -6.8 -5.65 -7.6 M-9.65 9.9 L-6.75 11.15 -4.45 9.1 Q-6.05 8.1 -7.9 8.25 L-7.85 7.9 Q-7.85 5.55 -10.25 5.55 L-12.3 6.55 Q-12.7 6.55 -16.2 4.55 -12.6 6.8 -12.6 7.85 -12.6 10.3 -10.25 10.3 L-9.15 10.15 -9.65 9.9 M-4.45 9.1 L-3.8 9.55 -4.35 9.0 -4.45 9.1 M-32.15 1.9 L-30.45 2.55 -32.15 1.9" fill="#996600" fill-opacity="0.12156863" fill-rule="evenodd" stroke="none"/>
    <path d="M17.15 -0.6 Q16.8 -0.05 14.85 -0.2 L16.05 0.7 Q16.05 1.1 15.5 1.3 14.65 1.25 13.0 0.3 L11.05 -0.7 Q11.05 0.85 9.5 0.85 7.05 0.85 2.35 -3.45 -2.0 -7.45 -2.0 -8.55 -2.05 -9.65 -1.1 -9.65 11.3 -2.15 11.4 -2.15 L14.05 -3.2 Q23.4 -0.95 23.4 -0.55 L23.25 0.2 21.35 0.35 17.15 -0.6 M27.15 -7.2 L26.35 -6.35 Q8.05 -16.2 1.6 -19.4 L-0.9 -20.6 -0.4 -21.1 1.6 -20.25 Q27.15 -9.2 27.15 -7.2 M-14.25 -0.45 Q-14.25 -1.35 -17.85 -3.2 -21.4 -5.0 -21.4 -5.7 -21.3 -6.9 -20.25 -6.9 -7.9 -1.2 -6.65 -1.2 L-3.5 -0.8 -1.8 -1.3 Q-1.0 -1.3 -0.1 0.2 0.75 1.55 0.75 2.25 0.9 4.3 -0.65 4.3 L-2.6 3.4 Q-0.65 4.55 -0.65 5.2 -0.65 6.2 -1.6 6.2 -2.45 6.2 -6.95 3.35 -11.4 0.45 -12.15 0.45 L-13.35 0.6 Q-9.75 1.5 -9.75 3.1 L-11.35 5.05 Q-12.5 5.05 -13.8 4.1 -15.0 3.2 -15.0 2.55 L-14.65 2.4 Q-15.55 2.05 -15.55 1.4 L-15.35 0.05 -14.75 -0.05 -13.3 0.2 -13.3 0.15 Q-14.25 -0.05 -14.25 -0.45 M-7.9 8.25 L-8.85 8.35 Q-9.0 8.15 -9.15 8.45 -8.15 9.85 -9.4 9.55 L-10.5 9.55 -9.65 9.9 -9.15 10.15 -10.25 10.3 Q-12.6 10.3 -12.6 7.85 -12.6 6.8 -16.2 4.55 -12.7 6.55 -12.3 6.55 L-10.25 5.55 Q-7.85 5.55 -7.85 7.9 L-7.9 8.25" fill="#996600" fill-opacity="0.18039216" fill-rule="evenodd" stroke="none"/>
    <path d="M6.65 -22.1 Q6.3 -22.3 6.5 -22.85 L6.65 -23.55 6.65 -24.05 6.65 -24.2 6.35 -24.4 4.35 -25.45 4.0 -25.6 2.35 -26.45 2.0 -26.6 1.0 -27.0 0.45 -26.95 Q-0.2 -26.9 -0.65 -26.5 L-0.95 -26.3 -2.9 -25.1 Q-3.3 -24.75 -3.8 -24.65 L-4.05 -24.55 -4.75 -24.2 -5.25 -23.8 Q-6.6 -22.95 -8.0 -22.45 L-8.45 -22.25 -9.8 -21.4 M17.05 -19.2 L17.05 -18.75 17.05 -18.5 Q17.05 -17.45 17.2 -16.45 M17.05 -18.5 L16.6 -18.85 16.05 -19.2 15.5 -19.65 14.5 -20.25 13.9 -20.65 13.7 -20.85 12.55 -21.35 12.25 -21.4 12.25 -21.25 12.0 -19.95 M12.25 -21.95 L12.25 -21.45 12.55 -21.35 M12.25 -21.45 L12.25 -21.4 10.9 -22.3 9.25 -23.35 9.0 -23.5 7.95 -24.0 7.65 -24.1 7.4 -24.25 Q7.2 -24.3 7.05 -24.45 M6.65 -24.05 L6.75 -24.15 6.65 -24.2 6.65 -24.55 M-36.5 -0.7 L-36.45 -0.7 -34.95 0.15 -34.35 0.45 -33.45 0.85 Q-32.5 1.3 -31.6 1.8 L-30.45 2.55 -28.7 3.45 -28.05 3.8 -25.95 4.95 -25.25 5.35 -23.15 6.5 -22.2 7.0 -20.7 7.7 -19.3 8.3 -15.8 9.9 -15.05 10.25 -14.6 10.45 -14.05 10.75 -11.45 12.1 -8.05 13.8 -5.8 14.75 -5.05 15.05 -4.0 15.65 Q-2.8 16.45 -1.45 16.8 L-0.65 17.0 1.15 17.4 1.95 17.45 M7.35 14.85 L10.0 13.6 10.5 13.4 M28.65 4.3 L29.4 4.0 M36.75 0.85 L37.4 0.55 41.1 -1.6 M27.9 -12.0 L27.9 -12.4 27.9 -13.1 27.9 -13.85 M33.8 -7.9 L33.8 -8.95 33.8 -10.05 33.8 -10.25 Q31.25 -11.9 28.5 -12.75 L28.15 -12.9 27.9 -13.1 M33.8 -10.05 L34.25 -9.85 34.55 -9.7 39.3 -6.8 39.35 -6.35 39.4 -4.35 M33.8 -10.55 L33.8 -10.25 M40.95 -1.85 L42.25 -2.35 Q43.8 -3.05 45.1 -4.0 L40.15 -5.8 39.9 -5.9 M45.4 -4.3 L45.1 -4.0 45.4 -3.9 M36.25 0.75 L35.85 1.1 35.45 1.3 Q34.3 2.2 33.05 2.8 32.2 3.2 31.55 3.7 L29.4 4.0 M28.65 4.3 L27.8 4.65 27.55 4.75 26.75 5.1 M26.1 5.1 L23.65 6.3 Q22.7 6.6 21.8 7.25 M18.0 9.1 L17.25 9.6 16.55 9.85 15.2 10.35 Q14.4 10.6 13.65 11.15 L13.15 11.55 12.65 11.9 11.6 12.7 10.5 13.4 M7.35 14.85 L6.55 15.15 3.2 16.45 2.35 16.75 1.7 16.9 M21.1 7.4 L17.05 9.15 16.8 9.25 M-46.0 -4.7 L-42.45 -3.3 -40.75 -2.75 -41.7 -3.45 M-39.2 -7.15 L-41.15 -6.45 -42.05 -6.0 -42.7 -5.7 Q-42.95 -5.5 -43.25 -5.4 L-43.7 -5.3 -44.05 -5.15 Q-44.3 -5.0 -44.5 -4.95 L-45.4 -4.7 M-28.85 -11.85 L-28.15 -12.2 -26.75 -13.0 -26.15 -13.3 -25.05 -13.6 -22.65 -14.2 -22.4 -14.25 -22.05 -14.7 -21.85 -15.35 M-9.6 -21.15 Q-9.7 -20.8 -10.1 -20.7 L-10.8 -20.45 -12.8 -19.6 -13.2 -19.45 -15.05 -18.75 -15.95 -18.25 -16.3 -18.2 -16.7 -17.95 Q-17.6 -17.2 -18.75 -16.8 L-19.25 -16.55 -21.2 -15.55 -21.5 -15.3 -21.9 -14.9 Q-21.95 -14.55 -22.15 -14.4 L-22.25 -14.1 -22.3 -13.85 M-22.4 -14.25 L-22.15 -14.4 -22.05 -14.7 -21.9 -14.9 M-33.55 -7.95 L-33.4 -8.35 -33.45 -9.15 -34.15 -8.9 Q-35.15 -8.4 -36.25 -8.05 L-37.6 -7.5 -38.1 -7.35 -38.5 -7.2 -39.5 -6.55 M-33.3 -10.5 L-33.45 -9.25 -33.1 -9.5 -32.45 -9.9 -29.0 -11.4 Q-28.35 -11.7 -28.15 -12.2 M-33.45 -9.25 L-33.45 -9.15 Q-33.1 -9.2 -33.1 -9.5 M-40.3 -2.5 L-40.75 -2.75 -40.4 -2.55 -40.3 -2.5 -39.5 -2.2 -37.0 -0.9 -36.5 -0.7 M-35.6 -0.1 L-34.95 0.15 M-35.6 -0.1 L-37.0 -0.9 M-16.3 -18.2 L-16.15 -18.35 Q-15.8 -18.6 -15.8 -18.9 M-30.45 2.55 L-32.15 1.9" fill="none" stroke="#660000" stroke-linecap="round" stroke-linejoin="round" stroke-opacity="0.5019608" stroke-width="0.05"/>
    <path d="M4.7 -13.75 L4.7 -13.7 4.7 -13.6 Q4.7 -12.6 3.85 -12.6 L3.15 -12.65 Q2.15 -12.85 2.2 -13.65 2.2 -14.75 3.6 -14.75 4.7 -14.75 4.7 -13.75 M1.6 -12.05 Q2.95 -12.05 3.2 -11.4 L3.3 -11.0 3.25 -10.75 Q3.05 -10.35 2.45 -10.2 L1.95 -10.15 Q0.9 -10.2 0.6 -10.6 0.4 -10.85 0.45 -11.2 0.4 -12.1 1.6 -12.05 M19.85 -3.9 L20.5 -3.65 20.85 -3.0 Q20.85 -2.1 19.6 -2.1 L19.5 -2.1 19.2 -2.15 18.85 -2.5 18.75 -2.95 Q18.75 -3.9 19.85 -3.9 M23.4 -0.05 L23.25 0.55 22.15 1.25 22.05 1.25 21.95 1.25 21.8 1.25 21.75 1.25 21.7 1.25 21.5 1.25 Q20.9 1.15 20.7 0.75 L20.6 0.25 Q20.6 -0.95 22.45 -0.95 23.35 -0.95 23.4 -0.05 M19.6 4.0 L19.65 4.5 19.65 4.6 Q19.65 6.35 17.95 6.35 L17.4 6.25 16.5 5.55 Q16.05 4.95 16.05 4.6 16.05 4.15 16.55 3.6 17.15 2.9 17.95 2.9 19.3 2.9 19.6 4.0 M11.4 0.5 Q11.4 1.6 10.15 1.6 L10.1 1.6 Q9.2 1.6 9.2 0.65 9.15 -0.5 10.4 -0.45 11.25 -0.5 11.4 0.25 L11.4 0.5 M1.3 8.65 Q1.75 8.85 1.75 9.35 1.75 10.1 0.8 10.15 L0.7 10.15 Q-0.35 10.1 -0.3 9.25 -0.35 8.5 0.5 8.5 L1.3 8.65 M-21.9 -1.65 Q-21.9 -0.8 -22.85 -0.75 -23.65 -0.75 -23.65 -1.55 -23.65 -2.5 -22.65 -2.5 -22.2 -2.55 -22.0 -2.1 L-21.9 -1.9 -21.9 -1.65 M-1.4 -12.75 L-1.85 -12.3 -3.2 -12.05 Q-4.3 -12.05 -4.1 -13.2 -4.3 -14.45 -3.1 -14.45 -1.3 -14.45 -1.25 -13.3 L-1.3 -13.0 -1.4 -12.75 M-11.6 -4.2 Q-11.6 -3.05 -13.15 -2.9 L-13.6 -2.9 Q-14.6 -2.9 -14.75 -4.3 -14.75 -5.55 -13.7 -5.55 -12.2 -5.55 -11.75 -4.85 -11.6 -4.6 -11.6 -4.2 M-2.75 -11.6 Q-1.1 -11.6 -1.05 -9.9 L-1.15 -9.0 Q-1.55 -8.15 -2.75 -8.15 L-2.8 -8.15 -2.85 -8.15 -3.6 -8.3 Q-4.4 -8.7 -4.5 -9.85 -4.5 -11.6 -2.75 -11.6" fill="#632727" fill-opacity="0.2627451" fill-rule="evenodd" stroke="none"/>
    <path d="M4.15 -14.75 L3.45 -15.05 Q2.45 -15.05 2.45 -14.35 2.45 -13.9 2.6 -13.6 1.55 -13.85 1.6 -14.65 1.6 -15.75 3.05 -15.75 4.15 -15.75 4.15 -14.75 M2.65 -12.4 L2.0 -12.55 Q0.0 -12.55 0.0 -11.6 L-0.15 -12.2 Q-0.15 -13.1 1.05 -13.05 2.35 -13.05 2.65 -12.4 M1.9 -11.2 L2.15 -11.35 2.65 -11.75 1.9 -11.2 M9.55 0.6 Q8.6 0.6 8.6 -0.35 8.6 -1.5 9.85 -1.45 10.7 -1.5 10.8 -0.75 L10.4 -0.8 Q9.35 -0.8 9.4 -0.05 9.35 0.35 9.55 0.6 M18.6 -3.15 L18.3 -3.5 18.2 -3.9 Q18.15 -4.85 19.25 -4.85 L19.9 -4.65 19.2 -4.15 18.55 -3.4 18.6 -3.15 M20.95 0.25 L20.1 -0.25 Q20.0 -0.45 20.05 -0.75 20.0 -1.95 21.85 -1.95 22.8 -1.95 22.8 -1.05 L22.7 -0.45 22.75 -0.7 Q22.8 -1.25 22.1 -1.25 20.7 -1.25 20.7 -0.3 20.65 0.05 20.95 0.25 M19.0 3.0 L18.4 2.95 Q17.7 2.95 17.1 3.6 16.55 4.1 16.55 4.4 L16.65 4.95 16.85 5.25 Q16.3 5.05 15.9 4.55 15.45 3.95 15.5 3.6 15.5 3.15 16.0 2.6 16.6 1.9 17.4 1.9 18.7 1.9 19.0 3.0 M0.15 9.15 Q-0.9 9.1 -0.9 8.25 -0.9 7.5 -0.1 7.55 L0.75 7.65 Q-0.2 7.7 -0.2 8.45 L0.15 9.15 M-22.5 -2.9 L-22.6 -3.0 Q-23.55 -3.05 -23.55 -2.4 L-23.4 -1.75 Q-24.25 -1.75 -24.2 -2.55 -24.2 -3.5 -23.2 -3.5 L-22.55 -3.05 -22.5 -2.9 M-1.85 -14.0 Q-2.05 -14.7 -2.6 -14.65 -3.85 -14.7 -3.8 -13.55 L-3.75 -13.05 Q-4.85 -13.05 -4.65 -14.2 -4.85 -15.45 -3.7 -15.4 -1.85 -15.45 -1.85 -14.3 L-1.85 -14.0 M-13.7 -3.9 L-14.2 -3.9 Q-15.2 -3.9 -15.3 -5.3 -15.35 -6.55 -14.3 -6.55 -12.75 -6.55 -12.3 -5.85 L-12.55 -5.85 Q-14.35 -5.85 -14.35 -4.75 -14.4 -4.0 -13.7 -3.9 M-1.75 -10.0 L-1.75 -10.05 Q-1.75 -10.85 -2.5 -10.85 -4.4 -10.85 -4.55 -9.6 L-4.15 -9.3 Q-4.95 -9.7 -5.05 -10.85 -5.05 -12.6 -3.3 -12.6 -1.65 -12.6 -1.6 -10.9 -1.6 -10.4 -1.75 -10.0" fill="#f5f0ef" fill-rule="evenodd" stroke="none"/>
    <path d="M2.6 -13.6 Q2.45 -13.9 2.45 -14.35 2.45 -15.05 3.45 -15.05 L4.15 -14.75 4.15 -14.7 4.15 -14.6 Q4.15 -13.6 3.3 -13.6 L2.6 -13.6 M0.0 -11.6 Q0.0 -12.55 2.0 -12.55 L2.65 -12.4 2.7 -12.0 2.65 -11.75 2.15 -11.35 1.9 -11.2 1.4 -11.15 Q0.3 -11.2 0.0 -11.6 M10.8 -0.75 L10.85 -0.5 Q10.85 0.6 9.55 0.6 9.35 0.35 9.4 -0.05 9.35 -0.8 10.4 -0.8 L10.8 -0.75 M19.9 -4.65 L20.25 -4.0 20.25 -3.95 Q20.25 -3.1 19.05 -3.05 L18.9 -3.05 18.6 -3.15 18.55 -3.4 19.2 -4.15 19.9 -4.65 M22.7 -0.45 L21.6 0.25 21.55 0.25 21.5 0.25 21.4 0.25 21.25 0.25 21.2 0.25 21.1 0.25 20.95 0.25 Q20.65 0.05 20.7 -0.3 20.7 -1.25 22.1 -1.25 22.8 -1.25 22.75 -0.7 L22.7 -0.45 M16.85 5.25 L16.65 4.95 16.55 4.4 Q16.55 4.1 17.1 3.6 17.7 2.95 18.4 2.95 L19.0 3.0 19.1 3.55 19.1 3.6 Q19.1 5.35 17.4 5.35 L16.85 5.25 M0.75 7.65 Q1.15 7.85 1.2 8.4 1.15 9.15 0.25 9.15 L0.15 9.15 -0.2 8.45 Q-0.2 7.7 0.75 7.65 M-23.4 -1.75 L-23.55 -2.4 Q-23.55 -3.05 -22.6 -3.0 L-22.5 -2.9 -22.45 -2.65 Q-22.5 -1.75 -23.4 -1.75 M-3.75 -13.05 L-3.8 -13.55 Q-3.85 -14.7 -2.6 -14.65 -2.05 -14.7 -1.85 -14.0 L-1.95 -13.75 -2.4 -13.3 -3.75 -13.05 M-12.3 -5.85 Q-12.15 -5.6 -12.15 -5.2 -12.15 -4.05 -13.7 -3.9 -14.4 -4.0 -14.35 -4.75 -14.35 -5.85 -12.55 -5.85 L-12.3 -5.85 M-4.15 -9.3 L-4.55 -9.6 Q-4.4 -10.85 -2.5 -10.85 -1.75 -10.85 -1.75 -10.05 L-1.75 -10.0 Q-2.1 -9.15 -3.3 -9.15 L-3.35 -9.15 -3.45 -9.15 -4.15 -9.3" fill="#d8c0b8" fill-rule="evenodd" stroke="none"/>
    <path d="M15.75 -16.5 Q15.35 -16.8 15.4 -17.5 L15.45 -18.25 M4.7 -21.15 L4.55 -23.75 4.45 -24.45 M9.5 -18.8 Q9.15 -20.0 9.2 -21.4 L9.2 -21.7 M21.55 -12.85 L21.65 -13.35 21.5 -14.0 21.4 -14.3 M28.2 -9.5 Q27.55 -10.4 27.7 -11.55 L27.75 -12.25 M33.25 -6.75 Q32.75 -7.0 32.85 -7.65 L32.8 -8.35 32.7 -8.95 M39.2 -4.6 Q38.9 -5.85 39.2 -7.2 M44.8 -2.6 L44.65 -4.45 44.55 -4.9 M40.2 -0.7 L40.5 -3.95 M30.2 4.35 L30.2 2.35 30.2 1.9 M24.6 7.4 L24.45 5.25 24.45 4.95 M14.0 12.3 Q13.55 11.2 13.7 10.0 L13.75 9.55 M18.95 10.45 L19.0 7.95 19.1 7.55 M8.95 15.05 Q8.45 15.15 8.45 14.65 L8.4 13.05 8.4 12.3 M3.2 18.25 L3.4 17.25 3.3 15.5 M35.3 1.75 L35.4 -0.7 M-46.0 -1.15 Q-46.35 -2.7 -46.3 -4.3 L-46.4 -5.05 M-41.35 0.3 Q-41.25 -1.05 -41.45 -2.3 L-41.5 -3.0 M-0.75 -24.6 Q-1.2 -24.35 -1.05 -24.75 -0.8 -25.55 -1.0 -27.15 M-2.75 19.85 L-2.45 16.35 M-7.95 17.1 L-7.9 16.8 -7.55 15.35 -7.4 14.55 M-12.75 14.65 Q-12.95 12.55 -12.75 10.45 M-18.1 11.3 Q-17.7 10.8 -17.65 9.85 L-17.65 8.7 M-21.85 9.3 L-22.25 6.55 -22.25 6.25 M-27.05 6.8 Q-27.35 6.8 -27.25 6.4 -27.0 5.0 -27.35 3.8 M-31.65 4.95 Q-32.1 4.6 -32.0 3.8 L-31.95 2.35 M-36.85 2.5 L-36.85 0.0 -36.85 -0.7" fill="none" stroke="#660000" stroke-linecap="round" stroke-linejoin="round" stroke-opacity="0.5019608" stroke-width="0.05"/>
  </g>
</svg>
