<?xml version="1.0" encoding="UTF-8" standalone="no"?>
<svg xmlns:xlink="http://www.w3.org/1999/xlink" height="89.65px" width="167.95px" xmlns="http://www.w3.org/2000/svg">
  <g transform="matrix(1.0, 0.0, 0.0, 1.0, 80.05, 0.7)">
    <path d="M87.85 45.3 L87.9 45.9 87.85 46.9 87.85 46.95 87.85 47.0 87.8 47.3 87.85 47.3 Q88.1 52.5 84.6 57.1 82.55 59.8 79.25 62.3 L78.95 62.55 76.45 64.35 72.85 66.75 72.65 66.85 71.75 67.45 Q65.8 71.15 59.05 74.55 53.4 77.35 47.15 79.9 45.3 80.7 43.4 81.45 L41.75 82.05 41.1 82.3 35.5 84.35 34.75 84.6 Q29.7 86.3 24.2 87.35 15.5 88.95 5.7 88.95 L5.6 88.95 4.25 88.95 1.0 88.85 0.95 88.85 -2.75 88.65 Q-12.8 87.8 -21.5 85.1 L-24.1 84.2 Q-31.5 81.6 -37.7 78.55 L-38.35 78.25 -38.4 78.2 -38.55 78.15 -39.55 77.6 -40.1 77.3 -40.2 77.25 -43.45 75.45 Q-47.0 73.45 -50.2 71.2 L-50.5 71.0 -53.75 68.4 Q-59.3 63.4 -59.9 57.6 L-59.95 57.2 -60.0 56.15 -60.0 56.1 -60.0 55.7 -60.0 55.2 -59.95 55.2 -60.0 55.0 -60.0 54.15 -60.0 54.1 -59.95 52.8 Q-59.6 48.15 -56.05 44.0 -54.15 41.7 -51.25 39.6 L-50.75 39.2 Q-47.65 36.95 -44.35 34.9 -38.1 30.95 -31.15 27.45 -24.1 23.9 -16.3 20.85 -11.85 19.1 -7.15 17.5 L-6.75 17.35 Q-2.55 15.95 1.9 15.0 12.35 9.4 18.0 9.6 23.6 9.75 23.7 11.4 23.8 13.0 25.6 9.3 36.4 13.3 46.75 16.15 L51.25 17.55 51.95 17.75 Q58.9 20.25 64.85 23.1 L65.0 23.2 65.15 23.25 65.85 23.6 66.35 23.85 Q70.05 25.7 73.3 27.7 L73.6 27.85 73.7 27.95 73.8 28.0 73.9 28.05 74.3 28.3 74.65 28.5 77.2 30.25 77.45 30.35 80.15 32.3 Q85.15 36.25 86.9 40.85 L87.65 43.5 87.75 43.95 87.85 44.9 87.85 45.3 M44.25 23.25 L44.35 23.25 44.3 23.25 44.25 23.25 M67.85 45.1 L67.8 45.0 67.75 44.65 67.8 45.1 67.85 45.1 67.95 45.1 67.9 44.95 67.85 45.1 M52.95 39.25 L52.9 39.25 53.0 39.3 52.95 39.25 M23.3 16.4 L23.3 16.35 23.15 16.35 23.3 16.4 M22.35 19.7 L22.25 19.7 22.35 19.7 M6.85 30.5 L6.8 30.45 6.7 30.5 6.85 30.5 M19.6 28.15 L19.55 28.2 19.65 28.2 19.6 28.15 M34.1 70.35 L34.15 70.3 34.1 70.3 34.1 70.35 M54.45 52.75 L54.5 52.75 54.45 52.75 M19.4 70.25 L19.5 70.25 19.4 70.25 M5.7 71.9 L5.8 71.9 5.7 71.9 M-25.2 46.45 L-25.25 46.45 -25.2 46.45 M-4.05 33.05 L-3.95 33.05 -3.95 33.0 -4.05 33.05 M-2.6 34.4 L-2.55 34.4 -2.55 34.35 -2.6 34.35 -2.6 34.4 M-7.6 69.45 L-7.5 69.5 -7.6 69.45 M-12.35 74.1 L-12.3 74.1 -12.5 74.05 -12.35 74.1 M-29.7 52.9 L-29.7 52.85 -29.7 52.9" fill="#663e3e" fill-opacity="0.3019608" fill-rule="evenodd" stroke="none"/>
    <path d="M30.9 20.3 L31.0 20.35 30.9 20.3 M-80.0 46.15 L-80.0 46.1 -80.0 45.7 -80.0 45.2 -79.95 45.2 -79.9 45.65 -79.85 46.1 -80.0 46.15 M1.2 13.0 L1.3 13.0 1.2 13.0 M-80.0 45.7 L-79.9 45.65 -80.0 45.7 M-15.85 66.95 L-15.9 66.95 -15.85 66.95 M-32.35 64.1 L-32.3 64.1 -32.35 64.1" fill="#e8eae1" fill-rule="evenodd" stroke="none"/>
    <path d="M41.55 35.6 L41.6 36.65 41.55 36.6 41.55 36.9 41.55 37.0 Q41.4 38.45 40.7 39.8 L36.55 36.0 30.05 30.0 32.9 29.25 30.05 30.0 29.35 29.3 28.75 28.8 29.35 29.3 28.2 30.45 27.85 30.85 Q27.7 30.7 27.55 30.65 L27.5 30.6 Q23.85 28.25 19.45 26.15 L26.45 22.65 Q32.0 25.3 36.35 28.35 L36.95 28.85 36.9 28.75 37.45 29.2 37.75 29.45 Q41.25 32.25 41.55 35.6 L36.55 36.0 41.55 35.6 M32.95 29.25 L36.35 28.35 32.95 29.25 32.9 29.25 33.0 29.3 32.95 29.25 M10.65 48.25 L10.7 48.35 10.55 48.3 10.65 48.25 M16.5 45.5 L16.25 45.4 16.45 45.3 16.5 45.5 16.45 45.3 20.6 43.05 22.8 41.8 34.45 42.75 22.8 41.8 26.1 39.85 29.7 37.65 30.05 37.45 35.9 42.85 36.95 43.8 36.25 44.25 36.15 44.3 35.95 44.45 35.85 44.5 32.95 46.25 32.45 46.55 28.9 48.65 16.5 45.5 28.9 48.65 28.55 48.8 28.2 49.0 20.25 53.15 19.95 53.35 19.75 52.9 16.5 45.5 M34.5 42.75 L35.9 42.85 34.5 42.75 34.45 42.75 34.5 42.75 M27.55 30.65 L28.2 30.45 27.55 30.65 M37.65 43.0 L37.95 43.0 37.8 43.15 37.65 43.0 M20.25 53.15 L19.75 52.9 20.25 53.15 M-33.35 37.35 L-37.5 39.75 -35.6 37.2 -35.25 37.2 -33.35 37.35 M-48.6 36.15 L-45.2 36.45 -42.15 36.7 -46.5 42.6 -51.35 49.05 Q-53.4 46.7 -53.45 44.05 L-53.5 44.0 -53.5 43.5 -53.45 43.45 -53.45 43.4 -53.45 43.35 -53.45 43.15 -53.45 43.1 Q-53.1 39.25 -48.6 36.15 M-45.2 36.45 L-45.25 36.45 -45.2 36.45 M-49.7 42.85 L-49.7 42.9 -49.7 42.85 -46.5 42.6 -49.7 42.85 -53.45 43.15 -49.7 42.85 M-42.15 47.65 L-42.1 47.7 -41.4 48.2 -42.85 48.55 -41.4 48.2 -33.8 52.75 -40.75 56.25 -46.2 53.1 -42.85 48.55 -42.15 47.65 M-24.9 56.8 L-24.85 56.8 -24.9 56.8" fill="#9ad1c4" fill-rule="evenodd" stroke="none"/>
    <path d="M40.75 16.9 L41.65 17.4 40.75 16.9 M41.65 17.4 L40.7 19.5 40.0 21.05 48.15 25.35 42.2 26.9 41.85 26.65 41.7 26.55 41.65 26.5 41.15 26.2 40.95 26.1 38.8 24.65 38.75 24.65 38.65 24.55 38.55 24.5 38.45 24.45 38.2 24.25 38.15 24.25 38.05 24.1 37.4 23.8 37.3 23.7 32.15 20.9 31.85 20.75 31.35 20.55 31.3 20.5 31.0 20.35 31.3 20.5 31.35 20.55 31.85 20.75 32.15 20.9 37.3 23.7 37.4 23.8 38.05 24.1 38.15 24.25 38.2 24.25 38.45 24.45 38.55 24.5 38.65 24.55 38.75 24.65 38.8 24.65 40.95 26.1 41.15 26.2 41.65 26.5 41.7 26.55 41.85 26.65 42.2 26.9 Q45.85 29.5 47.15 32.55 L47.85 34.65 47.9 34.95 47.85 35.1 47.6 37.9 Q47.0 40.7 44.4 43.2 L40.7 39.8 Q41.4 38.45 41.55 37.0 L41.55 36.9 41.55 36.6 41.6 36.65 41.55 35.6 47.8 35.1 41.55 35.6 Q41.25 32.25 37.75 29.45 L37.45 29.2 36.9 28.75 36.95 28.85 36.35 28.35 Q32.0 25.3 26.45 22.65 L26.4 22.65 31.0 20.35 26.4 22.65 Q21.95 20.5 16.75 18.7 L14.65 18.05 17.65 15.1 14.65 18.05 Q9.15 16.4 2.7 16.3 L1.9 16.3 1.85 16.3 1.2 16.3 1.0 16.3 0.15 16.3 1.2 13.0 2.25 9.7 1.2 13.0 0.15 16.3 Q-7.6 16.5 -13.7 18.75 L-13.75 18.75 -13.95 18.8 -14.9 19.15 -18.45 20.65 -18.85 20.8 Q-21.2 21.75 -23.5 22.8 L-23.95 23.0 -24.05 23.05 Q-28.15 24.9 -32.2 26.95 L-39.1 30.55 -39.2 30.65 -39.3 30.7 -40.05 31.05 -46.1 29.5 -40.05 31.05 -40.4 31.25 -44.4 33.55 -44.8 33.8 -46.25 34.65 -46.6 34.9 -46.8 35.0 -46.85 35.05 -46.9 35.05 -47.4 35.4 -47.6 35.5 -48.6 36.15 Q-53.1 39.25 -53.45 43.1 L-59.95 43.65 Q-59.8 39.25 -55.25 35.65 L-61.65 35.15 -52.05 28.6 -53.05 27.3 -54.5 25.45 -56.6 26.85 -68.0 34.65 -76.05 34.0 Q-74.15 31.7 -71.25 29.6 L-70.75 29.2 -64.35 24.9 Q-58.1 20.95 -51.15 17.45 -44.1 13.9 -36.3 10.85 -31.85 9.1 -27.15 7.5 L-26.75 7.35 Q-22.55 5.95 -18.1 5.0 -7.65 -0.6 -2.0 -0.4 3.6 -0.25 3.7 1.4 3.8 3.0 5.6 -0.7 16.4 3.3 26.75 6.15 L31.25 7.55 31.95 7.75 Q38.9 10.25 44.85 13.1 L45.0 13.2 45.15 13.25 36.8 17.45 45.15 13.25 45.85 13.6 46.35 13.85 Q50.05 15.7 53.3 17.7 L53.6 17.85 53.7 17.95 53.8 18.0 53.9 18.05 54.3 18.3 54.65 18.5 57.2 20.25 57.45 20.35 60.15 22.3 53.85 23.9 41.65 17.4 M17.65 15.1 L26.75 6.15 17.65 15.1 19.25 15.55 19.4 15.6 19.6 15.7 19.7 15.7 19.6 15.7 19.4 15.6 19.25 15.55 17.65 15.1 Q11.1 13.2 3.5 13.05 L3.2 13.05 3.15 13.05 3.2 13.05 3.5 13.05 Q11.1 13.2 17.65 15.1 M19.7 15.75 L19.7 15.7 19.7 15.75 20.15 15.85 19.7 15.75 M20.15 15.9 L20.15 15.85 20.15 15.9 20.55 16.0 20.6 16.05 Q25.9 17.9 30.5 20.1 L30.6 20.15 30.65 20.15 30.7 20.2 30.75 20.25 30.85 20.3 30.75 20.25 30.7 20.2 30.65 20.15 30.6 20.15 30.5 20.1 Q25.9 17.9 20.6 16.05 L20.55 16.0 20.15 15.9 M30.9 20.3 L30.85 20.3 30.9 20.3 31.0 20.35 30.9 20.3 M36.6 17.55 L31.0 20.35 36.6 17.55 36.8 17.45 36.6 17.55 M47.8 35.1 L47.85 35.1 47.8 35.0 47.75 34.65 47.8 35.1 M42.2 26.9 L36.35 28.35 42.2 26.9 M24.35 13.25 L24.3 13.25 24.25 13.25 24.35 13.25 M40.0 21.05 L38.85 20.45 40.0 21.05 M3.3 6.35 L3.15 6.35 3.3 6.4 3.3 6.35 5.6 -0.7 3.3 6.35 M2.25 9.7 L2.35 9.7 2.25 9.7 3.3 6.4 2.25 9.7 M1.3 13.0 L1.2 13.0 1.3 13.0 1.65 13.0 1.3 13.0 M1.75 13.0 L1.65 13.0 1.75 13.0 1.95 13.0 2.1 13.05 3.05 13.05 2.1 13.05 1.95 13.0 1.75 13.0 M3.15 13.05 L3.05 13.05 3.15 13.05 M40.7 19.5 L36.8 17.45 40.7 19.5 M-16.65 16.0 L-17.9 16.3 -18.1 16.35 -18.25 16.4 -18.5 16.5 -18.65 16.55 -19.35 17.0 Q-23.3 18.4 -27.0 19.95 -23.3 18.4 -19.35 17.0 L-18.65 16.55 -18.5 16.5 -18.25 16.4 -18.1 16.35 -17.9 16.3 -16.65 16.0 -16.6 16.0 -16.65 16.0 M-16.35 15.95 L-16.6 16.0 -16.35 15.95 -16.3 15.9 -16.35 15.95 M-14.75 15.4 L-15.3 15.6 -15.35 15.6 -15.55 15.65 -15.7 15.7 -16.3 15.9 -15.7 15.7 -15.55 15.65 -15.35 15.6 -15.3 15.6 -14.75 15.4 -18.1 5.0 -14.75 15.4 -13.7 18.75 -14.75 15.4 Q-7.5 13.1 1.2 13.0 -7.5 13.1 -14.75 15.4 M-36.3 10.85 L-27.0 19.95 -27.05 19.95 -27.0 19.95 -36.3 10.85 M-27.0 19.95 L-23.95 23.0 -27.0 19.95 M-27.05 19.95 Q-32.2 22.1 -37.0 24.55 -32.2 22.1 -27.05 19.95 M-37.0 24.55 L-32.2 26.95 -37.0 24.55 -46.1 29.5 -37.0 24.55 -51.15 17.45 -37.0 24.55 M-51.45 28.15 L-52.05 28.6 -51.45 28.15 -50.65 27.65 -51.45 28.15 -46.1 29.5 Q-50.25 31.95 -54.0 34.65 L-54.0 34.7 -54.2 34.85 -54.25 34.85 -54.25 34.9 -54.3 34.9 -54.4 34.95 -54.7 35.2 -54.85 35.3 -54.9 35.35 -54.95 35.4 -55.25 35.65 -54.95 35.4 -54.9 35.35 -54.85 35.3 -54.7 35.2 -54.4 34.95 -54.3 34.9 -54.25 34.9 -54.25 34.85 -54.2 34.85 -54.0 34.7 -54.0 34.65 Q-50.25 31.95 -46.1 29.5 L-51.45 28.15 M-50.45 25.55 L-53.05 27.3 -50.45 25.55 M-64.35 24.9 L-56.6 26.85 -64.35 24.9 M-55.25 35.65 L-48.6 36.15 -55.25 35.65 M-54.5 25.45 L-52.9 24.35 -54.5 25.45" fill="#6f706b" fill-rule="evenodd" stroke="none"/>
    <path d="M-80.0 45.0 L-80.0 44.15 -80.0 44.1 -79.95 42.8 -68.0 34.65 -56.6 26.85 -54.5 25.45 -53.05 27.3 -79.9 45.65 -79.95 45.2 -80.0 45.0 M-15.5 76.95 L-19.0 76.85 -19.05 76.85 -22.5 76.65 -21.05 66.6 -20.7 63.9 -15.05 73.9 -15.5 76.95 M-57.45 66.65 L-58.35 66.25 -58.4 66.2 -59.55 65.6 -60.1 65.3 -60.2 65.25 -62.45 64.05 -54.3 53.1 -52.8 51.05 -51.35 49.05 -46.5 42.6 -42.15 36.7 -35.6 37.2 -37.5 39.75 -37.85 40.25 -57.45 66.65 M-18.1 45.5 L-11.1 45.85 -12.8 57.95 Q-15.2 55.15 -16.1 55.15 L-17.6 55.75 Q-18.75 54.6 -19.25 54.6 L-19.4 54.75 -18.1 45.5" fill="#e8e7a8" fill-rule="evenodd" stroke="none"/>
    <path d="M26.4 22.65 L26.45 22.65 19.45 26.15 Q15.2 24.1 10.25 22.35 L14.65 18.05 10.25 22.35 9.35 22.0 Q6.95 21.15 3.95 21.2 0.95 21.2 -1.3 22.15 L-1.35 22.15 -1.65 22.25 -0.45 18.2 -1.65 22.25 -1.75 22.3 -5.7 23.95 -11.3 26.35 -11.35 26.35 -13.15 20.5 -11.35 26.35 -12.1 26.7 -17.6 29.25 -22.65 31.7 -32.2 26.95 -22.65 31.7 -27.55 34.25 -31.75 36.55 -32.75 37.0 -33.35 37.35 -35.25 37.2 -35.6 37.2 -42.15 36.7 -45.2 36.45 -48.6 36.15 -47.6 35.5 -47.4 35.4 -46.9 35.05 -46.85 35.05 -46.8 35.0 -46.6 34.9 -46.25 34.65 -44.8 33.8 -44.4 33.55 -40.4 31.25 -40.05 31.05 -39.3 30.7 -39.2 30.65 -39.1 30.55 -32.2 26.95 Q-28.15 24.9 -24.05 23.05 L-23.95 23.05 -23.95 23.0 -23.5 22.8 Q-21.2 21.75 -18.85 20.8 L-18.45 20.65 -14.9 19.15 -13.95 18.8 -13.75 18.75 -13.7 18.75 Q-7.6 16.5 0.15 16.3 L1.0 16.3 1.2 16.3 1.85 16.3 1.9 16.3 2.7 16.3 Q9.15 16.4 14.65 18.05 L16.75 18.7 Q21.95 20.5 26.4 22.65 M-0.4 18.15 L0.15 16.3 -0.4 18.15 -0.45 18.2 -0.35 18.2 -0.4 18.15 M-13.2 20.45 L-13.75 18.75 -13.2 20.45 -13.3 20.5 -13.15 20.5 -13.2 20.45 M-22.55 24.4 L-17.6 29.25 -22.55 24.4 -22.55 24.35 -22.6 24.35 -22.6 24.4 -22.55 24.4 M-23.95 23.05 L-22.6 24.35 -23.95 23.05 M-27.55 34.25 L-40.05 31.05 -27.55 34.25 M-41.4 35.7 L-42.15 36.7 -41.4 35.7" fill="#8da19c" fill-rule="evenodd" stroke="none"/>
    <path d="M10.25 22.35 Q15.2 24.1 19.45 26.15 23.85 28.25 27.5 30.6 L27.55 30.65 Q27.7 30.7 27.85 30.85 L26.2 32.5 25.5 33.25 30.05 37.45 29.7 37.65 26.1 39.85 22.8 41.8 20.6 43.05 16.45 45.3 13.25 38.0 7.95 40.4 7.35 40.7 6.95 39.8 7.35 40.7 10.65 48.25 10.55 48.3 4.75 51.1 0.9 52.85 -0.05 53.35 -2.4 54.4 -6.35 56.1 -8.7 57.05 -8.9 57.1 -10.7 57.85 -12.85 58.5 -12.8 57.95 -11.1 45.85 -10.95 44.85 -11.1 45.85 -18.1 45.5 -17.85 43.85 -18.1 45.5 -19.4 54.75 -19.9 58.45 -21.35 58.05 -24.85 56.8 -24.9 56.8 Q-29.6 54.95 -33.8 52.75 L-41.4 48.2 -42.1 47.7 -42.15 47.65 -36.7 40.25 -37.6 39.9 -37.5 39.75 -33.35 37.35 -32.75 37.0 -31.75 36.55 -27.55 34.25 -22.65 31.7 -17.6 29.25 -12.1 26.7 -11.35 26.35 -11.3 26.35 -5.7 23.95 -1.75 22.3 -1.65 22.25 -1.35 22.15 -1.3 22.15 Q0.95 21.2 3.95 21.2 6.95 21.15 9.35 22.0 L10.25 22.35 M6.05 36.1 L7.95 40.4 6.05 36.1 M12.9 37.2 L13.25 38.0 12.9 37.2 M25.5 33.25 L25.05 32.8 25.5 33.25 M26.2 32.5 L24.05 30.5 26.2 32.5 M-36.2 39.6 L-36.7 40.25 -36.2 39.6" fill="#eb9d56" fill-rule="evenodd" stroke="none"/>
    <path d="M10.7 48.35 L14.05 56.1 12.85 56.65 11.9 57.15 11.65 57.25 11.2 57.45 4.75 51.1 10.55 48.3 10.7 48.35" fill="#567280" fill-rule="evenodd" stroke="none"/>
    <path d="M40.0 21.05 L40.7 19.5 41.65 17.4 53.85 23.9 66.9 30.85 67.65 33.5 67.75 33.95 67.85 34.9 67.85 35.3 67.9 35.9 64.0 33.8 48.15 25.35 40.0 21.05 M40.7 39.8 L44.4 43.2 44.75 43.55 55.2 53.2 52.85 54.75 51.4 55.7 37.8 43.15 51.4 55.7 50.45 56.25 47.25 53.3 40.0 46.6 36.95 43.8 35.9 42.85 30.05 37.45 25.5 33.25 26.2 32.5 27.85 30.85 28.2 30.45 29.35 29.3 30.05 30.0 36.55 36.0 40.7 39.8 M7.35 40.7 L7.95 40.4 21.0 70.35 7.95 40.4 13.25 38.0 16.45 45.3 16.25 45.4 16.5 45.5 19.75 52.9 19.95 53.35 21.55 57.05 26.45 68.2 23.4 69.45 21.0 70.35 20.35 70.6 17.2 63.35 15.6 59.7 14.05 56.1 10.7 48.35 10.65 48.25 7.35 40.7 M37.8 43.15 L37.95 43.0 37.65 43.0 37.8 43.15 M26.2 32.5 L37.65 43.0 26.2 32.5 M-56.6 67.1 L-57.45 66.65 -37.85 40.25 -37.6 39.9 -36.7 40.25 -42.15 47.65 -42.85 48.55 -46.2 53.1 -48.8 56.65 -53.1 62.4 -56.6 67.1 M-79.6 47.4 L-79.65 47.15 -79.85 46.1 -79.9 45.65 -53.05 27.3 -52.05 28.6 -61.65 35.15 -75.8 44.8 -75.95 44.9 -79.6 47.4 M-14.05 66.95 L-14.05 67.0 -15.05 73.9 -20.7 63.9 -20.6 63.35 -19.9 58.45 -19.4 54.75 -19.25 54.6 Q-18.75 54.6 -17.6 55.75 L-16.1 55.15 Q-15.2 55.15 -12.8 57.95 L-12.85 58.5 -13.6 63.8 -14.05 66.95 M-14.3 61.9 L-14.2 61.9 -14.3 61.9 M-15.9 66.95 L-15.85 66.95 -15.9 66.95" fill="#c7aab8" fill-rule="evenodd" stroke="none"/>
    <path d="M48.15 25.35 L64.0 33.8 67.9 35.9 67.85 36.9 67.85 36.95 67.85 37.0 67.8 37.3 Q67.45 41.4 64.6 45.1 L44.75 43.55 64.6 45.1 Q62.55 47.8 59.25 50.3 L58.95 50.55 55.2 53.2 44.75 43.55 44.4 43.2 Q47.0 40.7 47.6 37.9 L47.85 35.1 47.95 35.1 47.9 34.95 47.85 34.65 47.15 32.55 Q45.85 29.5 42.2 26.9 L48.15 25.35 M66.9 30.85 L53.85 23.9 60.15 22.3 Q65.15 26.25 66.9 30.85 M64.0 33.8 L47.95 35.1 64.0 33.8 M-79.95 42.8 Q-79.6 38.15 -76.05 34.0 L-68.0 34.65 -79.95 42.8 M14.05 56.1 L15.6 59.7 17.2 63.35 20.35 70.6 15.5 72.35 14.75 72.6 Q9.7 74.3 4.2 75.35 -4.5 76.95 -14.3 76.95 L-14.4 76.95 -15.5 76.95 -15.05 73.9 -14.05 67.0 -14.05 66.95 -13.7 66.95 -13.6 66.95 Q-5.75 66.9 0.95 65.05 -5.75 66.9 -13.6 66.95 L-13.7 66.95 -14.05 66.95 -13.6 63.8 -12.7 63.8 -12.45 63.8 Q-5.65 63.65 -0.05 62.0 L3.15 60.85 4.3 60.35 4.6 60.25 4.7 60.2 6.55 59.45 6.6 59.45 7.05 59.25 11.2 57.45 11.65 57.25 11.9 57.15 12.85 56.65 14.05 56.1 M28.9 48.65 L32.45 46.55 32.95 46.25 35.85 44.5 35.95 44.45 36.15 44.3 36.25 44.25 36.95 43.8 40.0 46.6 34.65 50.1 40.0 46.6 47.25 53.3 34.65 50.1 47.25 53.3 50.45 56.25 Q45.05 59.5 39.05 62.55 33.05 65.5 26.45 68.2 L21.55 57.05 19.95 53.35 20.25 53.15 28.2 49.0 28.55 48.8 28.9 48.65 34.65 50.1 28.9 48.65 M20.25 53.15 L24.85 55.45 20.25 53.15 M34.65 50.1 L24.85 55.45 21.55 57.05 24.85 55.45 34.65 50.1 M39.05 62.55 L24.85 55.45 39.05 62.55 M15.6 59.7 L14.1 60.3 11.2 57.45 14.1 60.3 15.6 59.7 M14.15 60.3 L14.1 60.3 14.1 60.35 14.15 60.3 17.2 63.35 14.15 60.3 M0.95 65.05 L-0.05 62.0 0.95 65.05 2.45 64.65 2.75 64.55 2.8 64.55 3.0 64.5 3.5 64.3 3.0 64.5 2.8 64.55 2.75 64.55 2.45 64.65 0.95 65.05 4.2 75.35 0.95 65.05 M3.45 64.3 L3.5 64.3 3.45 64.3 3.75 64.2 3.9 64.2 4.1 64.1 14.1 60.35 4.1 64.1 3.9 64.2 3.75 64.2 3.45 64.3 M-22.5 76.65 Q-32.65 75.85 -41.5 73.1 L-44.1 72.2 Q-50.85 69.8 -56.6 67.1 L-53.1 62.4 -45.35 58.55 -53.1 62.4 -48.8 56.65 -46.2 53.1 -40.75 56.25 -45.35 58.55 -45.4 58.5 -45.35 58.55 -40.75 56.25 Q-35.5 59.0 -29.35 61.15 L-28.4 61.5 -28.35 61.5 -28.0 61.65 -27.9 61.7 -27.65 61.75 -20.6 63.35 -20.7 63.9 -21.05 66.6 Q-27.1 65.95 -32.3 64.1 -27.1 65.95 -21.05 66.6 L-22.5 76.65 M-62.45 64.05 Q-66.5 61.75 -70.2 59.2 L-70.5 59.0 -73.75 56.4 Q-78.45 52.2 -79.6 47.4 L-75.95 44.9 -75.8 44.8 -61.65 35.15 -55.25 35.65 Q-59.8 39.25 -59.95 43.65 L-75.95 44.9 -59.95 43.65 -53.45 43.1 -53.45 43.15 -53.45 43.35 -53.45 43.4 -53.45 43.45 -53.5 43.5 -53.5 44.0 -53.45 44.05 Q-53.4 46.7 -51.35 49.05 L-52.8 51.05 -54.3 53.1 -62.45 64.05 M-59.95 44.0 L-59.95 43.65 -59.95 44.0 -59.95 44.35 -60.0 44.5 -60.0 44.6 -59.9 45.05 Q-59.5 48.7 -55.9 51.85 -59.5 48.7 -59.9 45.05 L-60.0 44.6 -60.0 44.5 -59.95 44.35 -59.95 44.0 M-52.8 51.05 L-55.9 51.85 -52.8 51.05 M-45.6 58.4 L-45.65 58.4 -45.7 58.35 -45.65 58.4 -45.6 58.4 -45.4 58.5 -45.6 58.4 M-46.05 58.2 L-46.15 58.15 -46.2 58.1 -46.35 58.05 -48.8 56.65 -46.35 58.05 -46.2 58.1 -46.15 58.15 -46.05 58.2 -46.0 58.2 -46.05 58.2 M-45.7 58.35 L-46.0 58.2 -45.7 58.35 M-45.35 58.55 L-44.25 59.1 -45.35 58.55 M-44.25 59.1 L-44.15 59.15 -44.25 59.1 M-54.3 53.1 L-55.9 51.85 -54.3 53.1 M-73.75 56.4 L-55.9 51.85 -73.75 56.4 M-32.3 64.1 L-29.35 61.15 -32.3 64.1 -32.5 64.05 -32.35 64.1 -32.3 64.1 M-44.15 59.15 Q-38.9 61.8 -32.5 64.05 -38.9 61.8 -44.15 59.15 M-41.5 73.1 L-32.35 64.1 -41.5 73.1" fill="url(#gradient0)" fill-rule="evenodd" stroke="none"/>
    <path d="M64.6 45.1 Q67.45 41.4 67.8 37.3 L67.85 37.3 Q68.1 42.5 64.6 47.1 62.55 49.8 59.25 52.3 L58.95 52.55 56.45 54.35 52.85 56.75 52.65 56.85 51.75 57.45 39.05 64.55 Q33.4 67.35 27.15 69.9 L23.4 71.45 21.75 72.05 21.1 72.3 15.5 74.35 14.75 74.6 Q9.7 76.3 4.2 77.35 -4.5 78.95 -14.3 78.95 L-14.4 78.95 -15.75 78.95 -19.0 78.85 -19.05 78.85 -22.75 78.65 Q-32.8 77.8 -41.5 75.1 L-44.1 74.2 Q-51.5 71.6 -57.7 68.55 L-58.35 68.25 -58.4 68.2 -58.55 68.15 -59.55 67.6 -60.1 67.3 -60.2 67.25 -63.45 65.45 Q-67.0 63.45 -70.2 61.2 L-70.5 61.0 -73.75 58.4 Q-79.3 53.4 -79.9 47.6 L-79.95 47.2 -79.65 47.15 -79.6 47.4 Q-78.45 52.2 -73.75 56.4 L-70.5 59.0 -70.2 59.2 Q-66.5 61.75 -62.45 64.05 L-60.2 65.25 -60.1 65.3 -59.55 65.6 -58.4 66.2 -58.35 66.25 -57.45 66.65 -56.6 67.1 Q-50.85 69.8 -44.1 72.2 L-41.5 73.1 Q-32.65 75.85 -22.5 76.65 L-19.05 76.85 -19.0 76.85 -15.5 76.95 -14.4 76.95 -14.3 76.95 Q-4.5 76.95 4.2 75.35 9.7 74.3 14.75 72.6 L15.5 72.35 20.35 70.6 21.0 70.35 23.4 69.45 26.45 68.2 Q33.05 65.5 39.05 62.55 45.05 59.5 50.45 56.25 L51.4 55.7 52.85 54.75 55.2 53.2 58.95 50.55 59.25 50.3 Q62.55 47.8 64.6 45.1" fill="url(#gradient1)" fill-rule="evenodd" stroke="none"/>
    <path d="M11.2 57.45 L7.05 59.25 6.6 59.45 6.55 59.45 4.7 60.2 4.6 60.25 4.3 60.35 3.15 60.85 -0.05 62.0 -0.6 60.25 -0.05 62.0 Q-5.65 63.65 -12.45 63.8 L-12.7 63.8 -13.6 63.8 -12.85 58.5 -10.7 57.85 -8.9 57.1 -8.7 57.05 -6.35 56.1 -2.4 54.4 -0.05 53.35 0.9 52.85 4.75 51.1 11.2 57.45 M-0.6 60.25 L-2.4 54.4 -0.6 60.25 -0.5 60.25 -0.6 60.25 M-33.8 52.75 Q-29.6 54.95 -24.9 56.8 L-24.85 56.8 -21.35 58.05 -19.9 58.45 -20.6 63.35 -27.65 61.75 -27.9 61.7 -28.0 61.65 -28.35 61.5 -28.4 61.5 -29.35 61.15 -27.6 59.45 -24.85 56.8 -27.6 59.45 -27.5 59.5 -27.6 59.45 -29.35 61.15 Q-35.5 59.0 -40.75 56.25 L-33.8 52.75" fill="url(#gradient2)" fill-rule="evenodd" stroke="none"/>
    <path d="M-79.95 47.2 L-80.0 46.15 -79.85 46.1 -79.65 47.15 -79.95 47.2" fill="url(#gradient3)" fill-rule="evenodd" stroke="none"/>
    <path d="M17.65 15.1 L19.25 15.55 19.4 15.6 19.6 15.7 19.7 15.7 M19.7 15.75 L20.15 15.85 M20.15 15.9 L20.55 16.0 20.6 16.05 Q25.9 17.9 30.5 20.1 L30.6 20.15 30.65 20.15 30.7 20.2 30.75 20.25 30.85 20.3 M44.4 43.2 Q47.0 40.7 47.6 37.9 M1.3 13.0 L1.65 13.0 M1.75 13.0 L1.95 13.0 2.1 13.05 3.05 13.05 M3.15 13.05 L3.2 13.05 3.5 13.05 Q11.1 13.2 17.65 15.1 M34.65 50.1 L40.0 46.6 M21.55 57.05 L24.85 55.45 34.65 50.1 M0.95 65.05 L2.45 64.65 2.75 64.55 2.8 64.55 3.0 64.5 3.5 64.3 M3.45 64.3 L3.75 64.2 3.9 64.2 4.1 64.1 14.1 60.35 M0.95 65.05 Q-5.75 66.9 -13.6 66.95 L-13.7 66.95 -14.05 66.95 M-27.0 19.95 Q-23.3 18.4 -19.35 17.0 L-18.65 16.55 -18.5 16.5 -18.25 16.4 -18.1 16.35 -17.9 16.3 -16.65 16.0 M-16.6 16.0 L-16.35 15.95 M-16.3 15.9 L-15.7 15.7 -15.55 15.65 -15.35 15.6 -15.3 15.6 -14.75 15.4 Q-7.5 13.1 1.2 13.0 M-37.0 24.55 Q-32.2 22.1 -27.05 19.95 M-37.0 24.55 L-46.1 29.5 M-59.95 44.0 L-59.95 44.35 -60.0 44.5 -60.0 44.6 -59.9 45.05 Q-59.5 48.7 -55.9 51.85 L-54.3 53.1 M-45.6 58.4 L-45.4 58.5 M-48.8 56.65 L-46.35 58.05 -46.2 58.1 -46.15 58.15 -46.05 58.2 M-46.0 58.2 L-45.7 58.35 M-44.25 59.1 L-45.35 58.55 M-32.3 64.1 Q-27.1 65.95 -21.05 66.6 M-32.5 64.05 Q-38.9 61.8 -44.15 59.15" fill="none" stroke="#660000" stroke-linecap="round" stroke-linejoin="miter" stroke-miterlimit="3.0" stroke-opacity="0.101960786" stroke-width="0.05"/>
    <path d="M67.9 35.9 L67.85 35.3 67.85 34.9 67.75 33.95 67.65 33.5 66.9 30.85 M45.15 13.25 L45.1 13.2 45.0 13.2 44.85 13.1 Q38.9 10.25 31.95 7.75 L31.25 7.55 26.75 6.15 17.65 15.1 14.65 18.05 Q9.15 16.4 2.7 16.3 L1.9 16.3 1.85 16.3 1.2 16.3 1.0 16.3 0.15 16.3 -0.4 18.15 -0.45 18.2 -1.65 22.25 M19.7 15.7 L19.7 15.75 M20.15 15.85 L20.15 15.9 M30.85 20.3 L30.9 20.3 31.0 20.35 26.4 22.65 Q21.95 20.5 16.75 18.7 L14.65 18.05 10.25 22.35 M31.0 20.35 L36.6 17.55 M36.8 17.45 L45.15 13.25 45.85 13.6 46.35 13.85 Q50.05 15.7 53.3 17.7 L53.6 17.85 53.7 17.95 53.8 18.0 53.9 18.05 54.3 18.3 54.65 18.5 57.2 20.25 57.45 20.35 60.15 22.3 Q65.15 26.25 66.9 30.85 M53.85 23.9 L60.15 22.3 M31.0 20.35 L31.3 20.5 31.35 20.55 31.85 20.75 32.15 20.9 37.3 23.7 37.4 23.8 38.05 24.1 38.15 24.25 38.2 24.25 38.45 24.45 38.55 24.5 38.65 24.55 38.75 24.65 38.8 24.65 40.95 26.1 41.15 26.2 41.65 26.5 41.7 26.55 41.85 26.65 42.2 26.9 48.15 25.35 M41.55 35.6 L41.6 36.65 41.55 36.6 41.55 36.9 41.55 37.0 Q41.4 38.45 40.7 39.8 M47.6 37.9 L47.85 35.1 47.8 35.1 41.55 35.6 Q41.25 32.25 37.75 29.45 L37.45 29.2 36.9 28.75 36.95 28.85 36.35 28.35 32.95 29.25 M32.9 29.25 L30.05 30.0 M36.55 36.0 L41.55 35.6 M42.2 26.9 Q45.85 29.5 47.15 32.55 L47.85 34.65 47.9 34.95 M47.95 35.1 L64.0 33.8 M47.85 35.1 L47.8 35.0 47.75 34.65 47.8 35.1 47.85 35.1 47.9 34.95 M47.85 35.1 L47.95 35.1 M44.75 43.55 L64.6 45.1 Q67.45 41.4 67.8 37.3 L67.85 37.0 67.85 36.95 67.85 36.9 67.9 35.9 M67.85 37.3 Q68.1 42.5 64.6 47.1 62.55 49.8 59.25 52.3 L58.95 52.55 56.45 54.35 52.85 56.75 52.65 56.85 51.75 57.45 39.05 64.55 Q33.4 67.35 27.15 69.9 L23.4 71.45 21.75 72.05 21.1 72.3 15.5 74.35 14.75 74.6 Q9.7 76.3 4.2 77.35 -4.5 78.95 -14.3 78.95 L-14.4 78.95 -15.75 78.95 -19.0 78.85 -19.05 78.85 -22.75 78.65 Q-32.8 77.8 -41.5 75.1 L-44.1 74.2 Q-51.5 71.6 -57.7 68.55 L-58.35 68.25 -58.4 68.2 -58.55 68.15 -59.55 67.6 -60.1 67.3 -60.2 67.25 -63.45 65.45 Q-67.0 63.45 -70.2 61.2 L-70.5 61.0 -73.75 58.4 Q-79.3 53.4 -79.9 47.6 L-79.95 47.2 -80.0 46.15 -80.0 46.1 -80.0 45.7 -80.0 45.2 -80.0 45.0 -80.0 44.15 -80.0 44.1 -79.95 42.8 Q-79.6 38.15 -76.05 34.0 -74.15 31.7 -71.25 29.6 L-70.75 29.2 -64.35 24.9 Q-58.1 20.95 -51.15 17.45 -44.1 13.9 -36.3 10.85 -31.85 9.1 -27.15 7.5 L-26.75 7.35 Q-22.55 5.95 -18.1 5.0 -7.65 -0.6 -2.0 -0.4 3.6 -0.25 3.7 1.4 3.8 3.0 5.6 -0.7 16.4 3.3 26.75 6.15 M67.85 37.0 L67.85 37.3 M26.4 22.65 L26.45 22.65 Q32.0 25.3 36.35 28.35 L42.2 26.9 M19.45 26.15 L26.45 22.65 M3.3 6.35 L5.6 -0.7 M3.3 6.4 L3.3 6.35 M2.25 9.7 L1.2 13.0 0.15 16.3 Q-7.6 16.5 -13.7 18.75 L-13.75 18.75 -13.2 20.45 -13.15 20.5 -11.35 26.35 M1.65 13.0 L1.75 13.0 M3.05 13.05 L3.15 13.05 M2.25 9.7 L3.3 6.4 M1.3 13.0 L1.2 13.0 M20.35 70.6 L21.0 70.35 23.4 69.45 26.45 68.2 M16.5 45.5 L28.9 48.65 32.45 46.55 32.95 46.25 35.85 44.5 35.95 44.45 36.15 44.3 36.25 44.25 36.95 43.8 M35.9 42.85 L34.5 42.75 34.45 42.75 22.8 41.8 M10.55 48.3 L10.7 48.35 M32.9 29.25 L32.95 29.25 M28.2 30.45 L27.55 30.65 M20.25 53.15 L28.2 49.0 28.55 48.8 28.9 48.65 34.65 50.1 47.25 53.3 M51.4 55.7 L52.85 54.75 55.2 53.2 M24.85 55.45 L20.25 53.15 19.95 53.35 M24.85 55.45 L39.05 62.55 Q45.05 59.5 50.45 56.25 L51.4 55.7 M39.05 62.55 Q33.05 65.5 26.45 68.2 M14.05 56.1 L12.85 56.65 11.9 57.15 11.65 57.25 11.2 57.45 14.1 60.3 15.6 59.7 M14.15 60.3 L14.1 60.3 14.1 60.35 M14.15 60.3 L17.2 63.35 M-0.05 62.0 L3.15 60.85 4.3 60.35 4.6 60.25 4.7 60.2 6.55 59.45 6.6 59.45 7.05 59.25 11.2 57.45 4.75 51.1 M-2.4 54.4 L-0.6 60.25 -0.05 62.0 0.95 65.05 M3.5 64.3 L3.45 64.3 M20.35 70.6 L15.5 72.35 14.75 72.6 Q9.7 74.3 4.2 75.35 -4.5 76.95 -14.3 76.95 L-14.4 76.95 -15.5 76.95 -19.0 76.85 -19.05 76.85 -22.5 76.65 Q-32.65 75.85 -41.5 73.1 L-44.1 72.2 Q-50.85 69.8 -56.6 67.1 L-57.45 66.65 -58.35 66.25 -58.4 66.2 -59.55 65.6 -60.1 65.3 -60.2 65.25 -62.45 64.05 Q-66.5 61.75 -70.2 59.2 L-70.5 59.0 -73.75 56.4 Q-78.45 52.2 -79.6 47.4 L-79.65 47.15 -79.85 46.1 -79.9 45.65 -79.95 45.2 -80.0 45.0 M4.2 75.35 L0.95 65.05 M-14.05 66.95 L-14.05 67.0 M19.75 52.9 L20.25 53.15 M64.6 45.1 Q62.55 47.8 59.25 50.3 L58.95 50.55 55.2 53.2 M-16.65 16.0 L-16.6 16.0 M-16.35 15.95 L-16.3 15.9 M-14.75 15.4 L-18.1 5.0 M-23.95 23.0 L-23.5 22.8 Q-21.2 21.75 -18.85 20.8 L-18.45 20.65 -14.9 19.15 -13.95 18.8 -13.75 18.75 M-13.7 18.75 L-14.75 15.4 M-27.05 19.95 L-27.0 19.95 -36.3 10.85 M-23.95 23.05 L-23.95 23.0 -24.05 23.05 Q-28.15 24.9 -32.2 26.95 L-22.65 31.7 M-17.6 29.25 L-22.55 24.4 M-22.6 24.35 L-23.95 23.05 M-23.95 23.0 L-27.0 19.95 M-22.6 24.35 L-22.55 24.35 -22.55 24.4 M-40.05 31.05 L-39.3 30.7 -39.2 30.65 -39.1 30.55 -32.2 26.95 -37.0 24.55 -51.15 17.45 M-46.1 29.5 L-40.05 31.05 -27.55 34.25 M-40.05 31.05 L-40.4 31.25 -44.4 33.55 -44.8 33.8 -46.25 34.65 -46.6 34.9 -46.8 35.0 -46.85 35.05 -46.9 35.05 -47.4 35.4 -47.6 35.5 -48.6 36.15 -45.2 36.45 -42.15 36.7 M-35.25 37.2 L-33.35 37.35 M-35.6 37.2 L-42.15 36.7 M-75.95 44.9 L-59.95 43.65 Q-59.8 39.25 -55.25 35.65 L-61.65 35.15 M-68.0 34.65 L-76.05 34.0 M-55.25 35.65 L-54.95 35.4 -54.9 35.35 -54.85 35.3 -54.7 35.2 -54.4 34.95 -54.3 34.9 -54.25 34.9 -54.25 34.85 -54.2 34.85 -54.0 34.7 -54.0 34.65 Q-50.25 31.95 -46.1 29.5 L-51.45 28.15 M-51.35 49.05 Q-53.4 46.7 -53.45 44.05 L-53.5 44.0 -53.5 43.5 -53.45 43.45 -53.45 43.4 -53.45 43.35 -53.45 43.15 -53.45 43.1 -59.95 43.65 -59.95 44.0 M-55.9 51.85 L-52.8 51.05 M-49.7 42.85 L-53.45 43.15 M-46.5 42.6 L-49.7 42.85 M-42.85 48.55 L-41.4 48.2 M-53.45 43.1 Q-53.1 39.25 -48.6 36.15 L-55.25 35.65 M-56.6 26.85 L-64.35 24.9 M-45.7 58.35 L-45.65 58.4 -45.6 58.4 M-45.4 58.5 L-45.35 58.55 -40.75 56.25 -46.2 53.1 M-46.05 58.2 L-46.0 58.2 M-45.35 58.55 L-53.1 62.4 M-44.15 59.15 L-44.25 59.1 M-55.9 51.85 L-73.75 56.4 M-13.6 63.8 L-12.7 63.8 -12.45 63.8 Q-5.65 63.65 -0.05 62.0 M-15.85 66.95 L-15.9 66.95 M-20.6 63.35 L-27.65 61.75 -27.9 61.7 -28.0 61.65 -28.35 61.5 -28.4 61.5 -29.35 61.15 -32.3 64.1 -32.35 64.1 -32.3 64.1 M-27.6 59.45 L-24.85 56.8 M-29.35 61.15 L-27.6 59.45 M-32.35 64.1 L-32.5 64.05 M-32.35 64.1 L-41.5 73.1 M-40.75 56.25 Q-35.5 59.0 -29.35 61.15 M-33.8 52.75 L-40.75 56.25" fill="none" stroke="#660000" stroke-linecap="round" stroke-linejoin="miter" stroke-miterlimit="3.0" stroke-opacity="0.3019608" stroke-width="0.05"/>
    <path d="M41.65 17.4 L40.75 16.9 M7.95 40.4 L6.05 36.1 M13.25 38.0 L12.9 37.2 M29.35 29.3 L28.75 28.8 M-36.7 40.25 L-36.2 39.6 M-42.15 36.7 L-41.4 35.7 M-35.6 37.2 L-35.25 37.2 M-11.1 45.85 L-10.95 44.85 M-51.45 28.15 L-50.65 27.65 M-53.05 27.3 L-50.45 25.55" fill="none" stroke="#660000" stroke-linecap="round" stroke-linejoin="miter" stroke-miterlimit="3.0" stroke-opacity="0.3019608" stroke-width="0.05"/>
    <path d="M40.0 21.05 L48.15 25.35 64.0 33.8 67.9 35.9 M66.9 30.85 L53.85 23.9 41.65 17.4 M40.7 39.8 L44.4 43.2 44.75 43.55 M30.05 30.0 L36.55 36.0 M7.35 40.7 L10.65 48.25 10.7 48.35 14.05 56.1 15.6 59.7 17.2 63.35 20.35 70.6 M21.0 70.35 L7.95 40.4 M16.45 45.3 L13.25 38.0 M16.45 45.3 L16.5 45.5 M36.95 43.8 L35.9 42.85 M29.35 29.3 L30.05 30.0 M25.5 33.25 L30.05 37.45 35.9 42.85 M40.0 46.6 L36.95 43.8 M37.65 43.0 L37.8 43.15 51.4 55.7 M55.2 53.2 L44.75 43.55 M37.65 43.0 L26.2 32.5 M19.95 53.35 L21.55 57.05 M47.25 53.3 L40.0 46.6 M26.45 68.2 L21.55 57.05 M50.45 56.25 L47.25 53.3 M19.95 53.35 L19.75 52.9 16.5 45.5 M-15.05 73.9 L-15.5 76.95 M40.7 39.8 L36.55 36.0 M36.8 17.45 L40.7 19.5 M-37.5 39.75 L-37.6 39.9 M-42.15 36.7 L-46.5 42.6 -51.35 49.05 -52.8 51.05 M-54.3 53.1 L-62.45 64.05 M-37.85 40.25 L-37.6 39.9 M-11.1 45.85 L-12.8 57.95 -12.85 58.5 M-18.1 45.5 L-19.4 54.75 M-79.9 45.65 L-80.0 45.7 M-75.95 44.9 L-79.6 47.4 M-75.8 44.8 L-61.65 35.15 -52.05 28.6 -51.45 28.15 M-53.05 27.3 L-79.9 45.65 M-75.8 44.8 L-75.95 44.9 M-68.0 34.65 L-79.95 42.8 M-54.5 25.45 L-56.6 26.85 -68.0 34.65 M-19.9 58.45 L-19.4 54.75 M-46.2 53.1 L-48.8 56.65 M-53.1 62.4 L-56.6 67.1 M-53.1 62.4 L-48.8 56.65 M-14.05 66.95 L-13.6 63.8 -12.85 58.5 M-21.05 66.6 L-20.7 63.9 -20.6 63.35 -19.9 58.45 M-21.05 66.6 L-22.5 76.65 M-57.45 66.65 L-37.85 40.25 M-42.15 47.65 L-36.7 40.25 M-46.2 53.1 L-42.85 48.55" fill="none" stroke="#660000" stroke-linecap="round" stroke-linejoin="miter" stroke-miterlimit="3.0" stroke-opacity="0.3019608" stroke-width="0.05"/>
    <path d="M36.6 17.55 L36.8 17.45 M38.85 20.45 L40.0 21.05 M6.95 39.8 L7.35 40.7 M25.05 32.8 L25.5 33.25 M24.05 30.5 L26.2 32.5 M-14.05 67.0 L-15.05 73.9 M-37.5 39.75 L-35.6 37.2 M-52.8 51.05 L-54.3 53.1 M-17.85 43.85 L-18.1 45.5 M-42.15 47.65 L-42.85 48.55 M-52.9 24.35 L-54.5 25.45" fill="none" stroke="#660000" stroke-linecap="square" stroke-linejoin="miter" stroke-miterlimit="3.0" stroke-opacity="0.3019608" stroke-width="0.05"/>
  </g>
  <defs>
    <linearGradient gradientTransform="matrix(0.0872, 0.0, 0.0, 0.0334, -7.1, 49.6)" gradientUnits="userSpaceOnUse" id="gradient0" spreadMethod="pad" x1="-819.2" x2="819.2">
      <stop offset="0.0" stop-color="#7f8772"/>
      <stop offset="1.0" stop-color="#4c4d49"/>
    </linearGradient>
    <linearGradient gradientTransform="matrix(0.0902, 0.0, 0.0, 0.0254, -6.05, 58.1)" gradientUnits="userSpaceOnUse" id="gradient1" spreadMethod="pad" x1="-819.2" x2="819.2">
      <stop offset="0.0" stop-color="#ffffff"/>
      <stop offset="1.0" stop-color="#bb9991"/>
    </linearGradient>
    <linearGradient gradientTransform="matrix(0.0277, 0.0, 0.0, 0.0078, -14.95, 57.45)" gradientUnits="userSpaceOnUse" id="gradient2" spreadMethod="pad" x1="-819.2" x2="819.2">
      <stop offset="0.0" stop-color="#567280"/>
      <stop offset="1.0" stop-color="#493b4d"/>
    </linearGradient>
    <linearGradient gradientTransform="matrix(1.0, 0.0, 0.0, 1.0, 3.0, 107.0)" gradientUnits="userSpaceOnUse" id="gradient3" spreadMethod="pad" x1="-819.2" x2="819.2">
      <stop offset="0.0" stop-color="#ffffff"/>
      <stop offset="1.0" stop-color="#bb9991"/>
    </linearGradient>
  </defs>
</svg>
