<?xml version="1.0" encoding="UTF-8" standalone="no"?>
<svg xmlns:xlink="http://www.w3.org/1999/xlink" height="101.5px" width="20.0px" xmlns="http://www.w3.org/2000/svg">
  <g transform="matrix(1.0, 0.0, 0.0, 1.0, 10.0, 49.0)">
    <path d="M3.25 -2.05 L7.55 0.65 7.05 -38.4 10.0 -36.05 10.0 52.5 -10.0 42.5 -10.0 -49.0 -5.5 -46.75 -6.0 -21.05 -2.2 -20.5 -2.2 -36.8 3.25 -33.55 3.25 -2.05" fill="url(#gradient0)" fill-rule="evenodd" stroke="none"/>
  </g>
  <defs>
    <linearGradient gradientTransform="matrix(0.0, 0.0899, -0.0122, 0.0, 0.0, -30.6)" gradientUnits="userSpaceOnUse" id="gradient0" spreadMethod="pad" x1="-819.2" x2="819.2">
      <stop offset="0.0" stop-color="#ffffff"/>
      <stop offset="1.0" stop-color="#ffffff" stop-opacity="0.0"/>
    </linearGradient>
  </defs>
</svg>
