<?xml version="1.0" encoding="UTF-8" standalone="no"?>
<svg xmlns:xlink="http://www.w3.org/1999/xlink" height="12.35px" width="113.05px" xmlns="http://www.w3.org/2000/svg">
  <g transform="matrix(1.0, 0.0, 0.0, 1.0, 56.4, 5.9)">
    <path d="M-53.7 -5.6 L-51.0 -5.9 Q-48.95 -5.9 -47.6 -5.35 -46.25 -4.85 -45.8 -4.1 -45.45 -3.25 -45.45 -1.6 L-45.45 -0.45 -50.1 -0.45 -50.1 -2.6 -50.2 -3.7 -50.85 -3.95 Q-51.45 -3.95 -51.55 -3.65 -51.75 -3.35 -51.75 -2.45 L-51.75 3.05 -51.55 4.2 Q-51.45 4.5 -50.85 4.5 L-50.2 4.2 -50.1 3.0 -50.1 1.5 -45.45 1.5 -45.45 1.95 Q-45.45 3.75 -45.8 4.55 -46.25 5.35 -47.5 5.95 L-50.85 6.45 -54.25 6.0 Q-55.5 5.5 -55.95 4.65 -56.4 3.75 -56.4 2.0 L-56.4 -1.45 -56.25 -3.4 Q-56.15 -4.1 -55.5 -4.6 -54.8 -5.2 -53.7 -5.6 M23.7 -5.65 L23.7 6.25 19.65 6.25 19.65 -1.8 18.05 6.25 15.15 6.25 13.45 -1.6 13.45 6.25 9.4 6.25 9.4 -5.65 15.5 -5.65 15.95 -3.2 16.6 -0.1 17.75 -5.65 23.7 -5.65 M30.2 -3.25 L30.2 -1.0 33.15 -1.0 33.15 1.25 30.2 1.25 30.2 3.8 33.7 3.8 33.7 6.25 25.6 6.25 25.6 -5.65 33.35 -5.65 33.35 -3.25 30.2 -3.25 M-2.3 -4.55 Q-1.95 -3.95 -1.95 -2.6 L-1.95 -2.05 -6.2 -2.05 -6.2 -2.95 Q-6.2 -3.55 -6.35 -3.7 L-6.9 -3.95 -7.55 -3.7 -7.8 -2.95 Q-7.8 -2.45 -7.45 -2.1 L-6.2 -1.35 Q-3.05 -0.15 -2.3 0.65 -1.5 1.4 -1.5 3.2 -1.5 4.4 -1.95 5.05 -2.4 5.65 -3.65 6.1 L-6.65 6.45 -9.8 6.0 Q-11.15 5.55 -11.5 4.8 -11.95 4.05 -11.95 2.75 L-11.95 1.95 -7.7 1.95 -7.7 3.45 -7.45 4.25 -6.8 4.5 Q-6.35 4.5 -6.1 4.2 L-5.9 3.5 Q-5.9 2.45 -6.35 2.15 -6.8 1.8 -8.45 1.05 L-10.85 -0.1 -11.75 -1.0 -12.05 -2.6 Q-12.05 -3.95 -11.6 -4.6 -11.05 -5.2 -9.95 -5.6 L-7.1 -5.9 -3.95 -5.5 -2.3 -4.55 M7.7 -3.25 L4.55 -3.25 4.55 -1.0 7.5 -1.0 7.5 1.25 4.55 1.25 4.55 3.8 8.05 3.8 8.05 6.25 -0.05 6.25 -0.05 -5.65 7.7 -5.65 7.7 -3.25 M35.05 -5.65 L39.0 -5.65 41.55 -0.3 41.55 -5.65 45.4 -5.65 45.4 6.25 41.35 6.25 39.0 0.8 39.0 6.25 35.05 6.25 35.05 -5.65 M-21.65 -5.6 L-18.8 -5.9 -15.65 -5.5 Q-14.45 -5.15 -14.0 -4.55 -13.65 -3.95 -13.65 -2.6 L-13.65 -2.05 -17.9 -2.05 -17.9 -2.95 Q-17.9 -3.55 -18.05 -3.7 L-18.6 -3.95 -19.25 -3.7 -19.5 -2.95 Q-19.5 -2.45 -19.15 -2.1 L-17.9 -1.35 Q-14.75 -0.15 -14.0 0.65 -13.2 1.4 -13.2 3.2 -13.2 4.4 -13.65 5.05 -14.1 5.65 -15.35 6.1 L-18.35 6.45 -21.5 6.0 Q-22.85 5.55 -23.2 4.8 -23.65 4.05 -23.65 2.75 L-23.65 1.95 -19.4 1.95 -19.4 3.45 -19.15 4.25 -18.5 4.5 Q-18.05 4.5 -17.8 4.2 L-17.6 3.5 Q-17.6 2.45 -18.05 2.15 -18.5 1.8 -20.15 1.05 L-22.55 -0.1 -23.45 -1.0 -23.75 -2.6 Q-23.75 -3.95 -23.3 -4.6 -22.75 -5.2 -21.65 -5.6 M-39.05 -5.65 L-39.05 3.8 -36.25 3.8 -36.25 6.25 -43.65 6.25 -43.65 -5.65 -39.05 -5.65 M-31.2 6.25 L-36.0 6.25 -33.65 -5.65 -27.05 -5.65 -24.35 6.25 -29.05 6.25 -29.3 4.1 -30.95 4.1 -31.2 6.25 M-29.4 2.0 L-30.2 -3.05 -31.1 2.0 -29.4 2.0 M56.65 -5.65 L56.65 -3.25 53.95 -3.25 53.95 6.25 49.2 6.25 49.2 -3.25 46.5 -3.25 46.5 -5.65 56.65 -5.65" fill="#1b5fc3" fill-rule="evenodd" stroke="none"/>
  </g>
</svg>
