<?xml version="1.0" encoding="UTF-8" standalone="no"?>
<svg xmlns:xlink="http://www.w3.org/1999/xlink" height="9.05px" width="18.1px" xmlns="http://www.w3.org/2000/svg">
  <g transform="matrix(1.0, 0.0, 0.0, 1.0, 31.05, -61.1)">
    <path d="M-26.95 62.95 L-23.5 61.25 -23.85 61.1 -31.05 64.7 -30.7 64.85 -27.3 63.15 -25.0 64.3 -28.4 66.0 -28.1 66.15 -24.65 64.45 -22.35 65.6 -25.8 67.3 -25.45 67.5 -22.0 65.8 -19.7 66.9 -23.15 68.65 -22.8 68.8 -19.35 67.1 -17.05 68.25 -20.5 69.95 -20.15 70.15 -12.95 66.55 -13.3 66.35 -16.75 68.05 -19.05 66.9 -15.6 65.2 -15.95 65.05 -19.35 66.75 -21.65 65.6 -18.25 63.9 -18.6 63.7 -22.0 65.45 -24.3 64.3 -20.9 62.6 -21.25 62.4 -24.65 64.1 -26.95 62.95" fill="#ffffff" fill-rule="evenodd" stroke="none"/>
  </g>
</svg>
