<?xml version="1.0" encoding="UTF-8" standalone="no"?>
<svg xmlns:xlink="http://www.w3.org/1999/xlink" height="59.35px" width="17.9px" xmlns="http://www.w3.org/2000/svg">
  <g transform="matrix(1.0, 0.0, 0.0, 1.0, 30.8, 390.6)">
    <path d="M-25.5 -338.75 L-25.5 -331.25 M-30.7 -341.25 L-30.8 -334.0" fill="none" stroke="#ffffcc" stroke-linecap="round" stroke-linejoin="round" stroke-width="0.05"/>
    <path d="M-18.15 -338.75 L-18.05 -331.25" fill="none" stroke="#d1c28b" stroke-linecap="round" stroke-linejoin="round" stroke-width="0.05"/>
    <path d="M-21.85 -390.6 L-21.85 -362.3" fill="none" stroke="#bfbf98" stroke-linecap="round" stroke-linejoin="round" stroke-width="0.05"/>
    <path d="M-21.2 -361.55 L-20.35 -361.95 -20.35 -362.6 -19.95 -359.65 -19.95 -359.5 -19.95 -359.1 -19.95 -358.9 -20.1 -358.8 -21.05 -358.35 -20.1 -358.8 -19.95 -358.9 -19.95 -358.35 -20.0 -358.3 -20.1 -358.25 -20.2 -358.2 -21.05 -357.8 -21.05 -358.35 -21.2 -361.55 M-18.15 -341.55 L-12.9 -344.15 -12.9 -341.35 -18.15 -338.75 -18.15 -341.55" fill="#c5c59d" fill-rule="evenodd" stroke="none"/>
    <path d="M-22.4 -361.55 L-21.2 -361.55 -21.05 -358.35 -22.55 -358.35 -22.4 -361.55 M-22.55 -358.35 L-21.05 -358.35 -21.05 -357.8 -21.15 -357.8 -22.45 -357.8 -22.6 -357.8 -22.55 -358.35 M-25.5 -341.55 L-18.15 -341.55 -18.15 -338.75 -25.5 -338.75 -25.5 -341.55" fill="#d1c28b" fill-rule="evenodd" stroke="none"/>
    <path d="M-20.35 -362.6 L-20.35 -361.95 -21.2 -361.55 -22.4 -361.55 -23.25 -361.95 -23.3 -362.6 -23.25 -361.95 -22.4 -361.55 -22.55 -358.35 -23.5 -358.8 -23.65 -358.9 -23.5 -358.8 -22.55 -358.35 -22.6 -357.8 -23.5 -358.25 -23.65 -358.35 -23.65 -358.9 -23.65 -359.1 -23.65 -359.5 -23.65 -359.65 -23.3 -362.6 -23.25 -362.6 -22.4 -363.0 -21.2 -363.0 -20.35 -362.6 M-30.75 -344.2 L-25.5 -341.55 -25.5 -338.75 -30.75 -341.35 -30.75 -344.2" fill="url(#gradient0)" fill-rule="evenodd" stroke="none"/>
    <path d="M-23.65 -359.5 L-23.65 -359.1 -24.05 -359.05 -23.65 -359.1 -23.65 -358.9 -23.65 -358.35 -23.5 -358.25 -24.8 -357.45 Q-26.55 -356.15 -27.95 -353.85 -29.7 -351.15 -30.3 -348.05 L-30.7 -345.05 -30.75 -345.05 -30.75 -347.85 Q-30.7 -353.4 -28.1 -356.55 -26.35 -358.75 -24.05 -359.05 L-23.65 -359.5" fill="url(#gradient1)" fill-rule="evenodd" stroke="none"/>
    <path d="M-22.6 -357.8 L-22.45 -357.8 Q-23.55 -355.7 -24.4 -352.0 L-24.7 -350.45 -25.15 -347.65 -25.5 -341.55 -30.75 -344.2 -30.75 -344.35 -30.7 -345.05 -30.3 -348.05 Q-29.7 -351.15 -27.95 -353.85 -26.55 -356.15 -24.8 -357.45 L-23.5 -358.25 -22.6 -357.8" fill="url(#gradient2)" fill-rule="evenodd" stroke="none"/>
    <path d="M-22.45 -357.8 L-21.15 -357.8 Q-20.1 -355.7 -19.25 -352.0 L-18.95 -350.45 -18.5 -347.65 Q-18.1 -344.65 -18.15 -341.55 L-25.5 -341.55 -25.15 -347.65 -24.7 -350.45 -24.4 -352.0 Q-23.55 -355.7 -22.45 -357.8" fill="url(#gradient3)" fill-rule="evenodd" stroke="none"/>
    <path d="M-19.95 -359.1 L-19.95 -359.5 -19.55 -359.05 -19.95 -359.1 M-21.15 -357.8 L-21.05 -357.8 -20.2 -358.2 -20.1 -358.25 -18.85 -357.45 Q-17.1 -356.15 -15.65 -353.85 -13.95 -351.15 -13.3 -348.05 L-12.95 -345.05 -12.9 -344.5 -12.9 -344.15 -18.15 -341.55 Q-18.1 -344.65 -18.5 -347.65 L-18.95 -350.45 -19.25 -352.0 Q-20.1 -355.7 -21.15 -357.8" fill="url(#gradient4)" fill-rule="evenodd" stroke="none"/>
    <path d="M-19.95 -358.9 L-19.95 -359.1 -19.55 -359.05 Q-17.3 -358.75 -15.5 -356.55 -12.95 -353.4 -12.9 -347.85 L-12.9 -345.05 -12.95 -345.05 -13.3 -348.05 Q-13.95 -351.15 -15.65 -353.85 -17.1 -356.15 -18.85 -357.45 L-20.1 -358.25 -20.0 -358.3 -19.95 -358.35 -19.95 -358.9" fill="url(#gradient5)" fill-rule="evenodd" stroke="none"/>
    <path d="M-30.75 -345.05 L-30.7 -345.05 -30.75 -345.05" fill="url(#gradient6)" fill-rule="evenodd" stroke="none"/>
    <path d="M-21.2 -361.55 L-20.35 -361.95 -20.35 -362.6 -21.2 -363.0 -22.4 -363.0 -23.25 -362.6 -23.3 -362.6 -23.25 -361.95 -22.4 -361.55 -21.2 -361.55 -21.05 -358.35 -20.1 -358.8 -19.95 -358.9 -19.95 -359.1 -19.95 -359.5 -19.95 -359.65 -20.35 -362.6 M-23.65 -359.1 L-23.65 -359.5 -24.05 -359.05 -23.65 -359.1 -23.65 -358.9 -23.5 -358.8 -22.55 -358.35 -22.4 -361.55 M-23.65 -359.5 L-23.65 -359.65 -23.3 -362.6 M-21.05 -358.35 L-22.55 -358.35 -22.6 -357.8 -23.5 -358.25 -24.8 -357.45 Q-26.55 -356.15 -27.95 -353.85 -29.7 -351.15 -30.3 -348.05 L-30.7 -345.05 -30.75 -344.35 -30.75 -344.2 -25.5 -341.55 -25.5 -338.75 -18.15 -338.75 -12.9 -341.35 -12.9 -344.15 -12.9 -344.5 -12.95 -345.05 -13.3 -348.05 Q-13.95 -351.15 -15.65 -353.85 -17.1 -356.15 -18.85 -357.45 L-20.1 -358.25 -20.0 -358.3 -19.95 -358.35 -19.95 -358.9 M-21.05 -357.8 L-21.05 -358.35 M-21.15 -357.8 L-21.05 -357.8 -20.2 -358.2 -20.1 -358.25 M-22.45 -357.8 L-21.15 -357.8 Q-20.1 -355.7 -19.25 -352.0 L-18.95 -350.45 -18.5 -347.65 Q-18.1 -344.65 -18.15 -341.55 L-12.9 -344.15 M-22.6 -357.8 L-22.45 -357.8 Q-23.55 -355.7 -24.4 -352.0 L-24.7 -350.45 -25.15 -347.65 -25.5 -341.55 -18.15 -341.55 -18.15 -338.75 M-23.5 -358.25 L-23.65 -358.35 -23.65 -358.9 M-30.75 -345.05 L-30.75 -347.85 Q-30.7 -353.4 -28.1 -356.55 -26.35 -358.75 -24.05 -359.05 M-19.55 -359.05 L-19.95 -359.5 M-19.95 -359.1 L-19.55 -359.05 Q-17.3 -358.75 -15.5 -356.55 -12.95 -353.4 -12.9 -347.85 L-12.9 -345.05 -12.9 -344.5 M-12.95 -345.05 L-12.9 -345.05 M-30.75 -344.35 L-30.75 -345.05 M-30.7 -345.05 L-30.75 -345.05 M-25.5 -338.75 L-30.75 -341.35 -30.75 -344.2" fill="none" stroke="#660000" stroke-linecap="round" stroke-linejoin="round" stroke-opacity="0.3019608" stroke-width="0.05"/>
  </g>
  <defs>
    <linearGradient gradientTransform="matrix(0.0, 0.0301, -0.0077, 0.0, -29.8, -302.55)" gradientUnits="userSpaceOnUse" id="gradient0" spreadMethod="pad" x1="-819.2" x2="819.2">
      <stop offset="0.0" stop-color="#ffffcc"/>
      <stop offset="1.0" stop-color="#d9cda2"/>
    </linearGradient>
    <linearGradient gradientTransform="matrix(0.0038, 0.0038, -0.0064, 0.0064, -25.95, -350.85)" gradientUnits="userSpaceOnUse" id="gradient1" spreadMethod="pad" x1="-819.2" x2="819.2">
      <stop offset="0.0" stop-color="#ffffcc"/>
      <stop offset="1.0" stop-color="#d1c28b"/>
    </linearGradient>
    <linearGradient gradientTransform="matrix(-0.0052, -0.0021, 0.0037, -0.0092, -29.45, -351.9)" gradientUnits="userSpaceOnUse" id="gradient2" spreadMethod="pad" x1="-819.2" x2="819.2">
      <stop offset="0.0" stop-color="#ffffcc"/>
      <stop offset="1.0" stop-color="#d1c28b"/>
    </linearGradient>
    <linearGradient gradientTransform="matrix(-0.0043, 0.0, 0.0, -0.0099, -21.05, -348.85)" gradientUnits="userSpaceOnUse" id="gradient3" spreadMethod="pad" x1="-819.2" x2="819.2">
      <stop offset="0.0" stop-color="#ffffcc"/>
      <stop offset="1.0" stop-color="#d1c28b"/>
    </linearGradient>
    <linearGradient gradientTransform="matrix(-0.0041, 0.0016, -0.0036, -0.0092, -15.4, -351.4)" gradientUnits="userSpaceOnUse" id="gradient4" spreadMethod="pad" x1="-819.2" x2="819.2">
      <stop offset="0.0" stop-color="#ffdccc"/>
      <stop offset="1.0" stop-color="#d1a98c"/>
    </linearGradient>
    <linearGradient gradientTransform="matrix(-0.003, 0.003, -0.0064, -0.0064, -16.6, -351.95)" gradientUnits="userSpaceOnUse" id="gradient5" spreadMethod="pad" x1="-819.2" x2="819.2">
      <stop offset="0.0" stop-color="#ffdccc"/>
      <stop offset="1.0" stop-color="#d1a98c"/>
    </linearGradient>
    <linearGradient gradientTransform="matrix(0.002, 5.0E-4, -0.0024, 0.0091, -26.6, -351.95)" gradientUnits="userSpaceOnUse" id="gradient6" spreadMethod="pad" x1="-819.2" x2="819.2">
      <stop offset="0.0" stop-color="#9c8d79"/>
      <stop offset="1.0" stop-color="#615052"/>
    </linearGradient>
  </defs>
</svg>
