<?xml version="1.0" encoding="UTF-8" standalone="no"?>
<svg xmlns:xlink="http://www.w3.org/1999/xlink" height="140.65px" width="69.2px" xmlns="http://www.w3.org/2000/svg">
  <g transform="matrix(1.0, 0.0, 0.0, 1.0, 34.6, 48.35)">
    <path d="M28.9 -40.75 L20.05 -31.9 28.9 -31.9 28.9 -40.75 20.05 -40.75 20.05 -31.9 20.05 -13.65 28.9 -31.9 28.9 -13.65 28.9 14.65 28.9 35.85 28.9 52.4 28.9 71.85 28.9 91.3 M20.05 -47.85 L20.05 -40.75 M20.05 -13.65 L28.9 -13.65 M28.9 35.85 L20.05 35.85 20.05 52.4 28.9 52.4 24.45 62.1 28.9 71.85 20.05 71.85 20.05 91.3 M-17.7 13.45 L-17.7 35.85 20.05 35.85 20.05 14.65 20.05 -13.65 M28.9 14.65 L20.05 14.65 28.9 35.85 M24.45 62.1 L20.05 71.85 20.05 52.4 24.45 62.1 M-24.75 30.0 L-24.75 35.85 -17.7 35.85 -17.7 54.15 -17.7 91.3 M-24.75 91.3 L-24.75 54.15 -24.75 35.85 -31.85 35.85 M-24.75 54.15 L-17.7 54.15 -21.2 72.7 -17.7 91.3 M-21.2 72.7 L-24.75 91.3 M-24.75 54.15 L-21.2 72.7 M20.05 -31.9 L-20.65 -31.9" fill="none" stroke="#6f0000" stroke-linecap="round" stroke-linejoin="round" stroke-width="1.0"/>
    <path d="M28.9 91.3 L33.6 91.3 M20.05 91.3 L28.9 91.3 M-17.7 91.3 L20.05 91.3 M-17.7 91.3 L-24.75 91.3 -33.6 91.3" fill="none" stroke="#6f0000" stroke-linecap="round" stroke-linejoin="round" stroke-width="2.0"/>
  </g>
</svg>
