<?xml version="1.0" encoding="UTF-8" standalone="no"?>
<svg xmlns:xlink="http://www.w3.org/1999/xlink" height="12.2px" width="18.95px" xmlns="http://www.w3.org/2000/svg">
  <g transform="matrix(1.0, 0.0, 0.0, 1.0, 7.1, 9.9)">
    <path d="M11.85 -0.8 L5.65 2.3 -0.55 -0.8 5.65 -3.85 11.85 -0.8" fill="#000000" fill-opacity="0.14117648" fill-rule="evenodd" stroke="none"/>
    <path d="M1.95 -1.9 L1.95 -0.1 -7.1 -4.6 -7.1 -6.4 -6.1 -5.9 -5.15 -7.4 -5.0 -7.6 -0.85 -5.55 3.75 -7.85 5.45 -5.25 0.35 -2.7 -0.1 -2.9 1.95 -1.9" fill="#ffda1c" fill-rule="evenodd" stroke="none"/>
    <path d="M7.05 -4.45 L1.95 -1.9 -0.1 -2.9 0.35 -2.7 5.45 -5.25 7.05 -4.45 M-7.1 -6.4 L-5.15 -7.4 -6.1 -5.9 -7.1 -6.4 M-5.0 -7.6 L-0.35 -9.9 3.75 -7.85 -0.85 -5.55 -5.0 -7.6" fill="#fff0a3" fill-rule="evenodd" stroke="none"/>
    <path d="M7.05 -4.45 L7.05 -2.65 1.95 -0.1 1.95 -1.9 7.05 -4.45" fill="#eeab11" fill-rule="evenodd" stroke="none"/>
  </g>
</svg>
