<?xml version="1.0" encoding="UTF-8" standalone="no"?>
<svg xmlns:xlink="http://www.w3.org/1999/xlink" height="39.0px" width="36.0px" xmlns="http://www.w3.org/2000/svg">
  <g transform="matrix(1.0, 0.0, 0.0, 1.0, 12.0, 35.0)">
    <path d="M12.0 -24.0 L12.0 0.0 M22.0 -29.0 L22.0 -5.0 M16.0 -26.0 L16.0 -2.0 M14.0 -25.0 L14.0 -1.0 M18.0 -27.0 L18.0 -3.0 M20.0 -28.0 L20.0 -4.0 M2.0 -21.0 L2.0 3.0 M6.0 -21.0 L6.0 3.0 M8.0 -22.0 L8.0 2.0 M10.0 -23.0 L10.0 1.0 M-8.0 -34.0 L-8.0 -26.0 M-6.0 -33.0 L-6.0 -27.0 M-2.0 -31.0 L-2.0 -29.0 M-4.0 -32.0 L-4.0 -28.0 M-6.0 -25.0 L-6.0 -1.0 M-10.0 -35.0 L-10.0 -11.0 M-4.0 -24.0 L-4.0 0.0 M-2.0 -23.0 L-2.0 1.0 M0.0 -22.0 L0.0 2.0" fill="none" stroke="#660000" stroke-linecap="round" stroke-linejoin="round" stroke-opacity="0.101960786" stroke-width="0.05"/>
    <path d="M24.0 -22.0 L4.0 -12.0 -12.0 -20.0 M24.0 -18.0 L4.0 -8.0 -12.0 -16.0 M24.0 -14.0 L4.0 -4.0 -12.0 -12.0 M24.0 -10.0 L4.0 0.0 -8.0 -6.0 M24.0 -26.0 L4.0 -16.0 -12.0 -24.0 M24.0 -6.0 L4.0 4.0 -8.0 -2.0 M-4.0 -28.0 L-12.0 -32.0 M-8.0 -26.0 L-12.0 -28.0" fill="none" stroke="#cccccc" stroke-linecap="round" stroke-linejoin="round" stroke-opacity="0.3019608" stroke-width="0.05"/>
  </g>
</svg>
