<?xml version="1.0" encoding="UTF-8" standalone="no"?>
<svg xmlns:xlink="http://www.w3.org/1999/xlink" height="118.6px" width="72.4px" xmlns="http://www.w3.org/2000/svg">
  <g transform="matrix(1.0, 0.0, 0.0, 1.0, 36.7, 71.8)">
    <path d="M21.7 21.7 L35.7 28.7 -0.55 46.8 -14.55 39.85 21.7 21.7" fill="#663e3e" fill-opacity="0.2" fill-rule="evenodd" stroke="none"/>
    <path d="M-10.9 -40.85 L23.1 -56.85 21.1 23.65 -8.9 38.65 -10.9 -40.85" fill="url(#gradient0)" fill-rule="evenodd" stroke="none"/>
    <path d="M25.1 -58.85 L25.1 23.65 23.1 24.65 23.1 -56.85 21.05 -55.85 15.5 -53.05 15.5 -50.05 15.5 -49.05 15.5 -44.05 15.5 -41.05 15.5 -40.05 15.5 -35.05 15.5 -32.05 15.5 -31.05 15.5 -26.05 15.5 -23.05 15.5 -22.05 15.5 -17.05 15.5 -14.05 15.5 -13.05 15.5 -8.05 15.5 -5.05 15.5 -4.05 15.5 0.95 15.5 3.95 15.5 4.95 15.5 9.95 15.5 12.95 15.5 13.95 15.5 18.95 15.5 26.45 15.5 28.45 14.7 28.85 14.7 -52.65 12.7 -51.65 7.5 -49.05 7.5 -46.05 7.5 -45.05 7.5 -40.05 7.5 -37.05 7.5 -36.05 7.5 -31.05 7.5 -28.05 7.5 -27.05 7.5 -22.05 7.5 -19.05 7.5 -18.05 7.5 -13.05 7.5 -10.05 7.5 -9.05 7.5 -4.05 7.5 -1.05 7.5 -0.05 7.5 4.95 7.5 7.95 7.5 8.95 7.5 13.95 7.5 16.95 7.5 17.95 7.5 22.95 7.5 30.45 7.5 32.45 6.7 32.85 6.7 -12.75 6.7 -48.65 4.7 -47.65 -0.5 -45.05 -0.5 -42.05 -0.5 -41.05 -0.5 -36.05 -0.5 -33.05 -0.5 -32.05 -0.5 -27.05 -0.5 -24.05 -0.5 -23.05 -0.5 -18.05 -0.5 -15.05 -0.5 -14.05 -0.5 -9.05 -0.5 -6.05 -0.5 -5.05 -0.5 -0.05 -0.5 2.95 -0.5 3.95 -0.5 8.95 -0.5 11.95 -0.5 12.95 -0.5 17.95 -0.5 20.95 -0.5 21.95 -0.5 26.95 -0.5 34.45 -0.5 36.45 -1.3 36.85 -1.3 -44.65 -3.3 -43.65 -8.9 -40.85 -8.9 -37.85 -8.9 -36.9 -8.9 -31.9 -8.9 -28.85 -8.9 -27.9 -8.9 -22.9 -8.9 -19.85 -8.9 -18.9 -8.9 -13.9 -8.9 -12.75 -8.9 -10.85 -8.9 -9.9 -8.9 -4.9 -8.9 -1.85 -8.9 -0.9 -8.9 4.1 -8.9 7.15 -8.9 8.1 -8.9 13.1 -8.9 16.15 -8.9 17.1 -8.9 22.1 -8.9 25.15 -8.9 26.1 -8.9 31.1 -8.9 38.65 -8.9 40.65 -10.9 41.65 -10.9 -40.85 25.1 -58.85 M-27.5 31.35 L-29.5 32.35 -29.5 -50.15 -27.5 -51.15 -27.5 31.35 M-0.75 -68.8 L-31.7 -53.3 -32.7 -53.8 -0.75 -69.8 -0.75 -68.8 M-12.25 -45.5 L-12.25 -44.5 -13.2 -44.0 -14.2 -44.5 -12.25 -45.5 M17.75 -59.5 L15.8 -58.55 15.8 -59.55 17.75 -60.5 17.75 -59.5" fill="#863e54" fill-rule="evenodd" stroke="none"/>
    <path d="M21.1 -9.75 L21.1 -7.85 21.05 -7.85 21.05 -9.75 21.1 -9.75 M21.1 -0.75 L21.1 1.15 21.05 1.15 21.05 -0.75 21.1 -0.75" fill="#97bcbc" fill-rule="evenodd" stroke="none"/>
    <path d="M1.55 -67.65 L-0.75 -68.8 -0.75 -69.8 2.55 -68.15 1.55 -67.65 M20.1 -58.35 L17.8 -59.5 17.75 -59.5 17.75 -60.5 17.8 -60.5 21.1 -58.85 20.1 -58.35 M15.8 -58.55 L0.7 -66.1 0.55 -67.15 15.8 -59.55 15.8 -58.55 M4.7 -44.65 L4.7 -47.65 6.7 -48.65 6.7 -12.75 5.7 -12.75 5.7 -17.15 4.7 -17.65 4.7 -20.65 5.7 -21.15 5.7 -26.15 4.7 -26.65 4.7 -29.65 5.7 -30.15 5.7 -35.15 4.7 -35.65 4.7 -38.65 5.7 -39.15 5.7 -44.15 4.7 -44.65 M20.05 -7.3 L21.05 -7.85 21.1 -7.85 20.05 -7.3" fill="url(#gradient1)" fill-rule="evenodd" stroke="none"/>
    <path d="M-2.3 -13.15 L-2.3 -12.75 -3.1 -12.75 -2.3 -13.15" fill="url(#gradient2)" fill-rule="evenodd" stroke="none"/>
    <path d="M6.5 -68.15 L4.55 -67.15 6.5 -66.15 15.8 -61.5 17.8 -62.5 25.1 -58.85 -10.9 -40.85 -18.2 -44.5 -16.2 -45.5 -27.5 -51.15 -29.5 -50.15 -36.7 -53.8 -0.75 -71.8 6.5 -68.15 M0.55 -67.15 L1.55 -67.65 2.55 -68.15 -0.75 -69.8 -32.7 -53.8 -31.7 -53.3 -29.55 -52.2 -27.55 -53.2 -12.2 -45.5 -12.25 -45.5 -14.2 -44.5 -13.2 -44.0 -10.9 -42.85 20.1 -58.35 21.1 -58.85 17.8 -60.5 17.75 -60.5 15.8 -59.55 0.55 -67.15" fill="#f5d5c8" fill-rule="evenodd" stroke="none"/>
    <path d="M1.55 -67.65 L0.55 -67.15 0.7 -66.1 15.8 -58.55 17.75 -59.5 17.8 -59.5 20.1 -58.35 -10.9 -42.85 -13.2 -44.0 -12.25 -44.5 -12.25 -45.5 -12.2 -45.5 -27.55 -53.2 -29.55 -52.2 -31.7 -53.3 -0.75 -68.8 1.55 -67.65" fill="#6b5d52" fill-rule="evenodd" stroke="none"/>
    <path d="M6.5 -68.15 L6.5 -66.15 4.55 -67.15 6.5 -68.15" fill="#faf9f3" fill-rule="evenodd" stroke="none"/>
    <path d="M23.1 24.65 L21.1 23.65 21.1 16.15 22.1 15.65 22.1 10.65 21.1 10.15 22.1 10.65 15.5 13.95 15.5 12.95 21.1 10.15 21.1 7.15 22.1 6.65 22.1 1.65 21.1 1.15 22.1 1.65 21.6 1.9 17.2 4.1 17.05 4.2 16.65 4.4 15.5 4.95 15.5 3.95 21.05 1.15 21.1 1.15 21.1 -0.75 21.1 -1.85 22.1 -2.35 22.1 -7.35 21.1 -7.85 22.1 -7.35 21.6 -7.1 17.2 -4.9 15.5 -4.05 15.5 -5.05 20.05 -7.3 21.1 -7.85 21.1 -9.75 21.1 -10.85 22.1 -11.35 22.1 -16.35 21.1 -16.85 22.1 -16.35 15.5 -13.05 15.5 -14.05 21.1 -16.85 21.1 -19.85 22.1 -20.35 22.1 -25.35 21.1 -25.85 21.05 -25.85 21.1 -25.85 22.1 -25.35 15.5 -22.05 15.5 -23.05 21.05 -25.85 21.05 -28.85 22.1 -29.35 22.1 -34.35 21.1 -34.85 21.05 -34.85 21.1 -34.85 22.1 -34.35 15.5 -31.05 15.5 -32.05 21.05 -34.85 21.05 -37.85 22.1 -38.35 22.1 -43.35 21.1 -43.85 21.05 -43.85 21.1 -43.85 22.1 -43.35 15.5 -40.05 15.5 -41.05 21.05 -43.85 21.05 -46.85 22.1 -47.35 22.1 -52.35 21.1 -52.85 21.05 -52.85 21.1 -52.85 22.1 -52.35 15.5 -49.05 15.5 -50.05 21.05 -52.85 21.05 -55.85 23.1 -56.85 23.1 24.65 M14.7 28.85 L12.7 27.85 12.7 20.35 13.7 19.85 13.7 14.85 12.7 14.35 13.7 14.85 7.5 17.95 7.5 16.95 12.7 14.35 12.7 11.35 13.7 10.85 13.7 5.85 12.7 5.35 13.7 5.85 7.5 8.95 7.5 7.95 12.7 5.35 12.7 2.35 13.55 1.9 13.7 1.9 13.7 1.85 13.7 -3.15 12.7 -3.65 13.7 -3.15 7.5 -0.05 7.5 -1.05 12.7 -3.65 12.7 -6.65 13.7 -7.15 13.7 -12.15 12.7 -12.65 13.7 -12.15 7.5 -9.05 7.5 -10.05 12.7 -12.65 12.7 -15.65 13.7 -16.15 13.7 -21.15 12.7 -21.65 13.7 -21.15 7.5 -18.05 7.5 -19.05 12.7 -21.65 12.7 -24.65 13.7 -25.15 13.7 -30.15 12.7 -30.65 13.7 -30.15 7.5 -27.05 7.5 -28.05 12.7 -30.65 12.7 -33.65 13.7 -34.15 13.7 -39.15 12.7 -39.65 13.7 -39.15 7.5 -36.05 7.5 -37.05 12.7 -39.65 12.7 -42.65 13.7 -43.15 13.7 -48.15 12.7 -48.65 13.7 -48.15 7.5 -45.05 7.5 -46.05 12.7 -48.65 12.7 -51.65 14.7 -52.65 14.7 28.85 M6.7 32.85 L4.7 31.85 4.7 24.35 5.7 23.85 5.7 18.85 4.7 18.35 5.7 18.85 -0.5 21.95 -0.5 20.95 4.7 18.35 4.7 15.35 5.7 14.85 5.7 9.85 4.7 9.35 5.7 9.85 -0.5 12.95 -0.5 11.95 4.7 9.35 4.7 6.35 5.7 5.85 5.7 1.9 5.7 0.85 4.7 0.35 5.7 0.85 3.55 1.9 -0.5 3.95 -0.5 2.95 3.85 0.8 4.7 0.35 4.7 -2.65 5.7 -3.15 5.7 -8.15 4.7 -8.65 5.7 -8.15 -0.5 -5.05 -0.5 -6.05 4.7 -8.65 4.7 -11.65 5.7 -12.15 5.7 -12.75 6.7 -12.75 6.7 32.85 M-1.3 36.85 L-3.3 35.85 -3.3 28.35 -2.3 27.85 -2.3 22.85 -3.3 22.35 -2.3 22.85 -8.9 26.1 -8.9 25.15 -3.3 22.35 -3.3 19.35 -2.3 18.85 -2.3 13.85 -3.3 13.35 -2.3 13.85 -8.9 17.1 -8.9 16.15 -3.3 13.35 -3.3 10.35 -2.3 9.85 -2.3 4.85 -3.3 4.35 -2.3 4.85 -8.9 8.1 -8.9 7.15 -3.3 4.35 -3.3 1.35 -2.3 0.85 -2.3 -4.15 -3.3 -4.65 -2.3 -4.15 -8.9 -0.9 -8.9 -1.85 -3.3 -4.65 -3.3 -7.65 -2.3 -8.15 -2.3 -12.75 -2.3 -13.15 -3.3 -13.65 -2.3 -13.15 -3.1 -12.75 -8.9 -9.9 -8.9 -10.85 -3.3 -13.65 -3.3 -16.65 -2.3 -17.15 -2.3 -22.15 -3.3 -22.65 -2.3 -22.15 -8.9 -18.9 -8.9 -19.85 -3.3 -22.65 -3.3 -25.65 -2.3 -26.15 -2.3 -31.15 -3.3 -31.65 -2.3 -31.15 -8.9 -27.9 -8.9 -28.85 -3.3 -31.65 -3.3 -34.65 -2.3 -35.15 -2.3 -40.15 -8.9 -36.9 -8.9 -37.85 -3.3 -40.65 -3.3 -43.65 -1.3 -44.65 -1.3 36.85 M-0.5 -42.05 L4.7 -44.65 5.7 -44.15 -0.5 -41.05 -0.5 -42.05 M4.7 -35.65 L5.7 -35.15 -0.5 -32.05 -0.5 -33.05 4.7 -35.65 M4.7 -26.65 L5.7 -26.15 -0.5 -23.05 -0.5 -24.05 4.7 -26.65 M4.7 -17.65 L5.7 -17.15 -0.5 -14.05 -0.5 -15.05 4.7 -17.65 M-3.3 -40.65 L-2.3 -40.15 -3.3 -40.65" fill="url(#gradient3)" fill-rule="evenodd" stroke="none"/>
    <path d="M22.1 -52.35 L22.1 -47.35 21.05 -46.85 15.5 -44.05 15.5 -49.05 22.1 -52.35 M22.1 -43.35 L22.1 -38.35 21.05 -37.85 15.5 -35.05 15.5 -40.05 22.1 -43.35 M22.1 -34.35 L22.1 -29.35 21.05 -28.85 15.5 -26.05 15.5 -31.05 22.1 -34.35 M22.1 -25.35 L22.1 -20.35 21.1 -19.85 15.5 -17.05 15.5 -22.05 22.1 -25.35 M22.1 -16.35 L22.1 -11.35 21.1 -10.85 15.5 -8.05 15.5 -13.05 22.1 -16.35 M22.1 -7.35 L22.1 -2.35 21.1 -1.85 15.5 0.95 15.5 -4.05 17.2 -4.9 21.6 -7.1 22.1 -7.35 M22.1 1.65 L22.1 6.65 21.1 7.15 15.5 9.95 15.5 4.95 16.65 4.4 17.05 4.2 17.2 4.1 21.6 1.9 22.1 1.65 M22.1 10.65 L22.1 15.65 21.1 16.15 15.5 18.95 15.5 13.95 22.1 10.65 M13.7 -39.15 L13.7 -34.15 12.7 -33.65 7.5 -31.05 7.5 -36.05 13.7 -39.15 M13.7 -30.15 L13.7 -25.15 12.7 -24.65 7.5 -22.05 7.5 -27.05 13.7 -30.15 M13.7 -21.15 L13.7 -16.15 12.7 -15.65 7.5 -13.05 7.5 -18.05 13.7 -21.15 M13.7 -12.15 L13.7 -7.15 12.7 -6.65 7.5 -4.05 7.5 -9.05 13.7 -12.15 M13.7 -3.15 L13.7 1.85 13.55 1.9 12.7 2.35 7.5 4.95 7.5 -0.05 13.7 -3.15 M13.7 5.85 L13.7 10.85 12.7 11.35 7.5 13.95 7.5 8.95 13.7 5.85 M13.7 14.85 L13.7 19.85 12.7 20.35 7.5 22.95 7.5 17.95 13.7 14.85 M13.7 -48.15 L13.7 -43.15 12.7 -42.65 7.5 -40.05 7.5 -45.05 13.7 -48.15 M5.7 -44.15 L5.7 -39.15 4.7 -38.65 -0.5 -36.05 -0.5 -41.05 5.7 -44.15 M5.7 -35.15 L5.7 -30.15 4.7 -29.65 -0.5 -27.05 -0.5 -32.05 5.7 -35.15 M5.7 -26.15 L5.7 -21.15 4.7 -20.65 -0.5 -18.05 -0.5 -23.05 5.7 -26.15 M5.7 -17.15 L5.7 -12.75 5.7 -12.15 4.7 -11.65 -0.5 -9.05 -0.5 -14.05 5.7 -17.15 M5.7 -8.15 L5.7 -3.15 4.7 -2.65 -0.5 -0.05 -0.5 -5.05 5.7 -8.15 M5.7 1.9 L5.7 5.85 4.7 6.35 -0.5 8.95 -0.5 3.95 3.55 1.9 5.7 1.9 M5.7 9.85 L5.7 14.85 4.7 15.35 -0.5 17.95 -0.5 12.95 5.7 9.85 M5.7 18.85 L5.7 23.85 4.7 24.35 -0.5 26.95 -0.5 21.95 5.7 18.85 M15.5 4.95 L16.65 4.4 15.5 4.95 M-8.9 -36.9 L-2.3 -40.15 -2.3 -35.15 -3.3 -34.65 -8.9 -31.9 -8.9 -36.9 M-2.3 -31.15 L-2.3 -26.15 -3.3 -25.65 -8.9 -22.9 -8.9 -27.9 -2.3 -31.15 M-2.3 -22.15 L-2.3 -17.15 -3.3 -16.65 -8.9 -13.9 -8.9 -18.9 -2.3 -22.15 M-2.3 -12.75 L-2.3 -8.15 -3.3 -7.65 -8.9 -4.9 -8.9 -9.9 -3.1 -12.75 -2.3 -12.75 M-2.3 -4.15 L-2.3 0.85 -3.3 1.35 -4.45 1.9 -8.9 4.1 -8.9 -0.9 -2.3 -4.15 M-2.3 4.85 L-2.3 9.85 -3.3 10.35 Q-6.1 11.7 -8.9 13.1 L-8.9 8.1 -2.3 4.85 M-2.3 13.85 L-2.3 18.85 -3.3 19.35 Q-6.1 20.7 -8.9 22.1 L-8.9 17.1 -2.3 13.85 M-2.3 22.85 L-2.3 27.85 -3.3 28.35 Q-6.1 29.7 -8.9 31.1 L-8.9 26.1 -2.3 22.85" fill="url(#gradient4)" fill-rule="evenodd" stroke="none"/>
    <path d="M13.7 1.85 L13.7 1.9 13.55 1.9 13.7 1.85" fill="url(#gradient5)" fill-rule="evenodd" stroke="none"/>
    <path d="M5.7 0.85 L5.7 1.9 3.55 1.9 5.7 0.85" fill="url(#gradient6)" fill-rule="evenodd" stroke="none"/>
    <path d="M4.7 0.35 L3.85 0.8 4.7 0.35" fill="#f7f4ee" fill-rule="evenodd" stroke="none"/>
    <path d="M-36.7 0.6 L-36.7 -0.75 -36.7 0.6" fill="url(#gradient7)" fill-rule="evenodd" stroke="none"/>
    <path d="M-10.9 41.65 L-18.2 38.0 -18.2 36.0 -27.5 31.35 -27.5 -51.15 -16.2 -45.5 -18.2 -44.5 -10.9 -40.85 -10.9 41.65 M-29.5 32.35 L-36.7 28.7 -36.7 0.6 -36.7 -0.75 -36.7 -53.8 -29.5 -50.15 -29.5 32.35 M-18.2 36.0 L-18.2 -44.5 -18.2 36.0" fill="url(#gradient8)" fill-rule="evenodd" stroke="none"/>
    <path d="M6.5 -68.15 L4.55 -67.15 6.5 -66.15 M15.5 26.45 L15.5 28.45 M7.5 30.45 L7.5 32.45 M-0.5 34.45 L-0.5 36.45 M-8.9 38.65 L-8.9 40.65 M-18.2 38.0 L-18.2 36.0 M0.55 -67.15 L1.55 -67.65 -0.75 -68.8 -31.7 -53.3 -29.55 -52.2 -27.55 -53.2 -12.2 -45.5 -12.25 -45.5 -12.25 -44.5 -13.2 -44.0 -10.9 -42.85 20.1 -58.35 17.8 -59.5 17.75 -59.5 15.8 -58.55 0.7 -66.1 0.55 -67.15 15.8 -59.55 17.75 -60.5 17.8 -60.5 21.1 -58.85 20.1 -58.35 M1.55 -67.65 L2.55 -68.15 -0.75 -69.8 -0.75 -68.8 M15.8 -59.55 L15.8 -58.55 M17.75 -60.5 L17.75 -59.5 M12.7 -51.65 L14.7 -52.65 14.7 28.85 M15.5 -50.05 L15.5 -53.05 21.05 -55.85 23.1 -56.85 23.1 24.65 M21.05 -55.85 L21.05 -52.85 21.1 -52.85 22.1 -52.35 22.1 -47.35 21.05 -46.85 21.05 -43.85 21.1 -43.85 22.1 -43.35 22.1 -38.35 21.05 -37.85 21.05 -34.85 21.1 -34.85 22.1 -34.35 22.1 -29.35 21.05 -28.85 21.05 -25.85 21.1 -25.85 22.1 -25.35 22.1 -20.35 21.1 -19.85 21.1 -16.85 22.1 -16.35 22.1 -11.35 21.1 -10.85 21.1 -9.75 21.1 -7.85 22.1 -7.35 22.1 -2.35 21.1 -1.85 21.1 -0.75 21.1 1.15 22.1 1.65 22.1 6.65 21.1 7.15 21.1 10.15 22.1 10.65 22.1 15.65 21.1 16.15 21.1 23.65 M21.05 -52.85 L15.5 -50.05 15.5 -49.05 22.1 -52.35 M12.7 -39.65 L13.7 -39.15 13.7 -34.15 12.7 -33.65 12.7 -30.65 13.7 -30.15 13.7 -25.15 12.7 -24.65 12.7 -21.65 13.7 -21.15 13.7 -16.15 12.7 -15.65 12.7 -12.65 13.7 -12.15 13.7 -7.15 12.7 -6.65 12.7 -3.65 13.7 -3.15 13.7 1.85 13.55 1.9 12.7 2.35 12.7 5.35 13.7 5.85 13.7 10.85 12.7 11.35 12.7 14.35 13.7 14.85 13.7 19.85 12.7 20.35 12.7 27.85 M12.7 -42.65 L12.7 -39.65 7.5 -37.05 7.5 -36.05 13.7 -39.15 M13.7 -48.15 L13.7 -43.15 12.7 -42.65 7.5 -40.05 7.5 -37.05 M12.7 -48.65 L13.7 -48.15 7.5 -45.05 7.5 -40.05 M15.5 -40.05 L15.5 -41.05 15.5 -44.05 15.5 -49.05 M4.7 -44.65 L4.7 -47.65 -0.5 -45.05 -0.5 -42.05 4.7 -44.65 5.7 -44.15 5.7 -39.15 4.7 -38.65 4.7 -35.65 5.7 -35.15 5.7 -30.15 4.7 -29.65 4.7 -26.65 5.7 -26.15 5.7 -21.15 4.7 -20.65 4.7 -17.65 5.7 -17.15 5.7 -12.75 5.7 -12.15 4.7 -11.65 -0.5 -9.05 -0.5 -6.05 4.7 -8.65 5.7 -8.15 5.7 -3.15 4.7 -2.65 4.7 0.35 5.7 0.85 5.7 1.9 5.7 5.85 4.7 6.35 4.7 9.35 5.7 9.85 5.7 14.85 4.7 15.35 4.7 18.35 5.7 18.85 5.7 23.85 4.7 24.35 4.7 31.85 M6.7 -12.75 L6.7 -48.65 4.7 -47.65 M7.5 -46.05 L7.5 -49.05 12.7 -51.65 12.7 -48.65 7.5 -46.05 7.5 -45.05 M7.5 -31.05 L7.5 -36.05 M7.5 -27.05 L7.5 -28.05 7.5 -31.05 12.7 -33.65 M15.5 -26.05 L15.5 -31.05 15.5 -32.05 15.5 -35.05 15.5 -40.05 22.1 -43.35 M7.5 -27.05 L13.7 -30.15 M12.7 -30.65 L7.5 -28.05 M15.5 -22.05 L15.5 -23.05 15.5 -26.05 21.05 -28.85 M15.5 -13.05 L15.5 -14.05 15.5 -17.05 15.5 -22.05 22.1 -25.35 M7.5 -19.05 L7.5 -22.05 7.5 -27.05 M7.5 -18.05 L7.5 -19.05 12.7 -21.65 M7.5 -13.05 L7.5 -18.05 13.7 -21.15 M7.5 -9.05 L7.5 -10.05 7.5 -13.05 12.7 -15.65 M4.7 -11.65 L4.7 -8.65 M7.5 -0.05 L7.5 -1.05 7.5 -4.05 7.5 -9.05 13.7 -12.15 M15.5 -4.05 L17.2 -4.9 21.6 -7.1 22.1 -7.35 M15.5 -5.05 L20.05 -7.3 21.05 -7.85 21.1 -7.85 20.05 -7.3 M15.5 -5.05 L15.5 -8.05 15.5 -13.05 22.1 -16.35 M15.5 -4.05 L15.5 -5.05 M12.7 -24.65 L7.5 -22.05 M12.7 -6.65 L7.5 -4.05 M12.7 -3.65 L7.5 -1.05 M7.5 -0.05 L13.7 -3.15 M12.7 -12.65 L7.5 -10.05 M21.05 1.15 L21.1 1.15 M21.05 -37.85 L15.5 -35.05 M21.05 -25.85 L15.5 -23.05 M15.5 -44.05 L21.05 -46.85 M21.05 -43.85 L15.5 -41.05 M21.05 -34.85 L15.5 -32.05 M15.5 -31.05 L22.1 -34.35 M21.1 -10.85 L15.5 -8.05 M21.1 -16.85 L15.5 -14.05 M15.5 -17.05 L21.1 -19.85 M22.1 1.65 L21.6 1.9 17.2 4.1 17.05 4.2 16.65 4.4 15.5 4.95 15.5 9.95 21.1 7.15 M15.5 3.95 L15.5 0.95 15.5 -4.05 M15.5 4.95 L15.5 3.95 21.05 1.15 M3.85 0.8 L4.7 0.35 3.85 0.8 -0.5 2.95 -0.5 3.95 3.55 1.9 5.7 0.85 M7.5 8.95 L7.5 7.95 7.5 4.95 7.5 -0.05 M7.5 17.95 L7.5 16.95 7.5 13.95 7.5 8.95 13.7 5.85 M7.5 22.95 L7.5 17.95 13.7 14.85 M15.5 13.95 L15.5 12.95 15.5 9.95 M15.5 18.95 L15.5 13.95 22.1 10.65 M12.7 5.35 L7.5 7.95 M12.7 14.35 L7.5 16.95 M12.7 20.35 L7.5 22.95 7.5 30.45 M12.7 11.35 L7.5 13.95 M12.7 2.35 L7.5 4.95 M21.1 16.15 L15.5 18.95 15.5 26.45 M21.1 10.15 L15.5 12.95 M21.1 -1.85 L15.5 0.95 M6.7 -12.75 L6.7 32.85 M-29.5 -50.15 L-36.7 -53.8 M-0.75 -69.8 L-32.7 -53.8 -31.7 -53.3 M-27.5 -51.15 L-29.5 -50.15 -29.5 32.35 M-2.3 -40.15 L-3.3 -40.65 -8.9 -37.85 -8.9 -36.9 -2.3 -40.15 -2.3 -35.15 -3.3 -34.65 -3.3 -31.65 -2.3 -31.15 -2.3 -26.15 -3.3 -25.65 -3.3 -22.65 -2.3 -22.15 -2.3 -17.15 -3.3 -16.65 -3.3 -13.65 -2.3 -13.15 -2.3 -12.75 -2.3 -8.15 -3.3 -7.65 -3.3 -4.65 -2.3 -4.15 -2.3 0.85 -3.3 1.35 -3.3 4.35 -2.3 4.85 -2.3 9.85 -3.3 10.35 -3.3 13.35 -2.3 13.85 -2.3 18.85 -3.3 19.35 -3.3 22.35 -2.3 22.85 -2.3 27.85 -3.3 28.35 -3.3 35.85 M-3.3 -40.65 L-3.3 -43.65 -8.9 -40.85 -8.9 -37.85 M-0.5 -41.05 L-0.5 -42.05 M-3.3 -43.65 L-1.3 -44.65 -1.3 36.85 M-12.25 -45.5 L-14.2 -44.5 -13.2 -44.0 M-27.5 -51.15 L-16.2 -45.5 -18.2 -44.5 -10.9 -40.85 25.1 -58.85 M-0.5 -32.05 L-0.5 -33.05 -0.5 -36.05 -0.5 -41.05 5.7 -44.15 M-8.9 -31.9 L-8.9 -36.9 M-8.9 -27.9 L-8.9 -28.85 -8.9 -31.9 -3.3 -34.65 M-3.3 -31.65 L-8.9 -28.85 M-8.9 -27.9 L-2.3 -31.15 M-0.5 -27.05 L-0.5 -32.05 5.7 -35.15 M-0.5 -23.05 L-0.5 -24.05 -0.5 -27.05 4.7 -29.65 M-8.9 -18.9 L-8.9 -19.85 -8.9 -22.9 -8.9 -27.9 M-8.9 -12.75 L-8.9 -13.9 -8.9 -18.9 -2.3 -22.15 M-3.1 -12.75 L-2.3 -13.15 M-0.5 -14.05 L-0.5 -15.05 -0.5 -18.05 -0.5 -23.05 5.7 -26.15 M-8.9 -19.85 L-3.3 -22.65 M-3.3 -16.65 L-8.9 -13.9 M-8.9 -9.9 L-8.9 -10.85 M-8.9 -0.9 L-8.9 -1.85 -8.9 -4.9 -8.9 -9.9 -3.1 -12.75 M-0.5 -0.05 L-0.5 -5.05 -0.5 -6.05 M-3.3 -4.65 L-8.9 -1.85 M-8.9 -0.9 L-2.3 -4.15 M-3.3 -7.65 L-8.9 -4.9 M-3.3 -13.65 L-8.9 -10.85 M-0.5 -9.05 L-0.5 -14.05 5.7 -17.15 M-8.9 -22.9 L-3.3 -25.65 M-4.45 1.9 L-8.9 4.1 -8.9 7.15 -3.3 4.35 M-3.3 1.35 L-4.45 1.9 M-8.9 8.1 L-8.9 7.15 M-0.5 11.95 L-0.5 8.95 -0.5 3.95 M-8.9 8.1 L-2.3 4.85 M-0.5 17.95 L-0.5 12.95 -0.5 11.95 4.7 9.35 M-8.9 17.1 L-8.9 16.15 -8.9 13.1 -8.9 8.1 M-0.5 21.95 L-0.5 20.95 -0.5 17.95 4.7 15.35 M-3.3 13.35 L-8.9 16.15 M-8.9 17.1 L-2.3 13.85 M-3.3 19.35 Q-6.1 20.7 -8.9 22.1 L-8.9 25.15 -3.3 22.35 M-8.9 22.1 L-8.9 17.1 M-3.3 10.35 Q-6.1 11.7 -8.9 13.1 M-8.9 26.1 L-8.9 25.15 M-0.5 34.45 L-0.5 26.95 -0.5 21.95 5.7 18.85 M-8.9 31.1 L-8.9 26.1 -2.3 22.85 M-3.3 28.35 Q-6.1 29.7 -8.9 31.1 L-8.9 38.65 M-18.2 -44.5 L-18.2 36.0 M-27.5 31.35 L-27.5 -51.15 M-0.5 2.95 L-0.5 -0.05 4.7 -2.65 M-8.9 4.1 L-8.9 -0.9 M-10.9 -40.85 L-10.9 41.65 M4.7 -17.65 L-0.5 -15.05 M5.7 -8.15 L-0.5 -5.05 M-0.5 8.95 L4.7 6.35 M4.7 18.35 L-0.5 20.95 M-0.5 12.95 L5.7 9.85 M4.7 24.35 L-0.5 26.95 M4.7 -35.65 L-0.5 -33.05 M4.7 -26.65 L-0.5 -24.05 M4.7 -38.65 L-0.5 -36.05 M-0.5 -18.05 L4.7 -20.65" fill="none" stroke="#660000" stroke-linecap="round" stroke-linejoin="miter" stroke-miterlimit="3.0" stroke-opacity="0.3019608" stroke-width="0.05"/>
    <path d="M6.5 -66.15 L6.5 -68.15 M6.5 -66.15 L15.8 -61.5 17.8 -62.5 25.1 -58.85 25.1 23.65 M-36.7 28.7 L-36.7 0.6 -36.7 -0.75 -36.7 -53.8 -0.75 -71.8 6.5 -68.15 M-36.7 -0.75 L-36.7 0.6" fill="none" stroke="#660000" stroke-linecap="round" stroke-linejoin="miter" stroke-miterlimit="3.0" stroke-opacity="0.6" stroke-width="0.05"/>
    <path d="M25.1 23.65 L23.1 24.65 21.1 23.65 15.5 26.45 M15.5 28.45 L14.7 28.85 12.7 27.85 7.5 30.45 M7.5 32.45 L6.7 32.85 4.7 31.85 -0.5 34.45 M-0.5 36.45 L-1.3 36.85 -3.3 35.85 -8.9 38.65 M-18.2 36.0 L-27.5 31.35 -29.5 32.35 -36.7 28.7" fill="none" stroke="#660000" stroke-linecap="round" stroke-linejoin="miter" stroke-miterlimit="3.0" stroke-opacity="0.15294118" stroke-width="0.05"/>
    <path d="M-8.9 40.65 L-10.9 41.65 -18.2 38.0" fill="none" stroke="#660000" stroke-linecap="round" stroke-linejoin="miter" stroke-miterlimit="3.0" stroke-opacity="0.15294118" stroke-width="0.05"/>
  </g>
  <defs>
    <linearGradient gradientTransform="matrix(0.0, 0.0315, 0.0204, 0.0, 6.1, -1.6)" gradientUnits="userSpaceOnUse" id="gradient0" spreadMethod="pad" x1="-819.2" x2="819.2">
      <stop offset="0.34509803921568627" stop-color="#c5dcfe"/>
      <stop offset="1.0" stop-color="#016c87"/>
    </linearGradient>
    <linearGradient gradientTransform="matrix(0.0, 0.0482, -0.0044, 0.0, -33.1, -12.2)" gradientUnits="userSpaceOnUse" id="gradient1" spreadMethod="pad" x1="-819.2" x2="819.2">
      <stop offset="0.1607843137254902" stop-color="#e1c2b7"/>
      <stop offset="0.5568627450980392" stop-color="#a87e57"/>
    </linearGradient>
    <linearGradient gradientTransform="matrix(0.0, 0.0244, -0.0189, 0.0, 6.6, -13.9)" gradientUnits="userSpaceOnUse" id="gradient2" spreadMethod="pad" x1="-819.2" x2="819.2">
      <stop offset="0.0" stop-color="#916a47"/>
      <stop offset="1.0" stop-color="#2b1e1e"/>
    </linearGradient>
    <linearGradient gradientTransform="matrix(0.0, 0.0482, -0.0044, 0.0, -33.1, -3.2)" gradientUnits="userSpaceOnUse" id="gradient3" spreadMethod="pad" x1="-819.2" x2="819.2">
      <stop offset="0.1607843137254902" stop-color="#e1c2b7"/>
      <stop offset="0.5568627450980392" stop-color="#a87e57"/>
    </linearGradient>
    <linearGradient gradientTransform="matrix(0.0, 0.0244, -0.0189, 0.0, 6.6, -4.9)" gradientUnits="userSpaceOnUse" id="gradient4" spreadMethod="pad" x1="-819.2" x2="819.2">
      <stop offset="0.0" stop-color="#916a47"/>
      <stop offset="1.0" stop-color="#2b1e1e"/>
    </linearGradient>
    <linearGradient gradientTransform="matrix(0.0, 0.0325, -0.0012, 0.0, 13.7, -16.05)" gradientUnits="userSpaceOnUse" id="gradient5" spreadMethod="pad" x1="-819.2" x2="819.2">
      <stop offset="0.1607843137254902" stop-color="#faf9f3"/>
      <stop offset="0.5568627450980392" stop-color="#e4e2cd"/>
    </linearGradient>
    <linearGradient gradientTransform="matrix(0.0, 0.0244, -0.0189, 0.0, 6.6, -22.9)" gradientUnits="userSpaceOnUse" id="gradient6" spreadMethod="pad" x1="-819.2" x2="819.2">
      <stop offset="0.0" stop-color="#916a47"/>
      <stop offset="1.0" stop-color="#2b1e1e"/>
    </linearGradient>
    <linearGradient gradientTransform="matrix(0.0, 0.0328, -0.0045, 0.0, -14.55, 12.15)" gradientUnits="userSpaceOnUse" id="gradient7" spreadMethod="pad" x1="-819.2" x2="819.2">
      <stop offset="0.1607843137254902" stop-color="#faf9f3"/>
      <stop offset="0.5568627450980392" stop-color="#e4e2cd"/>
    </linearGradient>
    <linearGradient gradientTransform="matrix(0.0, 0.0482, -0.0044, 0.0, -33.1, -3.2)" gradientUnits="userSpaceOnUse" id="gradient8" spreadMethod="pad" x1="-819.2" x2="819.2">
      <stop offset="0.0" stop-color="#e1c2b7"/>
      <stop offset="1.0" stop-color="#a87e57"/>
    </linearGradient>
  </defs>
</svg>
