<?xml version="1.0" encoding="UTF-8" standalone="no"?>
<svg xmlns:xlink="http://www.w3.org/1999/xlink" height="12.5px" width="21.0px" xmlns="http://www.w3.org/2000/svg">
  <g transform="matrix(1.0, 0.0, 0.0, 1.0, 10.5, 6.25)">
    <path d="M0.5 -3.75 L0.5 -5.25 0.8 -5.1 7.5 -1.75 8.5 -1.25 7.05 -0.5 0.8 -3.6 0.5 -3.75" fill="#faf9f3" fill-rule="evenodd" stroke="none"/>
    <path d="M0.5 -5.25 L0.5 -3.75 -7.0 0.0 -8.5 -0.75 0.5 -5.25" fill="#97bcbc" fill-rule="evenodd" stroke="none"/>
    <path d="M7.05 -0.5 L8.5 -1.25 7.5 -1.75 0.8 -5.1 0.5 -5.25 -8.5 -0.75 -7.0 0.0 -1.5 2.75 -0.45 3.25 0.55 2.75 7.05 -0.5 M-10.5 -0.75 L0.5 -6.25 1.8 -5.6 8.5 -2.25 10.5 -1.25 1.7 3.15 -0.5 4.25 -2.5 3.25 -8.0 0.5 -10.5 -0.75 -8.0 0.5 -2.5 3.25 -0.5 4.25 -0.5 6.25 -10.5 1.25 -10.5 -0.75" fill="#f7f4ee" fill-rule="evenodd" stroke="none"/>
    <path d="M1.7 3.15 L10.5 -1.25 10.5 0.75 3.3 4.35 3.3 3.95 1.7 3.15" fill="url(#gradient0)" fill-rule="evenodd" stroke="none"/>
    <path d="M-0.5 4.25 L1.7 3.15 3.3 3.95 3.3 4.35 -0.5 6.25 -0.5 4.25" fill="url(#gradient1)" fill-rule="evenodd" stroke="none"/>
    <path d="M0.5 -3.75 L0.8 -3.6 7.05 -0.5 0.55 2.75 -0.45 3.25 -1.5 2.75 -7.0 0.0 0.5 -3.75" fill="#8c7b74" fill-rule="evenodd" stroke="none"/>
    <path d="M0.5 -5.25 L0.5 -3.75 0.8 -3.6 7.05 -0.5 8.5 -1.25 7.5 -1.75 0.8 -5.1 0.5 -5.25 -8.5 -0.75 -7.0 0.0 0.5 -3.75 M10.5 -1.25 L8.5 -2.25 1.8 -5.6 0.5 -6.25 -10.5 -0.75 -8.0 0.5 -2.5 3.25 -0.5 4.25 1.7 3.15 10.5 -1.25 10.5 0.75 3.3 4.35 -0.5 6.25 -10.5 1.25 -10.5 -0.75 M0.55 2.75 L-0.45 3.25 -1.5 2.75 -7.0 0.0 M7.05 -0.5 L0.55 2.75 M-0.5 4.25 L-0.5 6.25" fill="none" stroke="#660000" stroke-linecap="round" stroke-linejoin="miter" stroke-miterlimit="3.0" stroke-opacity="0.3019608" stroke-width="0.05"/>
  </g>
  <defs>
    <linearGradient gradientTransform="matrix(0.0, 0.0493, -0.0037, 0.0, 7.5, 39.85)" gradientUnits="userSpaceOnUse" id="gradient0" spreadMethod="pad" x1="-819.2" x2="819.2">
      <stop offset="0.0" stop-color="#a5cfc0"/>
      <stop offset="1.0" stop-color="#7e9e9e"/>
    </linearGradient>
    <linearGradient gradientTransform="matrix(0.0, 0.0493, -0.0037, 0.0, 2.5, 42.35)" gradientUnits="userSpaceOnUse" id="gradient1" spreadMethod="pad" x1="-819.2" x2="819.2">
      <stop offset="0.0" stop-color="#a5cfc0"/>
      <stop offset="1.0" stop-color="#7e9e9e"/>
    </linearGradient>
  </defs>
</svg>
