<?xml version="1.0" encoding="UTF-8" standalone="no"?>
<svg xmlns:xlink="http://www.w3.org/1999/xlink" height="24.0px" width="48.0px" xmlns="http://www.w3.org/2000/svg">
  <g transform="matrix(1.0, 0.0, 0.0, 1.0, 24.0, 6.05)">
    <path d="M-24.0 5.95 L0.0 -6.05 24.0 5.95 0.0 17.95 -24.0 5.95" fill="#96847f" fill-rule="evenodd" stroke="none"/>
    <path d="M12.85 1.2 L22.95 6.25 2.7 16.4 -7.4 11.35 12.85 1.2" fill="#663e3e" fill-opacity="0.3019608" fill-rule="evenodd" stroke="none"/>
  </g>
</svg>
