<?xml version="1.0" encoding="UTF-8" standalone="no"?>
<svg xmlns:xlink="http://www.w3.org/1999/xlink" height="110.5px" width="221.85px" xmlns="http://www.w3.org/2000/svg">
  <g transform="matrix(1.0, 0.0, 0.0, 1.0, 108.3, 8.0)">
    <path d="M-28.25 6.0 L-12.1 14.1 -11.65 13.85 36.95 38.15 36.95 38.2 85.55 62.5 M-20.25 2.0 L-4.1 10.1 -3.65 9.85 44.95 34.15 44.95 34.2 93.55 58.5 M97.55 56.5 L48.95 32.2 48.95 32.15 0.35 7.85 -0.1 8.1 -16.25 0.0 M89.55 60.5 L40.95 36.2 40.95 36.15 -7.65 11.85 -8.1 12.1 -24.25 4.0 M-36.25 10.0 L-20.1 18.1 -19.65 17.85 28.95 42.15 28.95 42.2 77.55 66.5 M81.55 64.5 L32.95 40.2 32.95 40.15 -15.65 15.85 -16.1 16.1 -32.25 8.0 M-44.25 14.0 L-28.1 22.1 -27.65 21.85 20.95 46.15 20.95 46.2 69.55 70.5 M-40.25 12.0 L-24.1 20.1 -23.65 19.85 24.95 44.15 24.95 44.2 73.55 68.5 M65.55 72.5 L16.95 48.2 16.95 48.15 -31.65 23.85 -32.1 24.1 -48.25 16.0 M57.55 76.55 L8.95 52.2 8.95 52.15 -39.65 27.85 -40.1 28.1 -56.25 20.0 M-52.25 18.0 L-36.1 26.1 -35.65 25.85 12.95 50.15 12.95 50.2 61.55 74.55 M29.55 90.5 L-19.05 66.2 -19.05 66.15 -67.65 41.85 -68.1 42.1 -84.25 34.0 M-88.25 36.0 L-72.1 44.1 -71.65 43.85 -23.05 68.15 -23.05 68.2 25.55 92.5 M21.55 94.5 L-27.05 70.2 -27.05 70.15 -75.65 45.85 -76.1 46.1 -92.25 38.0 -95.8 39.75 M-96.25 40.0 L-80.1 48.1 -79.65 47.85 -31.05 72.15 -31.05 72.2 17.55 96.5 M-80.25 32.0 L-64.1 40.1 -63.65 39.85 -15.05 64.15 -15.05 64.2 33.55 88.5 M-76.25 30.0 L-60.1 38.1 -59.65 37.85 -11.05 62.15 -11.05 62.2 37.55 86.5 M-68.25 26.0 L-52.1 34.1 -51.65 33.85 -3.05 58.15 -3.05 58.2 45.55 82.5 M41.55 84.5 L-7.05 60.2 -7.05 60.15 -55.65 35.85 -56.1 36.1 -72.25 28.0 M49.55 80.55 L0.95 56.2 0.95 56.15 -47.65 31.85 -48.1 32.1 -64.25 24.0 M-60.25 22.0 L-44.1 30.1 -43.65 29.85 4.95 54.15 4.95 54.2 53.55 78.55 M-108.3 45.95 L-92.1 54.1 -91.65 53.85 -43.05 78.15 -43.05 78.2 5.55 102.5 M13.55 98.5 L-35.05 74.2 -35.05 74.15 -83.65 49.85 -84.1 50.1 -100.25 42.0 M9.55 100.5 L-39.05 76.2 -39.05 76.15 -87.65 51.85 -88.1 52.1 -104.3 44.0 M101.55 54.5 L52.95 30.2 52.95 30.15 4.35 5.85 3.9 6.1 -12.25 -2.0 M-8.25 -4.0 L7.9 4.1 8.35 3.85 56.95 28.15 56.95 28.2 105.55 52.5 M113.55 48.5 L64.95 24.2 64.95 24.15 16.35 -0.15 15.9 0.1 -0.25 -8.0 M-4.25 -6.0 L11.9 2.1 12.35 1.85 60.95 26.15 60.95 26.2 109.55 50.5" fill="none" stroke="#660000" stroke-linecap="round" stroke-linejoin="round" stroke-opacity="0.12156863" stroke-width="0.05"/>
  </g>
</svg>
