<?xml version="1.0" encoding="UTF-8" standalone="no"?>
<svg xmlns:xlink="http://www.w3.org/1999/xlink" height="73.95px" width="147.85px" xmlns="http://www.w3.org/2000/svg">
  <g transform="matrix(1.0, 0.0, 0.0, 1.0, 73.95, 37.0)">
    <path d="M26.75 -30.9 Q18.65 -33.15 9.25 -33.3 L9.1 -33.3 9.0 -33.3 8.65 -33.3 8.4 -33.3 8.3 -33.3 Q-1.5 -33.35 -9.85 -31.1 L-10.4 -30.95 -10.7 -30.85 -13.05 -30.15 -13.9 -29.85 -13.95 -29.85 -24.05 -26.05 -25.5 -25.5 -26.2 -25.2 -35.65 -20.8 -37.65 -19.8 -38.6 -19.3 Q-42.5 -17.25 -46.1 -15.0 L-48.35 -13.6 -49.5 -12.85 -53.4 -10.2 -53.55 -10.1 -53.65 -10.0 -53.75 -9.95 -54.15 -9.65 -54.3 -9.5 -56.2 -7.95 -57.95 -6.05 -58.65 -5.1 Q-60.55 -2.3 -60.55 0.85 L-60.6 1.05 -60.6 1.15 -60.6 1.35 -60.4 3.15 -60.15 4.15 Q-59.1 7.45 -55.8 10.35 L-55.8 10.4 -53.9 11.9 -53.55 12.1 -53.6 12.1 -53.3 12.3 -52.95 12.55 -52.85 12.65 Q-48.95 15.3 -44.6 17.6 L-44.2 17.8 -44.05 17.9 -42.95 18.45 -42.9 18.5 -42.8 18.55 -42.05 18.9 -41.05 19.4 Q-36.2 21.65 -30.6 23.7 L-30.25 23.8 -29.35 24.1 -27.8 24.6 -27.05 24.85 Q-19.6 26.95 -10.9 27.25 L-10.85 27.25 -10.25 27.3 -9.95 27.3 -8.35 27.3 -8.1 27.3 Q0.05 27.35 7.25 25.8 L7.55 25.7 8.1 25.6 Q10.8 24.95 13.35 24.1 L14.0 23.85 14.5 23.7 21.15 21.25 21.85 20.95 23.25 20.4 23.3 20.35 Q28.15 18.4 32.6 16.3 L33.65 15.85 35.65 14.85 43.3 10.75 44.5 10.05 46.8 8.65 52.65 4.75 53.65 4.05 53.85 3.9 53.95 3.85 54.0 3.8 54.5 3.4 55.15 2.9 57.1 1.05 Q59.95 -2.05 60.5 -5.45 L60.6 -6.45 60.6 -7.2 60.6 -7.5 60.6 -7.4 60.6 -7.6 60.55 -7.9 60.55 -8.05 60.5 -8.2 60.5 -8.45 Q60.0 -12.15 56.9 -15.3 L56.1 -16.1 54.25 -17.65 53.2 -18.4 52.8 -18.65 52.65 -18.7 52.6 -18.75 50.35 -20.25 50.05 -20.45 49.85 -20.55 49.95 -20.5 49.65 -20.7 49.75 -20.65 49.4 -20.85 49.2 -20.95 49.05 -21.05 48.9 -21.15 44.75 -23.5 43.8 -24.0 43.0 -24.4 42.45 -24.7 42.05 -24.9 42.0 -24.9 41.9 -24.95 41.35 -25.25 41.2 -25.3 Q36.2 -27.7 30.4 -29.75 L30.3 -29.75 30.35 -29.75 29.95 -29.9 29.4 -30.05 29.1 -30.15 28.3 -30.4 26.75 -30.9 M32.8 -33.85 L37.3 -32.45 38.0 -32.25 Q44.95 -29.75 50.9 -26.9 L51.05 -26.8 51.2 -26.75 51.9 -26.4 52.4 -26.15 52.65 -26.0 Q56.2 -24.25 59.35 -22.3 L59.65 -22.15 59.75 -22.05 59.85 -22.0 59.95 -21.95 60.35 -21.7 60.7 -21.5 63.25 -19.75 63.5 -19.65 66.2 -17.7 Q72.6 -12.6 73.7 -6.5 L73.9 -5.1 73.9 -4.7 73.9 -3.1 73.9 -3.05 73.9 -3.0 73.85 -2.7 Q73.5 1.4 70.65 5.1 68.6 7.8 65.3 10.3 L65.0 10.55 58.9 14.75 52.65 18.5 45.1 22.55 Q37.75 26.15 29.45 29.45 L21.55 32.35 20.8 32.6 Q15.75 34.3 10.25 35.35 1.55 36.95 -8.25 36.95 L-8.35 36.95 -12.95 36.85 -13.0 36.85 Q-25.15 36.3 -35.45 33.1 L-38.05 32.2 Q-45.85 29.45 -52.3 26.25 L-52.35 26.2 -53.5 25.6 -54.05 25.3 -54.15 25.25 Q-59.5 22.45 -64.15 19.2 L-64.35 19.05 -64.45 19.0 -67.7 16.4 Q-73.4 11.25 -73.9 5.2 L-73.95 5.0 -73.95 4.15 -73.95 4.1 Q-74.0 -1.3 -70.0 -6.0 -68.1 -8.3 -65.2 -10.4 L-64.7 -10.8 -64.35 -11.05 -58.3 -15.1 Q-52.05 -19.05 -45.1 -22.55 -38.05 -26.1 -30.25 -29.15 L-21.1 -32.5 -20.7 -32.65 Q-16.5 -34.05 -12.05 -35.0 -2.45 -37.05 8.5 -37.0 L9.3 -36.95 10.4 -36.95 Q22.45 -36.7 32.8 -33.85 M9.2 -33.65 L9.35 -33.6 9.35 -33.65 9.2 -33.65" fill="url(#gradient0)" fill-rule="evenodd" stroke="none"/>
    <path d="M26.75 -30.9 L28.3 -30.4 29.1 -30.15 29.4 -30.05 29.95 -29.9 30.35 -29.75 30.3 -29.75 30.4 -29.75 Q36.2 -27.7 41.2 -25.3 L41.35 -25.25 41.9 -24.95 42.0 -24.9 42.05 -24.9 42.45 -24.7 43.0 -24.4 43.8 -24.0 44.75 -23.5 48.9 -21.15 49.05 -21.05 49.2 -20.95 49.4 -20.85 49.75 -20.65 49.65 -20.7 49.95 -20.5 49.85 -20.55 50.05 -20.45 50.35 -20.25 52.6 -18.75 52.65 -18.7 52.8 -18.65 53.2 -18.4 54.25 -17.65 56.1 -16.1 56.9 -15.3 Q60.0 -12.15 60.5 -8.45 L60.5 -8.2 60.55 -8.05 60.55 -7.9 60.6 -7.6 60.6 -7.4 60.6 -7.5 60.6 -7.2 60.6 -6.45 60.5 -5.45 Q59.95 -2.05 57.1 1.05 L55.15 2.9 54.5 3.4 54.0 3.8 53.95 3.85 53.85 3.9 53.65 4.05 52.65 4.75 46.8 8.65 44.5 10.05 43.3 10.75 35.65 14.85 33.65 15.85 32.6 16.3 Q28.15 18.4 23.3 20.35 L23.25 20.4 21.85 20.95 21.15 21.25 14.5 23.7 14.0 23.85 13.35 24.1 Q10.8 24.95 8.1 25.6 L7.55 25.7 7.25 25.8 Q0.05 27.35 -8.1 27.3 L-8.35 27.3 -9.95 27.3 -10.25 27.3 -10.85 27.25 -10.9 27.25 Q-19.6 26.95 -27.05 24.85 L-27.8 24.6 -29.35 24.1 -30.25 23.8 -30.6 23.7 Q-36.2 21.65 -41.05 19.4 L-42.05 18.9 -42.8 18.55 -42.9 18.5 -42.95 18.45 -44.05 17.9 -44.2 17.8 -44.6 17.6 Q-48.95 15.3 -52.85 12.65 L-52.95 12.55 -53.3 12.3 -53.6 12.1 -53.55 12.1 -53.9 11.9 -55.8 10.4 -55.8 10.35 Q-59.1 7.45 -60.15 4.15 L-60.4 3.15 -60.6 1.35 -60.6 1.15 -60.6 1.05 -60.55 0.85 Q-60.55 -2.3 -58.65 -5.1 L-57.95 -6.05 -56.2 -7.95 -54.3 -9.5 -54.15 -9.65 -53.75 -9.95 -53.65 -10.0 -53.55 -10.1 -53.4 -10.2 -49.5 -12.85 -48.35 -13.6 -46.1 -15.0 Q-42.5 -17.25 -38.6 -19.3 L-37.65 -19.8 -35.65 -20.8 -26.2 -25.2 -25.5 -25.5 -24.05 -26.05 -13.95 -29.85 -13.9 -29.85 -13.05 -30.15 -10.7 -30.85 -10.4 -30.95 -9.85 -31.1 Q-1.5 -33.35 8.3 -33.3 L8.4 -33.3 8.65 -33.3 9.0 -33.3 9.1 -33.3 9.25 -33.3 Q18.65 -33.15 26.75 -30.9 M30.3 -26.75 L30.4 -26.75 30.35 -26.75 30.3 -26.75 M8.75 -23.7 L7.95 -23.7 7.9 -23.7 7.25 -23.7 7.05 -23.7 6.2 -23.7 Q-1.55 -23.5 -7.65 -21.25 L-7.7 -21.25 -7.9 -21.2 -8.85 -20.85 -12.4 -19.35 -12.8 -19.2 -17.45 -17.2 -17.9 -17.0 -18.0 -16.95 -26.15 -13.05 -33.05 -9.45 -33.15 -9.35 -33.25 -9.3 -34.0 -8.95 -34.35 -8.75 -38.35 -6.45 -38.75 -6.2 -40.2 -5.35 -40.55 -5.1 -40.75 -5.0 -40.8 -4.95 -40.85 -4.95 -41.35 -4.6 -41.55 -4.5 -42.55 -3.85 Q-47.05 -0.75 -47.4 3.1 L-47.4 3.15 -47.4 3.35 -47.4 3.4 -47.4 3.45 -47.45 3.5 -47.45 4.0 -47.4 4.05 Q-47.35 7.45 -43.95 10.35 L-42.75 11.3 -42.65 11.4 -42.55 11.45 Q-38.9 14.05 -34.7 16.25 -29.45 19.0 -23.3 21.15 L-22.35 21.5 -22.3 21.5 -21.95 21.65 -21.85 21.7 -21.6 21.75 Q-15.75 23.6 -8.85 23.8 L-7.9 23.8 -6.65 23.8 -6.4 23.8 Q0.4 23.65 6.0 22.0 L9.2 20.85 10.35 20.35 10.65 20.25 10.75 20.2 12.6 19.45 12.65 19.45 13.1 19.25 17.25 17.45 17.7 17.25 17.95 17.15 18.9 16.65 26.3 13.15 34.25 9.0 34.6 8.8 Q34.75 8.7 34.95 8.65 L38.5 6.55 39.0 6.25 41.9 4.5 42.0 4.45 42.2 4.3 42.3 4.25 44.0 3.0 Q47.25 0.25 47.6 -3.0 L47.6 -3.1 47.6 -3.4 47.65 -3.35 47.6 -4.4 Q47.3 -7.75 43.8 -10.55 L43.5 -10.8 42.95 -11.25 43.0 -11.15 42.4 -11.65 Q38.05 -14.7 32.5 -17.35 L32.45 -17.35 Q28.0 -19.5 22.8 -21.3 L20.7 -21.95 Q15.2 -23.6 8.75 -23.7 M8.4 -30.3 L8.3 -30.3 8.4 -30.3 M20.15 20.3 L20.15 20.35 20.2 20.3 20.15 20.3 M-26.3 24.1 L-26.25 24.1 -26.45 24.05 -26.3 24.1 M-54.15 -6.65 L-54.3 -6.5 -54.1 -6.65 -54.15 -6.65" fill="url(#gradient1)" fill-rule="evenodd" stroke="none"/>
  </g>
  <defs>
    <linearGradient gradientTransform="matrix(-0.0431, -0.0746, 0.0391, -0.0226, 0.9, 0.0)" gradientUnits="userSpaceOnUse" id="gradient0" spreadMethod="pad" x1="-819.2" x2="819.2">
      <stop offset="0.0" stop-color="#ffffff" stop-opacity="0.0"/>
      <stop offset="1.0" stop-color="#ffffff"/>
    </linearGradient>
    <linearGradient gradientTransform="matrix(0.037, -0.0641, 0.032, 0.0185, 0.0, -3.0)" gradientUnits="userSpaceOnUse" id="gradient1" spreadMethod="pad" x1="-819.2" x2="819.2">
      <stop offset="0.0" stop-color="#ffffff" stop-opacity="0.0"/>
      <stop offset="1.0" stop-color="#ffffff"/>
    </linearGradient>
  </defs>
</svg>
