<?xml version="1.0" encoding="UTF-8" standalone="no"?>
<svg xmlns:xlink="http://www.w3.org/1999/xlink" height="104.0px" width="104.0px" xmlns="http://www.w3.org/2000/svg">
  <g transform="matrix(1.0, 0.0, 0.0, 1.0, 52.0, 80.0)">
    <path d="M-47.95 -68.0 L-48.0 -68.0 -47.95 -68.0" fill="#ffdf9e" fill-rule="evenodd" stroke="none"/>
    <path d="M44.0 -50.0 L48.0 -52.0 48.0 -54.05 52.0 -52.05 0.0 -26.05 0.0 -24.05 -50.0 -49.0 -52.0 -50.0 -52.0 -52.0 -52.0 -52.05 -48.0 -54.05 -48.0 -52.0 -44.0 -50.0 -30.0 -43.0 -18.0 -37.0 -4.0 -30.0 0.0 -28.0 4.0 -30.0 18.0 -37.0 30.0 -43.0 44.0 -50.0 M50.0 -47.05 L52.0 -46.05 0.0 -20.05 0.0 -18.05 -4.0 -20.05 -16.0 -26.05 -18.0 -27.05 -30.0 -33.05 -42.0 -39.05 -44.0 -40.05 -48.0 -42.05 -52.0 -44.05 -52.0 -46.0 -51.95 -46.0 -50.0 -47.0 -50.0 -46.0 0.0 -21.05 50.0 -46.05 50.0 -47.05 M-51.95 -46.0 L0.0 -20.05 -51.95 -46.0 M-52.0 -52.0 L0.0 -26.05 -52.0 -52.0" fill="#ad6b80" fill-rule="evenodd" stroke="none"/>
    <path d="M52.0 -52.05 L52.0 -50.05 50.0 -49.05 50.0 -47.05 50.0 -46.05 0.0 -21.05 -50.0 -46.0 -50.0 -47.0 -50.0 -49.0 0.0 -24.05 0.0 -26.05 52.0 -52.05 M52.0 -46.05 L52.0 -44.05 48.0 -42.05 44.0 -40.05 42.0 -39.05 30.0 -33.05 18.0 -27.05 16.0 -26.05 4.0 -20.05 0.0 -18.05 0.0 -20.05 52.0 -46.05 M50.0 -49.05 L0.0 -24.05 50.0 -49.05 M0.0 -24.05 L0.0 -21.05 0.0 -24.05" fill="#664461" fill-rule="evenodd" stroke="none"/>
    <path d="M44.05 2.0 L42.05 1.0 42.0 -39.05 44.0 -40.05 44.05 2.0 M18.0 15.0 L16.0 14.0 16.0 -26.05 18.0 -27.05 18.0 15.0 M0.0 24.0 L-4.0 22.0 -4.0 20.0 -16.0 14.0 -16.0 -26.05 -4.0 -20.05 -4.0 20.0 -4.0 -20.05 0.0 -18.05 0.0 24.0 M-18.0 15.0 L-30.0 9.0 -30.0 7.0 -42.0 1.0 -42.0 -39.05 -30.0 -33.05 -18.0 -27.05 -18.0 15.0 M-44.0 2.0 L-48.0 0.0 -48.0 -42.05 -44.0 -40.05 -44.0 2.0 M-48.0 -54.05 L-48.0 -68.0 -47.95 -68.0 -44.0 -66.0 -30.0 -59.0 -18.0 -53.0 -4.0 -46.0 0.0 -44.0 0.0 -28.0 -4.0 -30.0 -18.0 -37.0 -30.0 -43.0 -44.0 -50.0 -48.0 -52.0 -48.0 -54.05 M-44.0 -50.0 L-44.0 -66.0 -44.0 -50.0 M-4.0 -30.0 L-4.0 -46.0 -4.0 -30.0 M-18.0 -37.0 L-18.0 -53.0 -18.0 -37.0 M-30.0 7.0 L-30.0 -33.05 -30.0 7.0 M-30.0 -43.0 L-30.0 -59.0 -30.0 -43.0" fill="url(#gradient0)" fill-rule="evenodd" stroke="none"/>
    <path d="M44.0 -66.0 L48.0 -68.0 48.0 -54.05 48.0 -52.0 44.0 -50.0 44.0 -66.0 44.0 -50.0 30.0 -43.0 18.0 -37.0 4.0 -30.0 0.0 -28.0 0.0 -44.0 4.0 -46.0 18.0 -53.0 30.0 -59.0 44.0 -66.0 M48.0 -42.05 L48.0 0.0 44.05 2.0 44.0 -40.05 48.0 -42.05 M42.05 1.0 L30.0 7.0 30.0 9.0 18.0 15.0 18.0 -27.05 30.0 -33.05 42.0 -39.05 42.05 1.0 M16.0 14.0 L4.0 20.0 4.0 22.0 0.0 24.0 0.0 -18.05 4.0 -20.05 16.0 -26.05 16.0 14.0 M-16.0 14.0 L-17.95 15.0 -18.0 15.0 -18.0 -27.05 -16.0 -26.05 -16.0 14.0 M-42.0 1.0 L-44.0 2.0 -44.0 -40.05 -42.0 -39.05 -42.0 1.0 M4.0 -46.0 L4.0 -30.0 4.0 -46.0 M4.0 20.0 L4.0 -20.05 4.0 20.0 M30.0 7.0 L30.0 -33.05 30.0 7.0 M18.0 -37.0 L18.0 -53.0 18.0 -37.0 M30.0 -59.0 L30.0 -43.0 30.0 -59.0" fill="url(#gradient1)" fill-rule="evenodd" stroke="none"/>
    <path d="M24.0 -76.0 L0.0 -64.0 0.0 -44.0 -4.0 -46.0 -18.0 -53.0 -30.0 -59.0 -44.0 -66.0 -47.95 -68.0 -24.0 -76.0 -47.95 -68.0 -48.0 -68.0 -24.0 -80.0 -24.0 -76.0 0.0 -64.0 0.0 -68.0 24.0 -80.0 24.0 -76.0" fill="#756469" fill-rule="evenodd" stroke="none"/>
    <path d="M48.0 -68.0 L44.0 -66.0 30.0 -59.0 18.0 -53.0 4.0 -46.0 0.0 -44.0 0.0 -64.0 24.0 -76.0 48.0 -68.0 24.0 -76.0 24.0 -80.0 48.0 -68.0 M-24.0 -80.0 L0.0 -68.0 0.0 -64.0 -24.0 -76.0 -24.0 -80.0" fill="#452e40" fill-rule="evenodd" stroke="none"/>
    <path d="M48.0 -68.0 L44.0 -66.0 44.0 -50.0 48.0 -52.0 48.0 -54.05 48.0 -68.0 24.0 -76.0 0.0 -64.0 0.0 -44.0 4.0 -46.0 18.0 -53.0 30.0 -59.0 44.0 -66.0 M52.0 -52.05 L52.0 -50.05 50.0 -49.05 50.0 -47.05 52.0 -46.05 52.0 -44.05 48.0 -42.05 48.0 0.0 M30.0 7.0 L30.0 9.0 M4.0 20.0 L4.0 22.0 M-4.0 22.0 L-4.0 20.0 M-17.95 15.0 L-18.0 15.0 M-30.0 9.0 L-30.0 7.0 M-48.0 0.0 L-48.0 -42.05 -52.0 -44.05 -52.0 -46.0 -51.95 -46.0 -50.0 -47.0 -50.0 -49.0 -52.0 -50.0 -52.0 -52.0 -52.0 -52.05 -48.0 -54.05 -48.0 -68.0 -24.0 -80.0 0.0 -68.0 24.0 -80.0 48.0 -68.0 M48.0 -54.05 L52.0 -52.05 0.0 -26.05 0.0 -24.05 50.0 -49.05 M24.0 -76.0 L24.0 -80.0 M0.0 -68.0 L0.0 -64.0 -24.0 -76.0 -47.95 -68.0 -44.0 -66.0 -30.0 -59.0 -18.0 -53.0 -4.0 -46.0 0.0 -44.0 0.0 -28.0 4.0 -30.0 4.0 -46.0 M44.0 -50.0 L30.0 -43.0 18.0 -37.0 4.0 -30.0 M18.0 -27.05 L16.0 -26.05 16.0 14.0 M4.0 -20.05 L0.0 -18.05 0.0 24.0 M0.0 -18.05 L0.0 -20.05 -51.95 -46.0 -52.0 -46.0 M0.0 -21.05 L0.0 -24.05 -50.0 -49.0 M30.0 -33.05 L18.0 -27.05 18.0 15.0 M16.0 -26.05 L4.0 -20.05 4.0 20.0 M48.0 -42.05 L44.0 -40.05 44.05 2.0 M44.0 -40.05 L42.0 -39.05 42.05 1.0 M50.0 -47.05 L50.0 -46.05 0.0 -21.05 -50.0 -46.0 -50.0 -47.0 M42.0 -39.05 L30.0 -33.05 30.0 7.0 M52.0 -46.05 L0.0 -20.05 M30.0 -43.0 L30.0 -59.0 M18.0 -53.0 L18.0 -37.0 M-24.0 -80.0 L-24.0 -76.0 M-47.95 -68.0 L-48.0 -68.0 M-47.95 -68.0 L-48.0 -68.0 M0.0 -28.0 L-4.0 -30.0 -18.0 -37.0 -30.0 -43.0 -44.0 -50.0 -48.0 -52.0 -48.0 -54.05 M-44.0 -66.0 L-44.0 -50.0 M-42.0 -39.05 L-44.0 -40.05 -44.0 2.0 M-44.0 -40.05 L-48.0 -42.05 M-4.0 -46.0 L-4.0 -30.0 M-16.0 -26.05 L-18.0 -27.05 -18.0 15.0 M-4.0 -20.05 L-16.0 -26.05 -16.0 14.0 M-18.0 -27.05 L-30.0 -33.05 -30.0 7.0 M-18.0 -53.0 L-18.0 -37.0 M-30.0 -33.05 L-42.0 -39.05 -42.0 1.0 M-30.0 -59.0 L-30.0 -43.0 M-4.0 -20.05 L-4.0 20.0 M0.0 -18.05 L-4.0 -20.05 M0.0 -26.05 L-52.0 -52.0" fill="none" stroke="#660000" stroke-linecap="round" stroke-linejoin="round" stroke-opacity="0.3019608" stroke-width="0.05"/>
    <path d="M48.0 0.0 L44.05 2.0 42.05 1.0 30.0 7.0 M30.0 9.0 L18.0 15.0 16.0 14.0 4.0 20.0 M4.0 22.0 L0.0 24.0 -4.0 22.0 M-4.0 20.0 L-16.0 14.0 -17.95 15.0 M-18.0 15.0 L-30.0 9.0 M-30.0 7.0 L-42.0 1.0 -44.0 2.0 -48.0 0.0" fill="none" stroke="#660000" stroke-linecap="round" stroke-linejoin="round" stroke-opacity="0.101960786" stroke-width="0.05"/>
  </g>
  <defs>
    <linearGradient gradientTransform="matrix(0.0, 0.0435, -0.0281, 0.0, -35.6, -30.9)" gradientUnits="userSpaceOnUse" id="gradient0" spreadMethod="pad" x1="-819.2" x2="819.2">
      <stop offset="0.0" stop-color="#ffdf9e"/>
      <stop offset="1.0" stop-color="#e0bb72"/>
    </linearGradient>
    <linearGradient gradientTransform="matrix(0.0, 0.0435, -0.0281, 0.0, -35.6, -30.9)" gradientUnits="userSpaceOnUse" id="gradient1" spreadMethod="pad" x1="-819.2" x2="819.2">
      <stop offset="0.0" stop-color="#c77c7c"/>
      <stop offset="1.0" stop-color="#945b6b"/>
    </linearGradient>
  </defs>
</svg>
