<?xml version="1.0" encoding="UTF-8" standalone="no"?>
<svg xmlns:xlink="http://www.w3.org/1999/xlink" height="42.0px" width="83.95px" xmlns="http://www.w3.org/2000/svg">
  <g transform="matrix(1.0, 0.0, 0.0, 1.0, -15.0, -30.5)">
    <path d="M33.95 72.5 L15.0 63.05 79.95 30.5 98.95 40.0 33.95 72.5" fill="#663e3e" fill-opacity="0.3019608" fill-rule="evenodd" stroke="none"/>
  </g>
</svg>
