<?xml version="1.0" encoding="UTF-8" standalone="no"?>
<svg xmlns:xlink="http://www.w3.org/1999/xlink" height="29.35px" width="45.0px" xmlns="http://www.w3.org/2000/svg">
  <g transform="matrix(1.0, 0.0, 0.0, 1.0, 23.7, 60.0)">
    <path d="M21.3 -43.05 L10.55 -42.5 21.3 -31.15 M21.3 -48.8 L-1.1 -60.0 -1.1 -54.85 -1.1 -54.8 21.3 -43.6 M-1.1 -54.85 L-1.1 -41.85 10.55 -42.5 -1.1 -54.8 M-1.1 -36.65 L-1.1 -41.85 M21.3 -30.65 L-1.1 -41.85" fill="none" stroke="#999999" stroke-linecap="round" stroke-linejoin="round" stroke-width="0.05"/>
    <path d="M-23.7 -38.45 L-2.25 -49.1" fill="none" stroke="#6f6f6f" stroke-linecap="round" stroke-linejoin="round" stroke-width="0.05"/>
  </g>
</svg>
