<?xml version="1.0" encoding="UTF-8" standalone="no"?>
<svg xmlns:xlink="http://www.w3.org/1999/xlink" height="25.0px" width="42.55px" xmlns="http://www.w3.org/2000/svg">
  <g transform="matrix(1.0, 0.0, 0.0, 1.0, 21.35, 9.4)">
    <path d="M11.05 2.5 L11.1 2.25 Q11.1 1.85 10.7 1.85 7.95 3.2 7.45 3.6 5.45 5.05 5.45 5.45 5.45 6.25 6.6 6.25 L8.2 5.8 8.2 5.85 7.75 6.4 8.25 6.85 Q8.85 6.85 10.0 5.2 L11.1 3.15 11.2 2.8 11.05 2.5 M1.15 4.25 L0.45 4.75 Q0.45 5.55 1.4 5.4 1.7 6.55 2.4 6.55 L3.5 6.7 Q3.95 6.7 4.65 6.15 L5.3 5.45 5.85 4.2 5.7 3.35 Q5.05 2.7 4.55 2.7 3.65 2.7 2.35 3.45 1.25 3.55 1.15 4.25 M3.6 8.5 L3.85 7.95 Q3.85 7.2 2.85 7.2 L2.8 7.2 2.7 7.2 Q-1.1 7.2 -1.1 8.05 L-0.6 8.9 Q-1.1 9.05 -1.1 9.6 -1.1 10.2 -0.6 10.2 L0.05 10.05 Q0.6 10.7 2.75 10.7 3.8 10.7 3.8 9.8 L3.4 9.1 3.6 8.65 3.6 8.5 M5.5 9.55 Q5.5 9.15 5.1 9.15 4.75 9.15 4.75 9.55 L5.1 9.95 Q5.5 9.95 5.5 9.55 M6.9 11.0 Q6.9 10.5 6.0 10.5 4.65 10.5 4.65 11.5 L5.15 11.95 Q5.6 11.95 6.9 11.0 M-2.25 4.4 Q-3.25 3.7 -3.65 3.7 -4.8 3.7 -4.8 4.25 L-4.35 5.0 -4.25 5.15 -4.8 5.05 Q-5.5 5.05 -5.5 5.6 -5.5 6.15 -4.6 6.15 L-4.1 6.1 -4.25 6.6 Q-4.25 7.45 -3.4 7.45 -2.65 7.45 -2.5 6.85 L-0.95 7.25 Q-0.35 7.25 -0.35 6.8 -0.9 6.5 -1.3 5.25 L-1.65 4.85 -2.25 4.4 M-3.8 5.75 L-3.7 5.8 -3.8 5.85 -3.8 5.75 M-10.05 0.7 Q-12.25 0.9 -12.25 2.8 -12.15 4.5 -10.5 4.5 -7.9 4.5 -7.9 2.25 -7.9 1.7 -8.05 1.4 L-8.55 0.85 -9.4 0.65 -10.05 0.7 M-13.7 2.5 L-13.95 2.5 -14.2 2.55 -14.25 2.55 -15.35 2.9 -15.85 3.15 -16.2 3.35 -16.55 3.95 Q-16.55 4.4 -16.1 4.5 -15.9 5.05 -14.95 5.05 -13.95 5.05 -13.95 4.35 L-13.95 4.25 -13.85 4.2 Q-12.4 3.8 -12.4 3.35 -12.4 2.55 -13.7 2.5 M-21.35 4.95 L-0.05 -5.7 21.2 4.95 -0.05 15.6 -21.35 4.95" fill="#b5ada2" fill-rule="evenodd" stroke="none"/>
    <path d="M11.05 2.5 L10.45 2.35 Q9.55 2.35 9.55 2.85 9.55 3.3 10.35 3.3 L11.1 3.15 10.0 5.2 Q8.85 6.85 8.25 6.85 L7.75 6.4 8.2 5.85 8.2 5.8 6.6 6.25 Q5.45 6.25 5.45 5.45 5.45 5.05 7.45 3.6 7.95 3.2 10.7 1.85 11.1 1.85 11.1 2.25 L11.05 2.5 M2.35 3.45 Q3.65 2.7 4.55 2.7 5.05 2.7 5.7 3.35 L5.85 4.2 5.3 5.45 4.65 6.15 Q3.95 6.7 3.5 6.7 L2.4 6.55 Q1.7 6.55 1.4 5.4 0.45 5.55 0.45 4.75 L1.15 4.25 1.1 4.45 Q1.1 5.25 2.1 5.25 L2.6 5.25 Q2.7 5.65 3.2 5.65 L3.6 5.6 Q3.7 6.0 4.35 6.0 5.25 6.0 5.25 5.2 5.2 4.5 4.55 4.5 L3.8 4.7 3.6 4.45 3.6 4.25 Q3.25 3.45 2.6 3.45 L2.35 3.45 M3.65 3.7 L4.4 4.45 Q5.15 4.45 5.15 3.7 5.1 2.95 4.45 2.95 3.65 2.95 3.65 3.7 M3.6 8.5 L3.6 8.65 3.4 9.1 3.8 9.8 Q3.8 10.7 2.75 10.7 0.6 10.7 0.05 10.05 0.4 9.8 0.4 9.25 0.4 8.8 -0.05 8.8 L-0.6 8.9 -1.1 8.05 Q-1.1 7.2 2.7 7.2 L2.8 7.2 Q2.15 7.25 2.15 7.85 2.15 8.6 3.05 8.6 L3.6 8.5 M1.7 8.15 Q1.7 7.3 0.95 7.3 0.1 7.3 0.1 8.1 0.1 8.7 1.2 8.7 1.7 8.7 1.7 8.15 M2.25 8.7 Q1.75 8.7 1.75 9.15 1.75 9.6 2.2 9.6 2.75 9.6 2.75 9.15 2.75 8.7 2.25 8.7 M6.9 11.0 Q5.6 11.95 5.15 11.95 L4.65 11.5 Q4.65 10.5 6.0 10.5 6.9 10.5 6.9 11.0 M-2.85 4.65 Q-2.85 3.9 -3.8 3.9 -4.35 3.9 -4.35 4.4 -4.35 5.3 -3.55 5.3 -3.05 5.3 -2.9 4.95 -2.9 5.4 -2.25 5.4 -1.65 5.4 -1.65 4.9 L-1.65 4.85 -1.3 5.25 Q-0.9 6.5 -0.35 6.8 -0.35 7.25 -0.95 7.25 L-2.5 6.85 -2.5 6.55 Q-2.7 5.75 -3.4 5.75 L-3.7 5.8 -3.8 5.75 -3.8 5.7 Q-3.8 5.25 -4.25 5.15 L-4.35 5.0 -4.8 4.25 Q-4.8 3.7 -3.65 3.7 -3.25 3.7 -2.25 4.4 L-2.3 4.4 Q-2.7 4.4 -2.85 4.65 M-8.55 0.85 L-8.05 1.4 Q-7.9 1.7 -7.9 2.25 -7.9 4.5 -10.5 4.5 -12.15 4.5 -12.25 2.8 -12.25 0.9 -10.05 0.7 L-10.1 0.95 -10.05 1.2 -10.6 1.1 Q-11.45 1.1 -11.45 1.75 -11.45 2.55 -10.55 2.55 L-10.2 2.55 Q-10.05 3.1 -9.5 3.1 -8.9 3.1 -8.9 2.5 -8.9 1.75 -9.55 1.75 L-9.6 1.75 -9.65 1.55 -9.5 1.55 Q-8.65 1.55 -8.55 0.85 M-10.0 3.9 Q-9.7 3.9 -9.7 3.6 L-10.2 3.2 -10.55 3.5 Q-10.45 3.9 -10.0 3.9 M-1.55 6.85 Q-1.2 6.85 -1.2 6.5 -1.2 6.05 -1.6 6.05 -1.95 6.05 -1.95 6.4 -1.95 6.85 -1.55 6.85 M-13.7 2.5 Q-12.4 2.55 -12.4 3.35 -12.4 3.8 -13.85 4.2 L-13.95 4.25 Q-14.0 3.55 -14.9 3.55 L-15.05 3.55 -15.0 3.3 -15.35 2.95 -15.85 3.15 -15.35 2.9 -14.25 2.55 Q-14.6 2.7 -14.6 3.05 -14.65 3.6 -14.0 3.6 -13.15 3.6 -13.15 2.9 -13.15 2.65 -13.3 2.55 L-13.7 2.5 M-16.1 4.5 Q-16.55 4.4 -16.55 3.95 L-16.2 3.35 -15.9 3.75 -16.15 4.15 -16.1 4.5" fill="#a3d100" fill-rule="evenodd" stroke="none"/>
    <path d="M11.1 3.15 L10.35 3.3 Q9.55 3.3 9.55 2.85 9.55 2.35 10.45 2.35 L11.05 2.5 11.2 2.8 11.1 3.15 M1.7 8.15 Q1.7 8.7 1.2 8.7 0.1 8.7 0.1 8.1 0.1 7.3 0.95 7.3 1.7 7.3 1.7 8.15 M5.5 9.55 Q5.5 9.95 5.1 9.95 L4.75 9.55 Q4.75 9.15 5.1 9.15 5.5 9.15 5.5 9.55 M-2.9 4.95 Q-3.05 5.3 -3.55 5.3 -4.35 5.3 -4.35 4.4 -4.35 3.9 -3.8 3.9 -2.85 3.9 -2.85 4.65 L-2.9 4.95 M-3.7 5.8 L-3.4 5.75 Q-2.7 5.75 -2.5 6.55 L-2.5 6.85 Q-2.65 7.45 -3.4 7.45 -4.25 7.45 -4.25 6.6 L-4.1 6.1 -3.8 5.85 -3.7 5.8 M-9.65 1.55 L-9.6 1.75 -9.6 1.85 Q-9.6 2.4 -10.2 2.55 L-10.55 2.55 Q-11.45 2.55 -11.45 1.75 -11.45 1.1 -10.6 1.1 L-10.05 1.2 -9.65 1.55 M-13.95 4.25 L-13.95 4.35 Q-13.95 5.05 -14.95 5.05 -15.9 5.05 -16.1 4.5 L-16.15 4.15 -15.9 3.75 -15.05 3.55 -14.9 3.55 Q-14.0 3.55 -13.95 4.25" fill="#fae9a7" fill-rule="evenodd" stroke="none"/>
    <path d="M1.15 4.25 Q1.25 3.55 2.35 3.45 L2.6 3.45 Q3.25 3.45 3.6 4.25 L3.6 4.45 Q3.45 5.1 2.6 5.25 L2.1 5.25 Q1.1 5.25 1.1 4.45 L1.15 4.25 M2.8 7.2 L2.85 7.2 Q3.85 7.2 3.85 7.95 L3.6 8.5 3.05 8.6 Q2.15 8.6 2.15 7.85 2.15 7.25 2.8 7.2 M0.05 10.05 L-0.6 10.2 Q-1.1 10.2 -1.1 9.6 -1.1 9.05 -0.6 8.9 L-0.05 8.8 Q0.4 8.8 0.4 9.25 0.4 9.8 0.05 10.05 M-4.25 5.15 Q-3.8 5.25 -3.8 5.7 L-3.8 5.75 -3.8 5.85 -4.1 6.1 -4.6 6.15 Q-5.5 6.15 -5.5 5.6 -5.5 5.05 -4.8 5.05 L-4.25 5.15 M-10.0 3.9 Q-10.45 3.9 -10.55 3.5 L-10.2 3.2 -9.7 3.6 Q-9.7 3.9 -10.0 3.9" fill="#ff1ad1" fill-rule="evenodd" stroke="none"/>
    <path d="M3.6 4.45 L3.8 4.7 3.55 5.3 3.6 5.6 3.2 5.65 Q2.7 5.65 2.6 5.25 3.45 5.1 3.6 4.45 M3.65 3.7 Q3.65 2.95 4.45 2.95 5.1 2.95 5.15 3.7 5.15 4.45 4.4 4.45 L3.65 3.7 M2.25 8.7 Q2.75 8.7 2.75 9.15 2.75 9.6 2.2 9.6 1.75 9.6 1.75 9.15 1.75 8.7 2.25 8.7 M-2.85 4.65 Q-2.7 4.4 -2.3 4.4 L-2.25 4.4 -1.65 4.85 -1.65 4.9 Q-1.65 5.4 -2.25 5.4 -2.9 5.4 -2.9 4.95 L-2.85 4.65 M-10.05 0.7 L-9.4 0.65 -8.55 0.85 Q-8.65 1.55 -9.5 1.55 L-9.65 1.55 -10.05 1.2 -10.1 0.95 -10.05 0.7 M-9.6 1.75 L-9.55 1.75 Q-8.9 1.75 -8.9 2.5 -8.9 3.1 -9.5 3.1 -10.05 3.1 -10.2 2.55 -9.6 2.4 -9.6 1.85 L-9.6 1.75 M-1.55 6.85 Q-1.95 6.85 -1.95 6.4 -1.95 6.05 -1.6 6.05 -1.2 6.05 -1.2 6.5 -1.2 6.85 -1.55 6.85 M-14.25 2.55 L-14.2 2.55 -13.95 2.5 -13.7 2.5 -13.3 2.55 Q-13.15 2.65 -13.15 2.9 -13.15 3.6 -14.0 3.6 -14.65 3.6 -14.6 3.05 -14.6 2.7 -14.25 2.55 M-16.2 3.35 L-15.85 3.15 -15.35 2.95 -15.0 3.3 -15.05 3.55 -15.9 3.75 -16.2 3.35" fill="#fe5a5a" fill-rule="evenodd" stroke="none"/>
    <path d="M3.8 4.7 L4.55 4.5 Q5.2 4.5 5.25 5.2 5.25 6.0 4.35 6.0 3.7 6.0 3.6 5.6 L3.55 5.3 3.8 4.7" fill="#ffff2b" fill-rule="evenodd" stroke="none"/>
    <path d="M15.65 2.15 L4.5 7.7 -1.0 4.95 10.1 -0.65 15.65 2.15" fill="#663e3e" fill-opacity="0.3019608" fill-rule="evenodd" stroke="none"/>
    <path d="M6.45 -9.4 L-4.7 -3.8 -6.45 -3.65 -6.7 -3.65 -6.9 -3.6 -8.9 -3.45 2.3 -9.05 6.45 -9.4" fill="url(#gradient0)" fill-rule="evenodd" stroke="none"/>
    <path d="M9.7 -3.85 L-0.25 1.1 -0.7 0.6 -4.7 -3.8 6.45 -9.4 6.5 -9.4 10.95 -4.5 9.7 -3.85" fill="#d15b2c" fill-rule="evenodd" stroke="none"/>
    <path d="M9.7 -3.85 L9.75 -0.1 7.75 0.9 7.7 -2.1 5.7 -1.1 5.75 1.9 -0.3 4.9 -0.7 4.7 -0.7 0.6 -0.25 1.1 9.7 -3.85" fill="#817eab" fill-rule="evenodd" stroke="none"/>
    <path d="M5.75 1.9 L5.7 -1.1 7.7 -2.1 7.75 0.9 5.75 1.9" fill="#45445c" fill-rule="evenodd" stroke="none"/>
    <path d="M-6.9 -3.6 L-6.7 -3.65 -6.45 -3.65 -7.35 -3.4 -6.9 -3.6" fill="#feda9e" fill-rule="evenodd" stroke="none"/>
    <path d="M-0.7 0.6 L-0.7 4.7 -7.35 1.4 -7.35 -3.4 -6.45 -3.65 -4.7 -3.8 -0.7 0.6" fill="#d8dbf7" fill-rule="evenodd" stroke="none"/>
    <path d="M9.7 -3.85 L-0.25 1.1 -0.7 0.6 M5.75 1.9 L5.7 -1.1 7.7 -2.1 7.75 0.9 M9.7 -3.85 L10.95 -4.5 6.5 -9.4 6.45 -9.4 -4.7 -3.8 -0.7 0.6 M6.45 -9.4 L2.3 -9.05 -8.9 -3.45 -6.9 -3.6 M-6.7 -3.65 L-6.45 -3.65 -4.7 -3.8 M5.75 1.9 L7.75 0.9 M-7.35 -3.4 L-7.35 1.4" fill="none" stroke="#660000" stroke-linecap="round" stroke-linejoin="round" stroke-opacity="0.3019608" stroke-width="0.05"/>
    <path d="M9.75 -0.1 L9.7 -3.85" fill="none" stroke="#660000" stroke-linecap="round" stroke-linejoin="round" stroke-opacity="0.3019608" stroke-width="0.05"/>
    <path d="M-0.7 4.7 L-0.3 4.9 5.75 1.9 M7.75 0.9 L9.75 -0.1 M-7.35 1.4 L-0.7 4.7" fill="none" stroke="#660000" stroke-linecap="round" stroke-linejoin="round" stroke-opacity="0.101960786" stroke-width="0.05"/>
    <path d="M-1.8 0.65 L-3.3 -0.1 -3.3 1.4 -1.8 2.15 -1.8 0.65" fill="#830099" fill-opacity="0.47058824" fill-rule="evenodd" stroke="none"/>
    <path d="M-1.8 0.65 L-3.3 -0.1 -3.3 1.4 -1.8 2.15 -1.8 0.65 Z" fill="none" stroke="#660000" stroke-linecap="round" stroke-linejoin="round" stroke-opacity="0.3019608" stroke-width="0.05"/>
    <path d="M-4.8 -0.85 L-4.8 0.65 -6.3 -0.1 -6.3 -1.6 -4.8 -0.85" fill="#990000" fill-rule="evenodd" stroke="none"/>
    <path d="M-4.8 -0.85 L-6.3 -1.6 -6.3 -0.1 -4.8 0.65 -4.8 -0.85 Z" fill="none" stroke="#660000" stroke-linecap="round" stroke-linejoin="round" stroke-opacity="0.3019608" stroke-width="0.05"/>
    <path d="M2.2 0.65 L2.2 2.15 3.7 1.4 3.7 -0.1 2.2 0.65" fill="#990000" fill-rule="evenodd" stroke="none"/>
    <path d="M2.2 0.65 L3.7 -0.1 3.7 1.4 2.2 2.15 2.2 0.65 Z" fill="none" stroke="#660000" stroke-linecap="round" stroke-linejoin="round" stroke-opacity="0.3019608" stroke-width="0.05"/>
  </g>
  <defs>
    <linearGradient gradientTransform="matrix(0.0046, 0.0046, -0.0026, 0.0026, -1.05, -6.1)" gradientUnits="userSpaceOnUse" id="gradient0" spreadMethod="pad" x1="-819.2" x2="819.2">
      <stop offset="0.0" stop-color="#eba133"/>
      <stop offset="1.0" stop-color="#cc4545"/>
    </linearGradient>
  </defs>
</svg>
