<?xml version="1.0" encoding="UTF-8" standalone="no"?>
<svg xmlns:xlink="http://www.w3.org/1999/xlink" height="176.7px" width="59.75px" xmlns="http://www.w3.org/2000/svg">
  <g transform="matrix(1.0, 0.0, 0.0, 1.0, 30.0, 142.4)">
    <path d="M29.55 -92.6 L-30.0 -122.4 -30.0 -142.4 29.55 -112.6 29.6 -92.65 29.55 -92.6 M29.6 -87.6 L29.75 5.45 23.1 2.1 23.25 9.25 -9.1 -6.95 -9.1 -18.2 -16.15 -22.4 -16.15 -10.45 -30.0 -17.4 -30.0 -117.4 29.55 -87.6 29.6 -87.6 M0.0 9.8 L0.0 18.9 -9.1 14.0 -9.1 -1.95 23.4 14.3 23.8 34.3 13.3 30.1 13.3 16.8 0.0 9.8 M-16.15 -5.45 L-16.15 34.3 -23.85 30.1 -23.15 9.8 -30.0 6.15 -30.0 -12.4 -16.15 -5.45" fill="url(#gradient0)" fill-rule="evenodd" stroke="none"/>
  </g>
  <defs>
    <linearGradient gradientTransform="matrix(0.0, 0.1648, -0.0364, 0.0, -0.2, 0.4)" gradientUnits="userSpaceOnUse" id="gradient0" spreadMethod="pad" x1="-819.2" x2="819.2">
      <stop offset="0.0" stop-color="#ffffff"/>
      <stop offset="1.0" stop-color="#ffffff" stop-opacity="0.0"/>
    </linearGradient>
  </defs>
</svg>
