<?xml version="1.0" encoding="UTF-8" standalone="no"?>
<svg xmlns:xlink="http://www.w3.org/1999/xlink" height="9.05px" width="18.1px" xmlns="http://www.w3.org/2000/svg">
  <g transform="matrix(1.0, 0.0, 0.0, 1.0, 67.05, -43.1)">
    <path d="M-62.95 44.95 L-59.5 43.25 -59.85 43.1 -67.05 46.7 -66.7 46.85 -63.3 45.15 -61.0 46.3 -64.4 48.0 -64.1 48.15 -60.65 46.45 -58.35 47.6 -61.8 49.3 -61.45 49.5 -58.0 47.8 -55.7 48.9 -59.15 50.65 -58.8 50.8 -55.35 49.1 -53.05 50.25 -56.5 51.95 -56.15 52.15 -48.95 48.55 -49.3 48.35 -52.75 50.05 -55.05 48.9 -51.6 47.2 -51.95 47.05 -55.35 48.75 -57.65 47.6 -54.25 45.9 -54.6 45.7 -58.0 47.45 -60.3 46.3 -56.9 44.6 -57.25 44.4 -60.65 46.1 -62.95 44.95" fill="#ffffff" fill-rule="evenodd" stroke="none"/>
  </g>
</svg>
