<?xml version="1.0" encoding="UTF-8" standalone="no"?>
<svg xmlns:xlink="http://www.w3.org/1999/xlink" height="220.6px" width="123.1px" xmlns="http://www.w3.org/2000/svg">
  <g transform="matrix(1.0, 0.0, 0.0, 1.0, 52.0, 186.4)">
    <path d="M71.1 8.8 L20.3 34.2 -4.95 21.5 45.7 -3.9 71.1 8.8" fill="#663e3e" fill-opacity="0.3019608" fill-rule="evenodd" stroke="none"/>
    <path d="M-48.0 -94.0 L-47.95 -94.0 -48.0 -94.0" fill="#ffdf9e" fill-rule="evenodd" stroke="none"/>
    <path d="M48.0 -94.0 L47.95 -94.05 48.0 -94.0 M-48.0 -94.0 L-47.9 -94.05 -47.95 -94.0 -48.0 -94.0" fill="#756469" fill-rule="evenodd" stroke="none"/>
    <path d="M0.0 -186.4 L0.0 -70.0 -4.0 -72.0 -18.0 -79.0 -30.0 -85.0 -44.0 -92.0 -47.95 -94.0 -47.9 -94.05 0.0 -186.4" fill="#bd97a1" fill-rule="evenodd" stroke="none"/>
    <path d="M18.0 -109.0 L19.15 -108.45 18.0 -109.0 M47.95 -94.05 L48.0 -94.0 44.0 -92.0 30.0 -85.0 18.0 -79.0 4.0 -72.0 0.0 -70.0 0.0 -186.4 47.95 -94.05" fill="#5c4e58" fill-rule="evenodd" stroke="none"/>
    <path d="M44.0 -76.0 L48.0 -78.0 48.0 -80.05 52.0 -78.05 0.0 -52.05 0.0 -50.05 0.0 -47.05 50.0 -72.05 50.0 -73.05 52.0 -72.05 0.0 -46.05 0.0 -44.05 0.0 24.0 -4.0 22.0 -4.0 20.0 -16.0 14.0 -16.0 -52.05 -18.0 -53.05 -18.0 15.0 -30.0 9.0 -30.0 7.0 -42.0 1.0 -42.0 -65.05 -44.0 -66.05 -44.0 2.0 -48.0 0.0 -48.0 -68.05 -52.0 -70.05 -52.0 -72.0 -51.95 -72.0 -50.0 -73.0 -50.0 -75.0 -52.0 -76.0 -52.0 -78.0 -52.0 -78.05 -48.0 -80.05 -48.0 -94.0 -47.95 -94.0 -44.0 -92.0 -30.0 -85.0 -18.0 -79.0 -4.0 -72.0 0.0 -70.0 0.0 -54.0 4.0 -56.0 18.0 -63.0 30.0 -69.0 44.0 -76.0 M44.05 2.0 L42.05 1.0 42.0 -65.05 44.0 -66.05 44.05 2.0 M18.0 15.0 L16.0 14.0 16.0 -52.05 18.0 -53.05 18.0 15.0 M-48.0 -80.05 L-48.0 -78.0 -44.0 -76.0 -30.0 -69.0 -18.0 -63.0 -4.0 -56.0 0.0 -54.0 -4.0 -56.0 -18.0 -63.0 -30.0 -69.0 -44.0 -76.0 -48.0 -78.0 -48.0 -80.05 M-50.0 -73.0 L-50.0 -72.0 0.0 -47.05 -50.0 -72.0 -50.0 -73.0 M-51.95 -72.0 L0.0 -46.05 -51.95 -72.0 M-4.0 -56.0 L-4.0 -72.0 -4.0 -56.0 M-18.0 -63.0 L-18.0 -79.0 -18.0 -63.0 M-30.0 -69.0 L-30.0 -85.0 -30.0 -69.0 M-30.0 7.0 L-30.0 -59.05 -18.0 -53.05 -30.0 -59.05 -30.0 7.0 M-44.0 -76.0 L-44.0 -92.0 -44.0 -76.0 M-52.0 -78.0 L0.0 -52.05 -52.0 -78.0 M0.0 -50.05 L-50.0 -75.0 0.0 -50.05 M-4.0 -46.05 L0.0 -44.05 -4.0 -46.05 -4.0 20.0 -4.0 -46.05 -16.0 -52.05 -4.0 -46.05 M-42.0 -65.05 L-30.0 -59.05 -42.0 -65.05 M-48.0 -68.05 L-44.0 -66.05 -48.0 -68.05" fill="url(#gradient0)" fill-rule="evenodd" stroke="none"/>
    <path d="M0.0 -70.0 L4.0 -72.0 18.0 -79.0 30.0 -85.0 44.0 -92.0 48.0 -94.0 48.0 -80.05 48.0 -78.0 44.0 -76.0 44.0 -92.0 44.0 -76.0 30.0 -69.0 18.0 -63.0 4.0 -56.0 0.0 -54.0 0.0 -70.0 M52.0 -78.05 L52.0 -76.05 50.0 -75.05 50.0 -73.05 50.0 -72.05 0.0 -47.05 0.0 -50.05 0.0 -52.05 52.0 -78.05 M52.0 -72.05 L52.0 -70.05 48.0 -68.05 48.0 0.0 44.05 2.0 44.0 -66.05 42.0 -65.05 42.05 1.0 30.0 7.0 30.0 9.0 18.0 15.0 18.0 -53.05 16.0 -52.05 16.0 14.0 4.0 20.0 4.0 22.0 0.0 24.0 0.0 -44.05 0.0 -46.05 52.0 -72.05 M-16.0 14.0 L-17.95 15.0 -18.0 15.0 -18.0 -53.05 -16.0 -52.05 -16.0 14.0 M-42.0 1.0 L-44.0 2.0 -44.0 -66.05 -42.0 -65.05 -42.0 1.0 M50.0 -75.05 L0.0 -50.05 50.0 -75.05 M44.0 -66.05 L48.0 -68.05 44.0 -66.05 M4.0 -72.0 L4.0 -56.0 4.0 -72.0 M0.0 -44.05 L4.0 -46.05 4.0 20.0 4.0 -46.05 0.0 -44.05 M18.0 -53.05 L30.0 -59.05 30.0 7.0 30.0 -59.05 18.0 -53.05 M30.0 -85.0 L30.0 -69.0 30.0 -85.0 M18.0 -63.0 L18.0 -79.0 18.0 -63.0 M30.0 -59.05 L42.0 -65.05 30.0 -59.05 M4.0 -46.05 L16.0 -52.05 4.0 -46.05" fill="url(#gradient1)" fill-rule="evenodd" stroke="none"/>
    <path d="M0.0 -70.0 L4.0 -72.0 18.0 -79.0 30.0 -85.0 44.0 -92.0 48.0 -94.0 M44.0 -76.0 L48.0 -78.0 48.0 -80.05 48.0 -94.0 M52.0 -78.05 L52.0 -76.05 50.0 -75.05 50.0 -73.05 52.0 -72.05 52.0 -70.05 48.0 -68.05 48.0 0.0 M30.0 7.0 L30.0 9.0 M4.0 20.0 L4.0 22.0 M-4.0 22.0 L-4.0 20.0 -4.0 -46.05 -16.0 -52.05 -18.0 -53.05 -18.0 15.0 M-30.0 9.0 L-30.0 7.0 M-48.0 0.0 L-48.0 -68.05 -52.0 -70.05 -52.0 -72.0 -51.95 -72.0 -50.0 -73.0 -50.0 -75.0 -52.0 -76.0 -52.0 -78.0 -52.0 -78.05 -48.0 -80.05 -48.0 -94.0 M48.0 -80.05 L52.0 -78.05 0.0 -52.05 0.0 -50.05 50.0 -75.05 M44.0 -92.0 L44.0 -76.0 30.0 -69.0 18.0 -63.0 4.0 -56.0 0.0 -54.0 -4.0 -56.0 -18.0 -63.0 -30.0 -69.0 -44.0 -76.0 -48.0 -78.0 -48.0 -80.05 M48.0 -68.05 L44.0 -66.05 44.05 2.0 M44.0 -66.05 L42.0 -65.05 42.05 1.0 M50.0 -73.05 L50.0 -72.05 0.0 -47.05 -50.0 -72.0 -50.0 -73.0 M0.0 -70.0 L0.0 -54.0 M4.0 -56.0 L4.0 -72.0 M18.0 15.0 L18.0 -53.05 16.0 -52.05 16.0 14.0 M18.0 -79.0 L18.0 -63.0 M30.0 -69.0 L30.0 -85.0 M30.0 7.0 L30.0 -59.05 18.0 -53.05 M4.0 20.0 L4.0 -46.05 0.0 -44.05 0.0 24.0 M0.0 -44.05 L0.0 -46.05 -51.95 -72.0 -52.0 -72.0 M0.0 -50.05 L0.0 -47.05 M16.0 -52.05 L4.0 -46.05 M42.0 -65.05 L30.0 -59.05 M52.0 -72.05 L0.0 -46.05 M-4.0 -72.0 L-4.0 -56.0 M-16.0 14.0 L-16.0 -52.05 M-18.0 -53.05 L-30.0 -59.05 -30.0 7.0 M-30.0 -85.0 L-30.0 -69.0 M-18.0 -79.0 L-18.0 -63.0 M-44.0 -92.0 L-44.0 -76.0 M-42.0 1.0 L-42.0 -65.05 -44.0 -66.05 -44.0 2.0 M-44.0 -66.05 L-48.0 -68.05 M-30.0 -59.05 L-42.0 -65.05 M0.0 -44.05 L-4.0 -46.05 M-50.0 -75.0 L0.0 -50.05 M0.0 -52.05 L-52.0 -78.0" fill="none" stroke="#660000" stroke-linecap="round" stroke-linejoin="round" stroke-opacity="0.3019608" stroke-width="0.05"/>
    <path d="M48.0 0.0 L44.05 2.0 42.05 1.0 30.0 7.0 M30.0 9.0 L18.0 15.0 16.0 14.0 4.0 20.0 M4.0 22.0 L0.0 24.0 -4.0 22.0 M-4.0 20.0 L-16.0 14.0 -17.95 15.0 M-18.0 15.0 L-30.0 9.0 M-30.0 7.0 L-42.0 1.0 -44.0 2.0 -48.0 0.0" fill="none" stroke="#660000" stroke-linecap="round" stroke-linejoin="round" stroke-opacity="0.101960786" stroke-width="0.05"/>
    <path d="M-47.95 -94.0 L-48.0 -94.0" fill="none" stroke="#1d1442" stroke-linecap="round" stroke-linejoin="round" stroke-opacity="0.2509804" stroke-width="0.05"/>
    <path d="M47.95 -94.05 L48.0 -94.0 M47.95 -94.05 L0.0 -186.4 0.0 -70.0 M-47.9 -94.05 L0.0 -186.4 M-47.95 -94.0 L-47.9 -94.05" fill="none" stroke="#1d1442" stroke-linecap="round" stroke-linejoin="round" stroke-opacity="0.2509804" stroke-width="0.05"/>
    <path d="M48.0 -94.0 L47.95 -94.05 M-48.0 -94.0 L-47.9 -94.05 M-47.95 -94.0 L-44.0 -92.0 -30.0 -85.0 -18.0 -79.0 -4.0 -72.0 0.0 -70.0 M-48.0 -94.0 L-47.95 -94.0" fill="none" stroke="#660000" stroke-linecap="round" stroke-linejoin="round" stroke-opacity="0.3019608" stroke-width="0.05"/>
  </g>
  <defs>
    <linearGradient gradientTransform="matrix(0.0, 0.0435, -0.0281, 0.0, -172.6, 1.3)" gradientUnits="userSpaceOnUse" id="gradient0" spreadMethod="pad" x1="-819.2" x2="819.2">
      <stop offset="0.0" stop-color="#ffffff"/>
      <stop offset="1.0" stop-color="#f0dff0"/>
    </linearGradient>
    <linearGradient gradientTransform="matrix(0.0, 0.0435, -0.0281, 0.0, -172.6, 1.3)" gradientUnits="userSpaceOnUse" id="gradient1" spreadMethod="pad" x1="-819.2" x2="819.2">
      <stop offset="0.0" stop-color="#bc87bc"/>
      <stop offset="1.0" stop-color="#955977"/>
    </linearGradient>
  </defs>
</svg>
