<?xml version="1.0" encoding="UTF-8" standalone="no"?>
<svg xmlns:xlink="http://www.w3.org/1999/xlink" height="66.05px" width="131.9px" xmlns="http://www.w3.org/2000/svg">
  <g transform="matrix(1.0, 0.0, 0.0, 1.0, 11.9, -48.0)">
    <path d="M120.0 54.0 Q60.0 84.0 0.05 114.05 L0.0 114.05 -11.9 108.05 108.0 48.0 120.0 54.0" fill="#6e5e5b" fill-rule="evenodd" stroke="none"/>
    <path d="M92.4 61.8 L87.0 64.5 M103.2 56.4 L97.8 59.1 M114.0 51.0 L108.6 53.7 M27.6 94.2 L22.2 96.9 M38.4 88.8 L33.0 91.5 M49.2 83.4 L43.8 86.1 M60.0 78.0 L54.6 80.7 M70.8 72.6 L65.4 75.3 M6.0 105.0 L0.7 107.7 M16.8 99.6 L11.4 102.3 M81.6 67.2 L76.2 69.9 M-4.7 110.5 L-5.9 111.1" fill="none" stroke="#ffffff" stroke-linecap="round" stroke-linejoin="round" stroke-width="1.0"/>
  </g>
</svg>
