<?xml version="1.0" encoding="UTF-8" standalone="no"?>
<svg xmlns:xlink="http://www.w3.org/1999/xlink" height="2.65px" width="1.7px" xmlns="http://www.w3.org/2000/svg">
  <g transform="matrix(1.0, 0.0, 0.0, 1.0, 0.85, 2.65)">
    <path d="M0.45 -0.65 L-0.4 -1.05 -0.4 -1.95 0.45 -1.55 0.45 -0.65" fill="#ffffff" fill-rule="evenodd" stroke="none"/>
    <path d="M0.45 -0.65 L0.45 -1.55 -0.4 -1.95 -0.4 -1.05 0.45 -0.65 M0.85 0.0 L-0.85 -0.85 -0.85 -2.65 0.85 -1.8 0.85 0.0" fill="#3c3c3c" fill-rule="evenodd" stroke="none"/>
  </g>
</svg>
