<?xml version="1.0" encoding="UTF-8" standalone="no"?>
<svg xmlns:xlink="http://www.w3.org/1999/xlink" height="303.8px" width="63.75px" xmlns="http://www.w3.org/2000/svg">
  <g transform="matrix(1.0, 0.0, 0.0, 1.0, 31.9, 151.9)">
    <path d="M31.6 -117.1 L-27.95 -146.9 -27.95 -151.9 31.6 -122.1 31.6 -117.1 M31.65 -97.1 L31.65 -92.15 31.6 -92.1 -27.95 -121.9 -27.95 -126.9 31.6 -97.1 31.65 -97.1 M-27.95 -21.9 L31.6 7.9 31.85 7.9 31.85 12.75 31.6 12.9 -27.95 -16.9 -27.95 -21.9 M-14.85 116.7 L31.55 139.9 31.55 151.9 -31.9 120.15 -31.9 108.15 -16.4 115.9 -14.85 116.7" fill="url(#gradient0)" fill-rule="evenodd" stroke="none"/>
  </g>
  <defs>
    <linearGradient gradientTransform="matrix(0.0, 0.1648, -0.0364, 0.0, -0.2, 0.4)" gradientUnits="userSpaceOnUse" id="gradient0" spreadMethod="pad" x1="-819.2" x2="819.2">
      <stop offset="0.0" stop-color="#ffffff"/>
      <stop offset="1.0" stop-color="#ffffff" stop-opacity="0.0"/>
    </linearGradient>
  </defs>
</svg>
