<?xml version="1.0" encoding="UTF-8" standalone="no"?>
<svg xmlns:xlink="http://www.w3.org/1999/xlink" height="29.9px" width="46.65px" xmlns="http://www.w3.org/2000/svg">
  <g transform="matrix(1.0, 0.0, 0.0, 1.0, 24.5, 43.15)">
    <path d="M-24.5 -43.15 L-24.5 -30.15 -1.2 -31.45 -1.2 -18.45 -1.2 -13.25 M-24.5 -30.15 L-24.5 -24.95 M-1.2 -18.45 L-24.5 -30.15" fill="none" stroke="#999999" stroke-linecap="round" stroke-linejoin="round" stroke-width="0.05"/>
    <path d="M22.15 -37.5 L22.15 -25.0" fill="none" stroke="#6f6f6f" stroke-linecap="round" stroke-linejoin="round" stroke-width="0.05"/>
  </g>
</svg>
