<?xml version="1.0" encoding="UTF-8" standalone="no"?>
<svg xmlns:xlink="http://www.w3.org/1999/xlink" height="200.9px" width="55.0px" xmlns="http://www.w3.org/2000/svg">
  <g transform="matrix(1.0, 0.0, 0.0, 1.0, 27.5, 100.45)">
    <path d="M0.0 -12.45 L0.0 -0.4 0.0 5.55 0.0 5.7 -0.4 5.5 -27.5 4.2 0.0 17.95 0.0 25.55 0.0 33.55 M-0.05 -32.45 L-0.05 -24.45 -0.05 -24.4 0.0 -24.4 0.0 -16.4 0.0 -12.45 M0.0 5.7 L0.0 17.95 M0.0 -79.35 L-0.05 -52.45 -27.5 -66.15 -27.5 -100.45 M-27.5 -66.15 L-27.5 -58.15 -0.05 -44.45 -0.05 -52.45 M-0.05 -44.45 L-0.05 -32.45 M-27.5 -30.15 L-13.75 -27.25 -27.5 -38.15 -27.5 -30.15 0.0 -16.4 -13.75 -27.25 0.0 -24.4 M0.0 -0.4 L-27.5 -14.15 -27.5 -8.05 -0.4 5.5 0.0 5.55 M-27.5 -30.15 L-27.5 -14.15 M-27.5 -30.15 L0.0 -0.4 M-0.05 -44.45 L-27.5 -38.15 -0.05 -24.45 M-27.5 -58.15 L-27.5 -38.15 M-27.5 4.2 L-13.75 20.25 0.0 17.95 M-27.5 4.2 L-27.5 22.5 -13.75 20.25 0.0 36.25 0.0 33.55 M-27.5 40.85 L0.0 54.6 0.0 53.55 0.0 42.4 -27.45 28.7 -27.5 28.65 -27.5 40.85 0.0 72.95 0.0 69.55 0.0 54.6 M0.0 36.25 L0.0 42.4 M-27.5 22.5 L-27.5 28.65 M-27.45 28.7 L0.0 36.25 -27.5 22.5 M-27.5 65.3 L0.0 79.05 0.0 72.95 -27.5 59.2 -27.5 65.3 -13.75 79.8 0.0 79.05 M0.0 100.45 L0.0 94.3 -27.5 80.55 -27.5 86.7 M-13.75 79.8 L0.0 94.3 0.0 85.55 0.0 79.05 M-27.5 65.3 L-27.5 80.55 -13.75 79.8 M-27.5 40.85 L-27.5 59.2 M-27.5 -8.05 L-27.5 4.2" fill="none" stroke="#999999" stroke-linecap="round" stroke-linejoin="round" stroke-width="0.05"/>
    <path d="M27.5 -95.35 L27.5 -66.15 27.5 -66.1 27.5 -46.15 27.5 -38.15 27.5 -26.15 27.5 -8.15 27.5 -8.1 27.5 11.85 27.5 11.9 27.5 19.85 27.5 19.9 27.5 39.85 27.5 55.85 27.5 55.9 27.5 71.85 27.5 86.65 M27.5 -46.15 L27.45 -46.15 27.5 -46.15 M27.5 -26.15 L27.45 -26.15 0.0 -12.45 M0.0 5.55 L27.5 -8.15 M0.0 -24.4 L27.45 -26.15 27.5 -26.15 M27.5 -66.1 L13.75 -49.3 27.45 -46.15 0.0 -32.45 -0.05 -32.45 M0.0 -24.4 L27.5 -38.15 M27.5 11.85 L27.4 11.9 27.45 11.9 27.5 11.9 M27.45 11.9 L27.5 11.9 M0.0 25.55 L0.05 25.55 13.7 8.8 0.0 5.7 M0.0 33.55 L0.05 33.55 27.45 11.9 M27.4 11.9 L0.05 25.55 M27.5 -8.1 L13.7 8.8 27.4 11.9 M27.5 19.85 L0.05 33.55 M27.5 55.85 L27.45 55.85 27.5 55.85 M27.5 71.85 L27.45 71.85 27.5 71.85 M27.45 55.85 L0.0 69.55 13.75 70.7 27.5 55.9 M0.0 85.55 L0.05 85.55 13.75 70.7 27.45 71.85 0.05 85.55 M27.5 39.85 L0.05 53.55 27.45 55.85 M0.0 53.55 L0.05 53.55 27.5 19.9 M-0.05 -52.45 L27.5 -66.15 M0.0 -24.4 L-0.05 -24.4 M0.0 -32.45 L13.75 -49.3 -0.05 -52.45" fill="none" stroke="#6f6f6f" stroke-linecap="round" stroke-linejoin="round" stroke-width="0.05"/>
    <path d="M-27.5 -8.05 Q-26.0 -10.5 -27.5 -14.15 -13.45 -5.25 0.0 -0.4 -1.3 1.95 0.0 5.55 L-0.4 5.5 Q-12.4 -2.45 -27.5 -8.05 M-27.5 -66.1 Q-13.5 -56.45 -0.05 -52.4 -0.9 -48.75 -0.05 -44.4 -13.15 -53.25 -27.5 -58.1 -25.8 -61.15 -27.5 -66.1 M-27.5 28.7 L-27.45 28.7 Q-14.85 37.35 0.0 42.4 -2.05 48.5 0.0 54.6 -13.3 45.3 -27.5 40.85 -25.25 35.4 -27.5 28.7 M-27.5 65.3 Q-25.7 63.35 -27.5 59.2 -13.75 68.1 0.0 72.95 -2.2 75.0 0.0 79.05 -13.0 69.8 -27.5 65.3" fill="#e66f3c" fill-opacity="0.8" fill-rule="evenodd" stroke="none"/>
    <path d="M27.5 -38.15 Q13.8 -32.8 0.0 -24.4 L-0.05 -24.45 Q1.2 -28.65 -0.05 -32.45 13.9 -36.9 27.5 -46.15 26.4 -41.7 27.5 -38.15 M27.5 19.85 Q14.0 24.65 0.0 33.55 1.75 29.15 0.0 25.55 13.9 20.85 27.5 11.85 25.5 16.65 27.5 19.85 M0.0 85.55 Q2.65 76.55 0.0 69.55 14.05 64.8 27.5 55.85 25.65 64.35 27.5 71.85 13.95 76.85 0.0 85.55" fill="#b8562f" fill-opacity="0.8" fill-rule="evenodd" stroke="none"/>
  </g>
</svg>
