<?xml version="1.0" encoding="UTF-8" standalone="no"?>
<svg xmlns:xlink="http://www.w3.org/1999/xlink" height="25.85px" width="19.2px" xmlns="http://www.w3.org/2000/svg">
  <g transform="matrix(1.0, 0.0, 0.0, 1.0, 10.0, 12.95)">
    <path d="M-0.55 -12.15 L1.05 -12.95 2.65 -12.15 1.05 -11.35 -0.55 -12.15 M2.65 -0.3 L5.55 1.15 -1.4 4.6 Q-3.9 3.4 -6.35 2.15 L-4.0 0.95 -4.0 2.3 -2.0 3.3 0.05 2.3 0.05 1.15 1.05 1.65 2.65 0.85 2.65 -0.3 M5.55 2.55 L9.2 4.3 -2.0 9.9 -10.0 5.9 -6.35 4.1 -6.35 5.65 Q-3.9 6.9 -1.4 8.1 L5.55 4.65 5.55 2.55 M-4.0 -0.2 L-2.0 -1.2 -0.55 -0.5 0.05 -0.2 -2.0 0.8 -4.0 -0.2" fill="#f7f4ee" fill-rule="evenodd" stroke="none"/>
    <path d="M-2.0 12.9 L-10.0 8.9 -10.0 5.9 -2.0 9.9 -2.0 12.9 M-6.35 4.1 L-6.35 2.15 Q-3.9 3.4 -1.4 4.6 L-1.4 8.1 Q-3.9 6.9 -6.35 5.65 L-6.35 4.1 M-4.0 0.95 L-4.0 -0.2 -2.0 0.8 -2.0 3.3 -4.0 2.3 -4.0 0.95 M-0.55 -0.5 L-0.55 -12.15 1.05 -11.35 1.05 1.65 0.05 1.15 0.05 -0.2 -0.55 -0.5" fill="#faf9f3" fill-rule="evenodd" stroke="none"/>
    <path d="M2.65 -12.15 L2.65 -0.3 2.65 0.85 1.05 1.65 1.05 -11.35 2.65 -12.15 M5.55 1.15 L5.55 2.55 5.55 4.65 -1.4 8.1 -1.4 4.6 5.55 1.15 M9.2 4.3 L9.2 7.3 -2.0 12.9 -2.0 9.9 9.2 4.3 M0.05 1.15 L0.05 2.3 -2.0 3.3 -2.0 0.8 0.05 -0.2 0.05 1.15" fill="#97bcbc" fill-rule="evenodd" stroke="none"/>
    <path d="M-0.55 -12.15 L1.05 -12.95 2.65 -12.15 2.65 -0.3 5.55 1.15 5.55 2.55 9.2 4.3 9.2 7.3 M-10.0 8.9 L-10.0 5.9 -6.35 4.1 -6.35 2.15 -4.0 0.95 -4.0 -0.2 -2.0 -1.2 -0.55 -0.5 -0.55 -12.15 1.05 -11.35 2.65 -12.15 M-4.0 2.3 L-4.0 0.95 M5.55 2.55 L5.55 4.65 M-6.35 5.65 L-6.35 4.1 M2.65 0.85 L2.65 -0.3 M0.05 -0.2 L0.05 1.15 M1.05 -11.35 L1.05 1.65 M-6.35 2.15 Q-3.9 3.4 -1.4 4.6 L5.55 1.15 M-2.0 3.3 L-2.0 0.8 -4.0 -0.2 M-10.0 5.9 L-2.0 9.9 9.2 4.3 M-1.4 8.1 L-1.4 4.6 M-2.0 12.9 L-2.0 9.9 M0.05 -0.2 L-2.0 0.8 M-0.55 -0.5 L0.05 -0.2" fill="none" stroke="#660000" stroke-linecap="round" stroke-linejoin="miter" stroke-miterlimit="3.0" stroke-opacity="0.3019608" stroke-width="0.05"/>
    <path d="M9.2 7.3 L-2.0 12.9 -10.0 8.9 M1.05 1.65 L0.05 1.15 M0.05 2.3 L-2.0 3.3 -4.0 2.3 M5.55 4.65 L-1.4 8.1 Q-3.9 6.9 -6.35 5.65 M1.05 1.65 L2.65 0.85" fill="none" stroke="#660000" stroke-linecap="round" stroke-linejoin="miter" stroke-miterlimit="3.0" stroke-opacity="0.101960786" stroke-width="0.05"/>
  </g>
</svg>
