<?xml version="1.0" encoding="UTF-8" standalone="no"?>
<svg xmlns:xlink="http://www.w3.org/1999/xlink" height="182.5px" width="81.2px" xmlns="http://www.w3.org/2000/svg">
  <g transform="matrix(1.0, 0.0, 0.0, 1.0, 0.0, 182.3)">
    <path d="M0.0 -182.3 L0.0 0.2 81.2 0.2 81.2 -182.3 0.0 -182.3" fill="#a90101" fill-rule="evenodd" stroke="none">
      <animate attributeName="fill" dur="2s" repeatCount="indefinite" values="#a90101;#6f0001"/>
      <animate attributeName="fill-opacity" dur="2s" repeatCount="indefinite" values="1.0;1.0"/>
      <animate attributeName="d" dur="2s" repeatCount="indefinite" values="M0.0 -182.3 L0.0 0.2 81.2 0.2 81.2 -182.3 0.0 -182.3;M0.0 -182.3 L0.0 0.2 81.2 0.2 81.2 -182.3 0.0 -182.3"/>
    </path>
    <path d="M0.0 -182.3 L81.2 -182.3 81.2 0.2 0.0 0.2 0.0 -182.3" fill="none" stroke="#000000" stroke-linecap="round" stroke-linejoin="round" stroke-opacity="0.0" stroke-width="1.0">
      <animate attributeName="stroke" dur="2s" repeatCount="indefinite" values="#000000;#000001"/>
      <animate attributeName="stroke-width" dur="2s" repeatCount="indefinite" values="0.0;0.0"/>
      <animate attributeName="fill-opacity" dur="2s" repeatCount="indefinite" values="0.0;0.0"/>
      <animate attributeName="d" dur="2s" repeatCount="indefinite" values="M0.0 -182.3 L81.2 -182.3 81.2 0.2 0.0 0.2 0.0 -182.3;M0.0 -182.3 L81.2 -182.3 81.2 0.2 0.0 0.2 0.0 -182.3"/>
    </path>
  </g>
</svg>
