<?xml version="1.0" encoding="UTF-8" standalone="no"?>
<svg xmlns:xlink="http://www.w3.org/1999/xlink" height="7.0px" width="3.05px" xmlns="http://www.w3.org/2000/svg">
  <g transform="matrix(1.0, 0.0, 0.0, 1.0, 1.55, 3.5)">
    <path d="M0.15 3.5 L1.1 2.95 1.5 2.55 M-1.55 -2.75 L-1.55 -1.6 -1.55 -1.25 M-0.25 -3.5 Q-0.65 -2.95 -0.6 -2.0 M0.15 2.0 L1.1 2.0" fill="none" stroke="#999999" stroke-linecap="round" stroke-linejoin="round" stroke-width="0.05"/>
  </g>
</svg>
