<?xml version="1.0" encoding="UTF-8" standalone="no"?>
<svg xmlns:xlink="http://www.w3.org/1999/xlink" height="25.35px" width="20.55px" xmlns="http://www.w3.org/2000/svg">
  <g transform="matrix(1.0, 0.0, 0.0, 1.0, 10.25, 12.7)">
    <path d="M5.3 -9.75 L5.55 -8.45 Q5.5 -6.9 4.55 -5.75 L4.25 -5.4 Q3.0 -4.15 1.25 -4.15 -0.5 -4.15 -1.75 -5.4 L-2.1 -5.75 Q-3.0 -6.9 -3.0 -8.45 L-2.8 -9.75 Q-2.45 -9.25 -1.25 -9.15 -0.05 -9.05 1.65 -10.15 3.1 -9.05 4.2 -9.15 5.2 -9.25 5.3 -9.75 M0.05 -8.35 L-0.3 -8.65 -0.7 -8.35 -0.85 -7.7 -0.7 -7.05 -0.3 -6.75 0.05 -7.05 0.25 -7.7 0.05 -8.35 M3.05 -8.35 L2.65 -8.65 2.3 -8.35 2.1 -7.7 2.3 -7.05 2.65 -6.75 3.05 -7.05 3.2 -7.7 3.05 -8.35" fill="#fdb393" fill-rule="evenodd" stroke="none"/>
    <path d="M3.05 -8.35 L3.2 -7.7 3.05 -7.05 2.65 -6.75 2.3 -7.05 2.1 -7.7 2.3 -8.35 2.65 -8.65 3.05 -8.35 M0.05 -8.35 L0.25 -7.7 0.05 -7.05 -0.3 -6.75 -0.7 -7.05 -0.85 -7.7 -0.7 -8.35 -0.3 -8.65 0.05 -8.35" fill="#735743" fill-rule="evenodd" stroke="none"/>
    <path d="M4.55 -5.75 L4.7 -5.65 Q6.75 -4.65 6.75 -2.05 L6.75 4.0 -4.3 4.0 -4.3 -2.05 Q-4.35 -4.65 -2.25 -5.65 L-2.1 -5.75 -1.75 -5.4 Q-0.5 -4.15 1.25 -4.15 3.0 -4.15 4.25 -5.4 L4.55 -5.75" fill="#9f5524" fill-rule="evenodd" stroke="none"/>
    <path d="M-2.8 -9.75 L-1.75 -11.45 Q-0.5 -12.7 1.25 -12.7 3.0 -12.7 4.25 -11.45 L5.3 -9.75 Q5.2 -9.25 4.2 -9.15 3.1 -9.05 1.65 -10.15 -0.05 -9.05 -1.25 -9.15 -2.45 -9.25 -2.8 -9.75" fill="#e2d216" fill-rule="evenodd" stroke="none"/>
    <path d="M-0.45 -2.0 L-0.4 -1.4 -0.5 -0.55 -0.45 -2.0 M-8.05 1.3 L-8.15 1.1 -8.15 -1.2 -6.9 -1.6 Q-6.0 -1.95 -4.3 -3.1 -2.85 -1.55 -2.25 -1.65 L-1.6 -1.55 -1.6 1.55 -1.7 1.65 -1.9 1.85 Q-3.1 2.9 -4.7 2.9 -6.3 2.9 -7.45 1.85 L-7.7 1.65 -8.05 1.3 M-3.65 -1.3 L-3.85 -0.65 Q-3.85 -0.25 -3.65 0.0 L-3.3 0.3 -2.9 0.0 Q-2.75 -0.25 -2.75 -0.65 -2.75 -1.05 -2.9 -1.3 L-3.3 -1.6 -3.65 -1.3 M-6.8 -0.65 L-6.65 0.0 -6.25 0.3 -5.9 0.0 -5.7 -0.65 -5.9 -1.3 -6.25 -1.6 -6.65 -1.3 -6.8 -0.65" fill="#fdb393" fill-rule="evenodd" stroke="none"/>
    <path d="M-6.8 -0.65 L-6.65 -1.3 -6.25 -1.6 -5.9 -1.3 -5.7 -0.65 -5.9 0.0 -6.25 0.3 -6.65 0.0 -6.8 -0.65 M-3.65 -1.3 L-3.3 -1.6 -2.9 -1.3 Q-2.75 -1.05 -2.75 -0.65 -2.75 -0.25 -2.9 0.0 L-3.3 0.3 -3.65 0.0 Q-3.85 -0.25 -3.85 -0.65 L-3.65 -1.3" fill="#735743" fill-rule="evenodd" stroke="none"/>
    <path d="M-0.5 -0.55 L-0.5 1.85 -1.25 1.4 -1.4 1.3 -1.6 1.55 -1.6 -1.55 -2.25 -1.65 Q-2.85 -1.55 -4.3 -3.1 -6.0 -1.95 -6.9 -1.6 L-8.15 -1.2 -8.15 1.1 -8.05 1.3 -8.2 1.4 -8.7 1.65 -8.95 1.85 -8.95 -1.3 -8.95 -1.4 -8.95 -1.55 -8.75 -2.7 -8.15 -3.9 -7.7 -4.4 Q-6.45 -5.65 -4.7 -5.65 -2.95 -5.65 -1.7 -4.4 -0.95 -3.65 -0.65 -2.7 L-0.45 -2.0 -0.5 -0.55" fill="#de8b01" fill-rule="evenodd" stroke="none"/>
    <path d="M-0.5 1.85 L-0.4 1.95 -0.95 1.6 -1.25 2.8 Q-2.05 5.15 -4.5 5.65 -5.9 5.95 -7.15 4.95 -8.15 4.25 -8.5 3.2 L-8.7 1.65 -8.2 1.4 -8.05 2.85 Q-7.75 3.75 -6.85 4.4 -5.7 5.3 -4.45 5.0 -2.2 4.6 -1.5 2.45 L-1.25 1.4 -0.5 1.85" fill="#4062ae" fill-rule="evenodd" stroke="none"/>
    <path d="M-0.4 1.95 Q0.8 3.0 0.8 5.0 L0.8 11.05 -10.25 11.05 -10.25 5.0 Q-10.3 2.9 -8.95 1.85 L-8.7 1.65 -8.5 3.2 Q-8.15 4.25 -7.15 4.95 -5.9 5.95 -4.5 5.65 -2.05 5.15 -1.25 2.8 L-0.95 1.6 -0.4 1.95" fill="#708bcb" fill-rule="evenodd" stroke="none"/>
    <path d="M-1.6 1.55 L-1.4 1.3 -1.25 1.4 -1.5 2.45 Q-2.2 4.6 -4.45 5.0 -5.7 5.3 -6.85 4.4 -7.75 3.75 -8.05 2.85 L-8.2 1.4 -8.05 1.3 -7.7 1.65 -7.45 1.85 Q-6.3 2.9 -4.7 2.9 -3.1 2.9 -1.9 1.85 L-1.7 1.65 -1.6 1.55" fill="#c0cde9" fill-rule="evenodd" stroke="none"/>
    <path d="M1.45 2.9 L1.8 3.25 Q3.05 4.5 4.8 4.5 6.55 4.5 7.8 3.25 L8.1 2.9 8.25 3.0 8.25 3.1 Q8.25 4.05 7.25 4.75 6.35 5.35 5.2 5.45 L3.95 5.45 3.95 5.4 3.9 5.35 2.3 4.75 Q1.3 4.05 1.3 3.1 L1.3 3.0 1.45 2.9" fill="#258e0b" fill-rule="evenodd" stroke="none"/>
    <path d="M0.75 -1.1 Q1.1 -0.6 2.3 -0.5 3.5 -0.4 5.2 -1.5 6.65 -0.4 7.75 -0.5 8.75 -0.6 8.85 -1.1 L9.1 0.2 Q9.05 1.75 8.1 2.9 L7.8 3.25 Q6.55 4.5 4.8 4.5 3.05 4.5 1.8 3.25 L1.45 2.9 Q0.55 1.75 0.55 0.2 L0.75 -1.1 M6.6 0.3 Q6.4 0.0 6.2 0.0 L5.85 0.3 5.65 0.95 5.85 1.6 6.2 1.9 6.6 1.6 6.75 0.95 6.6 0.3 M3.25 0.0 L2.85 0.3 Q2.7 0.55 2.7 0.95 L2.85 1.6 3.25 1.9 3.6 1.6 3.8 0.95 3.6 0.3 3.25 0.0" fill="#fdb393" fill-rule="evenodd" stroke="none"/>
    <path d="M8.25 3.0 Q10.3 4.0 10.3 6.6 L10.3 12.65 -0.75 12.65 -0.75 6.6 Q-0.8 4.0 1.3 3.0 L1.3 3.1 Q1.3 4.05 2.3 4.75 L3.9 5.35 3.95 5.4 3.95 5.45 5.2 5.45 Q6.35 5.35 7.25 4.75 8.25 4.05 8.25 3.1 L8.25 3.0" fill="#2ca70c" fill-rule="evenodd" stroke="none"/>
    <path d="M3.25 0.0 L3.6 0.3 3.8 0.95 3.6 1.6 3.25 1.9 2.85 1.6 2.7 0.95 Q2.7 0.55 2.85 0.3 L3.25 0.0 M6.6 0.3 L6.75 0.95 6.6 1.6 6.2 1.9 5.85 1.6 5.65 0.95 5.85 0.3 6.2 0.0 Q6.4 0.0 6.6 0.3" fill="#735743" fill-rule="evenodd" stroke="none"/>
    <path d="M8.85 -1.1 Q8.75 -0.6 7.75 -0.5 6.65 -0.4 5.2 -1.5 3.5 -0.4 2.3 -0.5 1.1 -0.6 0.75 -1.1 1.05 -2.05 1.8 -2.8 3.05 -4.05 4.8 -4.05 6.55 -4.05 7.8 -2.8 L8.85 -1.1" fill="url(#gradient0)" fill-rule="evenodd" stroke="none"/>
  </g>
  <defs>
    <linearGradient gradientTransform="matrix(0.0049, 0.0, 0.0, 0.0024, 4.8, -2.05)" gradientUnits="userSpaceOnUse" id="gradient0" spreadMethod="pad" x1="-819.2" x2="819.2">
      <stop offset="0.0" stop-color="#6a6a6a"/>
      <stop offset="1.0" stop-color="#813c0a"/>
    </linearGradient>
  </defs>
</svg>
