<?xml version="1.0" encoding="UTF-8" standalone="no"?>
<svg xmlns:xlink="http://www.w3.org/1999/xlink" height="22.05px" width="24.65px" xmlns="http://www.w3.org/2000/svg">
  <g transform="matrix(1.0, 0.0, 0.0, 1.0, 8.4, 10.9)">
    <path d="M6.4 3.25 L-8.4 -4.1 -8.4 -4.4 -8.1 -4.25 6.4 2.95 6.4 3.25 M-8.1 -5.4 L-8.4 -5.55 -8.4 -5.95 1.5 -10.9 16.25 -3.5 6.4 1.45 6.4 1.8 -8.1 -5.4 M-8.4 -5.95 L6.4 1.45 -8.4 -5.95" fill="#f2ecea" fill-rule="evenodd" stroke="none"/>
    <path d="M15.95 -1.8 L16.25 -1.95 16.25 -1.65 6.4 3.25 6.4 2.95 15.95 -1.8 M16.25 -3.5 L16.25 -3.15 15.95 -3.0 6.4 1.8 6.4 1.45 16.25 -3.5" fill="#b8a0b1" fill-rule="evenodd" stroke="none"/>
    <path d="M15.95 -3.0 L15.95 -1.8 6.4 2.95 6.4 1.8 15.95 -3.0" fill="#8c415e" fill-rule="evenodd" stroke="none"/>
    <path d="M-8.1 -4.25 L-8.1 -5.4 6.4 1.8 6.4 2.95 -8.1 -4.25" fill="#cc0000" fill-rule="evenodd" stroke="none"/>
    <path d="M15.95 -3.0 L15.95 -1.8 16.25 -1.95 16.25 -1.65 6.4 3.25 -8.4 -4.1 -8.4 -4.4 -8.1 -4.25 -8.1 -5.4 -8.4 -5.55 -8.4 -5.95 1.5 -10.9 16.25 -3.5 16.25 -3.15 15.95 -3.0 6.4 1.8 6.4 2.95 15.95 -1.8 M6.4 2.95 L-8.1 -4.25 M6.4 2.95 L6.4 3.25 M16.25 -3.5 L6.4 1.45 6.4 1.8 -8.1 -5.4 M6.4 1.45 L-8.4 -5.95" fill="none" stroke="#660000" stroke-linecap="round" stroke-linejoin="round" stroke-opacity="0.3019608" stroke-width="0.05"/>
    <path d="M-4.0 9.8 L-2.4 9.0 0.2 10.35 -1.4 11.15 -4.0 9.8 M-3.2 8.8 L-4.75 9.6 -7.4 8.25 -5.8 7.45 -3.2 8.8" fill="#663e3e" fill-opacity="0.3019608" fill-rule="evenodd" stroke="none"/>
  </g>
</svg>
