<?xml version="1.0" encoding="UTF-8" standalone="no"?>
<svg xmlns:xlink="http://www.w3.org/1999/xlink" height="9.05px" width="18.1px" xmlns="http://www.w3.org/2000/svg">
  <g transform="matrix(1.0, 0.0, 0.0, 1.0, 45.55, -67.6)">
    <path d="M-41.45 69.45 L-38.0 67.75 -38.35 67.6 -45.55 71.2 -45.2 71.35 -41.8 69.65 -39.5 70.8 -42.9 72.5 -42.6 72.65 -39.15 70.95 -36.85 72.1 -40.3 73.8 -39.95 74.0 -36.5 72.3 -34.2 73.4 -37.65 75.15 -37.3 75.3 -33.85 73.6 -31.55 74.75 -35.0 76.45 -34.65 76.65 -27.45 73.05 -27.8 72.85 -31.25 74.55 -33.55 73.4 -30.1 71.7 -30.45 71.55 -33.85 73.25 -36.15 72.1 -32.75 70.4 -33.1 70.2 -36.5 71.95 -38.8 70.8 -35.4 69.1 -35.75 68.9 -39.15 70.6 -41.45 69.45" fill="#ffffff" fill-rule="evenodd" stroke="none"/>
  </g>
</svg>
