<?xml version="1.0" encoding="UTF-8" standalone="no"?>
<svg xmlns:xlink="http://www.w3.org/1999/xlink" height="15.0px" width="4.0px" xmlns="http://www.w3.org/2000/svg">
  <g transform="matrix(1.0, 0.0, 0.0, 1.0, 2.0, 9.25)">
    <path d="M0.9 -7.35 L1.05 -5.6 1.0 -5.05 0.95 -5.0 Q0.75 -5.4 0.75 -6.5 0.75 -7.15 0.9 -7.35 M-2.0 -8.25 L0.0 -9.25 2.0 -8.25 0.0 -7.25 -2.0 -8.25 0.0 -7.25 0.0 5.75 -2.0 4.75 -2.0 -8.25 M1.15 -1.35 L1.05 -0.4 1.0 -0.35 0.85 -0.35 0.85 -0.65 1.05 -1.6 1.15 -1.35 M-0.4 -0.3 L-0.45 -0.45 -0.65 -0.45 -1.05 3.35 -0.9 3.9 -0.85 3.9 Q-0.45 2.2 -0.45 0.85 L-0.4 -0.3 M-1.15 -3.05 L-1.1 -3.5 -1.2 -3.5 Q-1.6 -2.2 -1.6 -0.3 L-1.45 1.2 -1.35 1.15 -1.15 -3.05 M-0.6 -2.55 L-0.3 -5.65 -0.4 -6.65 -0.9 -2.7 -0.85 -2.5 -0.6 -2.55" fill="#cccccc" fill-rule="evenodd" stroke="none"/>
    <path d="M0.9 -7.35 Q0.75 -7.15 0.75 -6.5 0.75 -5.4 0.95 -5.0 L1.0 -5.05 1.05 -5.6 0.9 -7.35 M0.0 -7.25 L2.0 -8.25 2.0 4.75 0.0 5.75 0.0 -7.25 M1.15 -1.35 L1.05 -1.6 0.85 -0.65 0.85 -0.35 1.0 -0.35 1.05 -0.4 1.15 -1.35 M-0.6 -2.55 L-0.85 -2.5 -0.9 -2.7 -0.4 -6.65 -0.3 -5.65 -0.6 -2.55 M-1.15 -3.05 L-1.35 1.15 -1.45 1.2 -1.6 -0.3 Q-1.6 -2.2 -1.2 -3.5 L-1.1 -3.5 -1.15 -3.05 M-0.4 -0.3 L-0.45 0.85 Q-0.45 2.2 -0.85 3.9 L-0.9 3.9 -1.05 3.35 -0.65 -0.45 -0.45 -0.45 -0.4 -0.3" fill="#8c8c8c" fill-rule="evenodd" stroke="none"/>
    <path d="M2.0 -8.25 L0.0 -9.25 -2.0 -8.25 0.0 -7.25 2.0 -8.25 2.0 4.75 0.0 5.75 -2.0 4.75 -2.0 -8.25 M0.0 5.75 L0.0 -7.25" fill="none" stroke="#660000" stroke-linecap="round" stroke-linejoin="round" stroke-opacity="0.3019608" stroke-width="0.05"/>
  </g>
</svg>
