<?xml version="1.0" encoding="UTF-8" standalone="no"?>
<svg xmlns:xlink="http://www.w3.org/1999/xlink" height="77.95px" width="88.85px" xmlns="http://www.w3.org/2000/svg">
  <g transform="matrix(1.0, 0.0, 0.0, 1.0, 44.4, 38.95)">
    <path d="M25.55 -34.6 L28.65 -34.6 44.45 -8.0 32.65 4.15 24.75 4.15 26.55 10.85 7.2 12.4 4.35 17.75 16.2 34.1 6.15 39.0 -21.0 28.5 -21.0 34.1 -37.65 33.0 -44.4 27.35 -35.8 10.15 -41.45 4.05 -38.25 -5.4 -16.6 -9.8 -1.25 -38.4 3.8 -38.95 5.6 -36.4 12.1 -37.1 15.6 -26.6 22.4 -27.2 25.55 -34.6" fill="#bcd7fe" fill-rule="evenodd" stroke="none"/>
    <path d="M25.55 -34.6 L28.65 -34.6 44.45 -8.0 32.65 4.15 24.75 4.15 26.55 10.85 7.2 12.4 4.35 17.75 16.2 34.1 6.15 39.0 -21.0 28.5 -21.0 34.1 -37.65 33.0 -44.4 27.35 -35.8 10.15 -41.45 4.05 -38.25 -5.4 -16.6 -9.8 -1.25 -38.4 3.8 -38.95 5.6 -36.4 12.1 -37.1 15.6 -26.6 22.4 -27.2 25.55 -34.6 Z" fill="none" stroke="#ffffff" stroke-linecap="round" stroke-linejoin="round" stroke-width="0.05"/>
  </g>
</svg>
