<?xml version="1.0" encoding="UTF-8" standalone="no"?>
<svg xmlns:xlink="http://www.w3.org/1999/xlink" height="20.0px" width="40.0px" xmlns="http://www.w3.org/2000/svg">
  <g transform="matrix(1.0, 0.0, 0.0, 1.0, 20.0, 10.0)">
    <path d="M8.0 -4.0 L4.0 -6.0 0.0 -8.0 -4.0 -6.0 -8.0 -4.0 -12.0 -2.0 -16.0 0.0 -12.0 2.0 -8.0 4.0 -4.0 6.0 0.0 8.0 4.0 6.0 8.0 4.0 12.0 2.0 16.0 0.0 12.0 -2.0 8.0 -4.0 M20.0 0.0 L0.0 10.0 -20.0 0.0 0.0 -10.0 20.0 0.0" fill="#a88783" fill-rule="evenodd" stroke="none"/>
    <path d="M4.0 -6.0 L8.0 -4.0 8.0 4.0 8.0 -4.0 12.0 -2.0 16.0 0.0 12.0 2.0 8.0 4.0 4.0 6.0 4.0 -6.0 4.0 6.0 0.0 8.0 0.0 -8.0 4.0 -6.0 M12.0 -2.0 L12.0 2.0 12.0 -2.0" fill="#aaaaaa" fill-rule="evenodd" stroke="none"/>
    <path d="M0.0 -8.0 L0.0 8.0 -4.0 6.0 -8.0 4.0 -8.0 -4.0 -8.0 4.0 -12.0 2.0 -12.0 -2.0 -12.0 2.0 -16.0 0.0 -12.0 -2.0 -8.0 -4.0 -4.0 -6.0 -4.0 6.0 -4.0 -6.0 0.0 -8.0" fill="#888888" fill-rule="evenodd" stroke="none"/>
    <path d="M8.0 -4.0 L4.0 -6.0 4.0 6.0 8.0 4.0 8.0 -4.0 12.0 -2.0 16.0 0.0 12.0 2.0 8.0 4.0 M4.0 -6.0 L0.0 -8.0 0.0 8.0 4.0 6.0 M20.0 0.0 L0.0 -10.0 -20.0 0.0 0.0 10.0 20.0 0.0 M12.0 2.0 L12.0 -2.0 M-4.0 -6.0 L-8.0 -4.0 -8.0 4.0 -4.0 6.0 -4.0 -6.0 0.0 -8.0 M-8.0 -4.0 L-12.0 -2.0 -12.0 2.0 -8.0 4.0 M-12.0 -2.0 L-16.0 0.0 -12.0 2.0 M-4.0 6.0 L0.0 8.0" fill="none" stroke="#660000" stroke-linecap="round" stroke-linejoin="round" stroke-opacity="0.3019608" stroke-width="0.05"/>
  </g>
</svg>
