<?xml version="1.0" encoding="UTF-8" standalone="no"?>
<svg xmlns:xlink="http://www.w3.org/1999/xlink" height="67.05px" width="132.9px" xmlns="http://www.w3.org/2000/svg">
  <g transform="matrix(1.0, 0.0, 0.0, 1.0, 12.4, -47.5)">
    <path d="M108.0 47.5 L108.25 47.55 120.25 53.55 120.5 53.85 120.5 54.2 120.25 54.45 0.35 114.4 0.3 114.45 0.25 114.5 0.1 114.55 -0.2 114.5 -12.1 108.5 -12.35 108.25 -12.35 107.9 -12.1 107.6 107.8 47.55 108.0 47.5" fill="#6e5e5b" fill-rule="evenodd" stroke="none"/>
    <path d="M112.8 51.6 L114.0 51.0 M102.1 57.1 L107.4 54.4 M91.3 62.5 L96.7 59.8 M26.5 94.9 L31.9 92.2 M69.7 73.3 L75.1 70.6 M58.9 78.7 L64.3 76.0 M48.1 84.1 L53.5 81.4 M37.3 89.5 L42.7 86.8 M4.9 105.7 L10.3 103.0 M80.5 67.9 L85.9 65.2 M15.7 100.3 L21.1 97.6 M-5.9 111.1 L-0.5 108.4" fill="none" stroke="#dddddd" stroke-linecap="round" stroke-linejoin="round" stroke-width="1.0"/>
  </g>
</svg>
