<?xml version="1.0" encoding="UTF-8" standalone="no"?>
<svg xmlns:xlink="http://www.w3.org/1999/xlink" height="102.5px" width="16.0px" xmlns="http://www.w3.org/2000/svg">
  <g transform="matrix(1.0, 0.0, 0.0, 1.0, 8.0, 51.25)">
    <path d="M-4.0 -49.25 L-4.95 -48.75 -5.0 -48.75 -5.0 -45.75 -8.0 -47.25 -8.0 -51.25 -4.0 -49.25 M7.05 -42.75 L7.0 -42.75 7.0 -39.75 4.0 -41.25 4.0 -45.25 8.0 -43.25 7.05 -42.75 M1.0 -42.75 L-2.0 -44.25 -2.0 -48.25 2.0 -46.25 1.05 -45.75 1.0 -45.75 1.0 -42.75 M-8.0 -22.25 L-5.0 -20.75 -5.0 -17.75 -8.0 -19.25 -8.0 -22.25 M1.0 -17.75 L1.0 -14.75 -2.0 -16.25 -2.0 -19.25 1.0 -17.75 M7.0 -18.75 L4.0 -20.25 4.0 -23.25 7.0 -21.75 7.0 -18.75 M4.0 -13.25 L4.0 -16.25 7.0 -14.75 7.0 -11.75 4.0 -13.25 M7.0 -28.75 L7.0 -25.75 4.0 -27.25 4.0 -30.25 7.0 -28.75 M-8.0 -29.25 L-5.0 -27.75 -5.0 -24.75 -8.0 -26.25 -8.0 -29.25 M-5.0 -31.75 L-8.0 -33.25 -8.0 -36.25 -5.0 -34.75 -5.0 -31.75 M-2.0 -23.25 L-2.0 -26.25 1.0 -24.75 1.0 -21.75 -2.0 -23.25 M-2.0 -30.25 L-2.0 -33.25 1.0 -31.75 1.0 -28.75 -2.0 -30.25 M-5.0 -38.75 L-8.0 -40.25 -8.0 -43.25 -5.0 -41.75 -5.0 -38.75 M4.0 -37.25 L7.0 -35.75 7.0 -32.75 4.0 -34.25 4.0 -37.25 M1.0 -38.75 L1.0 -35.75 -2.0 -37.25 -2.0 -40.25 1.0 -38.75 M-8.0 -15.25 L-5.0 -13.75 -5.0 -10.75 -8.0 -12.25 -8.0 -15.25 M4.0 0.75 L4.0 -2.25 7.0 -0.75 7.0 2.25 4.0 0.75 M-8.0 1.75 L-8.0 -1.25 -5.0 0.25 -5.0 3.25 -8.0 1.75 M-5.0 -6.75 L-5.0 -3.75 -8.0 -5.25 -8.0 -8.25 -5.0 -6.75 M-2.0 -2.25 L-2.0 -5.25 1.0 -3.75 1.0 -0.75 -2.0 -2.25 M7.0 -7.75 L7.0 -4.75 4.0 -6.25 4.0 -9.25 7.0 -7.75 M1.0 -10.75 L1.0 -7.75 -2.0 -9.25 -2.0 -12.25 1.0 -10.75 M1.0 3.25 L1.0 6.25 -2.0 4.75 -2.0 1.75 1.0 3.25 M1.0 13.25 L-2.0 11.75 -2.0 8.75 1.0 10.25 1.0 13.25 M7.0 13.25 L7.0 16.25 4.0 14.75 4.0 11.75 7.0 13.25 M4.0 4.75 L7.0 6.25 7.0 9.25 4.0 7.75 4.0 4.75 M-5.0 7.25 L-5.0 10.25 -8.0 8.75 -8.0 5.75 -5.0 7.25 M-5.0 14.25 L-5.0 17.25 -8.0 15.75 -8.0 12.75 -5.0 14.25 M-2.0 15.75 L1.0 17.25 1.0 20.25 -2.0 18.75 -2.0 15.75 M-8.0 19.75 L-5.0 21.25 -5.0 24.25 -8.0 22.75 -8.0 19.75 M-2.0 25.75 L-2.0 22.75 1.0 24.25 1.0 27.25 -2.0 25.75 M7.0 20.25 L7.0 23.25 4.0 21.75 4.0 18.75 7.0 20.25 M-5.0 38.25 L-8.0 36.75 -8.0 33.75 -5.0 35.25 -5.0 38.25 M-8.0 26.75 L-5.0 28.25 -5.0 31.25 -8.0 29.75 -8.0 26.75 M1.0 31.25 L1.0 34.25 -2.0 32.75 -2.0 29.75 1.0 31.25 M7.0 30.25 L4.0 28.75 4.0 25.75 7.0 27.25 7.0 30.25 M4.0 35.75 L4.0 32.75 7.0 34.25 7.0 37.25 4.0 35.75 M-2.0 43.75 L1.0 45.25 1.0 48.25 -2.0 46.75 -2.0 43.75 M-5.0 42.25 L-5.0 45.25 -8.0 43.75 -8.0 40.75 -5.0 42.25 M7.0 41.25 L7.0 44.25 4.0 42.75 4.0 39.75 7.0 41.25 M4.0 46.75 L7.0 48.25 7.0 51.25 4.0 49.75 4.0 46.75 M1.0 38.25 L1.0 41.25 -2.0 39.75 -2.0 36.75 1.0 38.25" fill="url(#gradient0)" fill-rule="evenodd" stroke="none"/>
  </g>
  <defs>
    <linearGradient gradientTransform="matrix(0.0, 0.0612, -0.0024, 0.0, -6.0, 0.0)" gradientUnits="userSpaceOnUse" id="gradient0" spreadMethod="pad" x1="-819.2" x2="819.2">
      <stop offset="0.0" stop-color="#ffffff"/>
      <stop offset="1.0" stop-color="#ffffff" stop-opacity="0.0"/>
    </linearGradient>
  </defs>
</svg>
