<?xml version="1.0" encoding="UTF-8" standalone="no"?>
<svg xmlns:xlink="http://www.w3.org/1999/xlink" height="7.6px" width="5.55px" xmlns="http://www.w3.org/2000/svg">
  <g transform="matrix(1.0, 0.0, 0.0, 1.0, 2.7, 7.25)">
    <path d="M1.2 -7.1 L1.7 -7.25 Q2.4 -7.3 2.8 -6.3 L2.85 -5.35 2.65 -4.35 1.7 -1.55 Q0.95 0.3 0.2 0.35 L0.1 0.35 0.0 0.35 Q-0.8 0.3 -1.55 -1.55 L-2.5 -4.35 -2.7 -5.35 -2.6 -6.3 Q-2.3 -7.3 -1.6 -7.25 L-1.1 -7.1 0.0 -6.7 1.2 -7.1" fill="#b53c00" fill-rule="evenodd" stroke="none"/>
  </g>
</svg>
