<?xml version="1.0" encoding="UTF-8" standalone="no"?>
<svg xmlns:xlink="http://www.w3.org/1999/xlink" height="103.6px" width="182.15px" xmlns="http://www.w3.org/2000/svg">
  <g transform="matrix(1.0, 0.0, 0.0, 1.0, 94.7, 10.8)">
    <path d="M79.15 43.1 L81.25 44.1 81.25 44.15 -1.6 85.55 -3.65 84.55 79.15 43.1 M81.25 45.15 L83.3 46.2 0.5 87.65 -1.6 86.6 81.25 45.15 M83.3 47.2 L85.4 48.25 85.4 48.3 2.55 89.7 0.5 88.7 83.3 47.2 M85.4 49.3 L87.45 50.3 87.45 50.35 4.65 91.8 2.55 90.75 Q43.95 70.0 85.4 49.3 M-94.7 32.75 L-7.8 -10.8 66.7 26.55 64.6 27.55 -7.8 -8.7 -90.55 32.75 Q-89.55 33.25 -88.5 33.8 L-7.8 -6.65 64.6 29.65 -18.15 71.1 -18.15 69.05 -88.5 33.8 -18.15 69.05 -20.15 70.05 -94.7 32.75 M66.7 31.65 L66.75 31.7 66.75 32.7 68.8 33.75 68.8 33.8 -14.0 75.2 -16.05 74.2 66.7 32.7 66.7 31.75 66.7 31.65 66.7 31.75 -16.05 73.15 -18.15 72.15 -18.15 72.1 64.65 30.7 66.7 31.65 M68.8 34.8 L70.9 35.85 -11.95 77.3 -14.0 76.25 68.8 34.8 M70.9 36.85 L72.95 37.9 72.95 37.95 -9.85 79.35 -11.95 78.35 70.9 36.85 M72.95 38.95 L79.15 42.05 -3.65 83.55 -9.85 80.4 72.95 38.95" fill="#f0ebdb" fill-rule="evenodd" stroke="none"/>
    <path d="M81.25 44.15 L81.25 45.15 -1.6 86.6 -1.6 85.55 81.25 44.15 M83.3 46.2 L83.3 47.2 0.5 88.7 0.5 87.65 83.3 46.2 M85.4 48.3 L85.4 49.3 Q43.95 70.0 2.55 90.75 L2.55 89.7 85.4 48.3 M87.45 50.35 L87.4 51.4 4.7 92.8 4.65 92.75 4.65 91.8 87.45 50.35 M-18.1 81.4 L-18.1 81.45 -20.15 82.45 -20.15 70.05 -18.15 69.05 -18.15 71.1 64.6 29.65 64.6 27.55 66.7 26.55 66.7 31.65 64.65 30.7 64.6 29.65 64.65 30.7 -18.15 72.1 -18.15 72.15 -18.1 81.4 M68.8 33.8 L68.8 34.8 -14.0 76.25 -14.0 75.2 68.8 33.8 M70.9 35.85 L70.9 36.85 -11.95 78.35 -11.95 77.3 70.9 35.85 M72.95 37.95 L72.95 38.95 -9.85 80.4 -9.85 79.35 72.95 37.95 M79.15 42.05 L79.15 43.1 -3.65 84.55 -3.65 83.55 79.15 42.05 M66.7 31.75 L66.7 32.7 -16.05 74.2 -16.05 73.15 66.7 31.75 M-18.15 72.1 L-18.15 71.1 -18.15 72.1" fill="#cfb9c6" fill-rule="evenodd" stroke="none"/>
    <path d="M4.65 92.75 Q-6.75 87.05 -18.1 81.4 L-18.15 72.15 -16.05 73.15 -16.05 74.2 -14.0 75.2 -14.0 76.25 -11.95 77.3 -11.95 78.35 -9.85 79.35 -9.85 80.4 -3.65 83.55 -3.65 84.55 -1.6 85.55 -1.6 86.6 0.5 87.65 0.5 88.7 2.55 89.7 2.55 90.75 4.65 91.8 4.65 92.75 M-20.15 82.45 L-94.7 45.15 -94.7 32.75 -20.15 70.05 -20.15 82.45 M64.6 27.55 L64.6 29.65 -7.8 -6.65 -88.5 33.8 Q-89.55 33.25 -90.55 32.75 L-7.8 -8.7 64.6 27.55" fill="#e0c9be" fill-rule="evenodd" stroke="none"/>
    <path d="M79.15 43.1 L81.25 44.1 81.25 44.15 81.25 45.15 83.3 46.2 83.3 47.2 85.4 48.25 85.4 48.3 85.4 49.3 87.45 50.3 87.45 50.35 87.4 51.4 M4.7 92.8 L4.65 92.75 Q-6.75 87.05 -18.1 81.4 L-18.1 81.45 -20.15 82.45 -94.7 45.15 -94.7 32.75 -7.8 -10.8 66.7 26.55 66.7 31.65 66.75 31.7 66.75 32.7 68.8 33.75 68.8 33.8 68.8 34.8 70.9 35.85 70.9 36.85 72.95 37.9 72.95 37.95 72.95 38.95 M-3.65 84.55 L-1.6 85.55 81.25 44.15 M64.6 27.55 L64.6 29.65 64.65 30.7 66.7 31.65 66.7 31.75 66.7 32.7 M-16.05 74.2 L-14.0 75.2 68.8 33.8 M64.6 27.55 L66.7 26.55 M0.5 88.7 L2.55 89.7 85.4 48.3 M4.65 91.8 L4.65 92.75 M2.55 89.7 L2.55 90.75 4.65 91.8 87.45 50.35 M0.5 87.65 L0.5 88.7 M0.5 87.65 L83.3 46.2 M-18.15 69.05 L-18.15 71.1 64.6 29.65 -7.8 -6.65 -88.5 33.8 -18.15 69.05 -20.15 70.05 -20.15 82.45 M-18.15 71.1 L-18.15 72.1 -18.15 72.15 -16.05 73.15 66.7 31.75 M-16.05 73.15 L-16.05 74.2 M-9.85 79.35 L-9.85 80.4 M-1.6 85.55 L-1.6 86.6 0.5 87.65 M-3.65 83.55 L79.15 42.05 M-11.95 77.3 L-11.95 78.35 -9.85 79.35 72.95 37.95 M-14.0 75.2 L-14.0 76.25 -11.95 77.3 70.9 35.85 M-18.15 72.15 L-18.1 81.4 M-88.5 33.8 Q-89.55 33.25 -90.55 32.75 L-7.8 -8.7 64.6 27.55 M-20.15 70.05 L-94.7 32.75" fill="none" stroke="#660000" stroke-linecap="round" stroke-linejoin="round" stroke-opacity="0.3019608" stroke-width="0.05"/>
    <path d="M72.95 38.95 L79.15 42.05 79.15 43.1 M-3.65 83.55 L-3.65 84.55 M-9.85 80.4 L-3.65 83.55" fill="none" stroke="#660000" stroke-linecap="round" stroke-linejoin="round" stroke-opacity="0.3019608" stroke-width="0.05"/>
    <path d="M87.4 51.4 L4.7 92.8 M79.15 43.1 L-3.65 84.55 M66.7 32.7 L-16.05 74.2 M2.55 90.75 Q43.95 70.0 85.4 49.3 M0.5 88.7 L83.3 47.2 M-18.15 72.1 L64.65 30.7 M-9.85 80.4 L72.95 38.95 M-1.6 86.6 L81.25 45.15 M-11.95 78.35 L70.9 36.85 M-14.0 76.25 L68.8 34.8" fill="none" stroke="#660000" stroke-linecap="round" stroke-linejoin="round" stroke-opacity="0.101960786" stroke-width="0.05"/>
    <path d="M67.4 47.8 L77.2 56.6 85.2 60.6 29.25 88.65 21.25 84.65 11.45 75.85 5.45 72.85 -4.55 64.05 -23.75 54.45 -50.7 50.75 -64.8 43.55 -55.4 38.6 -18.6 49.05 Q5.4 37.05 29.4 25.0 L51.4 36.0 61.4 44.8 67.4 47.8" fill="#660000" fill-opacity="0.16078432" fill-rule="evenodd" stroke="none"/>
  </g>
</svg>
