<?xml version="1.0" encoding="UTF-8" standalone="no"?>
<svg xmlns:xlink="http://www.w3.org/1999/xlink" height="48.0px" width="48.0px" xmlns="http://www.w3.org/2000/svg">
  <g transform="matrix(1.0, 0.0, 0.0, 1.0, 24.0, 30.05)">
    <path d="M-24.0 5.95 L0.0 -6.05 24.0 5.95 0.0 17.95 -24.0 5.95" fill="#96847f" fill-rule="evenodd" stroke="none"/>
    <path d="M4.4 2.15 L9.1 4.5 14.95 1.55 23.95 6.05 12.5 11.75 7.9 9.45 -4.6 15.65 -13.55 11.15 4.4 2.15" fill="#663e3e" fill-opacity="0.3019608" fill-rule="evenodd" stroke="none"/>
    <path d="M0.0 -28.05 L0.0 -26.85 -18.8 -17.45 -20.0 -18.05 0.0 -28.05 M0.0 -2.1 L0.0 -2.05 0.0 -2.1" fill="#5a11a3" fill-rule="evenodd" stroke="none"/>
    <path d="M-2.2 7.05 L-2.25 7.1 -2.25 7.05 -3.9 6.25 -3.9 3.25 -2.2 2.4 -2.2 7.05" fill="#602860" fill-rule="evenodd" stroke="none"/>
    <path d="M-3.9 6.25 L-7.4 8.0 -7.4 5.0 -3.9 3.25 -3.9 6.25" fill="#7e645e" fill-rule="evenodd" stroke="none"/>
    <path d="M0.0 -2.05 L8.0 1.95 8.0 9.95 0.0 5.95 0.0 -2.05 M-12.0 11.95 L-24.0 5.95 -24.0 -2.05 -12.0 3.95 -12.0 11.95" fill="url(#gradient0)" fill-rule="evenodd" stroke="none"/>
    <path d="M0.0 5.95 L-0.05 5.9 0.0 5.95 -2.2 7.05 -2.2 2.4 -3.9 3.25 -7.4 5.0 -7.4 8.0 -7.4 9.65 -12.0 11.95 -12.0 3.95 -12.0 3.9 0.0 -2.1 0.0 -2.05 0.0 5.95 M20.0 3.95 L8.0 9.95 8.0 1.95 20.0 -4.05 20.0 3.95" fill="url(#gradient1)" fill-rule="evenodd" stroke="none"/>
    <path d="M-18.8 -17.45 L0.0 -26.85 14.8 -19.45 8.0 -16.05 0.0 -20.05 -12.0 -14.05 -18.8 -17.45" fill="#556470" fill-rule="evenodd" stroke="none"/>
    <path d="M0.0 -18.05 L0.0 -2.1 -12.0 3.9 -12.0 -12.05 0.0 -18.05 M8.0 1.95 L8.0 -14.05 20.0 -20.05 20.0 -4.05 8.0 1.95" fill="#6e5982" fill-rule="evenodd" stroke="none"/>
    <path d="M0.0 -26.85 L0.0 -28.05 16.0 -20.05 14.8 -19.45 0.0 -26.85 M0.0 -18.05 L8.0 -14.05 8.0 1.95 0.0 -2.05 0.0 -2.1 0.0 -18.05 M-24.0 -18.05 L-12.0 -12.05 -12.0 3.9 -12.0 3.95 -24.0 -2.05 -24.0 -18.05" fill="#6b7fbd" fill-rule="evenodd" stroke="none"/>
    <path d="M0.0 -28.05 L-20.0 -18.05 -18.8 -17.45 -12.0 -14.05 0.0 -20.05 8.0 -16.05 14.8 -19.45 16.0 -20.05 0.0 -28.05 M8.0 -14.05 L0.0 -18.05 -12.0 -12.05 -24.0 -18.05 0.0 -30.05 20.0 -20.05 8.0 -14.05" fill="#86b7e0" fill-rule="evenodd" stroke="none"/>
    <path d="M0.0 -28.05 L-20.0 -18.05 -18.8 -17.45 0.0 -26.85 14.8 -19.45 16.0 -20.05 0.0 -28.05 M8.0 -14.05 L0.0 -18.05 M0.0 -2.05 L8.0 1.95 M8.0 -14.05 L20.0 -20.05 0.0 -30.05 -24.0 -18.05 -12.0 -12.05 0.0 -18.05 M14.8 -19.45 L8.0 -16.05 0.0 -20.05 -12.0 -14.05 -18.8 -17.45 M0.0 5.95 L-0.05 5.9 0.0 5.95 M-2.2 7.05 L-2.25 7.1 M-7.4 8.0 L-7.4 9.65 M-24.0 5.95 L-24.0 -2.05 -24.0 -18.05 M20.0 -4.05 L8.0 1.95 M-7.4 5.0 L-7.4 8.0 M-2.2 7.05 L-2.2 2.4 M-24.0 -2.05 L-12.0 3.95 M-12.0 3.9 L0.0 -2.1" fill="none" stroke="#660000" stroke-linecap="round" stroke-linejoin="round" stroke-opacity="0.3019608" stroke-width="0.05"/>
    <path d="M0.0 -26.85 L0.0 -28.05 M0.0 -18.05 L0.0 -2.1 0.0 -2.05 0.0 5.95 M8.0 1.95 L8.0 -14.05 M20.0 -4.05 L20.0 -20.05 M20.0 3.95 L20.0 -4.05 M8.0 1.95 L8.0 9.95 M-12.0 3.95 L-12.0 11.95 M-12.0 3.95 L-12.0 3.9 -12.0 -12.05" fill="none" stroke="#660000" stroke-linecap="round" stroke-linejoin="round" stroke-opacity="0.3019608" stroke-width="0.05"/>
    <path d="M8.0 9.95 L0.0 5.95 -2.2 7.05 M-7.4 9.65 L-12.0 11.95 -24.0 5.95 M8.0 9.95 L20.0 3.95" fill="none" stroke="#660000" stroke-linecap="round" stroke-linejoin="round" stroke-opacity="0.101960786" stroke-width="0.05"/>
  </g>
  <defs>
    <linearGradient gradientTransform="matrix(0.0, 0.0325, -0.022, 0.0, -86.2, -7.1)" gradientUnits="userSpaceOnUse" id="gradient0" spreadMethod="pad" x1="-819.2" x2="819.2">
      <stop offset="0.1607843137254902" stop-color="#faf9f3"/>
      <stop offset="0.5568627450980392" stop-color="#e4e2cd"/>
    </linearGradient>
    <linearGradient gradientTransform="matrix(0.0, 0.033, -0.0158, 0.0, -55.25, -14.75)" gradientUnits="userSpaceOnUse" id="gradient1" spreadMethod="pad" x1="-819.2" x2="819.2">
      <stop offset="0.0" stop-color="#a5cfc0"/>
      <stop offset="1.0" stop-color="#7e9e9e"/>
    </linearGradient>
  </defs>
</svg>
