<?xml version="1.0" encoding="UTF-8" standalone="no"?>
<svg xmlns:xlink="http://www.w3.org/1999/xlink" height="27.7px" width="48.0px" xmlns="http://www.w3.org/2000/svg">
  <g transform="matrix(1.0, 0.0, 0.0, 1.0, 24.0, 9.75)">
    <path d="M18.4 4.6 L10.4 8.6 7.35 7.1 -3.2 12.35 -10.6 8.65 4.3 1.15 7.35 2.7 11.0 0.9 18.4 4.6" fill="#663e3e" fill-opacity="0.3019608" fill-rule="evenodd" stroke="none"/>
    <path d="M6.75 6.9 L-5.05 12.8 -11.25 9.7 0.5 3.8 6.75 6.9" fill="#bfb451" fill-rule="evenodd" stroke="none"/>
    <path d="M-23.5 3.25 L-24.0 3.0 0.0 -9.0 24.0 3.0 22.75 3.6 18.85 5.55 18.85 4.95 19.95 4.4 22.8 3.0 0.0 -8.4 -22.8 3.0 -19.95 4.4 0.0 14.4 13.05 7.85 13.05 8.45 0.0 15.0 -23.5 3.25" fill="#fddcac" fill-rule="evenodd" stroke="none"/>
    <path d="M22.75 3.6 L24.0 3.0 24.0 4.25 24.0 5.95 18.85 8.5 18.85 5.55 22.75 3.6 M19.95 4.4 L0.0 -5.55 -19.95 4.4 -22.8 3.0 0.0 -8.4 22.8 3.0 19.95 4.4 M13.05 8.45 L13.05 11.4 0.0 17.95 -24.0 5.95 -24.0 4.7 -24.0 3.0 -23.5 3.25 0.0 15.0 13.05 8.45" fill="#dbae72" fill-rule="evenodd" stroke="none"/>
    <path d="M12.5 4.3 L12.95 4.5 13.55 4.3 14.5 4.95 Q15.25 5.55 16.05 5.55 16.75 5.55 18.4 7.4 L17.6 8.15 17.9 8.15 Q18.2 8.2 18.2 8.4 15.6 10.05 14.8 10.05 L14.45 9.9 14.05 10.0 13.45 9.35 Q13.45 9.05 14.45 8.45 14.1 8.3 12.55 6.75 10.35 6.25 10.35 5.5 10.35 5.2 11.2 4.75 12.0 4.3 12.5 4.3" fill="#fdcb82" fill-rule="evenodd" stroke="none"/>
    <path d="M-10.35 4.5 L-10.6 4.6 -10.35 4.5" fill="#e00505" fill-rule="evenodd" stroke="none"/>
    <path d="M-10.6 5.0 L-10.6 8.75 -17.05 5.5 -17.05 0.9 -14.3 0.6 -10.6 5.0 M0.85 3.05 L0.85 0.65 7.3 3.9 7.3 6.3 0.85 3.05" fill="#fddcac" fill-rule="evenodd" stroke="none"/>
    <path d="M-10.35 4.5 L0.85 -0.3 1.1 -0.35 6.05 2.4 7.3 2.95 7.3 3.9 7.3 2.95 7.45 3.0 10.9 -1.2 13.6 -0.25 13.55 3.2 7.3 6.3 7.3 3.9 0.85 0.65 0.85 3.05 -10.6 8.75 -10.6 5.0 -10.6 4.6 -10.6 5.0 -14.3 0.6 -17.05 0.9 -17.05 0.15 -13.95 -0.35 -13.9 -0.35 -10.6 4.1 -10.35 4.5 -10.6 4.6 -10.35 4.5 M-10.6 4.1 L-10.6 4.6 -10.6 4.1" fill="#d993a7" fill-rule="evenodd" stroke="none"/>
    <path d="M1.1 -0.35 L0.85 -0.3 -10.35 4.5 -10.6 4.1 -13.9 -0.35 -13.95 -0.35 -13.9 -0.35 -12.65 -1.1 -12.7 -1.15 -12.15 -1.4 -11.95 -1.55 -11.9 -1.5 1.3 -8.1 1.1 -0.35 M7.3 2.95 L6.05 2.4 10.55 -3.15 1.3 -8.1 0.9 -9.75 15.7 -1.55 14.85 -0.35 14.2 -0.05 13.6 -0.25 10.9 -1.2 7.45 3.0 7.3 2.95" fill="#99036e" fill-rule="evenodd" stroke="none"/>
    <path d="M1.1 -0.35 L1.3 -8.1 -11.9 -1.5 -11.95 -1.55 -12.15 -1.4 -12.7 -1.15 -12.65 -1.1 -13.9 -0.35 -13.95 -0.35 -17.05 0.15 -18.25 0.35 -18.25 -0.35 0.9 -9.75 1.3 -8.1 10.55 -3.15 6.05 2.4 1.1 -0.35" fill="url(#gradient0)" fill-rule="evenodd" stroke="none"/>
    <path d="M-10.35 4.5 L0.85 -0.3 1.1 -0.35 M-13.95 -0.35 L-13.9 -0.35 -10.6 4.1 -10.35 4.5 M0.85 3.05 L0.85 0.65 M7.3 2.95 L6.05 2.4 1.1 -0.35 M13.6 -0.25 L14.2 -0.05 14.85 -0.35 15.7 -1.55 0.9 -9.75 -18.25 -0.35 -18.25 0.35 -17.05 0.15 M7.3 2.95 L7.45 3.0 10.9 -1.2 13.6 -0.25 13.55 3.2 M-17.05 0.9 L-17.05 0.15 M-17.05 5.5 L-17.05 0.9" fill="none" stroke="#660000" stroke-linecap="round" stroke-linejoin="round" stroke-opacity="0.3019608" stroke-width="0.05"/>
    <path d="M-10.6 4.6 L-10.6 5.0 -10.6 8.75 M7.3 3.9 L7.3 2.95 M7.3 3.9 L7.3 6.3 M-10.6 4.6 L-10.6 4.1" fill="none" stroke="#660000" stroke-linecap="round" stroke-linejoin="round" stroke-opacity="0.3019608" stroke-width="0.05"/>
    <path d="M-10.6 8.75 L0.85 3.05 M13.55 3.2 L7.3 6.3 0.85 3.05 M-10.6 8.75 L-17.05 5.5" fill="none" stroke="#660000" stroke-linecap="round" stroke-linejoin="round" stroke-opacity="0.101960786" stroke-width="0.05"/>
    <path d="M-4.5 2.8 L-4.5 5.8 -2.5 4.8 -2.5 1.8 -4.5 2.8" fill="#c27713" fill-rule="evenodd" stroke="none"/>
    <path d="M-4.5 2.8 L-4.5 5.8 -2.5 4.8 -2.5 1.8 -4.5 2.8 Z" fill="none" stroke="#660000" stroke-linecap="round" stroke-linejoin="round" stroke-opacity="0.3019608" stroke-width="0.05"/>
    <path d="M-8.0 4.55 L-8.0 6.05 -6.5 5.3 -6.5 3.8 -8.0 4.55" fill="#990000" fill-rule="evenodd" stroke="none"/>
    <path d="M-8.0 4.55 L-6.5 3.8 -6.5 5.3 -8.0 6.05 -8.0 4.55 Z" fill="none" stroke="#660000" stroke-linecap="round" stroke-linejoin="round" stroke-opacity="0.3019608" stroke-width="0.05"/>
    <path d="M8.3 2.8 L9.8 2.05 9.8 3.55 8.3 4.3 8.3 2.8" fill="#830099" fill-opacity="0.47058824" fill-rule="evenodd" stroke="none"/>
    <path d="M8.3 2.8 L9.8 2.05 9.8 3.55 8.3 4.3 8.3 2.8 Z" fill="none" stroke="#660000" stroke-linecap="round" stroke-linejoin="round" stroke-opacity="0.3019608" stroke-width="0.05"/>
    <path d="M11.3 1.3 L11.3 2.8 12.8 2.05 12.8 0.55 11.3 1.3" fill="#990000" fill-rule="evenodd" stroke="none"/>
    <path d="M11.3 1.3 L12.8 0.55 12.8 2.05 11.3 2.8 11.3 1.3 Z" fill="none" stroke="#660000" stroke-linecap="round" stroke-linejoin="round" stroke-opacity="0.3019608" stroke-width="0.05"/>
    <path d="M-1.3 1.65 L-1.3 3.15 0.2 2.4 0.2 0.9 -1.3 1.65" fill="#990000" fill-rule="evenodd" stroke="none"/>
    <path d="M-1.3 1.65 L0.2 0.9 0.2 2.4 -1.3 3.15 -1.3 1.65 Z" fill="none" stroke="#660000" stroke-linecap="round" stroke-linejoin="round" stroke-opacity="0.3019608" stroke-width="0.05"/>
    <path d="M-13.35 4.15 L-13.35 5.65 -14.85 4.9 -14.85 3.4 -13.35 4.15" fill="#990000" fill-rule="evenodd" stroke="none"/>
    <path d="M-13.35 4.15 L-14.85 3.4 -14.85 4.9 -13.35 5.65 -13.35 4.15 Z" fill="none" stroke="#660000" stroke-linecap="round" stroke-linejoin="round" stroke-opacity="0.3019608" stroke-width="0.05"/>
  </g>
  <defs>
    <linearGradient gradientTransform="matrix(0.0, 0.0058, -0.0064, 0.0, 5.8, -2.85)" gradientUnits="userSpaceOnUse" id="gradient0" spreadMethod="pad" x1="-819.2" x2="819.2">
      <stop offset="0.00784313725490196" stop-color="#7d2b2b"/>
      <stop offset="1.0" stop-color="#e85a5a"/>
    </linearGradient>
  </defs>
</svg>
