<?xml version="1.0" encoding="UTF-8" standalone="no"?>
<svg xmlns:xlink="http://www.w3.org/1999/xlink" height="43.0px" width="78.0px" xmlns="http://www.w3.org/2000/svg">
  <g transform="matrix(1.0, 0.0, 0.0, 1.0, 35.65, 4.05)">
    <path d="M-5.65 -3.05 L20.35 9.95 -3.65 21.95 -29.65 8.95 -35.65 11.95 -9.65 24.95 -21.65 30.95 -19.65 31.95 22.35 10.95 30.35 14.95 -11.65 35.95 -5.65 38.95 42.35 14.95 36.35 11.95 32.35 13.95 -3.65 -4.05 -5.65 -3.05" fill="#6e5e5b" fill-rule="evenodd" stroke="none"/>
  </g>
</svg>
