<?xml version="1.0" encoding="UTF-8" standalone="no"?>
<svg xmlns:xlink="http://www.w3.org/1999/xlink" height="3.8px" width="10.05px" xmlns="http://www.w3.org/2000/svg">
  <g transform="matrix(1.0, 0.0, 0.0, 1.0, 3.75, 6.4)">
    <path d="M5.15 -6.4 L6.3 -4.65 2.2 -2.6 1.35 -4.5 5.15 -6.4 M0.95 -2.95 L0.25 -3.3 0.25 -4.45 0.35 -4.4 0.95 -2.95 M-0.75 -3.8 L-3.75 -5.3 -3.2 -6.15 -0.75 -4.9 -0.75 -3.8" fill="#544d99" fill-opacity="0.5019608" fill-rule="evenodd" stroke="none"/>
  </g>
</svg>
