<?xml version="1.0" encoding="UTF-8" standalone="no"?>
<svg xmlns:xlink="http://www.w3.org/1999/xlink" height="288.0px" width="80.0px" xmlns="http://www.w3.org/2000/svg">
  <g transform="matrix(1.0, 0.0, 0.0, 1.0, 40.0, 144.0)">
    <path d="M20.0 -116.0 L-20.0 -136.0 -20.0 -144.0 20.0 -124.0 20.0 -116.0 M0.0 26.0 L0.0 34.0 -40.0 14.0 -40.0 6.0 0.0 26.0 M40.0 -46.0 L20.0 -56.0 20.0 -64.0 40.0 -54.0 40.0 -46.0 M0.0 -54.0 L0.0 -46.0 -20.0 -56.0 -20.0 -64.0 0.0 -54.0 M-20.0 -84.0 L0.0 -74.0 -8.0 -70.0 -20.0 -76.0 -20.0 -84.0 M-40.0 106.0 L20.0 136.0 20.0 144.0 -40.0 114.0 -40.0 106.0 M20.0 68.0 L20.0 76.0 0.0 66.0 0.0 58.0 20.0 68.0" fill="url(#gradient0)" fill-rule="evenodd" stroke="none"/>
  </g>
  <defs>
    <linearGradient gradientTransform="matrix(0.0, 0.202, -0.0122, 0.0, -10.0, 27.5)" gradientUnits="userSpaceOnUse" id="gradient0" spreadMethod="pad" x1="-819.2" x2="819.2">
      <stop offset="0.0" stop-color="#ffffff"/>
      <stop offset="1.0" stop-color="#ffffff" stop-opacity="0.0"/>
    </linearGradient>
  </defs>
</svg>
