<?xml version="1.0" encoding="UTF-8" standalone="no"?>
<svg xmlns:xlink="http://www.w3.org/1999/xlink" height="63.4px" width="125.45px" xmlns="http://www.w3.org/2000/svg">
  <g transform="matrix(1.0, 0.0, 0.0, 1.0, 9.55, -48.95)">
    <path d="M110.75 49.0 L111.1 49.05 111.35 49.35 111.3 49.65 114.8 51.4 115.25 51.25 115.65 51.25 115.9 51.55 115.85 51.95 115.55 52.2 Q114.7 52.45 113.9 52.95 L113.95 52.95 111.95 53.95 Q110.95 54.3 110.15 54.8 L110.2 54.8 108.45 55.75 106.65 56.65 106.25 56.7 105.95 56.45 105.75 56.55 105.75 56.6 105.8 56.95 105.55 57.25 103.5 58.25 103.45 58.25 101.9 59.1 100.05 60.0 98.25 60.8 98.25 60.75 96.45 61.65 94.65 62.65 92.95 63.55 92.55 63.6 92.25 63.3 92.05 63.4 92.1 63.55 92.05 63.95 91.75 64.2 Q90.95 64.4 90.1 64.85 L88.25 65.85 86.65 66.75 84.75 67.85 82.65 68.95 80.95 69.6 80.55 69.55 80.35 69.3 80.1 69.4 80.2 69.75 80.05 70.1 78.15 71.45 76.15 72.2 74.4 72.8 72.6 73.5 72.65 73.5 71.05 74.6 70.7 74.7 Q70.45 74.7 70.35 74.55 L70.25 74.35 70.0 74.5 70.1 74.65 70.05 75.0 69.8 75.3 68.05 76.2 68.0 76.2 Q67.2 76.85 66.2 77.15 65.35 77.4 64.25 77.95 L62.4 78.7 60.6 79.35 Q59.5 79.75 58.95 80.35 L57.3 81.55 55.5 82.35 53.65 83.35 53.3 83.4 53.0 83.15 52.95 83.05 52.7 83.15 52.8 83.35 52.75 83.75 52.5 84.0 Q51.8 84.2 50.85 84.75 L49.05 85.85 49.05 85.8 Q48.2 86.4 47.15 86.8 L45.25 87.5 45.2 87.55 Q44.3 87.95 43.7 88.45 L43.65 88.45 41.8 89.65 Q40.55 90.4 39.7 90.3 L39.35 90.15 39.2 89.95 38.95 90.05 39.05 90.15 39.1 90.5 38.9 90.85 37.2 91.75 35.25 92.7 33.3 93.45 Q32.45 93.65 31.9 94.2 L31.9 94.15 Q31.2 94.9 29.85 95.4 28.65 95.8 27.95 96.3 L26.15 97.2 26.2 97.2 Q25.25 97.65 24.45 98.05 L24.05 98.1 23.75 97.8 23.7 97.7 23.45 97.85 23.5 97.85 23.6 98.25 23.45 98.6 21.6 99.7 Q20.6 100.0 19.9 100.4 L18.05 101.3 18.1 101.3 16.15 102.4 Q15.05 103.05 14.3 103.1 13.8 103.15 12.9 103.8 L12.9 103.75 11.0 104.95 9.3 105.8 7.1 106.8 6.7 106.75 6.45 106.5 6.4 106.4 6.2 106.55 6.3 106.9 6.1 107.25 Q4.95 108.15 4.0 108.2 L2.25 108.7 2.3 108.7 0.5 109.75 -1.15 110.8 -2.5 111.6 -4.2 112.3 -4.55 112.35 -4.85 112.05 -4.85 111.7 -4.85 111.6 -8.5 109.75 -8.75 109.95 -9.15 110.0 -9.45 109.8 -9.55 109.4 -9.3 109.1 -8.3 108.65 -8.25 108.6 -7.05 108.05 -7.05 108.0 -5.05 107.05 -4.65 107.05 -4.45 107.2 -4.25 107.1 -4.2 106.85 -3.95 106.55 -2.15 105.75 -0.4 105.0 1.15 104.0 1.2 103.95 Q2.05 103.25 3.45 102.9 L5.1 102.4 6.5 101.7 6.6 101.6 8.4 100.5 10.05 99.45 Q10.95 98.8 11.95 98.4 L12.0 98.4 14.1 97.6 14.45 97.6 14.55 97.65 14.85 97.5 14.9 97.3 15.15 97.0 16.85 96.1 Q17.8 95.55 19.0 95.25 L20.4 94.4 20.45 94.4 Q21.1 93.55 22.1 93.25 L23.9 92.5 25.85 91.6 27.75 90.7 29.65 89.75 31.35 88.9 31.7 88.9 31.9 89.0 32.15 88.85 32.2 88.6 32.45 88.3 34.45 87.3 34.5 87.3 36.1 86.45 Q37.2 85.8 38.05 85.6 L39.55 84.7 Q40.55 83.85 41.6 83.6 L41.65 83.6 Q42.45 83.45 43.3 82.95 44.3 82.3 45.1 82.0 L45.45 82.0 45.6 82.1 45.85 82.0 45.9 81.7 Q45.95 81.5 46.15 81.4 47.0 80.95 47.95 80.65 L49.75 79.8 Q50.7 79.15 51.8 78.6 L53.5 77.6 Q54.3 77.0 55.5 76.75 L55.5 76.7 Q56.5 76.55 57.15 76.2 L57.2 76.15 58.95 75.4 60.3 74.5 Q60.95 73.75 62.4 73.3 L62.8 73.3 62.95 73.45 63.2 73.3 63.2 72.95 63.5 72.7 65.55 71.9 66.75 71.05 66.8 71.05 Q67.4 70.5 68.35 70.0 69.25 69.55 70.45 69.2 L72.35 68.2 Q73.3 67.5 74.45 67.15 L76.35 66.4 76.4 66.4 77.7 65.6 Q77.85 65.45 78.05 65.45 78.25 65.45 78.4 65.6 L78.45 65.65 78.7 65.55 78.65 65.3 78.85 64.95 Q79.9 64.15 81.05 64.0 81.85 63.9 82.45 63.4 L82.5 63.4 Q83.2 62.75 84.15 62.2 85.1 61.6 86.2 61.1 L87.75 60.3 87.75 60.25 89.55 59.35 91.7 58.55 91.75 58.5 Q92.5 58.35 93.25 57.85 L93.3 57.85 Q94.2 57.25 95.15 56.8 L95.5 56.8 95.8 57.0 96.0 56.85 95.95 56.55 96.2 56.25 Q96.85 55.8 98.05 55.25 L98.1 55.25 100.0 54.55 Q100.75 54.3 101.5 53.7 102.4 53.05 103.35 52.75 L105.15 51.95 107.0 51.0 108.8 49.9 Q109.75 49.25 110.75 49.0" fill="#90672a" fill-opacity="0.7019608" fill-rule="evenodd" stroke="none"/>
  </g>
</svg>
