<?xml version="1.0" encoding="UTF-8" standalone="no"?>
<svg xmlns:xlink="http://www.w3.org/1999/xlink" height="333.8px" width="127.4px" xmlns="http://www.w3.org/2000/svg">
  <g transform="matrix(1.0, 0.0, 0.0, 1.0, 43.95, 267.0)">
    <path d="M19.8 -77.35 L19.8 -77.2 19.55 -77.2 19.8 -77.35" fill="#703224" fill-rule="evenodd" stroke="none"/>
    <path d="M-32.0 -235.0 L-36.0 -237.0 20.0 -265.0 20.0 -261.0 -32.0 -235.0" fill="#163625" fill-rule="evenodd" stroke="none"/>
    <path d="M20.0 -265.0 L75.5 -237.25 71.5 -235.25 20.0 -261.0 20.0 -265.0 M19.5 66.8 Q-12.2 50.9 -43.95 35.05 L-43.95 23.05 -31.3 29.35 -30.0 30.05 -28.45 30.8 -26.9 31.6 19.5 54.8 19.5 66.8 M-40.0 -102.0 L-40.0 -107.0 19.55 -77.2 19.8 -77.2 19.8 -72.35 19.55 -72.2 -40.0 -102.0 M-40.0 -207.0 L-40.0 -212.0 19.55 -182.2 19.6 -182.2 19.6 -177.25 19.55 -177.2 -40.0 -207.0 M-40.0 -232.0 L-40.0 -237.0 19.55 -207.2 19.55 -202.2 -40.0 -232.0" fill="#312c65" fill-rule="evenodd" stroke="none"/>
    <path d="M79.5 -237.25 L79.5 -232.25 19.55 -202.2 19.55 -207.2 79.5 -237.25 M79.55 -212.25 L79.55 -207.25 19.6 -177.25 19.6 -182.2 19.6 -182.25 79.55 -212.25 M79.75 -107.25 L79.75 -102.25 80.0 21.05 80.0 23.0 20.0 52.55 19.9 -6.95 20.0 -7.0 19.9 -7.0 19.8 -72.35 19.8 -77.2 19.8 -77.35 79.75 -107.25 M83.45 22.8 L83.45 34.8 19.5 66.8 19.5 54.8 67.95 30.55 69.55 29.8 70.85 29.1 83.45 22.8 M79.75 -102.25 L19.8 -72.35 79.75 -102.25" fill="#1a1735" fill-rule="evenodd" stroke="none"/>
    <path d="M20.0 -265.0 L-36.0 -237.0 -32.0 -235.0 19.55 -209.2 71.5 -235.25 75.5 -237.25 20.0 -265.0 M-40.0 -237.0 L20.0 -267.0 26.05 -264.0 79.5 -237.25 19.55 -207.2 -40.0 -237.0 M80.0 21.05 L83.45 22.8 70.85 29.1 69.5 29.75 67.95 30.55 19.5 54.8 -26.9 31.6 -28.45 30.8 -30.0 30.0 -31.3 29.35 -43.95 23.05 -40.0 21.05 -40.0 23.0 19.55 52.8 20.0 52.55 80.0 23.0 80.0 21.05" fill="#3e3982" fill-rule="evenodd" stroke="none"/>
    <path d="M71.5 -235.25 L19.55 -209.2 -32.0 -235.0 20.0 -261.0 71.5 -235.25" fill="url(#gradient0)" fill-rule="evenodd" stroke="none"/>
    <path d="M20.0 -7.0 L19.9 -6.95 19.9 -7.0 20.0 -7.0" fill="url(#gradient1)" fill-rule="evenodd" stroke="none"/>
    <path d="M-32.0 -235.0 L-36.0 -237.0 20.0 -265.0 75.5 -237.25 71.5 -235.25 19.55 -209.2 -32.0 -235.0 20.0 -261.0 20.0 -265.0 M-40.0 -237.0 L20.0 -267.0 26.05 -264.0 79.5 -237.25 79.5 -232.25 79.55 -212.25 79.55 -207.25 79.75 -107.25 79.75 -102.25 80.0 21.05 83.45 22.8 83.45 34.8 19.5 66.8 M-43.95 35.05 L-43.95 23.05 -40.0 21.05 -40.0 -102.0 -40.0 -107.0 -40.0 -207.0 -40.0 -212.0 -40.0 -232.0 -40.0 -237.0 19.55 -207.2 79.5 -237.25 M19.55 -207.2 L19.55 -202.2 79.5 -232.25 M20.0 -261.0 L71.5 -235.25 M19.6 -182.2 L19.6 -182.25 19.55 -182.2 -40.0 -212.0 M19.6 -177.25 L19.55 -177.2 -40.0 -207.0 M19.6 -182.2 L19.6 -177.25 79.55 -207.25 M19.8 -77.2 L19.8 -72.35 79.75 -102.25 M19.8 -77.2 L19.8 -77.35 19.55 -77.2 -40.0 -107.0 M19.8 -72.35 L19.55 -72.2 -40.0 -102.0 M19.9 -6.95 L20.0 -7.0 M19.9 -7.0 L19.9 -6.95 20.0 52.55 80.0 23.0 80.0 21.05 M19.8 -72.35 L19.9 -7.0 M19.8 -77.35 L79.75 -107.25 M19.6 -177.25 L19.8 -77.35 M19.55 -202.2 L19.6 -182.25 79.55 -212.25 M20.0 52.55 L19.55 52.8 -40.0 23.0 -40.0 21.05 M-30.0 30.05 L-30.0 30.0 -31.3 29.35 -30.0 30.05 -28.45 30.8 -30.0 30.0 M-28.45 30.8 L-26.9 31.6 19.5 54.8 67.95 30.55 69.5 29.75 70.85 29.1 83.45 22.8 M-31.3 29.35 L-43.95 23.05 M69.5 29.75 L69.55 29.8 70.85 29.1 M69.55 29.8 L67.95 30.55 M19.5 54.8 L19.5 66.8 M19.55 -202.2 L-40.0 -232.0" fill="none" stroke="#660000" stroke-linecap="round" stroke-linejoin="round" stroke-opacity="0.3019608" stroke-width="0.05"/>
    <path d="M19.5 66.8 Q-12.2 50.9 -43.95 35.05" fill="none" stroke="#660000" stroke-linecap="round" stroke-linejoin="round" stroke-opacity="0.101960786" stroke-width="0.05"/>
    <path d="M20.0 -198.2 L79.5 -228.0 M20.0 -186.2 L79.5 -216.0 M20.0 -190.2 L79.5 -220.0 M20.0 -194.2 L79.5 -224.0 M19.55 -198.2 L-40.0 -228.0 M19.55 -194.2 L-40.0 -224.0 M19.55 -190.2 L-40.0 -220.0 M19.55 -186.2 L-40.0 -216.0" fill="none" stroke="#5b60a3" stroke-linecap="round" stroke-linejoin="round" stroke-opacity="0.7137255" stroke-width="0.05"/>
  </g>
  <defs>
    <linearGradient gradientTransform="matrix(0.0632, 0.0, 0.0, 0.0217, 19.75, -227.0)" gradientUnits="userSpaceOnUse" id="gradient0" spreadMethod="pad" x1="-819.2" x2="819.2">
      <stop offset="0.0" stop-color="#b37784"/>
      <stop offset="1.0" stop-color="#765d7d"/>
    </linearGradient>
    <linearGradient gradientTransform="matrix(1.0, 0.0, 0.0, 1.0, 20.0, 30.0)" gradientUnits="userSpaceOnUse" id="gradient1" spreadMethod="pad" x1="-819.2" x2="819.2">
      <stop offset="0.0" stop-color="#c287bb"/>
      <stop offset="1.0" stop-color="#42518a"/>
    </linearGradient>
  </defs>
</svg>
