126;mcLoading
132;mcAntiPanel
135;mcAntiLayer
137;brushWood
149;mcAnalog
153;mcStatSlot
160;mcStats
169;mcCompt
410;mcObs
411;mcHouse1
522;mcHouse2
693;mcHouse3
702;mcRoad
707;mcDalle
708;mcHouse
710;mcTest
713;mcBg
