<?xml version="1.0" encoding="UTF-8" standalone="no"?>
<svg xmlns:xlink="http://www.w3.org/1999/xlink" height="19.05px" width="38.95px" xmlns="http://www.w3.org/2000/svg">
  <g transform="matrix(1.0, 0.0, 0.0, 1.0, 19.45, 9.55)">
    <path d="M12.45 -7.9 L12.55 -7.65 12.3 -7.45 12.15 -7.2 12.0 -7.1 11.5 -6.8 11.2 -6.15 Q11.2 -5.65 12.0 -5.25 12.75 -4.85 13.85 -4.85 L14.4 -4.85 15.15 -5.0 15.7 -5.25 Q16.5 -5.65 16.5 -6.15 L16.3 -6.7 16.05 -6.9 15.7 -7.1 15.55 -7.2 15.45 -7.4 15.15 -7.65 15.25 -7.9 15.25 -8.0 15.4 -8.05 Q16.0 -8.35 16.05 -8.8 L17.8 -8.2 19.0 -7.35 Q19.5 -6.85 19.5 -6.2 19.5 -5.05 17.8 -4.2 16.15 -3.35 13.85 -3.35 11.5 -3.35 9.8 -4.2 8.15 -5.05 8.2 -6.2 8.15 -6.9 8.75 -7.45 L9.8 -8.2 11.6 -8.8 11.7 -8.55 Q11.8 -8.25 12.25 -8.05 L12.45 -7.95 12.45 -7.9 M12.45 -9.25 L12.75 -9.45 13.05 -9.55 13.25 -9.3 13.3 -9.3 13.15 -9.25 12.95 -9.1 12.85 -8.85 13.15 -8.5 13.9 -8.3 Q14.3 -8.35 14.6 -8.5 L14.95 -8.85 14.85 -9.05 14.6 -9.25 14.45 -9.3 14.7 -9.55 14.95 -9.45 15.3 -9.2 15.45 -8.85 14.95 -8.3 13.85 -8.1 12.75 -8.3 Q12.3 -8.55 12.3 -8.85 L12.45 -9.25 M-1.1 0.65 Q1.45 0.65 3.25 1.55 L4.35 2.35 3.25 3.15 -0.4 4.9 -0.9 5.25 Q-2.1 6.55 -4.7 8.05 -7.35 9.5 -11.05 9.5 -14.8 9.45 -17.45 8.15 -19.1 7.35 -19.45 6.35 -19.1 5.3 -17.45 4.5 -14.85 3.2 -12.3 3.2 L-7.95 2.7 -5.1 1.4 Q-3.6 0.65 -1.1 0.65" fill="url(#gradient0)" fill-rule="evenodd" stroke="none"/>
  </g>
  <defs>
    <linearGradient gradientTransform="matrix(0.0, 0.0051, -0.0238, 0.0, 0.05, 5.35)" gradientUnits="userSpaceOnUse" id="gradient0" spreadMethod="pad" x1="-819.2" x2="819.2">
      <stop offset="0.0" stop-color="#ffffff"/>
      <stop offset="1.0" stop-color="#ffffff" stop-opacity="0.0"/>
    </linearGradient>
  </defs>
</svg>
