<?xml version="1.0" encoding="UTF-8" standalone="no"?>
<svg xmlns:xlink="http://www.w3.org/1999/xlink" height="39.8px" width="46.65px" xmlns="http://www.w3.org/2000/svg">
  <g transform="matrix(1.0, 0.0, 0.0, 1.0, 24.5, 53.05)">
    <path d="M-24.5 -43.15 Q-22.95 -44.8 -24.5 -48.3 -12.9 -40.75 -1.2 -36.6 -3.05 -34.85 -1.2 -31.45 -12.2 -39.25 -24.5 -43.1 L-24.5 -43.15" fill="#e66f3c" fill-opacity="0.8" fill-rule="evenodd" stroke="none"/>
    <path d="M-1.2 -25.95 L22.15 -37.5 22.15 -51.15 22.1 -51.15 22.15 -51.15 M22.15 -37.5 L22.15 -25.0" fill="none" stroke="#6f6f6f" stroke-linecap="round" stroke-linejoin="round" stroke-width="0.05"/>
    <path d="M-1.2 -53.05 L-1.2 -36.6 -1.2 -31.45 -1.2 -25.95 -1.2 -18.45 -1.2 -13.25 M-24.5 -43.15 L-24.5 -43.1 -1.2 -31.45 -12.85 -30.8 -1.2 -18.45 -24.5 -30.15 -24.5 -24.95 M-24.5 -30.15 L-24.5 -43.15 -24.5 -48.3 -1.2 -36.6 M-24.5 -30.15 L-12.85 -30.8 -24.5 -43.1" fill="none" stroke="#999999" stroke-linecap="round" stroke-linejoin="round" stroke-width="0.05"/>
  </g>
</svg>
