<?xml version="1.0" encoding="UTF-8" standalone="no"?>
<svg xmlns:xlink="http://www.w3.org/1999/xlink" height="51.3px" width="27.15px" xmlns="http://www.w3.org/2000/svg">
  <g transform="matrix(1.0, 0.0, 0.0, 1.0, 13.55, 25.65)">
    <path d="M1.2 -25.65 L12.5 -24.05 13.6 -21.9 5.25 -12.0 1.8 20.3 -2.15 25.65 -5.3 25.65 -7.65 23.55 -10.0 17.1 -13.55 15.8 -8.45 4.5 -10.3 -6.8 -5.7 -9.5 -5.7 -15.45 -12.85 -20.1 -10.55 -22.9 -0.35 -21.15 1.2 -25.65" fill="#bcd7fe" fill-rule="evenodd" stroke="none"/>
    <path d="M1.2 -25.65 L-0.35 -21.15 -10.55 -22.9 -12.85 -20.1 -5.7 -15.45 -5.7 -9.5 -10.3 -6.8 -8.45 4.5 -13.55 15.8 -10.0 17.1 -7.65 23.55 -5.3 25.65 -2.15 25.65 1.8 20.3 5.25 -12.0 13.6 -21.9 12.5 -24.05 1.2 -25.65 Z" fill="none" stroke="#ffffff" stroke-linecap="round" stroke-linejoin="round" stroke-width="0.05"/>
  </g>
</svg>
