<?xml version="1.0" encoding="UTF-8" standalone="no"?>
<svg xmlns:xlink="http://www.w3.org/1999/xlink" height="57.9px" width="115.5px" xmlns="http://www.w3.org/2000/svg">
  <g transform="matrix(1.0, 0.0, 0.0, 1.0, 57.75, -19.05)">
    <path d="M43.4 22.5 Q45.7 21.35 48.0 20.25 L48.0 20.15 50.15 19.05 57.75 22.85 11.1 46.2 Q10.4 46.55 10.15 47.3 9.85 48.0 10.15 48.75 10.4 49.45 11.1 49.8 L55.5 72.0 55.45 72.05 57.7 73.2 50.2 76.95 48.0 75.8 48.0 75.75 0.9 52.2 0.0 52.0 -0.9 52.2 -50.25 76.9 -57.65 73.2 -55.4 72.05 -55.5 72.0 -11.1 49.8 Q-10.4 49.45 -10.1 48.75 -9.85 48.0 -10.1 47.3 -10.4 46.55 -11.1 46.2 L-57.75 22.85 -50.2 19.1 -47.35 20.55 -8.35 40.1 -0.9 43.8 0.0 44.0 0.9 43.8 11.2 38.65 43.4 22.5" fill="#a57530" fill-rule="evenodd" stroke="none"/>
  </g>
</svg>
