<?xml version="1.0" encoding="UTF-8" standalone="no"?>
<svg xmlns:xlink="http://www.w3.org/1999/xlink" height="1.7px" width="0.9px" xmlns="http://www.w3.org/2000/svg">
  <g transform="matrix(1.0, 0.0, 0.0, 1.0, 0.45, 0.85)">
    <path d="M-0.1 0.55 L-0.45 0.4 -0.45 -0.85 -0.1 -0.65 -0.1 0.55" fill="#b06d74" fill-rule="evenodd" stroke="none"/>
    <path d="M-0.1 0.55 L-0.1 -0.65 0.45 -0.35 0.45 0.85 -0.1 0.55" fill="#6d4e8f" fill-opacity="0.5137255" fill-rule="evenodd" stroke="none"/>
    <path d="M-0.1 -0.65 L-0.45 -0.85 -0.45 0.4 -0.1 0.55 M-0.1 -0.65 L0.45 -0.35 0.45 0.85 -0.1 0.55" fill="none" stroke="#660000" stroke-linecap="round" stroke-linejoin="round" stroke-opacity="0.3019608" stroke-width="0.05"/>
  </g>
</svg>
