<?xml version="1.0" encoding="UTF-8" standalone="no"?>
<svg xmlns:xlink="http://www.w3.org/1999/xlink" height="270.5px" width="186.2px" xmlns="http://www.w3.org/2000/svg">
  <g transform="matrix(1.0, 0.0, 0.0, 1.0, 0.0, 270.3)">
    <path d="M0.0 -270.3 L0.0 0.2 186.2 0.2 186.2 -270.3 0.0 -270.3" fill="#9d0101" fill-rule="evenodd" stroke="none">
      <animate attributeName="fill" dur="2s" repeatCount="indefinite" values="#9d0101;#db0203"/>
      <animate attributeName="fill-opacity" dur="2s" repeatCount="indefinite" values="1.0;1.0"/>
      <animate attributeName="d" dur="2s" repeatCount="indefinite" values="M0.0 -270.3 L0.0 0.2 186.2 0.2 186.2 -270.3 0.0 -270.3;M0.0 -270.3 L0.0 0.2 186.2 0.2 186.2 -270.3 0.0 -270.3"/>
    </path>
    <path d="M0.0 -270.3 L186.2 -270.3 186.2 0.2 0.0 0.2 0.0 -270.3" fill="none" stroke="#000000" stroke-linecap="round" stroke-linejoin="round" stroke-opacity="0.0" stroke-width="1.0">
      <animate attributeName="stroke" dur="2s" repeatCount="indefinite" values="#000000;#000001"/>
      <animate attributeName="stroke-width" dur="2s" repeatCount="indefinite" values="0.0;0.0"/>
      <animate attributeName="fill-opacity" dur="2s" repeatCount="indefinite" values="0.0;0.0"/>
      <animate attributeName="d" dur="2s" repeatCount="indefinite" values="M0.0 -270.3 L186.2 -270.3 186.2 0.2 0.0 0.2 0.0 -270.3;M0.0 -270.3 L186.2 -270.3 186.2 0.2 0.0 0.2 0.0 -270.3"/>
    </path>
  </g>
</svg>
