<?xml version="1.0" encoding="UTF-8" standalone="no"?>
<svg xmlns:xlink="http://www.w3.org/1999/xlink" height="35.55px" width="54.75px" xmlns="http://www.w3.org/2000/svg">
  <g transform="matrix(1.0, 0.0, 0.0, 1.0, 8.75, 98.55)">
    <path d="M46.0 -64.95 L16.1 -64.95 Q6.2 -61.05 -4.05 -64.95 L-8.75 -64.95 -8.75 -98.55 46.0 -98.55 46.0 -64.95" fill="#999999" fill-rule="evenodd" stroke="none"/>
  </g>
</svg>
