<?xml version="1.0" encoding="UTF-8" standalone="no"?>
<svg xmlns:xlink="http://www.w3.org/1999/xlink" height="4.35px" width="7.2px" xmlns="http://www.w3.org/2000/svg">
  <g transform="matrix(1.0, 0.0, 0.0, 1.0, 3.6, 2.2)">
    <path d="M2.15 -2.2 Q2.8 -2.2 3.25 -1.5 L3.6 -0.6 Q3.6 0.1 2.25 1.1 0.8 2.2 -0.5 2.15 L-1.8 2.15 Q-2.45 2.0 -3.05 1.35 -3.6 0.7 -3.6 0.25 L-3.5 -0.25 -3.35 -0.5 -1.7 -0.5 Q-0.7 -0.6 0.25 -1.35 1.35 -2.2 2.15 -2.2" fill="#333333" fill-rule="evenodd" stroke="none"/>
  </g>
</svg>
