<?xml version="1.0" encoding="UTF-8" standalone="no"?>
<svg xmlns:xlink="http://www.w3.org/1999/xlink" height="25.05px" width="28.2px" xmlns="http://www.w3.org/2000/svg">
  <g transform="matrix(1.0, 0.0, 0.0, 1.0, 12.2, 14.35)">
    <path d="M-11.75 -6.8 Q-12.2 -6.8 -12.2 -7.25 -12.2 -7.75 -11.75 -7.75 -11.3 -7.75 -11.3 -7.25 -11.3 -6.8 -11.75 -6.8 M6.65 10.55 L6.2 10.7 5.9 10.55 5.85 10.35 Q5.85 9.85 6.4 9.85 6.95 9.85 6.95 10.15 L6.65 10.55" fill="#c7c7c7" fill-rule="evenodd" stroke="none"/>
    <path d="M8.7 -13.75 Q8.5 -13.75 8.4 -13.9 L8.35 -14.05 Q8.35 -14.4 8.7 -14.35 L9.05 -14.0 Q9.05 -13.75 8.7 -13.75 M15.65 -0.75 Q15.45 -0.75 15.4 -0.9 L15.4 -1.05 Q15.4 -1.3 15.7 -1.35 L16.0 -1.05 Q16.0 -0.75 15.65 -0.75 M11.75 0.55 Q11.75 0.2 12.1 0.2 12.45 0.2 12.45 0.5 L12.05 0.9 Q11.85 0.9 11.8 0.75 L11.75 0.55 M10.85 6.9 Q11.2 6.85 11.2 7.2 L10.8 7.5 Q10.45 7.5 10.45 7.15 10.45 6.95 10.85 6.9" fill="#ffffff" fill-rule="evenodd" stroke="none"/>
  </g>
</svg>
