<?xml version="1.0" encoding="UTF-8" standalone="no"?>
<svg xmlns:xlink="http://www.w3.org/1999/xlink" height="7.0px" width="13.0px" xmlns="http://www.w3.org/2000/svg">
  <g transform="matrix(1.0, 0.0, 0.0, 1.0, 6.5, 3.5)">
    <path d="M6.25 -1.05 L6.5 -0.5 Q6.5 0.6 4.75 1.85 2.45 3.5 -1.4 3.5 -2.9 3.5 -4.85 0.25 L-6.5 -2.95 Q-6.5 -3.75 -4.35 -3.4 L0.35 -2.4 2.65 -1.4 4.75 -1.15 6.25 -1.05" fill="#666666" fill-rule="evenodd" stroke="none"/>
  </g>
</svg>
