<?xml version="1.0" encoding="UTF-8" standalone="no"?>
<svg xmlns:xlink="http://www.w3.org/1999/xlink" height="68.8px" width="71.0px" xmlns="http://www.w3.org/2000/svg">
  <g transform="matrix(1.0, 0.0, 0.0, 1.0, 33.0, 33.3)">
    <path d="M13.2 -31.1 Q10.35 -32.5 6.0 -31.25 1.85 -30.05 -1.2 -27.2 -4.5 -24.15 -4.5 -20.85 -4.5 -19.5 -3.5 -18.25 -1.55 -15.75 3.5 -15.75 11.25 -15.75 14.5 -19.5 16.5 -21.75 16.5 -24.75 16.5 -29.45 13.2 -31.1 M-6.15 -25.8 Q-5.1 -27.6 -3.4 -29.05 0.65 -32.5 6.75 -33.15 12.6 -33.8 16.9 -31.6 21.5 -29.2 21.5 -24.65 L21.3 -19.85 22.0 -19.95 Q27.0 -20.55 30.4 -18.4 34.25 -16.0 34.25 -11.2 34.25 -7.65 32.5 -5.3 L31.5 -4.15 Q27.9 -0.75 20.1 -0.75 14.2 -0.75 11.5 -3.85 11.5 0.0 5.0 0.0 1.75 0.0 -0.15 -2.75 -1.1 -4.1 -1.4 -5.4 -1.4 -7.45 0.6 -8.5 L2.3 -9.05 1.45 -9.25 -0.1 -9.5 Q-4.7 -9.5 -6.8 -14.05 -7.85 -16.3 -8.0 -18.9 -8.0 -22.8 -6.15 -25.8 M32.0 -3.45 Q38.0 -4.65 38.0 2.55 38.0 4.0 36.75 5.0 36.05 5.55 35.05 5.85 L31.85 6.25 Q28.05 6.25 26.45 3.75 25.5 2.3 25.5 0.9 25.5 -0.05 27.45 -1.45 29.5 -2.9 31.75 -3.4 L32.0 -3.45 M34.05 10.15 Q36.0 12.65 36.0 16.0 36.0 20.95 32.85 24.95 28.45 30.55 19.3 30.75 L18.6 30.75 Q13.4 30.75 9.65 28.9 10.0 29.75 10.0 30.95 10.0 32.4 8.35 33.35 L7.8 33.65 Q6.15 34.35 3.6 34.35 L3.0 34.35 Q1.35 34.25 0.4 33.75 L0.1 33.55 -0.15 33.4 -0.25 33.3 -0.45 33.1 Q-1.05 32.4 -1.05 31.0 L-0.75 29.8 0.7 28.15 Q2.3 27.0 4.5 26.8 L6.5 26.8 Q5.15 25.65 4.05 24.15 L3.15 22.85 Q2.75 25.15 0.6 27.25 -1.05 28.8 -3.35 29.75 -6.6 31.0 -11.25 31.0 L-11.35 31.0 Q-17.2 31.0 -19.45 27.5 L-20.25 25.75 -20.6 25.75 Q-24.3 25.75 -25.3 23.35 L-25.65 21.0 -25.65 20.65 Q-25.65 17.05 -21.2 17.95 -19.5 18.25 -18.45 19.05 L-17.45 17.45 -17.35 17.35 Q-21.6 17.3 -23.65 15.2 -25.05 13.75 -25.05 12.25 -25.05 10.95 -24.1 9.95 L-24.35 10.0 -24.5 10.0 -24.65 10.0 -24.75 10.0 -26.1 9.8 -27.25 9.45 Q-30.5 7.95 -32.0 3.0 -33.05 -0.5 -33.0 -4.0 -33.0 -10.4 -28.75 -14.6 -24.95 -18.4 -19.35 -19.1 L-18.25 -19.2 Q-13.45 -19.55 -10.0 -17.05 -5.75 -14.0 -5.75 -8.05 -5.75 -3.95 -7.6 0.65 -6.3 -0.6 -4.55 -0.85 -2.45 -1.15 -0.9 0.15 0.75 1.6 0.75 4.3 0.75 6.05 -0.85 8.95 -1.7 10.45 -2.65 11.35 -1.4 11.5 0.9 15.6 L1.0 15.75 Q1.15 8.45 8.7 3.95 11.9 2.05 14.75 2.0 17.85 1.95 19.25 4.15 28.9 5.05 33.05 9.05 L34.05 10.15 M-14.15 -23.7 L-14.25 -23.9 Q-14.6 -25.0 -14.5 -26.25 -14.5 -29.45 -10.55 -29.95 -6.65 -30.45 -6.65 -26.25 L-6.65 -25.8 Q-6.75 -24.5 -7.5 -23.4 -8.7 -21.75 -11.1 -21.75 -13.4 -21.75 -14.15 -23.7 M9.8 -9.0 L9.0 -9.0 7.45 -9.25 5.9 -9.5 4.65 -9.2 5.05 -9.2 Q8.15 -8.9 9.8 -7.65 L9.75 -8.15 9.8 -9.0 M14.25 -11.55 Q14.35 -10.25 15.2 -9.0 16.85 -6.5 20.75 -6.5 24.2 -6.5 26.5 -9.0 28.25 -10.95 28.25 -12.55 28.25 -15.9 26.05 -17.25 24.15 -18.4 21.25 -17.8 18.5 -17.2 16.45 -15.45 14.25 -13.6 14.25 -11.55 M0.4 -4.25 Q1.3 -2.75 4.0 -2.75 6.75 -2.75 7.9 -3.95 8.6 -4.65 8.6 -5.6 8.6 -8.2 4.3 -8.35 0.0 -8.55 0.0 -5.75 -0.05 -5.0 0.4 -4.25 M20.85 17.25 Q24.25 15.05 24.25 12.5 24.25 8.55 21.3 6.8 18.75 5.2 14.9 5.8 11.15 6.3 8.45 8.5 5.5 10.85 5.5 13.9 5.5 15.7 6.45 17.2 8.05 19.75 11.85 19.75 17.1 19.75 20.85 17.25 M33.5 2.0 Q34.0 0.95 34.0 0.1 34.0 -2.6 31.15 -1.65 28.25 -0.65 28.25 1.2 28.25 1.9 28.65 2.45 29.45 3.5 31.5 3.5 32.75 3.5 33.5 2.0 M-30.25 -5.6 Q-29.95 -3.65 -28.65 -1.85 -26.15 1.75 -21.25 1.75 -14.8 1.75 -12.0 -2.0 -10.25 -4.35 -10.25 -7.4 -10.25 -12.4 -13.35 -14.85 -16.15 -17.0 -20.25 -16.45 -24.3 -15.95 -27.1 -13.1 -30.25 -10.0 -30.25 -5.6 M-10.5 -29.05 Q-12.5 -29.15 -12.5 -26.5 L-12.3 -25.6 Q-11.85 -24.75 -10.75 -24.75 -9.6 -24.75 -9.0 -25.55 -8.5 -26.15 -8.5 -26.85 -8.5 -28.95 -10.5 -29.05 M1.25 29.75 L1.5 30.85 Q2.05 31.9 3.6 31.9 4.7 31.9 5.5 31.0 6.15 30.25 6.15 29.55 6.15 27.05 3.7 27.4 1.25 27.7 1.25 29.75 M-9.9 6.9 L-9.7 4.8 Q-11.65 7.7 -14.2 9.0 -12.4 10.1 -11.85 12.3 L-10.1 12.0 -6.65 12.6 -6.4 12.6 Q-8.4 12.25 -9.3 9.8 -9.85 8.35 -9.9 6.9 M-7.3 4.8 Q-7.3 7.35 -5.0 7.35 -2.65 7.35 -1.35 6.25 -0.25 5.35 -0.25 4.2 -0.25 1.05 -3.75 1.2 -7.3 1.4 -7.3 4.8 M-24.5 22.2 L-24.25 23.3 Q-23.75 24.35 -22.5 24.35 -21.25 24.35 -20.7 23.5 -20.25 22.85 -20.25 22.0 -20.25 19.5 -22.35 19.85 -24.5 20.15 -24.5 22.2 M-19.1 14.6 Q-16.0 14.6 -16.0 12.4 -16.0 10.15 -18.55 10.6 -21.15 11.05 -21.15 12.75 L-20.95 13.7 Q-20.5 14.6 -19.1 14.6 M-17.9 20.15 Q-17.75 21.4 -16.95 22.55 -15.4 24.75 -12.0 24.75 -7.85 24.75 -5.95 21.9 -4.75 20.1 -4.75 18.4 -4.75 11.35 -11.3 14.15 -13.75 15.15 -15.85 17.1 -17.9 19.0 -17.9 20.15" fill="#760101" fill-rule="evenodd" stroke="none"/>
    <path d="M13.2 -31.1 Q16.5 -29.45 16.5 -24.75 16.5 -21.75 14.5 -19.5 11.25 -15.75 3.5 -15.75 -1.55 -15.75 -3.5 -18.25 -4.5 -19.5 -4.5 -20.85 -4.5 -24.15 -1.2 -27.2 1.85 -30.05 6.0 -31.25 10.35 -32.5 13.2 -31.1 M0.4 -4.25 Q-0.05 -5.0 0.0 -5.75 0.0 -8.55 4.3 -8.35 8.6 -8.2 8.6 -5.6 8.6 -4.65 7.9 -3.95 6.75 -2.75 4.0 -2.75 1.3 -2.75 0.4 -4.25 M14.25 -11.55 Q14.25 -13.6 16.45 -15.45 18.5 -17.2 21.25 -17.8 24.15 -18.4 26.05 -17.25 28.25 -15.9 28.25 -12.55 28.25 -10.95 26.5 -9.0 24.2 -6.5 20.75 -6.5 16.85 -6.5 15.2 -9.0 14.35 -10.25 14.25 -11.55 M33.5 2.0 Q32.75 3.5 31.5 3.5 29.45 3.5 28.65 2.45 28.25 1.9 28.25 1.2 28.25 -0.65 31.15 -1.65 34.0 -2.6 34.0 0.1 34.0 0.95 33.5 2.0 M20.85 17.25 Q17.1 19.75 11.85 19.75 8.05 19.75 6.45 17.2 5.5 15.7 5.5 13.9 5.5 10.85 8.45 8.5 11.15 6.3 14.9 5.8 18.75 5.2 21.3 6.8 24.25 8.55 24.25 12.5 24.25 15.05 20.85 17.25 M1.25 29.75 Q1.25 27.7 3.7 27.4 6.15 27.05 6.15 29.55 6.15 30.25 5.5 31.0 4.7 31.9 3.6 31.9 2.05 31.9 1.5 30.85 L1.25 29.75 M-10.5 -29.05 Q-8.5 -28.95 -8.5 -26.85 -8.5 -26.15 -9.0 -25.55 -9.6 -24.75 -10.75 -24.75 -11.85 -24.75 -12.3 -25.6 L-12.5 -26.5 Q-12.5 -29.15 -10.5 -29.05 M-30.25 -5.6 Q-30.25 -10.0 -27.1 -13.1 -24.3 -15.95 -20.25 -16.45 -16.15 -17.0 -13.35 -14.85 -10.25 -12.4 -10.25 -7.4 -10.25 -4.35 -12.0 -2.0 -14.8 1.75 -21.25 1.75 -26.15 1.75 -28.65 -1.85 -29.95 -3.65 -30.25 -5.6 M-7.3 4.8 Q-7.3 1.4 -3.75 1.2 -0.25 1.05 -0.25 4.2 -0.25 5.35 -1.35 6.25 -2.65 7.35 -5.0 7.35 -7.3 7.35 -7.3 4.8 M-17.9 20.15 Q-17.9 19.0 -15.85 17.1 -13.75 15.15 -11.3 14.15 -4.75 11.35 -4.75 18.4 -4.75 20.1 -5.95 21.9 -7.85 24.75 -12.0 24.75 -15.4 24.75 -16.95 22.55 -17.75 21.4 -17.9 20.15 M-19.1 14.6 Q-20.5 14.6 -20.95 13.7 L-21.15 12.75 Q-21.15 11.05 -18.55 10.6 -16.0 10.15 -16.0 12.4 -16.0 14.6 -19.1 14.6 M-24.5 22.2 Q-24.5 20.15 -22.35 19.85 -20.25 19.5 -20.25 22.0 -20.25 22.85 -20.7 23.5 -21.25 24.35 -22.5 24.35 -23.75 24.35 -24.25 23.3 L-24.5 22.2" fill="#ba0101" fill-rule="evenodd" stroke="none"/>
    <path d="M31.5 -4.15 L32.2 -3.5 32.0 -3.45 31.75 -3.4 Q29.5 -2.9 27.45 -1.45 25.5 -0.05 25.5 0.9 25.5 2.3 26.45 3.75 28.05 6.25 31.85 6.25 L35.05 5.85 35.0 6.3 Q35.0 8.2 34.05 10.15 L33.05 9.05 Q28.9 5.05 19.25 4.15 17.85 1.95 14.75 2.0 11.9 2.05 8.7 3.95 1.15 8.45 1.0 15.75 L0.9 15.6 Q-1.4 11.5 -2.65 11.35 -1.7 10.45 -0.85 8.95 0.75 6.05 0.75 4.3 0.75 1.6 -0.9 0.15 -2.45 -1.15 -4.55 -0.85 -6.3 -0.6 -7.6 0.65 -5.75 -3.95 -5.75 -8.05 -5.75 -14.0 -10.0 -17.05 -13.45 -19.55 -18.25 -19.2 -17.55 -21.15 -15.6 -22.7 L-14.15 -23.7 Q-13.4 -21.75 -11.1 -21.75 -8.7 -21.75 -7.5 -23.4 -6.75 -24.5 -6.65 -25.8 L-6.15 -25.8 Q-8.0 -22.8 -8.0 -18.9 -7.85 -16.3 -6.8 -14.05 -4.7 -9.5 -0.1 -9.5 L1.45 -9.25 2.3 -9.05 0.6 -8.5 Q-1.4 -7.45 -1.4 -5.4 -1.1 -4.1 -0.15 -2.75 1.75 0.0 5.0 0.0 11.5 0.0 11.5 -3.85 14.2 -0.75 20.1 -0.75 27.9 -0.75 31.5 -4.15 M19.3 30.75 L19.5 30.75 Q19.3 35.0 12.75 35.0 9.0 35.0 7.45 33.8 L7.8 33.65 8.35 33.35 Q10.0 32.4 10.0 30.95 10.0 29.75 9.65 28.9 13.4 30.75 18.6 30.75 L19.3 30.75 M3.0 34.35 Q1.65 35.5 -1.6 35.5 -5.95 35.5 -8.65 34.1 -11.2 32.8 -11.25 31.0 -6.6 31.0 -3.35 29.75 -1.05 28.8 0.6 27.25 2.75 25.15 3.15 22.85 L4.05 24.15 Q5.15 25.65 6.5 26.8 L4.5 26.8 Q2.3 27.0 0.7 28.15 L-0.75 29.8 -1.05 31.0 Q-1.05 32.4 -0.45 33.1 L-0.25 33.3 -0.15 33.4 0.1 33.55 0.4 33.75 Q1.35 34.25 3.0 34.35 M-25.65 21.0 L-25.65 21.35 -28.1 19.25 Q-29.75 17.15 -29.75 14.8 -29.75 11.6 -27.65 9.25 L-27.25 9.45 -26.1 9.8 -24.75 10.0 -24.65 10.0 -24.5 10.0 -24.35 10.0 -24.1 9.95 Q-25.05 10.95 -25.05 12.25 -25.05 13.75 -23.65 15.2 -21.6 17.3 -17.35 17.35 L-17.45 17.45 -18.45 19.05 Q-19.5 18.25 -21.2 17.95 -25.65 17.05 -25.65 20.65 L-25.65 21.0 M9.8 -9.0 L9.75 -8.15 9.8 -7.65 Q8.15 -8.9 5.05 -9.2 L4.65 -9.2 5.9 -9.5 7.45 -9.25 9.0 -9.0 9.8 -9.0 M-9.9 6.9 Q-9.85 8.35 -9.3 9.8 -8.4 12.25 -6.4 12.6 L-6.65 12.6 -10.1 12.0 -11.85 12.3 Q-12.4 10.1 -14.2 9.0 -11.65 7.7 -9.7 4.8 L-9.9 6.9" fill="#430101" fill-rule="evenodd" stroke="none"/>
  </g>
</svg>
