<?xml version="1.0" encoding="UTF-8" standalone="no"?>
<svg xmlns:xlink="http://www.w3.org/1999/xlink" height="8.8px" width="6.65px" xmlns="http://www.w3.org/2000/svg">
  <g transform="matrix(1.0, 0.0, 0.0, 1.0, -1.7, 4.85)">
    <path d="M4.65 -4.85 L5.95 -1.25 8.35 -1.25 6.55 0.5 7.6 3.45 5.35 1.7 3.15 3.95 3.75 0.45 1.7 -1.25 4.05 -1.25 4.65 -4.85" fill="#65f028" fill-rule="evenodd" stroke="none"/>
  </g>
</svg>
