<?xml version="1.0" encoding="UTF-8" standalone="no"?>
<svg xmlns:xlink="http://www.w3.org/1999/xlink" height="6.65px" width="7.2px" xmlns="http://www.w3.org/2000/svg">
  <g transform="matrix(1.0, 0.0, 0.0, 1.0, -0.65, 2.55)">
    <path d="M5.9 -0.85 L7.45 -1.0 7.85 1.4 6.25 1.7 6.5 3.35 3.8 4.1 3.45 2.25 1.2 2.7 0.65 -0.35 3.0 -0.55 2.65 -2.5 5.65 -2.55 5.9 -0.85" fill="#ff0000" fill-rule="evenodd" stroke="none"/>
  </g>
</svg>
