<?xml version="1.0" encoding="UTF-8" standalone="no"?>
<svg xmlns:xlink="http://www.w3.org/1999/xlink" height="97.65px" width="106.65px" xmlns="http://www.w3.org/2000/svg">
  <g transform="matrix(1.0, 0.0, 0.0, 1.0, 51.15, 46.35)">
    <path d="M23.3 -27.55 L24.95 -26.45 Q28.5 -23.95 30.75 -20.4 31.15 -21.45 31.95 -22.35 33.7 -24.3 36.15 -24.3 38.6 -24.3 40.3 -22.35 42.05 -20.4 42.05 -17.65 42.05 -14.9 40.3 -12.95 38.6 -11.0 36.15 -11.0 L34.15 -11.35 Q34.7 -8.25 34.7 -4.7 34.65 10.05 24.3 23.85 13.9 37.7 -0.65 35.05 -15.15 32.45 -26.8 24.05 -38.4 15.7 -34.95 -8.0 -31.5 -31.7 -21.0 -33.7 -14.4 -35.0 -6.75 -35.0 -7.6 -35.3 -8.35 -35.75 -10.25 -36.95 -10.25 -38.65 -10.25 -40.35 -8.35 -41.55 -6.45 -42.75 -3.8 -42.75 -1.15 -42.75 0.75 -41.55 2.65 -40.35 2.65 -38.65 2.65 -36.95 0.75 -35.75 -0.25 -35.15 -1.4 -34.8 L2.3 -34.55 Q7.4 -34.1 12.0 -32.7 L12.8 -34.0 Q14.6 -36.3 17.15 -36.3 19.7 -36.3 21.5 -34.0 23.3 -31.65 23.3 -28.4 L23.3 -27.55 M49.75 -3.0 Q52.15 -3.0 53.8 -0.95 55.5 1.1 55.5 4.0 55.5 6.9 53.8 8.95 52.15 11.0 49.75 11.0 47.35 11.0 45.65 8.95 44.0 6.9 44.0 4.0 44.0 1.1 45.65 -0.95 47.35 -3.0 49.75 -3.0 M47.6 26.15 Q45.65 28.25 42.9 28.25 40.15 28.25 38.2 26.15 36.25 24.05 36.25 21.1 36.25 18.15 38.2 16.05 40.15 13.95 42.9 13.95 45.65 13.95 47.6 16.05 49.55 18.15 49.55 21.1 49.55 24.05 47.6 26.15 M19.1 30.45 Q20.2 28.95 21.75 28.95 23.3 28.95 24.4 30.45 25.5 31.95 25.5 34.1 25.5 36.25 24.4 37.75 23.3 39.25 21.75 39.25 20.2 39.25 19.1 37.75 18.0 36.25 18.0 34.1 18.0 31.95 19.1 30.45 M-8.0 43.85 Q-8.0 42.35 -7.0 41.25 -5.95 40.2 -4.5 40.2 -3.05 40.2 -2.05 41.25 -1.0 42.35 -1.0 43.85 -1.0 45.35 -2.05 46.4 -3.05 47.5 -4.5 47.5 -5.95 47.5 -7.0 46.4 -8.0 45.35 -8.0 43.85" fill="#ff0000" fill-rule="evenodd" stroke="none"/>
    <path d="M-41.65 -15.0 Q-40.05 -16.5 -37.75 -16.5 -35.45 -16.5 -33.85 -15.0 -32.25 -13.5 -32.25 -11.35 -32.25 -9.2 -33.85 -7.7 -35.45 -6.2 -37.75 -6.2 -40.05 -6.2 -41.65 -7.7 -43.25 -9.2 -43.25 -11.35 -43.25 -13.5 -41.65 -15.0" fill="#ff0000" fill-rule="evenodd" stroke="none"/>
    <path d="M-33.85 20.75 Q-32.25 22.25 -32.25 24.4 -32.25 26.55 -33.85 28.05 -35.45 29.55 -37.75 29.55 -40.05 29.55 -41.65 28.05 -43.25 26.55 -43.25 24.4 -43.25 22.25 -41.65 20.75 -40.05 19.25 -37.75 19.25 -35.45 19.25 -33.85 20.75" fill="#ff0000" fill-rule="evenodd" stroke="none"/>
    <path d="M-16.0 41.0 Q-13.7 41.0 -12.1 42.5 -10.5 44.0 -10.5 46.15 -10.5 48.3 -12.1 49.8 -13.7 51.3 -16.0 51.3 -18.3 51.3 -19.9 49.8 -21.5 48.3 -21.5 46.15 -21.5 44.0 -19.9 42.5 -18.3 41.0 -16.0 41.0" fill="#ff0000" fill-rule="evenodd" stroke="none"/>
    <path d="M-22.4 37.75 Q-24.0 36.25 -24.0 34.1 -24.0 31.95 -22.4 30.45 -20.8 28.95 -18.5 28.95 -16.2 28.95 -14.6 30.45 -13.0 31.95 -13.0 34.1 -13.0 36.25 -14.6 37.75 -16.2 39.25 -18.5 39.25 -20.8 39.25 -22.4 37.75" fill="#ff0000" fill-rule="evenodd" stroke="none"/>
    <path d="M-27.65 -29.25 Q-29.25 -30.75 -29.25 -32.9 -29.25 -35.05 -27.65 -36.55 -26.05 -38.05 -23.75 -38.05 -21.45 -38.05 -19.85 -36.55 -18.25 -35.05 -18.25 -32.9 -18.25 -30.75 -19.85 -29.25 -21.45 -27.75 -23.75 -27.75 -26.05 -27.75 -27.65 -29.25" fill="#ff0000" fill-rule="evenodd" stroke="none"/>
    <path d="M1.35 -29.25 Q-0.25 -30.75 -0.25 -32.9 -0.25 -35.05 1.35 -36.55 2.95 -38.05 5.25 -38.05 7.55 -38.05 9.15 -36.55 10.75 -35.05 10.75 -32.9 10.75 -30.75 9.15 -29.25 7.55 -27.75 5.25 -27.75 2.95 -27.75 1.35 -29.25" fill="#ff0000" fill-rule="evenodd" stroke="none"/>
    <path d="M38.45 -6.9 Q42.65 -2.95 42.65 2.7 42.65 8.4 38.45 12.35 34.2 16.3 28.15 16.3 22.1 16.3 17.85 12.35 13.65 8.4 13.65 2.7 13.65 -2.95 17.85 -6.9 22.1 -10.85 28.15 -10.85 34.2 -10.85 38.45 -6.9" fill="#ff0000" fill-rule="evenodd" stroke="none"/>
    <path d="M-20.3 -6.9 Q-16.1 -2.95 -16.1 2.7 -16.1 8.4 -20.3 12.35 -24.55 16.3 -30.6 16.3 -36.65 16.3 -40.9 12.35 -45.1 8.4 -45.1 2.7 -45.1 -2.95 -40.9 -6.9 -36.65 -10.85 -30.6 -10.85 -24.55 -10.85 -20.3 -6.9" fill="#ff0000" fill-rule="evenodd" stroke="none"/>
    <path d="M-25.05 -16.4 Q-29.25 -20.35 -29.25 -26.05 -29.25 -31.7 -25.05 -35.65 -20.8 -39.6 -14.75 -39.6 -8.7 -39.6 -4.45 -35.65 -0.25 -31.7 -0.25 -26.05 -0.25 -20.35 -4.45 -16.4 -8.7 -12.45 -14.75 -12.45 -20.8 -12.45 -25.05 -16.4" fill="#ff0000" fill-rule="evenodd" stroke="none"/>
    <path d="M-30.3 30.85 Q-34.5 26.9 -34.5 21.2 -34.5 15.55 -30.3 11.6 -26.05 7.65 -20.0 7.65 -13.95 7.65 -9.7 11.6 -5.5 15.55 -5.5 21.2 -5.5 26.9 -9.7 30.85 -13.95 34.8 -20.0 34.8 -26.05 34.8 -30.3 30.85" fill="#ff0000" fill-rule="evenodd" stroke="none"/>
    <path d="M19.65 9.75 Q25.5 15.2 25.5 23.0 25.5 30.85 19.65 36.3 13.85 41.75 5.5 41.75 -2.85 41.75 -8.7 36.3 -14.5 30.85 -14.5 23.0 -14.5 15.2 -8.7 9.75 -2.85 4.3 5.5 4.3 13.85 4.3 19.65 9.75" fill="#ff0000" fill-rule="evenodd" stroke="none"/>
    <path d="M6.6 -28.85 Q3.9 -31.2 3.9 -34.55 3.9 -37.95 6.6 -40.3 9.3 -42.65 13.2 -42.65 17.05 -42.65 19.75 -40.3 22.45 -37.95 22.45 -34.55 22.45 -31.2 19.75 -28.85 17.05 -26.5 13.2 -26.5 9.3 -26.5 6.6 -28.85" fill="#ff0000" fill-rule="evenodd" stroke="none"/>
    <path d="M24.65 -24.65 Q23.2 -26.05 23.2 -28.05 23.2 -30.05 24.65 -31.45 26.05 -32.85 28.1 -32.85 30.2 -32.85 31.6 -31.45 33.05 -30.05 33.05 -28.05 33.05 -26.05 31.6 -24.65 30.2 -23.25 28.1 -23.25 26.05 -23.25 24.65 -24.65" fill="#ff0000" fill-rule="evenodd" stroke="none"/>
    <path d="M24.65 26.6 Q23.2 25.2 23.2 23.2 23.2 21.2 24.65 19.8 26.05 18.4 28.1 18.4 30.2 18.4 31.6 19.8 33.05 21.2 33.05 23.2 33.05 25.2 31.6 26.6 30.2 28.0 28.1 28.0 26.05 28.0 24.65 26.6" fill="#ff0000" fill-rule="evenodd" stroke="none"/>
    <path d="M5.6 44.9 Q4.15 43.5 4.15 41.5 4.15 39.5 5.6 38.1 7.0 36.7 9.05 36.7 11.15 36.7 12.55 38.1 14.0 39.5 14.0 41.5 14.0 43.5 12.55 44.9 11.15 46.3 9.05 46.3 7.0 46.3 5.6 44.9" fill="#ff0000" fill-rule="evenodd" stroke="none"/>
    <path d="M-36.9 -20.6 Q-38.35 -22.0 -38.35 -24.0 -38.35 -26.0 -36.9 -27.4 -35.5 -28.8 -33.45 -28.8 -31.35 -28.8 -29.95 -27.4 -28.5 -26.0 -28.5 -24.0 -28.5 -22.0 -29.95 -20.6 -31.35 -19.2 -33.45 -19.2 -35.5 -19.2 -36.9 -20.6" fill="#ff0000" fill-rule="evenodd" stroke="none"/>
    <path d="M-15.65 -41.25 Q-16.55 -42.1 -16.55 -43.35 -16.55 -44.6 -15.65 -45.45 -14.8 -46.35 -13.5 -46.35 -12.25 -46.35 -11.35 -45.45 -10.5 -44.6 -10.5 -43.35 -10.5 -42.1 -11.35 -41.25 -12.25 -40.35 -13.5 -40.35 -14.8 -40.35 -15.65 -41.25" fill="#ff0000" fill-rule="evenodd" stroke="none"/>
    <path d="M24.6 -35.25 Q23.7 -36.1 23.7 -37.35 23.7 -38.6 24.6 -39.45 25.45 -40.35 26.75 -40.35 28.0 -40.35 28.9 -39.45 29.75 -38.6 29.75 -37.35 29.75 -36.1 28.9 -35.25 28.0 -34.35 26.75 -34.35 25.45 -34.35 24.6 -35.25" fill="#ff0000" fill-rule="evenodd" stroke="none"/>
    <path d="M41.35 -7.1 Q40.45 -7.95 40.45 -9.2 40.45 -10.45 41.35 -11.3 42.2 -12.2 43.5 -12.2 44.75 -12.2 45.65 -11.3 46.5 -10.45 46.5 -9.2 46.5 -7.95 45.65 -7.1 44.75 -6.2 43.5 -6.2 42.2 -6.2 41.35 -7.1" fill="#ff0000" fill-rule="evenodd" stroke="none"/>
    <path d="M33.95 34.65 Q33.05 33.8 33.05 32.55 33.05 31.3 33.95 30.45 34.8 29.55 36.1 29.55 37.35 29.55 38.25 30.45 39.1 31.3 39.1 32.55 39.1 33.8 38.25 34.65 37.35 35.55 36.1 35.55 34.8 35.55 33.95 34.65" fill="#ff0000" fill-rule="evenodd" stroke="none"/>
    <path d="M16.3 45.8 Q15.4 44.95 15.4 43.7 15.4 42.45 16.3 41.6 17.15 40.7 18.45 40.7 19.7 40.7 20.6 41.6 21.45 42.45 21.45 43.7 21.45 44.95 20.6 45.8 19.7 46.7 18.45 46.7 17.15 46.7 16.3 45.8" fill="#ff0000" fill-rule="evenodd" stroke="none"/>
    <path d="M-31.35 35.8 Q-32.25 34.95 -32.25 33.7 -32.25 32.45 -31.35 31.6 -30.5 30.7 -29.2 30.7 -27.95 30.7 -27.05 31.6 -26.2 32.45 -26.2 33.7 -26.2 34.95 -27.05 35.8 -27.95 36.7 -29.2 36.7 -30.5 36.7 -31.35 35.8" fill="#ff0000" fill-rule="evenodd" stroke="none"/>
    <path d="M-50.25 16.55 Q-51.15 15.7 -51.15 14.45 -51.15 13.2 -50.25 12.35 -49.4 11.45 -48.1 11.45 -46.85 11.45 -45.95 12.35 -45.1 13.2 -45.1 14.45 -45.1 15.7 -45.95 16.55 -46.85 17.45 -48.1 17.45 -49.4 17.45 -50.25 16.55" fill="#ff0000" fill-rule="evenodd" stroke="none"/>
    <path d="M-50.25 -7.2 Q-51.15 -8.05 -51.15 -9.3 -51.15 -10.55 -50.25 -11.4 -49.4 -12.3 -48.1 -12.3 -46.85 -12.3 -45.95 -11.4 -45.1 -10.55 -45.1 -9.3 -45.1 -8.05 -45.95 -7.2 -46.85 -6.3 -48.1 -6.3 -49.4 -6.3 -50.25 -7.2" fill="#ff0000" fill-rule="evenodd" stroke="none"/>
  </g>
</svg>
