<?xml version="1.0" encoding="UTF-8" standalone="no"?>
<svg xmlns:xlink="http://www.w3.org/1999/xlink" height="14.05px" width="40.15px" xmlns="http://www.w3.org/2000/svg">
  <g transform="matrix(1.0, 0.0, 0.0, 1.0, 16.05, 8.85)">
    <path d="M22.15 -4.3 L22.15 4.3 -16.05 4.3 -16.05 -4.3 22.15 -4.3" fill="#333333" fill-rule="evenodd" stroke="none"/>
    <path d="M-1.15 -0.2 L-3.35 0.1 -4.55 -8.55 -2.35 -8.85 -1.15 -0.2" fill="#333333" fill-rule="evenodd" stroke="none"/>
    <path d="M24.1 -2.3 L-16.05 -2.3 -16.05 -4.3 24.1 -4.3 24.1 -2.3" fill="#919191" fill-rule="evenodd" stroke="none"/>
    <path d="M24.1 -1.05 L24.1 0.95 -16.05 0.95 -16.05 -1.05 24.1 -1.05" fill="#6a6a6a" fill-rule="evenodd" stroke="none"/>
    <path d="M24.1 4.25 L-16.05 4.25 -16.05 2.25 24.1 2.25 24.1 4.25" fill="#6a6a6a" fill-rule="evenodd" stroke="none"/>
    <path d="M20.6 -5.55 L20.55 5.2 18.35 5.2 18.4 -5.55 20.6 -5.55" fill="#333333" fill-rule="evenodd" stroke="none"/>
    <path d="M8.1 -5.55 L8.05 5.2 5.85 5.2 5.9 -5.55 8.1 -5.55" fill="#333333" fill-rule="evenodd" stroke="none"/>
  </g>
</svg>
