<?xml version="1.0" encoding="UTF-8" standalone="no"?>
<svg xmlns:xlink="http://www.w3.org/1999/xlink" height="19.9px" width="15.15px" xmlns="http://www.w3.org/2000/svg">
  <g transform="matrix(1.0, 0.0, 0.0, 1.0, -27.0, 12.15)">
    <path d="M27.0 -12.15 Q32.8 -11.8 36.8 -7.15 L38.75 -4.45 Q42.15 1.1 42.15 6.05 L42.1 7.1 Q41.9 6.6 41.4 6.6 L40.6 7.75 40.5 7.5 40.95 6.0 Q40.95 1.6 37.35 -4.2 L36.8 -5.05 Q32.75 -11.05 27.5 -11.25 L27.45 -11.25 27.0 -12.0 27.0 -12.15" fill="#a36a6a" fill-rule="evenodd" stroke="none"/>
  </g>
</svg>
