<?xml version="1.0" encoding="UTF-8" standalone="no"?>
<svg xmlns:xlink="http://www.w3.org/1999/xlink" height="19.75px" width="129.75px" xmlns="http://www.w3.org/2000/svg">
  <g transform="matrix(1.0, 0.0, 0.0, 1.0, 0.0, 0.0)">
    <path d="M123.25 19.75 L0.0 19.75 0.0 0.0 129.75 0.0 129.75 13.25 123.25 19.75 M122.4 17.75 L127.75 12.4 127.75 2.0 2.0 2.0 2.0 17.75 122.4 17.75" fill="#980101" fill-rule="evenodd" stroke="none"/>
    <path d="M122.4 17.75 L2.0 17.75 2.0 2.0 127.75 2.0 127.75 12.4 122.4 17.75" fill="url(#gradient0)" fill-rule="evenodd" stroke="none"/>
    <path d="M127.75 3.2 L2.0 3.2 2.0 2.0 127.75 2.0 127.75 3.2" fill="#fe5f5f" fill-rule="evenodd" stroke="none"/>
  </g>
  <defs>
    <linearGradient gradientTransform="matrix(0.0, 0.0096, -0.0768, 0.0, 64.9, 9.85)" gradientUnits="userSpaceOnUse" id="gradient0" spreadMethod="pad" x1="-819.2" x2="819.2">
      <stop offset="0.0" stop-color="#ca0202"/>
      <stop offset="1.0" stop-color="#ff0000"/>
    </linearGradient>
  </defs>
</svg>
