<?xml version="1.0" encoding="UTF-8" standalone="no"?>
<svg xmlns:xlink="http://www.w3.org/1999/xlink" height="30.25px" width="30.25px" xmlns="http://www.w3.org/2000/svg">
  <g transform="matrix(1.0, 0.0, 0.0, 1.0, 15.1, 15.1)">
    <path d="M7.3 -7.55 Q7.3 -10.55 5.15 -12.7 3.05 -14.85 0.0 -14.85 -3.0 -14.85 -5.15 -12.7 -7.3 -10.55 -7.3 -7.55 -7.3 -4.5 -5.15 -2.4 -3.0 -0.25 0.0 -0.25 3.05 -0.25 5.15 -2.4 7.3 -4.5 7.3 -7.55 M10.7 -10.7 Q15.15 -6.25 15.15 0.05 15.15 6.3 10.7 10.7 6.3 15.15 0.0 15.15 -6.25 15.15 -10.7 10.7 -15.1 6.3 -15.1 0.05 -15.1 -6.25 -10.7 -10.7 -6.25 -15.1 0.0 -15.1 6.3 -15.1 10.7 -10.7" fill="#ffffff" fill-rule="evenodd" stroke="none"/>
  </g>
</svg>
