720;McTankCanon
296;gfx.MaskHole
294;McRat
747;McMoto
576;McSoldatStun
772;McBazookaReloadInit
771;McBazookaReload
539;McJeep
650;McSoldat
302;McClown
789;McTrooperShoot
184;McShootPoint
700;McArtillery
464;McTankGun
671;McJet
567;gfx.MedicBriefcase
774;McBazookaAim
565;McDualGunMan
10;BandageCuisse
355;McSniper
788;McTrooperReloadInit
787;McTrooperReload
325;McTrooperDead
766;McGunMan
424;McShotgun
226;McBigTankGun
251;McLanceMissile
230;gfx.HeliceSmall
114;McSoldatCatch
10911;_MTPCDAT
404;McHeavy
790;McTrooperAim
575;gfx.Weapon
231;gfx.Helice
768;McBazookaStandUp
106;gfx.Helmet
805;McMachineGun
775;McBazookaStand
786;McSoldatBazooka
773;McBazookaShoot
652;McIconStatus
748;McGunManShock
654;McPalette
146;clown
706;McBigTank
515;McHelico
371;FxBlood
358;FxLineShot
