<?xml version="1.0" encoding="UTF-8" standalone="no"?>
<svg xmlns:xlink="http://www.w3.org/1999/xlink" height="19.6px" width="30.25px" xmlns="http://www.w3.org/2000/svg">
  <g transform="matrix(1.0, 0.0, 0.0, 1.0, 15.1, 4.45)">
    <path d="M15.05 -0.25 Q15.05 -2.45 14.55 -4.4 15.15 -2.3 15.15 0.05 15.15 6.3 10.7 10.7 6.3 15.15 0.0 15.15 -6.25 15.15 -10.7 10.7 -15.1 6.3 -15.1 0.05 -15.1 -2.35 -14.45 -4.45 -15.0 -2.5 -15.0 -0.25 -15.0 5.95 -10.6 10.3 -6.2 14.75 0.0 14.75 6.25 14.75 10.6 10.3 15.05 5.95 15.05 -0.25" fill="#ffffff" fill-rule="evenodd" stroke="none"/>
  </g>
</svg>
