<?xml version="1.0" encoding="UTF-8" standalone="no"?>
<svg xmlns:xlink="http://www.w3.org/1999/xlink" height="4.0px" width="20.0px" xmlns="http://www.w3.org/2000/svg">
  <g transform="matrix(1.0, 0.0, 0.0, 1.0, 10.0, 2.0)">
    <path d="M-10.0 -2.0 L10.0 -2.0 10.0 2.0 -10.0 2.0 -10.0 -2.0" fill="#3c0000" fill-rule="evenodd" stroke="none"/>
  </g>
</svg>
