<?xml version="1.0" encoding="UTF-8" standalone="no"?>
<svg xmlns:xlink="http://www.w3.org/1999/xlink" height="3.75px" width="3.75px" xmlns="http://www.w3.org/2000/svg">
  <g transform="matrix(1.0, 0.0, 0.0, 1.0, 1.8, 5.6)">
    <path d="M-1.3 -2.35 L-1.3 -5.1 1.45 -5.1 1.45 -2.35 -1.3 -2.35" fill="#d1d9e9" fill-rule="evenodd" stroke="none"/>
    <path d="M-1.3 -2.35 L-1.3 -5.1 1.45 -5.1 1.45 -2.35" fill="none" stroke="#3a4e78" stroke-linecap="round" stroke-linejoin="round" stroke-width="1.0"/>
  </g>
</svg>
