<?xml version="1.0" encoding="UTF-8" standalone="no"?>
<svg xmlns:xlink="http://www.w3.org/1999/xlink" height="25.15px" width="32.1px" xmlns="http://www.w3.org/2000/svg">
  <g transform="matrix(1.0, 0.0, 0.0, 1.0, 0.7, 34.55)">
    <path d="M5.65 -9.75 Q1.6 -10.5 -0.7 -12.65 L1.9 -12.15 Q8.35 -11.35 15.55 -14.5 22.7 -17.65 26.4 -22.95 30.15 -28.25 28.25 -32.55 L27.0 -34.55 Q29.4 -33.05 30.6 -30.4 32.65 -25.65 29.3 -20.15 25.9 -14.65 18.95 -11.6 12.05 -8.55 5.65 -9.75" fill="#993300" fill-rule="evenodd" stroke="none"/>
  </g>
</svg>
