<?xml version="1.0" encoding="UTF-8" standalone="no"?>
<svg xmlns:xlink="http://www.w3.org/1999/xlink" height="14.0px" width="14.0px" xmlns="http://www.w3.org/2000/svg">
  <g transform="matrix(1.0, 0.0, 0.0, 1.0, 0.0, 0.0)">
    <path d="M13.45 0.6 Q14.0 1.15 14.0 2.0 L14.0 12.0 Q14.0 12.85 13.45 13.45 12.85 14.0 12.0 14.0 L2.0 14.0 Q1.15 14.0 0.6 13.45 0.0 12.85 0.0 12.0 L0.0 2.0 Q0.0 1.15 0.6 0.6 1.15 0.0 2.0 0.0 L12.0 0.0 Q12.85 0.0 13.45 0.6 M13.0 2.0 L12.75 1.3 12.7 1.3 Q12.4 1.0 12.0 1.0 L2.0 1.0 Q1.6 1.0 1.3 1.3 1.0 1.6 1.0 2.0 L1.0 12.0 Q1.0 12.4 1.3 12.7 L1.3 12.75 2.0 13.0 12.0 13.0 12.7 12.75 12.75 12.7 13.0 12.0 13.0 2.0" fill="#d5eaff" fill-rule="evenodd" stroke="none"/>
    <path d="M13.0 2.0 L13.0 12.0 12.75 12.7 12.7 12.75 12.0 13.0 2.0 13.0 1.3 12.75 1.3 12.7 Q1.0 12.4 1.0 12.0 L1.0 2.0 Q1.0 1.6 1.3 1.3 1.6 1.0 2.0 1.0 L12.0 1.0 Q12.4 1.0 12.7 1.3 L12.75 1.3 13.0 2.0" fill="#f7fbff" fill-rule="evenodd" stroke="none"/>
    <path d="M11.95 8.4 L8.45 8.4 8.45 11.9 5.45 11.9 5.45 8.4 1.95 8.4 1.95 5.4 5.45 5.4 5.45 1.9 8.45 1.9 8.45 5.4 11.95 5.4 11.95 8.4" fill="#ff0000" fill-rule="evenodd" stroke="none"/>
  </g>
</svg>
