<?xml version="1.0" encoding="UTF-8" standalone="no"?>
<svg xmlns:xlink="http://www.w3.org/1999/xlink" height="33.7px" width="35.55px" xmlns="http://www.w3.org/2000/svg">
  <g transform="matrix(1.0, 0.0, 0.0, 1.0, 17.25, 17.1)">
    <path d="M6.75 -11.95 L6.7 -11.45 7.0 -11.35 10.45 -9.8 Q15.0 -6.9 15.0 -1.6 15.0 3.75 12.6 7.35 8.7 13.25 -1.0 13.25 -14.25 13.25 -14.25 1.0 -14.25 -0.55 -13.9 -1.9 -15.45 -2.7 -16.0 -4.9 -16.0 -5.7 -14.55 -7.0 -13.1 -8.3 -11.4 -9.0 L-9.4 -9.55 -8.55 -9.5 -5.85 -11.5 Q-2.55 -13.55 -1.5 -12.1 -0.85 -14.15 2.55 -14.45 6.75 -14.85 6.75 -11.95" fill="#ffcc00" fill-rule="evenodd" stroke="none"/>
    <path d="M6.75 -11.95 Q6.75 -14.85 2.55 -14.45 -0.85 -14.15 -1.5 -12.1 -2.55 -13.55 -5.85 -11.5 L-8.55 -9.5 -9.4 -9.55 -11.4 -9.0 Q-13.1 -8.3 -14.55 -7.0 -16.0 -5.7 -16.0 -4.9 -15.45 -2.7 -13.9 -1.9 -14.25 -0.55 -14.25 1.0 -14.25 13.25 -1.0 13.25 8.7 13.25 12.6 7.35 15.0 3.75 15.0 -1.6 15.0 -6.9 10.45 -9.8 L7.0 -11.35 6.7 -11.45 6.75 -11.95 M14.2 -10.75 Q25.55 6.55 5.65 15.3 L-2.45 16.6 Q-10.75 15.7 -13.3 10.25 -25.1 -10.1 -1.8 -16.4 8.5 -19.15 14.2 -10.75" fill="#ff9900" fill-rule="evenodd" stroke="none"/>
  </g>
</svg>
