<?xml version="1.0" encoding="UTF-8" standalone="no"?>
<svg xmlns:xlink="http://www.w3.org/1999/xlink" height="73.35px" width="74.0px" xmlns="http://www.w3.org/2000/svg">
  <g transform="matrix(1.0, 0.0, 0.0, 1.0, 35.25, 34.35)">
    <path d="M10.9 -30.6 L6.5 -30.3 Q0.1 -28.15 0.1 -23.45 0.1 -22.45 0.65 -21.55 1.7 -19.8 4.6 -19.8 9.45 -19.8 11.6 -23.3 12.9 -25.4 12.9 -27.65 12.9 -29.95 10.9 -30.6 M-5.0 -26.5 Q-4.0 -28.15 -2.3 -29.6 1.5 -32.85 6.9 -33.95 12.35 -35.05 16.05 -33.15 20.25 -31.05 20.25 -25.8 20.25 -23.85 19.5 -22.1 17.9 -18.55 13.2 -15.75 7.6 -12.5 3.6 -12.5 -2.15 -12.5 -4.8 -16.55 -6.5 -19.05 -6.5 -21.5 -6.5 -24.15 -5.0 -26.5 M38.7 0.7 L38.75 1.3 38.5 2.3 37.25 3.9 Q35.35 5.85 33.0 5.85 30.3 5.85 29.5 3.75 29.25 3.0 29.25 1.3 29.25 -2.55 34.0 -2.3 38.3 -2.1 38.7 0.7 M26.65 11.15 Q32.2 11.2 34.75 13.3 37.35 15.35 37.5 19.25 37.65 23.1 34.25 28.7 30.8 34.25 22.85 34.25 17.7 34.25 15.1 31.3 13.9 29.95 13.25 28.05 12.9 27.0 12.75 25.35 L12.65 24.6 Q11.55 26.0 9.35 26.0 5.15 26.0 3.4 21.05 L2.5 16.05 Q2.5 13.05 4.2 11.75 5.8 10.55 8.0 11.3 L9.6 12.1 Q9.0 10.85 9.0 9.5 9.0 7.25 11.75 5.25 14.4 3.35 17.75 2.95 21.45 2.55 23.75 4.4 26.4 6.55 26.5 11.15 L26.65 11.15 M-22.9 26.4 Q-23.55 26.85 -24.35 26.85 -26.55 26.85 -27.4 24.9 L-27.8 22.9 Q-27.8 20.45 -26.1 19.9 L-24.5 19.75 Q-21.25 20.0 -21.25 23.1 -21.25 24.05 -21.95 25.25 L-22.9 26.4 M-27.05 4.0 L-27.75 4.0 Q-32.45 4.0 -34.35 -0.95 -35.25 -3.4 -35.25 -5.9 -35.25 -10.8 -31.7 -14.7 -28.45 -18.3 -23.85 -19.4 -19.4 -20.55 -16.35 -18.6 L-16.05 -18.4 Q-13.8 -16.85 -12.95 -13.9 L-10.6 -15.35 Q-5.25 -17.35 -5.25 -8.65 -5.25 -6.6 -6.25 -4.8 -7.7 -2.0 -10.85 -2.0 -12.7 -2.0 -14.2 -4.15 -15.3 -2.4 -17.1 -0.8 L-17.0 -0.85 Q-10.9 -2.8 -10.9 3.55 -10.9 4.9 -12.4 6.5 -14.7 8.9 -19.0 8.9 -21.75 8.9 -22.7 7.15 -23.15 6.4 -23.15 5.15 -23.15 3.85 -22.05 2.5 -24.65 3.8 -27.05 4.0 M-14.0 -25.5 L-14.15 -25.75 Q-14.45 -26.45 -14.3 -27.25 -14.3 -30.7 -10.85 -30.7 -7.4 -30.7 -7.4 -27.65 L-7.45 -27.2 Q-7.6 -26.45 -8.3 -25.65 -9.5 -24.3 -11.35 -24.3 -13.35 -24.3 -14.0 -25.5 M17.6 -13.4 Q17.95 -15.3 19.35 -17.0 L20.1 -17.85 Q22.45 -20.2 25.75 -20.85 29.15 -21.5 31.4 -19.85 34.0 -18.0 34.0 -13.65 34.0 -10.9 33.35 -9.65 32.1 -7.25 28.9 -6.55 L26.8 -6.25 Q27.5 -5.55 27.5 -4.05 27.5 -3.25 26.4 -2.0 25.05 -0.5 23.5 -0.5 21.8 -0.5 21.0 -2.35 L20.5 -4.15 Q20.5 -5.9 22.3 -6.6 20.8 -6.95 19.75 -7.65 L19.75 -7.25 20.0 -6.45 20.25 -5.65 Q20.25 -4.85 19.25 -4.0 18.1 -3.0 16.5 -3.0 13.05 -3.0 11.7 -6.2 11.0 -7.75 11.0 -9.25 11.0 -10.8 12.35 -12.2 13.7 -13.55 15.4 -13.75 L17.6 -13.4 M10.0 -7.2 Q9.9 -5.75 9.15 -4.9 8.05 -3.65 5.5 -3.65 2.55 -3.65 1.65 -5.25 1.25 -6.05 1.4 -6.9 L1.5 -7.85 Q2.05 -10.35 5.7 -10.85 10.0 -11.45 10.0 -7.5 L10.0 -7.35 10.0 -7.3 10.0 -7.2 M15.6 -9.4 Q16.0 -9.95 16.0 -10.4 16.0 -12.0 14.35 -12.0 12.65 -12.0 12.65 -10.45 L12.85 -9.6 Q13.25 -8.75 14.25 -8.75 15.05 -8.75 15.6 -9.4 M5.55 -7.25 Q6.0 -7.9 6.0 -8.65 6.1 -10.0 4.5 -10.0 3.5 -10.0 2.9 -9.5 2.35 -9.0 2.35 -8.25 2.35 -7.75 2.5 -7.35 2.9 -6.5 4.0 -6.5 4.95 -6.5 5.55 -7.25 M35.25 -0.4 Q35.25 -1.8 33.1 -1.85 30.9 -1.9 30.9 0.1 30.9 1.75 32.5 1.75 33.0 1.75 34.1 0.9 35.25 0.05 35.25 -0.4 M24.05 -4.15 Q24.5 -4.55 24.5 -5.1 24.5 -6.25 23.15 -6.0 21.75 -5.75 21.75 -4.65 21.75 -3.75 22.75 -3.75 23.55 -3.75 24.05 -4.15 M20.5 -14.8 L20.95 -13.0 Q21.6 -11.25 22.75 -11.25 26.25 -15.6 26.25 -16.15 26.25 -18.5 23.4 -17.9 20.5 -17.3 20.5 -14.8 M19.25 8.5 Q20.15 7.55 20.15 6.55 20.15 3.5 16.9 4.8 13.6 6.1 13.6 7.75 13.6 8.35 14.0 8.85 14.65 9.75 16.1 9.75 18.1 9.75 19.25 8.5 M24.75 19.9 Q25.75 18.1 25.75 16.9 25.75 11.2 20.9 12.8 18.95 13.45 17.5 15.05 16.0 16.8 16.0 18.6 16.0 20.1 16.4 20.65 17.45 22.35 21.25 22.35 23.35 22.35 24.75 19.9 M0.0 6.5 Q-1.15 8.4 -3.75 8.4 -6.75 8.4 -7.75 6.5 -8.25 5.55 -8.15 4.5 -8.15 0.0 -3.7 -0.25 0.75 -0.5 0.75 4.05 0.75 5.3 0.0 6.5 M8.1 15.2 Q8.5 14.75 8.5 14.2 8.5 12.4 6.4 11.9 4.25 11.45 4.25 13.65 L4.5 14.7 Q5.1 15.75 6.75 15.75 7.6 15.75 8.1 15.2 M11.95 14.55 Q12.7 15.85 13.1 17.6 13.55 16.4 14.5 15.4 13.05 15.15 11.95 14.55 M0.85 32.1 Q1.2 33.0 2.25 33.0 2.8 33.0 3.25 32.55 L3.75 31.5 Q3.75 30.1 2.25 30.1 0.75 30.05 0.75 31.45 L0.85 32.1 M7.0 35.2 Q5.75 36.35 3.0 36.35 0.55 36.35 -0.5 34.75 -1.05 33.9 -1.05 32.9 -1.05 29.1 3.5 29.0 8.0 28.85 8.0 32.8 8.0 34.25 7.0 35.2 M-10.75 -29.35 Q-12.0 -29.35 -12.0 -28.3 L-11.75 -27.5 Q-11.4 -26.8 -10.75 -26.8 -10.1 -26.8 -9.75 -27.3 L-9.55 -28.1 Q-9.55 -29.35 -10.75 -29.35 M-30.9 -6.75 Q-30.05 -4.8 -27.35 -4.8 -22.0 -4.8 -19.55 -7.95 -18.05 -9.95 -18.05 -12.1 -18.05 -15.0 -20.1 -15.9 L-24.65 -15.75 Q-27.25 -14.8 -29.2 -12.9 -31.25 -10.85 -31.25 -8.75 -31.35 -7.75 -30.9 -6.75 M-11.75 -9.5 L-11.5 -8.0 Q-10.95 -6.5 -9.5 -6.5 -8.5 -6.5 -7.95 -7.25 -7.5 -7.85 -7.5 -8.6 -7.5 -12.3 -9.6 -12.4 -11.75 -12.5 -11.75 -9.5 M-4.3 4.7 Q-3.85 5.65 -2.75 5.65 -1.95 5.65 -1.4 5.2 -0.9 4.8 -0.9 4.15 -0.9 2.3 -2.7 2.15 -4.5 2.0 -4.5 3.7 L-4.3 4.7 M-17.5 5.65 Q-16.2 5.65 -15.25 4.5 -14.5 3.65 -14.5 3.05 -14.5 0.8 -17.0 1.15 -19.5 1.5 -19.5 3.5 L-19.25 4.6 Q-18.8 5.65 -17.5 5.65 M-16.2 10.7 Q-15.65 11.25 -15.65 12.8 -15.65 14.25 -16.5 15.05 -17.8 16.25 -21.25 16.25 -23.8 16.25 -25.0 14.3 -25.65 13.3 -25.75 12.2 -25.75 10.95 -24.95 10.1 -23.55 8.65 -20.0 8.9 -16.9 10.0 -16.2 10.7 M-15.5 15.75 Q-13.2 13.15 -10.0 12.6 -6.7 12.0 -4.5 13.9 -2.0 16.05 -2.0 20.55 -2.0 23.3 -3.5 25.25 -6.1 28.75 -12.75 28.75 -16.3 28.75 -17.5 25.7 L-18.0 22.45 Q-18.0 18.55 -15.5 15.75 M-13.75 23.5 Q-13.3 24.65 -12.0 24.65 -9.0 24.65 -7.75 22.15 -7.0 20.7 -7.0 18.7 -7.0 16.65 -8.1 15.9 -9.1 15.25 -10.5 15.9 -14.0 17.5 -14.0 22.25 L-13.75 23.5 M-26.3 23.0 L-26.15 23.7 Q-25.8 24.4 -24.75 24.4 -23.95 24.4 -23.5 23.75 -23.15 23.25 -23.15 22.75 -23.15 21.3 -24.7 21.4 -26.3 21.5 -26.3 23.0 M-24.25 12.75 L-24.05 13.65 Q-23.65 14.5 -22.35 14.5 -21.3 14.5 -20.6 13.65 -20.0 12.95 -20.0 12.15 -20.0 10.3 -22.1 10.65 -24.25 10.95 -24.25 12.75" fill="#430101" fill-rule="evenodd" stroke="none"/>
    <path d="M10.9 -30.6 Q12.9 -29.95 12.9 -27.65 12.9 -25.4 11.6 -23.3 9.45 -19.8 4.6 -19.8 1.7 -19.8 0.65 -21.55 0.1 -22.45 0.1 -23.45 0.1 -28.15 6.5 -30.3 L10.9 -30.6 M5.55 -7.25 Q4.95 -6.5 4.0 -6.5 2.9 -6.5 2.5 -7.35 2.35 -7.75 2.35 -8.25 2.35 -9.0 2.9 -9.5 3.5 -10.0 4.5 -10.0 6.1 -10.0 6.0 -8.65 6.0 -7.9 5.55 -7.25 M15.6 -9.4 Q15.05 -8.75 14.25 -8.75 13.25 -8.75 12.85 -9.6 L12.65 -10.45 Q12.65 -12.0 14.35 -12.0 16.0 -12.0 16.0 -10.4 16.0 -9.95 15.6 -9.4 M20.5 -14.8 Q20.5 -17.3 23.4 -17.9 26.25 -18.5 26.25 -16.15 26.25 -15.6 22.75 -11.25 21.6 -11.25 20.95 -13.0 L20.5 -14.8 M24.05 -4.15 Q23.55 -3.75 22.75 -3.75 21.75 -3.75 21.75 -4.65 21.75 -5.75 23.15 -6.0 24.5 -6.25 24.5 -5.1 24.5 -4.55 24.05 -4.15 M35.25 -0.4 Q35.25 0.05 34.1 0.9 33.0 1.75 32.5 1.75 30.9 1.75 30.9 0.1 30.9 -1.9 33.1 -1.85 35.25 -1.8 35.25 -0.4 M24.75 19.9 Q23.35 22.35 21.25 22.35 17.45 22.35 16.4 20.65 16.0 20.1 16.0 18.6 16.0 16.8 17.5 15.05 18.95 13.45 20.9 12.8 25.75 11.2 25.75 16.9 25.75 18.1 24.75 19.9 M19.25 8.5 Q18.1 9.75 16.1 9.75 14.65 9.75 14.0 8.85 13.6 8.35 13.6 7.75 13.6 6.1 16.9 4.8 20.15 3.5 20.15 6.55 20.15 7.55 19.25 8.5 M8.1 15.2 Q7.6 15.75 6.75 15.75 5.1 15.75 4.5 14.7 L4.25 13.65 Q4.25 11.45 6.4 11.9 8.5 12.4 8.5 14.2 8.5 14.75 8.1 15.2 M0.85 32.1 L0.75 31.45 Q0.75 30.05 2.25 30.1 3.75 30.1 3.75 31.5 L3.25 32.55 Q2.8 33.0 2.25 33.0 1.2 33.0 0.85 32.1 M-10.75 -29.35 Q-9.55 -29.35 -9.55 -28.1 L-9.75 -27.3 Q-10.1 -26.8 -10.75 -26.8 -11.4 -26.8 -11.75 -27.5 L-12.0 -28.3 Q-12.0 -29.35 -10.75 -29.35 M-30.9 -6.75 Q-31.35 -7.75 -31.25 -8.75 -31.25 -10.85 -29.2 -12.9 -27.25 -14.8 -24.65 -15.75 L-20.1 -15.9 Q-18.05 -15.0 -18.05 -12.1 -18.05 -9.95 -19.55 -7.95 -22.0 -4.8 -27.35 -4.8 -30.05 -4.8 -30.9 -6.75 M-11.75 -9.5 Q-11.75 -12.5 -9.6 -12.4 -7.5 -12.3 -7.5 -8.6 -7.5 -7.85 -7.95 -7.25 -8.5 -6.5 -9.5 -6.5 -10.95 -6.5 -11.5 -8.0 L-11.75 -9.5 M-4.3 4.7 L-4.5 3.7 Q-4.5 2.0 -2.7 2.15 -0.9 2.3 -0.9 4.15 -0.9 4.8 -1.4 5.2 -1.95 5.65 -2.75 5.65 -3.85 5.65 -4.3 4.7 M-17.5 5.65 Q-18.8 5.65 -19.25 4.6 L-19.5 3.5 Q-19.5 1.5 -17.0 1.15 -14.5 0.8 -14.5 3.05 -14.5 3.65 -15.25 4.5 -16.2 5.65 -17.5 5.65 M-13.75 23.5 L-14.0 22.25 Q-14.0 17.5 -10.5 15.9 -9.1 15.25 -8.1 15.9 -7.0 16.65 -7.0 18.7 -7.0 20.7 -7.75 22.15 -9.0 24.65 -12.0 24.65 -13.3 24.65 -13.75 23.5 M-24.25 12.75 Q-24.25 10.95 -22.1 10.65 -20.0 10.3 -20.0 12.15 -20.0 12.95 -20.6 13.65 -21.3 14.5 -22.35 14.5 -23.65 14.5 -24.05 13.65 L-24.25 12.75 M-26.3 23.0 Q-26.3 21.5 -24.7 21.4 -23.15 21.3 -23.15 22.75 -23.15 23.25 -23.5 23.75 -23.95 24.4 -24.75 24.4 -25.8 24.4 -26.15 23.7 L-26.3 23.0" fill="#760101" fill-rule="evenodd" stroke="none"/>
    <path d="M19.5 -22.1 L19.5 -22.05 Q20.0 -21.05 20.0 -19.8 L19.85 -18.3 19.9 -18.45 20.9 -19.4 Q23.4 -21.35 26.75 -21.6 30.3 -21.85 32.6 -19.95 35.25 -17.75 35.25 -13.35 35.25 -11.3 33.2 -8.85 L31.1 -6.5 Q31.1 -5.6 30.1 -5.1 L29.95 -5.0 30.0 -4.15 30.0 -3.65 Q30.9 -4.2 31.95 -4.6 L36.65 -4.8 Q38.75 -3.85 38.75 -0.55 L38.7 0.7 Q38.3 -2.1 34.0 -2.3 29.25 -2.55 29.25 1.3 29.25 3.0 29.5 3.75 30.3 5.85 33.0 5.85 35.35 5.85 37.25 3.9 L38.5 2.3 Q37.2 8.0 30.35 8.0 28.65 8.0 27.5 7.2 L27.5 7.6 27.25 10.05 26.65 11.15 26.5 11.15 Q26.4 6.55 23.75 4.4 21.45 2.55 17.75 2.95 14.4 3.35 11.75 5.25 9.0 7.25 9.0 9.5 9.0 10.85 9.6 12.1 L8.0 11.3 Q5.8 10.55 4.2 11.75 2.5 13.05 2.5 16.05 L3.4 21.05 Q5.15 26.0 9.35 26.0 11.55 26.0 12.65 24.6 L12.75 25.35 Q12.9 27.0 13.25 28.05 13.9 29.95 15.1 31.3 L14.25 32.1 Q12.75 33.35 10.5 33.35 L8.25 33.1 Q7.9 39.0 0.1 39.0 -6.0 39.0 -6.0 33.55 -6.0 30.65 -3.75 28.4 L-3.65 28.35 Q-6.45 30.0 -10.5 30.0 -17.2 30.0 -19.15 26.05 L-21.6 26.5 -22.9 26.4 -21.95 25.25 Q-21.25 24.05 -21.25 23.1 -21.25 20.0 -24.5 19.75 L-26.1 19.9 -25.1 18.75 -23.2 17.55 -25.05 16.25 Q-26.4 15.3 -27.05 13.8 L-27.5 11.65 Q-27.5 10.85 -26.95 9.9 L-26.4 8.75 -27.25 5.4 -27.05 4.0 Q-24.65 3.8 -22.05 2.5 -23.15 3.85 -23.15 5.15 -23.15 6.4 -22.7 7.15 -21.75 8.9 -19.0 8.9 -14.7 8.9 -12.4 6.5 -10.9 4.9 -10.9 3.55 -10.9 -2.8 -17.0 -0.85 L-17.1 -0.8 Q-15.3 -2.4 -14.2 -4.15 -12.7 -2.0 -10.85 -2.0 -7.7 -2.0 -6.25 -4.8 -5.25 -6.6 -5.25 -8.65 -5.25 -17.35 -10.6 -15.35 L-12.95 -13.9 Q-13.8 -16.85 -16.05 -18.4 L-16.35 -18.6 -16.75 -18.85 -16.8 -19.65 Q-16.8 -21.85 -15.05 -24.3 L-14.0 -25.5 Q-13.35 -24.3 -11.35 -24.3 -9.5 -24.3 -8.3 -25.65 -7.6 -26.45 -7.45 -27.2 L-5.0 -26.5 Q-6.5 -24.15 -6.5 -21.5 -6.5 -19.05 -4.8 -16.55 -2.15 -12.5 3.6 -12.5 7.6 -12.5 13.2 -15.75 17.9 -18.55 19.5 -22.1 M10.0 -7.2 L10.0 -7.3 10.0 -7.35 10.0 -7.5 Q10.0 -11.45 5.7 -10.85 2.05 -10.35 1.5 -7.85 L1.4 -6.9 Q1.25 -6.05 1.65 -5.25 2.55 -3.65 5.5 -3.65 8.05 -3.65 9.15 -4.9 9.9 -5.75 10.0 -7.2 M17.6 -13.4 L15.4 -13.75 Q13.7 -13.55 12.35 -12.2 11.0 -10.8 11.0 -9.25 11.0 -7.75 11.7 -6.2 13.05 -3.0 16.5 -3.0 18.1 -3.0 19.25 -4.0 20.25 -4.85 20.25 -5.65 L20.0 -6.45 19.75 -7.25 19.75 -7.65 Q20.8 -6.95 22.3 -6.6 20.5 -5.9 20.5 -4.15 L21.0 -2.35 Q21.8 -0.5 23.5 -0.5 25.05 -0.5 26.4 -2.0 27.5 -3.25 27.5 -4.05 27.5 -5.55 26.8 -6.25 L28.9 -6.55 Q32.1 -7.25 33.35 -9.65 34.0 -10.9 34.0 -13.65 34.0 -18.0 31.4 -19.85 29.15 -21.5 25.75 -20.85 22.45 -20.2 20.1 -17.85 L19.35 -17.0 Q17.95 -15.3 17.6 -13.4 M11.1 -1.5 Q9.3 0.75 6.35 0.75 2.45 0.75 0.15 -1.75 L-1.1 -0.7 Q1.3 0.05 2.75 2.65 4.0 4.85 4.0 6.55 4.0 7.25 3.0 10.25 L2.9 10.4 7.5 9.9 Q7.0 8.45 7.0 6.65 7.0 3.9 7.95 2.8 9.4 1.15 14.75 -0.65 L11.95 -2.7 11.1 -1.5 M17.85 -0.75 L17.75 -0.75 18.65 -0.5 19.85 -0.5 17.85 -0.75 M0.0 6.5 Q0.75 5.3 0.75 4.05 0.75 -0.5 -3.7 -0.25 -8.15 0.0 -8.15 4.5 -8.25 5.55 -7.75 6.5 -6.75 8.4 -3.75 8.4 -1.15 8.4 0.0 6.5 M1.25 20.25 L1.25 20.5 Q1.25 23.25 -1.0 26.0 L-1.85 26.95 Q-0.5 26.15 1.15 25.85 3.4 25.45 5.1 26.35 L5.2 26.2 Q2.7 24.7 1.3 20.55 L1.25 20.25 M7.0 35.2 Q8.0 34.25 8.0 32.8 8.0 28.85 3.5 29.0 -1.05 29.1 -1.05 32.9 -1.05 33.9 -0.5 34.75 0.55 36.35 3.0 36.35 5.75 36.35 7.0 35.2 M-1.6 -6.95 L-1.5 -7.3 -1.75 -7.3 -1.6 -6.95 M-8.15 0.85 L-8.05 0.75 -8.5 0.9 -8.65 1.25 -8.15 0.85 M-9.75 7.35 Q-10.8 8.05 -11.0 10.1 L-10.9 11.15 -9.15 11.5 -8.1 11.15 -7.5 10.75 -9.75 7.35 M-15.5 15.75 Q-18.0 18.55 -18.0 22.45 L-17.5 25.7 Q-16.3 28.75 -12.75 28.75 -6.1 28.75 -3.5 25.25 -2.0 23.3 -2.0 20.55 -2.0 16.05 -4.5 13.9 -6.7 12.0 -10.0 12.6 -13.2 13.15 -15.5 15.75 M-16.2 10.7 Q-16.9 10.0 -20.0 8.9 -23.55 8.65 -24.95 10.1 -25.75 10.95 -25.75 12.2 -25.65 13.3 -25.0 14.3 -23.8 16.25 -21.25 16.25 -17.8 16.25 -16.5 15.05 -15.65 14.25 -15.65 12.8 -15.65 11.25 -16.2 10.7 M-2.75 12.85 Q-0.35 14.35 0.65 16.85 L-0.25 12.6 -2.75 12.85" fill="#000000" fill-rule="evenodd" stroke="none"/>
  </g>
</svg>
