<?xml version="1.0" encoding="UTF-8" standalone="no"?>
<svg xmlns:xlink="http://www.w3.org/1999/xlink" height="6.3px" width="4.85px" xmlns="http://www.w3.org/2000/svg">
  <g transform="matrix(1.0, 0.0, 0.0, 1.0, 2.4, 3.15)">
    <path d="M0.7 -0.55 L2.45 -0.55 1.15 0.7 1.9 2.8 0.25 1.55 -1.35 3.15 -0.9 0.65 -2.4 -0.55 -0.7 -0.55 -0.25 -3.15 0.7 -0.55" fill="#ffff00" fill-rule="evenodd" stroke="none"/>
  </g>
</svg>
