<?xml version="1.0" encoding="UTF-8" standalone="no"?>
<svg xmlns:xlink="http://www.w3.org/1999/xlink" height="14.3px" width="14.45px" xmlns="http://www.w3.org/2000/svg">
  <g transform="matrix(1.0, 0.0, 0.0, 1.0, -0.65, -0.65)">
    <path d="M12.9 8.55 L15.1 10.7 15.0 12.85 14.8 13.0 13.2 11.4 11.7 12.9 13.3 14.5 12.9 14.95 10.55 14.95 8.8 13.15 8.85 10.55 8.55 10.3 10.4 8.5 10.65 8.75 12.9 8.55 M7.45 5.55 L5.6 7.3 5.1 6.8 2.85 7.05 0.65 4.85 0.8 2.7 0.95 2.55 2.55 4.15 4.05 2.65 2.45 1.05 2.85 0.65 5.2 0.65 6.95 2.4 6.9 5.0 7.45 5.55" fill="#ffffff" fill-rule="evenodd" stroke="none"/>
  </g>
</svg>
