<?xml version="1.0" encoding="UTF-8" standalone="no"?>
<svg xmlns:xlink="http://www.w3.org/1999/xlink" height="14.0px" width="8.1px" xmlns="http://www.w3.org/2000/svg">
  <g transform="matrix(1.0, 0.0, 0.0, 1.0, 4.05, 7.0)">
    <path d="M2.5 -6.55 L2.55 -6.55 3.35 -5.9 3.85 -4.9 4.05 -3.7 4.0 -3.15 Q3.75 -2.4 3.1 -2.25 L2.95 2.3 0.25 2.3 0.0 -2.55 Q2.35 -3.7 2.9 -4.45 L2.8 -4.85 2.85 -4.9 2.5 -6.55 M-3.1 6.1 L-3.1 6.05 -4.0 6.05 -4.0 3.3 -3.05 3.3 -2.45 3.3 -2.25 5.4 -2.25 6.1 -3.1 6.1 M-3.05 2.3 L-4.0 2.3 -4.0 -3.0 -4.0 -3.9 -3.55 -3.65 Q-2.55 -3.2 -2.55 -1.8 L-2.45 -0.25 -2.25 2.0 -2.25 2.3 -3.05 2.3 M0.05 3.3 L2.85 3.3 2.85 3.45 2.95 5.55 2.95 6.1 0.25 6.1 0.1 5.85 0.1 3.85 0.05 3.3" fill="#e3b602" fill-rule="evenodd" stroke="none"/>
    <path d="M-4.0 -3.9 Q-3.9 -5.8 -2.6 -6.5 L-1.1 -6.95 0.0 -7.0 0.6 -7.0 1.7 -6.85 2.5 -6.55 2.85 -4.9 2.8 -4.85 2.9 -4.45 Q2.35 -3.7 0.0 -2.55 L0.0 -2.65 -0.2 -4.3 -1.0 -3.75 Q-1.35 -1.8 -0.95 0.35 L-0.65 2.3 -2.25 2.3 -2.25 2.0 -2.45 -0.25 -2.55 -1.8 Q-2.55 -3.2 -3.55 -3.65 L-4.0 -3.9 M-0.85 -4.8 Q-0.45 -5.3 -0.45 -5.75 -0.45 -6.5 -1.0 -6.5 -1.85 -6.5 -2.5 -5.85 L-3.05 -5.0 Q-3.05 -4.2 -2.2 -4.2 -1.35 -4.2 -0.85 -4.8 M-2.45 3.3 L-0.8 3.3 -0.95 3.85 -0.95 4.85 -0.9 6.1 -2.25 6.1 -2.25 5.4 -2.45 3.3" fill="#f4c402" fill-rule="evenodd" stroke="none"/>
    <path d="M4.05 -3.7 L4.0 -3.0 4.0 2.3 3.0 2.3 2.95 2.3 3.1 -2.25 Q3.75 -2.4 4.0 -3.15 L4.05 -3.7 M3.0 3.3 L4.0 3.3 4.0 6.05 3.0 6.05 3.0 6.1 2.95 6.1 2.95 5.55 2.85 3.45 2.85 3.3 3.0 3.3" fill="#d2a902" fill-rule="evenodd" stroke="none"/>
    <path d="M-0.65 2.3 L-0.95 0.35 Q-1.35 -1.8 -1.0 -3.75 L-0.2 -4.3 0.0 -2.65 0.0 -2.55 0.25 2.3 -0.65 2.3 M-0.85 -4.8 Q-1.35 -4.2 -2.2 -4.2 -3.05 -4.2 -3.05 -5.0 L-2.5 -5.85 Q-1.85 -6.5 -1.0 -6.5 -0.45 -6.5 -0.45 -5.75 -0.45 -5.3 -0.85 -4.8 M-1.75 -5.9 L-2.15 -5.7 -2.35 -5.4 Q-2.4 -5.0 -1.9 -5.0 L-1.55 -5.15 -1.35 -5.55 Q-1.4 -5.9 -1.75 -5.9 M-0.9 6.1 L-0.95 4.85 -0.95 3.85 -0.8 3.3 0.05 3.3 0.1 3.85 0.1 5.85 0.25 6.1 -0.9 6.1" fill="#fdd535" fill-rule="evenodd" stroke="none"/>
    <path d="M3.0 2.3 L3.0 3.3 2.85 3.3 0.05 3.3 -0.8 3.3 -2.45 3.3 -3.05 3.3 -3.05 2.3 -2.25 2.3 -0.65 2.3 0.25 2.3 2.95 2.3 3.0 2.3 M3.0 6.1 L3.0 7.0 -3.1 7.0 -3.1 6.1 -2.25 6.1 -0.9 6.1 0.25 6.1 2.95 6.1 3.0 6.1" fill="#a08001" fill-rule="evenodd" stroke="none"/>
    <path d="M-1.75 -5.9 Q-1.4 -5.9 -1.35 -5.55 L-1.55 -5.15 -1.9 -5.0 Q-2.4 -5.0 -2.35 -5.4 L-2.15 -5.7 -1.75 -5.9" fill="#fde68a" fill-rule="evenodd" stroke="none"/>
  </g>
</svg>
