<?xml version="1.0" encoding="UTF-8" standalone="no"?>
<svg xmlns:xlink="http://www.w3.org/1999/xlink" height="160.0px" width="320.0px" xmlns="http://www.w3.org/2000/svg">
  <g transform="matrix(1.0, 0.0, 0.0, 1.0, 160.0, 80.0)">
    <path d="M113.15 -56.55 Q160.0 -33.15 160.0 0.0 160.0 33.15 113.15 56.55 66.3 80.0 0.0 80.0 -66.25 80.0 -113.1 56.55 -160.0 33.15 -160.0 0.0 -160.0 -33.15 -113.1 -56.55 -66.25 -80.0 0.0 -80.0 66.3 -80.0 113.15 -56.55" fill="url(#gradient0)" fill-rule="evenodd" stroke="none"/>
  </g>
  <defs>
    <radialGradient cx="0" cy="0" gradientTransform="matrix(0.1973, 0.0, 0.0, 0.0987, 0.0, 0.0)" gradientUnits="userSpaceOnUse" id="gradient0" r="819.2" spreadMethod="pad">
      <stop offset="0.0" stop-color="#ffffff" stop-opacity="0.29803923"/>
      <stop offset="1.0" stop-color="#ffffff" stop-opacity="0.0"/>
    </radialGradient>
  </defs>
</svg>
