<?xml version="1.0" encoding="UTF-8" standalone="no"?>
<svg xmlns:xlink="http://www.w3.org/1999/xlink" height="8.8px" width="6.65px" xmlns="http://www.w3.org/2000/svg">
  <g transform="matrix(1.0, 0.0, 0.0, 1.0, -1.7, 3.85)">
    <path d="M4.65 -3.85 L5.95 -0.25 8.35 -0.25 6.55 1.5 7.6 4.45 5.35 2.7 3.15 4.95 3.75 1.45 1.7 -0.25 4.05 -0.25 4.65 -3.85" fill="#000000" fill-opacity="0.49803922" fill-rule="evenodd" stroke="none"/>
  </g>
</svg>
