<?xml version="1.0" encoding="UTF-8" standalone="no"?>
<svg xmlns:xlink="http://www.w3.org/1999/xlink" height="59.25px" width="22.75px" xmlns="http://www.w3.org/2000/svg">
  <g transform="matrix(1.0, 0.0, 0.0, 1.0, -10.75, 31.5)">
    <path d="M14.25 -28.25 Q13.7 -27.5 12.75 -27.5 11.5 -27.5 11.0 -28.45 L10.75 -29.5 Q10.75 -31.85 12.7 -31.45 14.65 -31.05 14.65 -29.4 14.65 -28.8 14.25 -28.25 M32.95 26.9 Q32.25 27.75 31.25 27.75 29.9 27.75 29.45 26.65 L29.25 25.55 Q29.25 23.45 31.4 23.45 33.5 23.45 33.5 25.55 L32.95 26.9" fill="#000000" fill-rule="evenodd" stroke="none"/>
  </g>
</svg>
