<?xml version="1.0" encoding="UTF-8" standalone="no"?>
<svg xmlns:xlink="http://www.w3.org/1999/xlink" height="8.0px" width="56.0px" xmlns="http://www.w3.org/2000/svg">
  <g transform="matrix(1.0, 0.0, 0.0, 1.0, 0.0, 0.0)">
    <path d="M48.0 8.0 L48.0 0.0 56.0 0.0 56.0 8.0 48.0 8.0" fill="#a0b4c5" fill-rule="evenodd" stroke="none"/>
    <path d="M48.0 0.0 L48.0 8.0 40.0 8.0 40.0 0.0 48.0 0.0" fill="#234adb" fill-rule="evenodd" stroke="none"/>
    <path d="M24.0 8.0 L24.0 0.0 32.0 0.0 32.0 8.0 24.0 8.0" fill="#42db23" fill-rule="evenodd" stroke="none"/>
    <path d="M24.0 0.0 L24.0 8.0 16.0 8.0 16.0 0.0 24.0 0.0" fill="#dbd223" fill-rule="evenodd" stroke="none"/>
    <path d="M40.0 0.0 L40.0 8.0 32.0 8.0 32.0 0.0 40.0 0.0" fill="#23a2db" fill-rule="evenodd" stroke="none"/>
    <path d="M8.0 0.0 L8.0 8.0 0.0 8.0 0.0 0.0 8.0 0.0" fill="#db2424" fill-rule="evenodd" stroke="none"/>
    <path d="M16.0 0.0 L16.0 8.0 8.0 8.0 8.0 0.0 16.0 0.0" fill="#db8115" fill-rule="evenodd" stroke="none"/>
  </g>
</svg>
