<?xml version="1.0" encoding="UTF-8" standalone="no"?>
<svg xmlns:xlink="http://www.w3.org/1999/xlink" height="6.1px" width="6.1px" xmlns="http://www.w3.org/2000/svg">
  <g transform="matrix(1.0, 0.0, 0.0, 1.0, 3.05, 3.05)">
    <path d="M2.15 -2.15 Q3.05 -1.25 3.05 0.0 3.05 1.25 2.15 2.15 1.25 3.05 0.0 3.05 -1.25 3.05 -2.15 2.15 -3.05 1.25 -3.05 0.0 -3.05 -1.25 -2.15 -2.15 -1.25 -3.05 0.0 -3.05 1.25 -3.05 2.15 -2.15 M-1.5 -0.6 Q-1.75 -0.9 -2.1 -0.9 L-2.7 -0.6 -3.0 0.0 -2.7 0.6 -2.1 0.9 Q-1.75 0.9 -1.5 0.6 -1.2 0.35 -1.2 0.0 L-1.5 -0.6" fill="#ffffff" fill-rule="evenodd" stroke="none"/>
  </g>
</svg>
