<?xml version="1.0" encoding="UTF-8" standalone="no"?>
<svg xmlns:xlink="http://www.w3.org/1999/xlink" height="1.75px" width="10.5px" xmlns="http://www.w3.org/2000/svg">
  <g transform="matrix(1.0, 0.0, 0.0, 1.0, -69.35, 21.7)">
    <path d="M76.4 -20.4 L75.1 -20.15 73.85 -20.35 72.6 -20.6 70.15 -20.85 Q69.35 -20.95 69.35 -21.3 L69.6 -21.65 70.95 -21.7 Q74.9 -21.7 76.4 -20.4 M79.85 -20.2 Q79.85 -19.95 79.1 -19.95 78.4 -19.95 78.4 -20.15 78.4 -20.45 79.2 -20.45 79.85 -20.45 79.85 -20.2" fill="#ffffff" fill-rule="evenodd" stroke="none"/>
  </g>
</svg>
