<?xml version="1.0" encoding="UTF-8" standalone="no"?>
<svg xmlns:xlink="http://www.w3.org/1999/xlink" height="44.25px" width="37.4px" xmlns="http://www.w3.org/2000/svg">
  <g transform="matrix(1.0, 0.0, 0.0, 1.0, 17.95, 28.0)">
    <use height="28.6" id="_p1" transform="matrix(1.0, 0.0, 0.0, 1.0, -17.0, -14.3)" width="34.05" xlink:href="#sprite0"/>
  </g>
  <defs/>
</svg>
