<?xml version="1.0" encoding="UTF-8" standalone="no"?>
<svg xmlns:xlink="http://www.w3.org/1999/xlink" height="0.1px" width="0.8px" xmlns="http://www.w3.org/2000/svg">
  <g transform="matrix(1.0, 0.0, 0.0, 1.0, -677.5, -205.05)">
    <path d="M678.3 205.05 L678.3 205.1 677.5 205.15 678.3 205.05" fill="#6a4f26" fill-rule="evenodd" stroke="none"/>
  </g>
</svg>
