<?xml version="1.0" encoding="UTF-8" standalone="no"?>
<svg xmlns:xlink="http://www.w3.org/1999/xlink" height="34.55px" width="42.6px" xmlns="http://www.w3.org/2000/svg">
  <g transform="matrix(1.0, 0.0, 0.0, 1.0, 19.6, 18.3)">
    <use height="34.55" id="_p1" transform="matrix(1.0, 0.0, 0.0, 1.0, -19.55, -18.3)" width="42.55" xlink:href="#sprite0"/>
  </g>
  <defs/>
</svg>
