<?xml version="1.0" encoding="UTF-8" standalone="no"?>
<svg xmlns:xlink="http://www.w3.org/1999/xlink" height="57.55px" width="61.65px" xmlns="http://www.w3.org/2000/svg">
  <g transform="matrix(1.0, 0.0, 0.0, 1.0, 30.85, 31.65)">
    <use height="23.55" transform="matrix(1.0, 0.0, 0.0, 1.0, -30.85, -31.05)" width="61.65" xlink:href="#sprite0"/>
  </g>
  <defs>
    <g id="sprite0" transform="matrix(1.0, 0.0, 0.0, 1.0, 30.85, 11.65)">
      <use height="23.55" id="+Da3+" transform="matrix(1.2465, 0.0, 0.0, 1.0, -30.8429, -11.65)" width="49.45" xlink:href="#text0"/>
    </g>
  </defs>
</svg>
