<?xml version="1.0" encoding="UTF-8" standalone="no"?>
<svg xmlns:xlink="http://www.w3.org/1999/xlink" height="17.75px" width="23.05px" xmlns="http://www.w3.org/2000/svg">
  <g transform="matrix(1.0, 0.0, 0.0, 1.0, 12.05, 12.0)">
    <use height="16.4" transform="matrix(1.0, 0.0, 0.0, 1.0, -5.55, -10.65)" width="15.65" xlink:href="#shape0"/>
  </g>
  <defs>
    <g id="shape0" transform="matrix(1.0, 0.0, 0.0, 1.0, 5.55, 10.65)">
      <path d="M10.1 -1.45 Q10.1 0.5 8.7 2.0 L7.9 2.75 6.9 4.25 Q5.35 5.75 2.15 5.75 -3.2 5.75 -4.85 4.4 -5.55 3.8 -5.55 2.7 -2.15 -1.55 1.25 -3.75 L3.0 -4.7 3.2 -6.3 Q3.3 -8.3 3.95 -9.0 7.7 -12.85 9.25 -7.8 10.1 -5.1 10.1 -1.45" fill="#cccccc" fill-rule="evenodd" stroke="none"/>
    </g>
  </defs>
</svg>
