<?xml version="1.0" encoding="UTF-8" standalone="no"?>
<svg xmlns:xlink="http://www.w3.org/1999/xlink" height="19.05px" width="18.7px" xmlns="http://www.w3.org/2000/svg">
  <g transform="matrix(1.0, 0.0, 0.0, 1.0, 0.0, 0.0)">
    <use height="19.05" transform="matrix(1.0, 0.0, 0.0, 1.0, 0.0, 0.0)" width="18.7" xlink:href="#shape0"/>
  </g>
  <defs>
    <g id="shape0" transform="matrix(1.0, 0.0, 0.0, 1.0, 0.0, 0.0)">
      <path d="M2.95 18.4 L0.9 16.85 Q-0.45 15.4 0.2 13.6 1.65 9.8 3.35 6.35 4.45 4.1 6.4 2.65 L7.0 2.2 Q9.2 1.3 11.65 0.6 L10.7 1.6 8.95 2.9 Q7.7 3.8 6.95 5.45 6.15 7.05 5.6 8.75 L4.65 11.7 3.95 14.6 2.95 18.4" fill="#ffffff" fill-rule="evenodd" stroke="none"/>
      <path d="M11.65 0.6 L12.4 0.35 Q15.0 -0.35 17.75 0.45 L18.7 0.65 Q16.0 1.4 14.15 3.55 12.5 5.45 11.45 7.6 10.3 9.85 10.0 12.35 L9.4 16.85 Q9.3 17.6 8.7 18.0 7.75 18.65 6.6 19.0 4.55 19.15 2.95 18.4 L3.95 14.6 4.65 11.7 5.6 8.75 Q6.15 7.05 6.95 5.45 7.7 3.8 8.95 2.9 L10.7 1.6 11.65 0.6" fill="#d6baba" fill-rule="evenodd" stroke="none"/>
      <path d="M11.65 0.6 L12.4 0.35 Q15.0 -0.35 17.75 0.45 L18.7 0.65 Q16.0 1.4 14.15 3.55 12.5 5.45 11.45 7.6 10.3 9.85 10.0 12.35 L9.4 16.85 Q9.3 17.6 8.7 18.0 7.75 18.65 6.6 19.0 4.55 19.15 2.95 18.4 L0.9 16.85 Q-0.45 15.4 0.2 13.6 1.65 9.8 3.35 6.35 4.45 4.1 6.4 2.65 L7.0 2.2 Q9.2 1.3 11.65 0.6 Z" fill="none" stroke="#000000" stroke-linecap="round" stroke-linejoin="round" stroke-opacity="0.3019608" stroke-width="0.05"/>
    </g>
  </defs>
</svg>
