<?xml version="1.0" encoding="UTF-8" standalone="no"?>
<svg xmlns:xlink="http://www.w3.org/1999/xlink" height="3.4px" width="6.75px" xmlns="http://www.w3.org/2000/svg">
  <g transform="matrix(1.0, 0.0, 0.0, 1.0, 10.45, 0.3)">
    <path d="M-3.7 -0.05 L-4.15 0.45 -4.1 1.1 -4.45 1.6 -5.15 1.75 -5.8 1.9 Q-6.2 1.9 -6.1 1.5 L-6.0 1.25 -6.1 1.0 Q-6.1 0.3 -4.9 -0.1 L-3.7 -0.05 M-9.1 2.85 L-9.45 3.1 -10.1 2.85 -10.35 2.4 -10.45 2.15 Q-10.45 1.45 -9.75 1.65 -9.05 1.85 -9.05 2.6 L-9.1 2.85" fill="#ffffff" fill-rule="evenodd" stroke="none"/>
  </g>
</svg>
