<?xml version="1.0" encoding="UTF-8" standalone="no"?>
<svg xmlns:xlink="http://www.w3.org/1999/xlink" height="32.0px" width="31.9px" xmlns="http://www.w3.org/2000/svg">
  <g transform="matrix(1.0, 0.0, 0.0, 1.0, 0.0, 0.0)">
    <path d="M31.9 32.0 L0.0 32.0 0.0 0.0 31.9 0.0 31.9 32.0" fill="#00ff00" fill-rule="evenodd" stroke="none"/>
  </g>
</svg>
