<?xml version="1.0" encoding="UTF-8" standalone="no"?>
<svg xmlns:xlink="http://www.w3.org/1999/xlink" height="27.15px" width="104.0px" xmlns="http://www.w3.org/2000/svg">
  <g transform="matrix(1.0, 0.0, 0.0, 1.0, 52.0, 13.55)">
    <use height="27.15" transform="matrix(1.0, 0.0, 0.0, 1.0, -52.0, -13.55)" width="104.0" xlink:href="#text0"/>
  </g>
  <defs/>
</svg>
