<div class="log">
	<h3>Historique de votre Capitale</h3>
	<div class="teml">
		<ul>
			
			<li>
				
				<span class="datelog">Le 30 janv. à 15:56:41</span> - 

	Vos habitants ont mangé <div class="sres"><span class="n">3</span> <img src="/img/icons/small/res_wheat.gif"></div>
	


			</li><li>
				
				<span class="datelog">Le 30 janv. à 15:56:41</span> - 

	Les ouvriers n'ont pas pu travailler car aucun bâtiment n'est en construction en ce moment <img src="/img/icons/l_cantbuild.png">


			</li><li>
				
				<span class="datelog">Le 30 janv. à 15:56:41</span> - 

	Vous n'avez pas encore construit de caserne


			</li><li class="turn">
				
				<span class="datelog">Le 30 janv. à 15:55:58</span> - 

	Vos habitants ont mangé <div class="sres"><span class="n">3</span> <img src="/img/icons/small/res_wheat.gif"></div>
	


			</li><li>
				
				<span class="datelog">Le 30 janv. à 15:55:58</span> - 

	Votre ville a produit 
	<div class="sres">
		<img src="/img/icons/small/res_wood.gif" alt="">
		<span class="number">5</span>
	</div>



			</li><li class="turn">
				
				<span class="datelog">Le 30 janv. à 15:54:49</span> - 

	Vos habitants ont mangé <div class="sres"><span class="n">3</span> <img src="/img/icons/small/res_wheat.gif"></div>
	


			</li><li>
				
				<span class="datelog">Le 30 janv. à 15:54:49</span> - 

	Votre ville a produit 
	<div class="sres">
		<img src="/img/icons/small/res_wheat.gif" alt="">
		<span class="number">6</span>
	</div>



			</li><li class="turn">
				
				<span class="datelog">Le 30 janv. à 15:54:46</span> - 

	Un citoyen a appris le métier <b>Bûcheron</b>


			</li><li class="turn">
				
				<span class="datelog">Le 30 janv. à 15:54:41</span> - 

	Vos habitants ont mangé <div class="sres"><span class="n">3</span> <img src="/img/icons/small/res_wheat.gif"></div>
	


			</li><li>
				
				<span class="datelog">Le 30 janv. à 15:54:41</span> - 

	Les ouvriers n'ont pas pu travailler car aucun bâtiment n'est en construction en ce moment <img src="/img/icons/l_cantbuild.png">


			</li><li>
				
				<span class="datelog">Le 30 janv. à 15:54:41</span> - 

	Un nouveau citoyen <img src="/img/icons/small/people_pend.gif"> a rejoint votre ville


			</li><li class="turn">
				
				<span class="datelog">Le 30 janv. à 15:54:37</span> - 

	Vos habitants ont mangé <div class="sres"><span class="n">2</span> <img src="/img/icons/small/res_wheat.gif"></div>
	


			</li><li>
				
				<span class="datelog">Le 30 janv. à 15:54:37</span> - 

	Votre ville a produit 
	<div class="sres">
		<img src="/img/icons/small/res_gold.gif" alt="">
		<span class="number">1</span>
	</div>



			</li><li class="turn">
				
				<span class="datelog">Le 30 janv. à 15:54:29</span> - 

	Un citoyen a appris le métier <b>Ouvrier</b>


			</li><li class="turn">
				
				<span class="datelog">Le 30 janv. à 15:54:24</span> - 

	Vos habitants ont mangé <div class="sres"><span class="n">2</span> <img src="/img/icons/small/res_wheat.gif"></div>
	


			</li><li>
				
				<span class="datelog">Le 30 janv. à 15:54:24</span> - 

	Un nouveau citoyen <img src="/img/icons/small/people_pend.gif"> a rejoint votre ville


			</li><li>
				
				<span class="datelog">Le 30 janv. à 15:54:24</span> - 

	Votre ville a produit 
	<div class="sres">
		<img src="/img/icons/small/res_wood.gif" alt="">
		<span class="number">1</span>
	</div>



			</li><li class="turn">
				
				<span class="datelog">Le 30 janv. à 15:54:21</span> - 

	Vos habitants ont mangé <div class="sres"><span class="n">1</span> <img src="/img/icons/small/res_wheat.gif"></div>
	


			</li><li>
				
				<span class="datelog">Le 30 janv. à 15:54:21</span> - 

	Votre ville a produit 
	<div class="sres">
		<img src="/img/icons/small/res_wheat.gif" alt="">
		<span class="number">6</span>
	</div>



			</li><li class="turn">
				
				<span class="datelog">Le 30 janv. à 15:54:02</span> - 

	Vos habitants ont mangé <div class="sres"><span class="n">1</span> <img src="/img/icons/small/res_wheat.gif"></div>
	


			</li><li>
				
				<span class="datelog">Le 30 janv. à 15:54:02</span> - 

	Votre ville a produit 
	<div class="sres">
		<img src="/img/icons/small/res_wood.gif" alt="">
		<span class="number">1</span>
	</div>



			</li><li class="turn">
				
				<span class="datelog">Le 30 janv. à 15:53:28</span> - 

	Vos habitants ont mangé <div class="sres"><span class="n">1</span> <img src="/img/icons/small/res_wheat.gif"></div>
	


			</li><li>
				
				<span class="datelog">Le 30 janv. à 15:53:28</span> - 

	Votre ville a produit 
	<div class="sres">
		<img src="/img/icons/small/res_wheat.gif" alt="">
		<span class="number">6</span>
	</div>



			</li>
		</ul>
	</div>
</div>