<?xml version="1.0" encoding="UTF-8" standalone="no"?>
<svg xmlns:ffdec="https://www.free-decompiler.com/flash" xmlns:xlink="http://www.w3.org/1999/xlink" ffdec:objectType="shape" height="30.5px" width="236.05px" xmlns="http://www.w3.org/2000/svg">
  <g transform="matrix(1.0, 0.0, 0.0, 1.0, 0.0, 0.0)">
    <path d="M30.5 15.25 Q30.5 21.55 26.0 26.0 21.55 30.5 15.25 30.5 8.95 30.5 4.45 26.0 0.0 21.55 0.0 15.25 0.0 8.95 4.45 4.45 8.95 0.0 15.25 0.0 21.55 0.0 26.0 4.45 30.5 8.95 30.5 15.25" fill="url(#gradient0)" fill-rule="evenodd" stroke="none"/>
    <path d="M235.45 14.05 L236.05 16.05 15.25 17.75 15.25 12.75 235.45 14.05" fill="url(#gradient1)" fill-rule="evenodd" stroke="none"/>
  </g>
  <defs>
    <radialGradient cx="0" cy="0" gradientTransform="matrix(0.0187, 0.0, 0.0, 0.0187, 15.25, 15.25)" gradientUnits="userSpaceOnUse" id="gradient0" r="819.2" spreadMethod="pad">
      <stop offset="0.0" stop-color="#ffffff"/>
      <stop offset="0.3686274509803922" stop-color="#3399ff"/>
      <stop offset="1.0" stop-color="#3300cc" stop-opacity="0.0"/>
    </radialGradient>
    <radialGradient cx="0" cy="0" gradientTransform="matrix(0.2189, 0.0, 0.0, 0.0225, 22.8, 15.3)" gradientUnits="userSpaceOnUse" id="gradient1" r="819.2" spreadMethod="pad">
      <stop offset="0.0" stop-color="#ffffff"/>
      <stop offset="0.3686274509803922" stop-color="#3399ff"/>
      <stop offset="1.0" stop-color="#3300cc" stop-opacity="0.0"/>
    </radialGradient>
  </defs>
</svg>
