<?xml version="1.0" encoding="UTF-8" standalone="no"?>
<svg xmlns:ffdec="https://www.free-decompiler.com/flash" xmlns:xlink="http://www.w3.org/1999/xlink" ffdec:objectType="shape" height="16.0px" width="16.0px" xmlns="http://www.w3.org/2000/svg">
  <g transform="matrix(1.0, 0.0, 0.0, 1.0, 0.0, 0.0)">
    <pattern ffdec:smoothed="false" height="16" id="PatternID_237_1" overflow="visible" patternTransform="matrix(1.0, 0.0, 0.0, 1.0, 0.0, 0.0)" patternUnits="userSpaceOnUse" viewBox="0 0 16 16" width="16">
      <image height="16" width="16" xlink:href="data:image/PNG;base64,iVBORw0KGgoAAAANSUhEUgAAABAAAAAQCAYAAAAf8/9hAAAAfUlEQVR4XuWS0QnAMAhEs23GyAoukSUyQ1bILCkXsFxEm59CP3pwP3o+EUzpRU3yk8LcbK1xM/QYwweUUlbTCjU2ci5ARGat9WjkQgDOsBtRU/8F0Hv/CJBzvgEMsQDkPAC0AdQMiLazVpBPUBC2o28HPK0gf5/WTO6o4+AFJK2uOUALUdQAAAAASUVORK5CYII="/>
    </pattern>
    <path d="M0.0 0.0 L16.0 0.0 16.0 16.0 0.0 16.0 0.0 0.0" ffdec:fill-bitmapId="236" style="fill:url(#PatternID_237_1)"/>
  </g>
</svg>
