<?xml version="1.0" encoding="UTF-8" standalone="no"?>
<svg xmlns:ffdec="https://www.free-decompiler.com/flash" xmlns:xlink="http://www.w3.org/1999/xlink" ffdec:objectType="shape" height="22.8px" width="21.8px" xmlns="http://www.w3.org/2000/svg">
  <g transform="matrix(1.0, 0.0, 0.0, 1.0, 10.9, 11.4)">
    <path d="M10.9 11.4 L-10.9 11.4 -10.9 -11.4 10.9 -11.4 10.9 11.4 Z" fill="none" stroke="#a5f231" stroke-linecap="round" stroke-linejoin="round" stroke-width="0.05"/>
    <path d="M8.25 2.0 L0.9 2.0 0.9 5.5 -8.25 0.0 0.9 -5.45 0.9 -1.95 8.25 -1.95 8.25 2.0" fill="#a5f231" fill-rule="evenodd" stroke="none"/>
  </g>
</svg>
