<?xml version="1.0" encoding="UTF-8" standalone="no"?>
<svg xmlns:ffdec="https://www.free-decompiler.com/flash" xmlns:xlink="http://www.w3.org/1999/xlink" ffdec:objectType="shape" height="86.0px" width="103.0px" xmlns="http://www.w3.org/2000/svg">
  <g transform="matrix(1.0, 0.0, 0.0, 1.0, 0.0, 0.0)">
    <path d="M103.0 86.0 L0.0 86.0 0.0 0.0 103.0 0.0 103.0 86.0" fill="#416512" fill-rule="evenodd" stroke="none"/>
  </g>
</svg>
