<?xml version="1.0" encoding="UTF-8" standalone="no"?>
<svg xmlns:ffdec="https://www.free-decompiler.com/flash" xmlns:xlink="http://www.w3.org/1999/xlink" ffdec:objectType="shape" height="14.0px" width="14.0px" xmlns="http://www.w3.org/2000/svg">
  <g transform="matrix(1.0, 0.0, 0.0, 1.0, -1.0, 0.0)">
    <path d="M15.0 0.0 L15.0 14.0 1.0 14.0 1.0 0.0 15.0 0.0" fill="#99ff00" fill-rule="evenodd" stroke="none"/>
  </g>
</svg>
