{
  "133":
  {
    "type": "dinoz",
    "rarity": "common",
    "element": "fire",
    "costs":
    [
      {
        "element": "fire",
        "amount": 1
      }
    ],
    "typeData":
    {
      "dinozStats":
      {
        "hatchTime":      1,
        "strength":       1,
        "endurance":      1
      }
    }
  },
  "134":
  {
	"type": "spell",
    "rarity": "common",
    "element": "air",
    "costs": [
      {
        "element": "air",
        "amount": "1"
      }
    ],
    "effects": [
      {
        "target": {
          "side": "ally",
          "entity": "player",
          "quantity": "one"
        },
        "action": {
          "type": "heal",
          "parameter": {
            "value": "5"
          }
        }
      }
    ]
  },
  "138":
  {
    "type": "dinoz",
    "rarity": "common",
    "element": "fire",
    "costs":
    [
      {
        "element": "fire",
        "amount": 1
      }
    ],
    "typeData":
    {
      "dinozStats":
      {
        "hatchTime":      2,
        "strength":      2,
        "endurance":      1
      },
      "triggerEffects": [
      {
        "triggers": [
          "onHatch"
        ],
        "effects": [
          {
            "target": {
              "side": "ally",
              "entity": "player",
              "quantity": "all"
            },
            "action": {
              "type": "damage",
              "parameter": {
                "value": "1"
              }
            }
          }
        ]
      }
      ]
    }
  },
  "139":
  {
    "type": "dinoz",
    "rarity": "common",
    "element": "fire",
    "costs":
    [
      {
        "element": "fire",
        "amount": 1
      }
    ],
    "keywords":
    [
      "tenacious"
    ],
    "typeData":
    {
      "dinozStats":
      {
        "hatchTime":      3,
        "strength":      2,
        "endurance":      3
      }
    }
  },
  "142":
  {
    "type": "dinoz",
    "rarity": "rare",
    "element": "fire",
    "costs":
    [
      {
        "element": "fire",
        "amount": 1
      }
    ],
    "keywords":
    [
      "flying"
    ],
    "typeData":
    {
      "dinozStats":
      {
        "hatchTime":      5,
        "strength":      5,
        "endurance":      4
      }
    }
  },
  "145":
  {
	"type": "spell",
    "rarity": "common",
    "element": "fire",
    "costs": [
      {
        "element": "fire",
        "amount": "1"
      }
    ],
    "effects": [
      {
        "target": {
          "side": "enemy",
          "entity": "dinoz",
          "quantity": "one"
        },
        "action": {
          "type": "damage",
          "parameter": {
            "value": "3"
          }
        }
      }
    ]
  },
  "146":
  {
	"type": "spell",
    "rarity": "uncommon",
    "element": "fire",
    "costs": [
      {
        "element": "fire",
        "amount": "1"
      }
    ],
    "keywords":
    [
      "discharge"
    ],
    "effects": [
      {
        "target": {
          "side": "enemy",
          "entity": [
            "dinoz",
            "egg"
          ],
          "quantity": "one"
        },
        "action": {
          "type": "damage",
          "parameter": {
            "value": "5"
          }
        }
      }
    ]
  },
  "147":
  {
	"type": "spell",
    "rarity": "common",
    "element": "fire",
    "costs": [
      {
        "element": "fire",
        "amount": "1"
      },
      {
        "element": "neutral",
        "amount": "1"
      }
    ],
    "effects": [
      {
        "target": {
          "side": "enemy",
          "entity": "dinoz",
          "quantity": "one"
        },
        "action": {
          "type": "damage",
          "parameter": {
            "value": "4"
          }
        }
      }
    ]
  },
  "148":
  {
	"type": "charm",
    "rarity": "uncommon",
    "element": "fire",
    "costs": [
      {
        "element": "fire",
        "amount": "1"
      },
      {
        "element": "neutral",
        "amount": "1"
      }
    ],
    "keywords":
    [
      "discharge"
    ],
    "typeData":
    {
      "charmTarget": {
        "side": "ally",
        "entity": ["dinoz", "egg"]
      },
      "passiveEffects":
      [
        {
          "target": {
            "side": "ally",
            "entity": "dinoz",
            "quantity": "charmedOne"
          },
          "action": {
            "type" : "temporaryStats",
            "parameter" : {
              "strength": 2
            }
          }
        }
      ]
    }
  },
  "150":
  {
	"type": "charm",
    "rarity": "common",
    "element": "fire",
    "costs": [
      {
        "element": "fire",
        "amount": "1"
      }
    ],
    "typeData":
    {
      "charmTarget": {
        "side": "ally",
        "entity": ["dinoz", "egg"]
      },
      "passiveEffects":
      [
        {
          "target": {
            "side": "ally",
            "entity": "dinoz",
            "quantity": "charmedOne"
          },
          "action": {
            "type" : "temporaryStats",
            "parameter" : {
              "strength": 1
            }
          }
        },
        {
          "target": {
            "side": "ally",
            "entity": "dinoz",
            "quantity": "charmedOne"
          },
          "action": {
            "type" : "gainKeyword",
            "parameter" : {
              "value": "pack"
            }
          }
        }
      ]
    }
  },
  "154":
  {
	"type": "spell",
    "rarity": "rare",
    "element": "fire",
    "costs": [
      {
        "element": "fire",
        "amount": "1"
      },
      {
        "element": "neutral",
        "amount": "2"
      }
    ],
    "keywords":
    [
      "discharge"
    ],
    "effects": [
      {
        "target": {
          "side": "enemy",
          "entity": [
            "dinoz",
            "egg"
          ],
          "quantity": "all"
        },
        "action": {
          "type": "damage",
          "parameter": {
            "value": "3"
          }
        }
      }
    ]
  },
  "155":
  {
    "type": "dinoz",
    "rarity": "uncommon",
    "element": "fire",
    "costs":
    [
      {
        "element": "fire",
        "amount": 1
      }
    ],
    "typeData":
    {
      "dinozStats":
      {
        "hatchTime":      7,
        "strength":       6,
        "endurance":      9
      }
    }
  },
  "156":
  {
    "type": "dinoz",
    "rarity": "common",
    "element": "wood",
    "costs":
    [
      {
        "element": "wood",
        "amount": 1
      }
    ],
    "keywords":
    [
      "overflow"
    ],
    "typeData":
    {
      "dinozStats":
      {
        "hatchTime":      1,
        "strength":       1,
        "endurance":      1
      }
    }
  },
  "157":
  {
    "type": "dinoz",
    "rarity": "common",
    "element": "wood",
    "costs":
    [
      {
        "element": "wood",
        "amount": 1
      }
    ],
    "keywords":
    [
      "overflow"
    ],
    "typeData":
    {
      "dinozStats":
      {
        "hatchTime":      3,
        "strength":       2,
        "endurance":      3
      }
    }
  },
  "158":
  {
    "type": "dinoz",
    "rarity": "common",
    "element": "wood",
    "costs":
    [
      {
        "element": "wood",
        "amount": 1
      }
    ],
    "typeData":
    {
      "dinozStats":
      {
        "hatchTime":      2,
        "strength":       2,
        "endurance":      2
      }
    }
  },
  "159":
  {
    "type": "dinoz",
    "rarity": "rare",
    "element": "wood",
    "costs":
    [
      {
        "element": "wood",
        "amount": 1
      }
    ],
    "keywords":
    [
      "armor",
      "overflow"
    ],
    "typeData":
    {
      "dinozStats":
      {
        "hatchTime":      2,
        "strength":       2,
        "endurance":      2
      }
    }
  },
  "160":
  {
    "type": "dinoz",
    "rarity": "common",
    "element": "wood",
    "costs":
    [
      {
        "element": "wood",
        "amount": 1
      }
    ],
    "typeData":
    {
      "dinozStats":
      {
        "hatchTime":      2,
        "strength":       1,
        "endurance":      3
      }
    }
  },
  "161":
  {
    "type": "dinoz",
    "rarity": "rare",
    "element": "wood",
    "costs":
    [
      {
        "element": "wood",
        "amount": 1
      }
    ],
    "typeData":
    {
      "dinozStats":
      {
        "hatchTime":      3,
        "strength":      3,
        "endurance":      3
      }
    }
  },
  "162":
  {
    "type": "dinoz",
    "rarity": "uncommon",
    "element": "wood",
    "costs":
    [
      {
        "element": "wood",
        "amount": 1
      }
    ],
    "typeData":
    {
      "dinozStats":
      {
        "hatchTime":      1,
        "strength":      1,
        "endurance":      2
      }
    }
  },
  "163":
  {
    "type": "dinoz",
    "rarity": "common",
    "element": "wood",
    "costs":
    [
      {
        "element": "wood",
        "amount": 1
      }
    ],
    "typeData":
    {
      "dinozStats":
      {
        "hatchTime":      4,
        "strength":       3,
        "endurance":      5
      }
    }
  },
  "164":
  {
    "type": "dinoz",
    "rarity": "common",
    "element": "wood",
    "costs":
    [
      {
        "element": "wood",
        "amount": 1
      }
    ],
    "keywords":
    [
      "armor"
    ],
    "typeData":
    {
      "dinozStats":
      {
        "hatchTime":      6,
        "strength":       4,
        "endurance":      5
      }
    }
  },
  "166":
  {
    "type": "dinoz",
    "rarity": "uncommon",
    "element": "wood",
    "costs":
    [
      {
        "element": "wood",
        "amount": 1
      }
    ],
    "typeData":
    {
      "dinozStats":
      {
        "hatchTime":      5,
        "strength":      3,
        "endurance":      9
      }
    }
  },
  "167":
  {
	"type": "spell",
    "rarity": "common",
    "element": "wood",
    "costs": [
      {
        "element": "wood",
        "amount": "1"
      }
    ],
    "effects": [
      {
        "target": {
          "side": "ally",
          "entity": "egg",
          "quantity": "one"
        },
        "action": {
          "type": "hatchMarker",
          "parameter": {
            "value": "2"
          }
        }
      }
    ]
  },
  "168":
  {
    "type": "spell",
    "rarity": "common",
    "element": "wood",
    "costs":
    [
      {
        "element": "wood",
        "amount": 1
      },
      {
        "element": "neutral",
        "amount": 4
      }
    ],
    "effects":
    [
      {
        "target": {
          "side": "enemy",
          "entity": "dinoz",
          "quantity": "one",
          "filter" : [{
            "stat" : "hatchMarker",
            "operator" : "minimum"
          }]
        },
        "action": {
          "type" : "destroy"
        }
      }
    ]
  },
  "170":
  {
	"type": "charm",
    "rarity": "common",
    "element": "wood",
    "costs": [
      {
        "element": "wood",
        "amount": "1"
      }
    ],
    "typeData":
    {
      "charmTarget": {
        "side": "ally",
        "entity": ["dinoz", "egg"],
        "filter" : [{
          "stat" : "age",
          "operator" : "maximum"
        }]
      },
      "passiveEffects":
      [
        {
          "target": {
            "side": "ally",
            "entity": ["dinoz", "egg"],
            "quantity": "charmedOne"
          },
          "action": {
            "type" : "gainKeyword",
            "parameter" : {
              "value": "armor"
            }
          }
        }
      ]
    }
  },
  "177":
  {
    "type": "dinoz",
    "rarity": "uncommon",
    "element": "wood",
    "costs":
    [
      {
        "element": "wood",
        "amount": 1
      }
    ],
    "typeData":
    {
      "dinozStats":
      {
        "hatchTime":      4,
        "strength":       4,
        "endurance":      3
      }
    }
  },
  "180":
  {
	"type": "charm",
    "rarity": "rare",
    "element": "wood",
    "costs": [
      {
        "element": "wood",
        "amount": "1"
      },{
        "element": "neutral",
        "amount": "3"
      }
    ],
    "typeData":
    {
      "charmTarget": {
        "side": "ally",
        "entity": ["dinoz", "egg"],
        "filter" : [{
          "stat" : "age",
          "operator" : "maximum"
        }]
      },
      "passiveEffects":
      [
        {
          "target": {
            "side": "ally",
            "entity": ["dinoz", "egg"],
            "quantity": "charmedOne"
          },
          "action": {
            "type" : "temporaryStats",
            "parameter" : {
              "strength": 3,
              "endurance": 6
            }
          }
        }
      ]
    }
  },
  "181":
  {
	"type": "charm",
    "rarity": "common",
    "element": "wood",
    "costs": [
      {
        "element": "wood",
        "amount": "1"
      },{
        "element": "neutral",
        "amount": "1"
      }
    ],
    "typeData":
    {
      "charmTarget": {
        "side": "ally",
        "entity": ["dinoz", "egg"],
        "filter" : [{
          "stat" : "age",
          "operator" : "minimum"
        }]
      },
      "passiveEffects":
      [
        {
          "target": {
            "side": "ally",
            "entity": ["dinoz", "egg"],
            "quantity": "charmedOne"
          },
          "action": {
            "type" : "temporaryStats",
            "parameter" : {
              "strength": 1,
              "endurance": 3
            }
          }
        }
      ]
    }
  },
  "185":
  {
    "type": "dinoz",
    "rarity": "uncommon",
    "element": "fire",
    "costs": [
      {
        "element": "fire",
        "amount": 1
      }
    ],
    "keywords": [
      "ephemeral",
      "flying",
      "focus"
    ],
    "typeData": {
      "dinozStats": {
        "hatchTime": 2,
        "strength": 3,
        "endurance": 1
      }
    }
  },
  "192":
  {
    "type": "dinoz",
    "rarity": "common",
    "element": "fire",
    "costs":
    [
      {
        "element": "fire",
        "amount": 1
      }
    ],
    "typeData":
    {
      "dinozStats":
      {
        "hatchTime":      4,
        "strength":       3,
        "endurance":      4
      }
    }
  },
  "193":
  {
    "type": "dinoz",
    "rarity": "uncommon",
    "element": "fire",
    "costs":
    [
      {
        "element": "fire",
        "amount": 1
      }
    ],
    "keywords":
    [
      "tenacious"
    ],
    "typeData":
    {
      "dinozStats":
      {
        "hatchTime":      3,
        "strength":      3,
        "endurance":      2
      }
    }
  },
  "204":
  {
	"type": "spell",
    "rarity": "uncommon",
    "element": "wood",
    "costs": [
      {
        "element": "wood",
        "amount": "1"
      },
      {
        "element": "neutral",
        "amount": "2"
      }
    ],
    "effects": [
      {
        "target": {
          "side": "ally",
          "entity": "egg",
          "quantity": "all"
        },
        "action": {
          "type": "hatchMarker",
          "parameter": {
            "value": "3"
          }
        }
      }
    ]
  },
  "206":
  {
    "type": "spell",
    "rarity": "uncommon",
    "element": "wood",
    "costs":
    [
      {
        "element": "wood",
        "amount": 1
      },
      {
        "element": "neutral",
        "amount": 1
      }
    ],
    "effects":
    [
      {
        "target": {
          "side": "enemy",
          "entity": "dinoz",
          "quantity": "one",
          "filter" : [{
            "stat" : "endurance",
            "operator" : "lowerOrEquals",
            "value" : "2"
          }]
        },
        "action": {
          "type" : "destroy"
        }
      }
    ]
  },
  "213":
  {
    "type": "dinoz",
    "rarity": "common",
    "element": "wood",
    "costs":
    [
      {
        "element": "wood",
        "amount": 1
      }
    ],
    "typeData":
    {
      "dinozStats":
      {
        "hatchTime":      8,
        "strength":      5,
        "endurance":      12
      }
    }
  },
  "216":
  {
    "type": "dinoz",
    "rarity": "common",
    "element": "water",
    "costs":
    [
      {
        "element": "water",
        "amount": 1
      }
    ],
    "keywords":
    [
      "pack"
    ],
    "typeData":
    {
      "dinozStats":
      {
        "hatchTime":      1,
        "strength":      1,
        "endurance":      1
      }
    }
  },
  "217":
  {
    "type": "dinoz",
    "rarity": "common",
    "element": "water",
    "costs":
    [
      {
        "element": "water",
        "amount": 1
      }
    ],
    "typeData":
    {
      "dinozStats":
      {
        "hatchTime":      2,
        "strength":      1,
        "endurance":      3
      }
    }
  },
  "219":
  {
    "type": "dinoz",
    "rarity": "common",
    "element": "water",
    "costs":
    [
      {
        "element": "water",
        "amount": 1
      }
    ],
    "keywords":
    [
      "pack"
    ],
    "typeData":
    {
      "dinozStats":
      {
        "hatchTime":      3,
        "strength":      2,
        "endurance":      3
      }
    }
  },
  "220":
  {
    "type": "dinoz",
    "rarity": "uncommon",
    "element": "water",
    "costs":
    [
      {
        "element": "water",
        "amount": 1
      }
    ],
    "keywords":
    [
      "regeneration"
    ],
    "typeData":
    {
      "dinozStats":
      {
        "hatchTime":      3,
        "strength":      1,
        "endurance":      4
      }
    }
  },
  "222":
  {
    "type": "dinoz",
    "rarity": "uncommon",
    "element": "water",
    "costs":
    [
      {
        "element": "water",
        "amount": 1
      }
    ],
    "keywords":
    [
      "venomous"
    ],
    "typeData":
    {
      "dinozStats":
      {
        "hatchTime":      4,
        "strength":      2,
        "endurance":      4
      }
    }
  },
  "223":
  {
    "type": "dinoz",
    "rarity": "rare",
    "element": "water",
    "costs":
    [
      {
        "element": "water",
        "amount": 1
      }
    ],
    "typeData":
    {
      "dinozStats":
      {
        "hatchTime":      4,
        "strength":      1,
        "endurance":      12
      }
    }
  },
  "224":
  {
    "type": "dinoz",
    "rarity": "rare",
    "element": "water",
    "costs": [
      {
        "element": "water",
        "amount": 1
      }
    ],
    "keywords": [
      "regeneration"
    ],
    "typeData": {
      "dinozStats": {
        "hatchTime": 5,
        "strength": 3,
        "endurance": 7
      }
    }
  },
  "228":
  {
    "type": "dinoz",
    "rarity": "rare",
    "element": "water",
    "costs":
    [
      {
        "element": "water",
        "amount": 1
      }
    ],
    "keywords":
    [
      "armor",
      "regeneration"
    ],
    "typeData":
    {
      "dinozStats":
      {
        "hatchTime":      3,
        "strength":       1,
        "endurance":      3
      }
    }
  },
  "233":
  {
	"type": "charm",
    "rarity": "common",
    "element": "water",
    "costs": [
      {
        "element": "water",
        "amount": "1"
      }
    ],
    "typeData":
    {
      "charmTarget": {
        "side": "ally",
        "entity": ["dinoz", "egg"]
      },
      "passiveEffects":
      [
        {
          "target": {
            "side": "ally",
            "entity": "dinoz",
            "quantity": "charmedOne"
          },
          "action": {
            "type" : "temporaryStats",
            "parameter" : {
              "strength": 1,
              "endurance": 1
            }
          }
        }
      ]
    }
  },
  "234":
  {
	"type": "charm",
    "rarity": "rare",
    "element": "water",
    "costs": [
      {
        "element": "water",
        "amount": "1"
      },{
        "element": "neutral",
        "amount": "2"
      }
    ],
    "typeData":
    {
      "charmTarget": {
        "side": "enemy",
        "entity": ["dinoz", "egg"],
        "filter" : [{
          "stat" : "strength",
          "operator" : "maximum"
        }]
      },
      "passiveEffects":
      [
        {
          "target": {
            "side": "enemy",
            "entity": ["dinoz", "egg"],
            "quantity": "charmedOne"
          },
          "action": {
            "type" : "gainKeyword",
            "parameter" : {
              "value": "stuck"
            }
          }
        }
      ]
    }
  },
  "236":
  {
	"type": "charm",
    "rarity": "uncommon",
    "element": "water",
    "costs": [
      {
        "element": "water",
        "amount": "1"
      },{
        "element": "neutral",
        "amount": "4"
      }
    ],
    "typeData":
    {
      "charmTarget": {
        "side": "enemy",
        "entity": "dinoz",
        "filter" : [{
          "stat" : "strength",
          "operator" : "maximum"
        }]
      },
      "passiveEffects":
      [
        {
          "target": {
            "side": "enemy",
            "entity": "dinoz",
            "quantity": "charmedOne"
          },
          "action": {
            "type" : "gainKeyword",
            "parameter" : {
              "value": ["stuck", "vaporous"]
            }
          }
        }
      ]
    }
  },
  "237":
  {
	"type": "charm",
    "rarity": "uncommon",
    "element": "water",
    "costs": [
      {
        "element": "water",
        "amount": "1"
      },{
        "element": "neutral",
        "amount": "1"
      }
    ],
    "typeData":
    {
      "charmTarget": {
        "side": "enemy",
        "entity": ["dinoz", "egg"],
        "filter" : [{
          "stat" : "strength",
          "operator" : "maximum"
        }]
      },
      "passiveEffects":
      [
        {
          "target": {
            "side": "enemy",
            "entity": ["dinoz", "egg"],
            "quantity": "charmedOne"
          },
          "action": {
            "type" : "temporaryStats",
            "parameter" : {
              "strength": -2
            }
          }
        }
      ]
    }
  },
  "238":
  {
    "type": "spell",
    "rarity": "common",
    "element": "water",
    "costs": [
      {
        "element": "water",
        "amount": "1"
      },{
        "element": "neutral",
        "amount": "1"
      }
    ],
    "keywords":
    [
      "focus"
    ],
    "effects":
    [
      {
        "target": {
          "side": "enemy",
          "entity": "player",
          "quantity": "all"
        },
        "action": {
          "type" : "skipRoundPhase",
          "parameter" : {
            "phase" : "attack"
          }
        }
      }
    ]
  },
  "240":
  {
	"type": "spell",
    "rarity": "rare",
    "element": "water",
    "costs": [
      {
        "element": "water",
        "amount": 1
      },
      {
        "element": "neutral",
        "amount": 5
      }
    ],
    "effects": [
      {
        "target": {
          "side": [
            "ally",
            "enemy"
          ],
          "entity": [
            "dinoz",
            "egg",
            "item"
          ],
          "quantity": "all"
        },
        "action": {
          "type": "destroy"
        }
      }
    ]
  },
  "243":
  {
	"type": "spell",
    "rarity": "uncommon",
    "element": "water",
    "costs": [
      {
        "element": "water",
        "amount": 1
      }
    ],
    "effects": [
      {
        "target": {
          "side": "enemy",
          "entity": "player",
          "quantity": "all"
        },
        "action": {
          "type": "heal",
          "parameter": {
            "value": 3
          }
        }
      },
      {
        "target": {
          "side": "enemy",
          "entity": "dinoz",
          "quantity": "all"
        },
        "action": {
          "type": "gainKeyword",
          "parameter": {
            "value": "poisoned"
          }
        }
      }
    ]
  },
  "244":
  {
	"type": "spell",
    "rarity": "common",
    "element": "water",
    "costs": [
      {
        "element": "water",
        "amount": 1
      },
      {
        "element": "neutral",
        "amount": 1
      }
    ],
    "effects": [
      {
        "target": {
          "side": "enemy",
          "entity": "egg",
          "quantity": "one"
        },
        "action": {
          "type": "destroy"
        }
      },
      {
        "target": {
          "side": "ally",
          "entity": "player",
          "quantity": "all"
        },
        "action": {
          "type": "heal",
          "parameter": {
            "value": "1"
          }
        }
      }
    ]
  },
  "251":
  {
    "type": "dinoz",
    "rarity": "common",
    "element": "thunder",
    "costs":
    [
      {
        "element": "thunder",
        "amount": 1
      }
    ],
    "keywords":
    [
      "initiative"
    ],
    "typeData":
    {
      "dinozStats":
      {
        "hatchTime":      1,
        "strength":      1,
        "endurance":      1
      }
    }
  },
  "252":
  {
    "type": "dinoz",
    "rarity": "rare",
    "element": "thunder",
    "costs":
    [
      {
        "element": "thunder",
        "amount": 1
      }
    ],
    "keywords":
    [
      "initiative"
    ],
    "typeData":
    {
      "dinozStats":
      {
        "hatchTime":      2,
        "strength":      2,
        "endurance":      1
      }
    }
  },
  "254":
  {
    "type": "dinoz",
    "rarity": "uncommon",
    "element": "thunder",
    "costs": [
      {
        "element": "thunder",
        "amount": 1
      }
    ],
    "keywords": [
      "armor"
    ],
    "typeData": {
      "dinozStats": {
        "hatchTime": 2,
        "strength":  1,
        "endurance": 2
      }
    }
  },
  "256":
  {
    "type": "dinoz",
    "rarity": "common",
    "element": "thunder",
    "costs":
    [
      {
        "element": "thunder",
        "amount": 1
      }
    ],
    "typeData":
    {
      "dinozStats":
      {
        "hatchTime":      3,
        "strength":      2,
        "endurance":      3
      }
    }
  },
  "257":
  {
    "type": "dinoz",
    "rarity": "rare",
    "element": "thunder",
    "costs": [
      {
        "element": "thunder",
        "amount": 1
      },
      {
        "element": "neutral",
        "amount": 1
      }
    ],
    "keywords": [
      "regeneration",
      "rock"
    ],
    "typeData": {
      "dinozStats": {
        "hatchTime": 3,
        "strength": 1,
        "endurance": 7
      }
    }
  },
  "258":
  {
    "type": "dinoz",
    "rarity": "uncommon",
    "element": "thunder",
    "costs":
    [
      {
        "element": "thunder",
        "amount": 1
      }
    ],
    "keywords":
    [
      "initiative"
    ],
    "typeData":
    {
      "dinozStats":
      {
        "hatchTime":      4,
        "strength":      3,
        "endurance":      3
      }
    }
  },
  "261":
  {
    "type": "dinoz",
    "rarity": "common",
    "element": "thunder",
    "costs":
    [
      {
        "element": "thunder",
        "amount": 1
      }
    ],
    "typeData":
    {
      "dinozStats":
      {
        "hatchTime":      5,
        "strength":      3,
        "endurance":      5
      }
    }
  },
  "263":
  {
    "type": "dinoz",
    "rarity": "common",
    "element": "thunder",
    "costs":
    [
      {
        "element": "thunder",
        "amount": 1
      }
    ],
    "keywords":
    [
      "rock"
    ],
    "typeData":
    {
      "dinozStats":
      {
        "hatchTime":      1,
        "strength":      1,
        "endurance":      1
      }
    }
  },
  "265":
  {
    "type": "dinoz",
    "rarity": "common",
    "element": "water",
    "costs":
    [
      {
        "element": "water",
        "amount": 1
      }
    ],
    "keywords":
    [
      "armor",
      "bubble"
    ],
    "typeData":
    {
      "dinozStats":
      {
        "hatchTime":      4,
        "strength":      4,
        "endurance":      5
      },
      "triggerEffects": [
      {
        "triggers": [
          "onDeath"
        ],
        "effects": [
          {
            "target": {
              "side": "ally",
              "entity": "player",
              "quantity": "all"
            },
            "action": {
              "type": "destroyEnergy",
              "parameter": {
                "value": "100"
              }
            }
          }
        ]
      }
      ]
    }
  },
  "270":
  {
	"type": "charm",
    "rarity": "uncommon",
    "element": "thunder",
    "costs": [
      {
        "element": "thunder",
        "amount": "1"
      }
    ],
    "typeData":
    {
      "charmTarget": {
        "side": "ally",
        "entity": ["dinoz", "egg"]
      },
      "passiveEffects":
      [
        {
          "target": {
            "side": "ally",
            "entity": "dinoz",
            "quantity": "charmedOne"
          },
          "action": {
            "type" : "temporaryStats",
            "parameter" : {
              "endurance": 4
            }
          }
        }
      ]
    }
  },
  "271":
  {
	"type": "spell",
    "rarity": "common",
    "element": "thunder",
    "costs": [
      {
        "element": "thunder",
        "amount": "1"
      },
      {
        "element": "neutral",
        "amount": "1"
      }
    ],
    "effects": [
      {
        "target": {
          "side": "enemy",
          "entity": "dinoz",
          "quantity": "all"
        },
        "action": {
          "type": "damage",
          "parameter": {
            "value": "1"
          }
        }
      }
    ]
  },
  "272":
  {
	"type": "spell",
    "rarity": "rare",
    "element": "thunder",
    "costs": [
      {
        "element": "thunder",
        "amount": "1"
      }
    ],
    "keywords":
    [
      "focus"
    ],
    "effects": [
      {
        "target": {
          "side": "ally",
          "entity": [
            "dinoz",
            "egg"
          ],
          "quantity": "all"
        },
        "action": {
          "type": "heal",
          "parameter": {
            "value": "2"
          }
        }
      }
    ]
  },
  "273":
  {
    "type": "spell",
    "rarity": "rare",
    "element": "thunder",
    "costs":
    [
      {
        "element": "thunder",
        "amount": 1
      },
      {
        "element": "neutral",
        "amount": 1
      }
    ],
    "effects":
    [
      {
        "target": {
          "side": "enemy",
          "entity": "dinoz",
          "quantity": "one",
          "filter" : [{
            "element":"thunder",
            "inverted":true
          }]
        },
        "action": {
          "type" : "destroy"
        }
      }
    ]
  },
  "275":
  {
	"type": "spell",
    "rarity": "rare",
    "element": "thunder",
    "costs": [
      {
        "element": "thunder",
        "amount": "1"
      },
      {
        "element": "neutral",
        "amount": "2"
      }
    ],
    "effects": [
      {
        "target": {
          "side": [
            "ally",
            "enemy"
          ],
          "entity": "item",
          "quantity": "all"
        },
        "action": {
          "type": "destroy"
        }
      }
    ]
  },
  "279":
  {
	"type": "spell",
    "rarity": "common",
    "element": "thunder",
    "costs": [
      {
        "element": "thunder",
        "amount": "1"
      }
    ],
    "effects": [
      {
        "target": {
          "side": "enemy",
          "entity": "item",
          "quantity": "one"
        },
        "action": {
          "type": "destroy"
        }
      }
    ]
  },
  "285":
  {
    "type": "dinoz",
    "rarity": "common",
    "element": "air",
    "costs":
    [
      {
        "element": "air",
        "amount": 1
      }
    ],
    "keywords":
    [
      "flying"
    ],
    "typeData":
    {
      "dinozStats":
      {
        "hatchTime":      1,
        "strength":      1,
        "endurance":      1
      }
    }
  },
  "288":
  {
    "type": "dinoz",
    "rarity": "uncommon",
    "element": "air",
    "costs":
    [
      {
        "element": "air",
        "amount": 1
      }
    ],
    "keywords":
    [
      "flying",
      "wizard"
    ],
    "typeData":
    {
      "dinozStats":
      {
        "hatchTime":      2,
        "strength":      0,
        "endurance":      5
      }
    }
  },
  "289":
  {
    "type": "dinoz",
    "rarity": "common",
    "element": "air",
    "costs":
    [
      {
        "element": "air",
        "amount": 1
      }
    ],
    "keywords":
    [
      "flying"
    ],
    "typeData":
    {
      "dinozStats":
      {
        "hatchTime":      3,
        "strength":      2,
        "endurance":      3
      }
    }
  },
  "291":
  {
    "type": "dinoz",
    "rarity": "common",
    "element": "air",
    "costs":
    [
      {
        "element": "air",
        "amount": 1
      }
    ],
    "keywords":
    [
      "wizard"
    ],
    "typeData":
    {
      "dinozStats":
      {
        "hatchTime":      4,
        "strength":      2,
        "endurance":      4
      }
    }
  },
  "292":
  {
    "type": "dinoz",
    "rarity": "uncommon",
    "element": "air",
    "costs":
    [
      {
        "element": "air",
        "amount": 1
      }
    ],
    "keywords":
    [
      "flying",
      "brood"
    ],
    "typeData":
    {
      "dinozStats":
      {
        "hatchTime":      4,
        "strength":      2,
        "endurance":      5
      }
    }
  },
  "295":
  {
    "type": "dinoz",
    "rarity": "rare",
    "element": "air",
    "costs":
    [
      {
        "element": "air",
        "amount": 1
      }
    ],
    "keywords":
    [
      "flying"
    ],
    "typeData":
    {
      "dinozStats":
      {
        "hatchTime":      5,
        "strength":      4,
        "endurance":      6
      }
    }
  },
  "298":
  {
    "type": "dinoz",
    "rarity": "common",
    "element": "air",
    "costs":
    [
      {
        "element": "air",
        "amount": 1
      }
    ],
    "keywords":
    [
      "vaporous"
    ],
    "typeData":
    {
      "dinozStats":
      {
        "hatchTime":      5,
        "strength":      3,
        "endurance":      10
      }
    }
  },
  "300":
  {
    "type": "dinoz",
    "rarity": "uncommon",
    "element": "air",
    "costs":
    [
      {
        "element": "air",
        "amount": 1
      }
    ],
    "keywords":
    [
      "flying"
    ],
    "typeData":
    {
      "dinozStats":
      {
        "hatchTime":      3,
        "strength":      0,
        "endurance":      9
      }
    }
  },
  "303":
  {
    "type": "spell",
    "rarity": "rare",
    "element": "air",
    "costs":
    [
      {
        "element": "air",
        "amount": 1
      },
      {
        "element": "neutral",
        "amount": 1
      }
    ],
    "effects":
    [
      {
        "target": {
          "side": "enemy",
          "entity": "dinoz",
          "quantity": "one",
          "filter" : [{
            "stat" : "cost",
            "operator" : "maximum"
          }]
        },
        "action": {
          "type" : "becomeEgg"
        }
      }
    ]
  },
  "304":
  {
	"type": "spell",
    "rarity": "rare",
    "element": "air",
    "costs": [
      {
        "element": "air",
        "amount": "1"
      },
      {
        "element": "neutral",
        "amount": "2"
      }
    ],
    "effects": [
      {
        "target": {
          "side": "ally",
          "entity": "player",
          "quantity": "all"
        },
        "action": {
          "type": "discard",
          "parameter": {
            "value": "4"
          }
        }
      },
      {
        "target": {
          "side": "ally",
          "entity": "player",
          "quantity": "all"
        },
        "action": {
          "type": "playCard",
          "parameter": {
            "value": "2"
          }
        }
      }
    ]
  },
  "305":
  {
	"type": "spell",
    "rarity": "rare",
    "element": "air",
    "costs": [
      {
        "element": "air",
        "amount": "1"
      },
      {
        "element": "neutral",
        "amount": "2"
      }
    ],
    "effects": [
      {
        "target": {
          "side": "ally",
          "entity": "player",
          "quantity": "all"
        },
        "action": {
          "type": "setHP",
          "parameter": {
            "value": "14"
          }
        }
      }
    ]
  },
  "306":
  {
	"type": "spell",
    "rarity": "common",
    "element": "air",
    "costs": [
      {
        "element": "air",
        "amount": "1"
      }
    ],
    "effects": [
      {
        "target": {
          "side": "enemy",
          "entity": "charm",
          "quantity": "one"
        },
        "action": {
          "type": "destroy"
        }
      }
    ]
  },
  "307":
  {
	"type": "spell",
    "rarity": "common",
    "element": "air",
    "costs": [
      {
        "element": "air",
        "amount": "1"
      }
    ],
    "keywords":
    [
      "focus"
    ],
    "effects": [
      {
        "target": {
          "side": "ally",
          "entity": "player",
          "quantity": "all"
        },
        "action": {
          "type": "heal",
          "parameter": {
            "value": "3"
          }
        }
      }
    ]
  },
  "317":
  {
    "type": "spell",
    "rarity": "common",
    "element": "air",
    "costs":
    [
      {
        "element": "air",
        "amount": 1
      },
      {
        "element": "neutral",
        "amount": 3
      }
    ],
    "effects":
    [
      {
        "target": {
          "side": "enemy",
          "entity": [
            "dinoz",
            "egg"
          ],
          "quantity": "one",
          "filter" : [{
            "stat" : "age",
            "operator" : "minimum"
          }]
        },
        "action": {
          "type" : "gainControl"
        }
      }
    ]
  },
  "318":
  {
    "type": "dinoz",
    "rarity": "uncommon",
    "element": "wood",
    "costs":
    [
      {
        "element": "wood",
        "amount": 1
      },{
      "element": "air",
      "amount": 1
    }
    ],
    "keywords":
    [
      "stompy"
    ],
    "typeData":
    {
      "dinozStats":
      {
        "hatchTime":      2,
        "strength":      2,
        "endurance":      4
      }
    }
  },
  "319":
  {
    "type": "dinoz",
    "rarity": "common",
    "element": "air",
    "costs":
    [
      {
        "element": "air",
        "amount": 1
      }
    ],
    "keywords":
    [
      "stompy"
    ],
    "typeData":
    {
      "dinozStats":
      {
        "hatchTime":      1,
        "strength":      1,
        "endurance":      1
      }
    }
  },
  "321":
  {
    "type": "dinoz",
    "rarity": "rare",
    "element": "wood",
    "costs":
    [
      {
        "element": "wood",
        "amount": 1
      }
    ],
    "keywords":
    [
      "tenacious",
      "stompy"
    ],
    "typeData":
    {
      "dinozStats":
      {
        "hatchTime":      9,
        "strength":      8,
        "endurance":      16
      }
    }
  },
  "322":
  {
    "type": "dinoz",
    "rarity": "uncommon",
    "element": "water",
    "costs": [
      {
        "element": "water",
        "amount": 1
      }
    ],
    "keywords": [
      "hero",
      "pack",
      "tenacious",
      "regeneration"
    ],
    "typeData": {
      "dinozStats": {
        "hatchTime": 5,
        "strength":  3,
        "endurance": 8
      }
    }
  },
  "323":
  {
    "type": "dinoz",
    "rarity": "rare",
    "element": "water",
    "costs":
    [
      {
        "element": "water",
        "amount": 1
      }
    ],
    "keywords":
    [
      "stompy",
      "pack"
    ],
    "typeData":
    {
      "dinozStats":
      {
        "hatchTime":      7,
        "strength":      6,
        "endurance":      14
      }
    }
  },
  "324":
  {
    "type": "dinoz",
    "rarity": "common",
    "element": "fire",
    "costs":
    [
      {
        "element": "fire",
        "amount": 1
      }
    ],
    "keywords":
    [
      "tenacious"
    ],
    "typeData":
    {
      "dinozStats":
      {
        "hatchTime":      6,
        "strength":      3,
        "endurance":      5
      }
    }
  },
  "325":
  {
    "type": "dinoz",
    "rarity": "common",
    "element": "thunder",
    "costs":
    [
      {
        "element": "thunder",
        "amount": 1
      }
    ],
    "keywords":
    [
      "initiative"
    ],
    "typeData":
    {
      "dinozStats":
      {
        "hatchTime":      4,
        "strength":      4,
        "endurance":      1
      }
    }
  },
  "326":
  {
    "type": "spell",
    "rarity": "uncommon",
    "element": "air",
    "costs":
    [
      {
        "element": "air",
        "amount": 1
      }
    ],
    "effects":
    [
      {
        "target": {
          "side": "enemy",
          "entity": ["dinoz","egg"],
          "quantity": "one",
          "filter" : [{
            "element":"fire"
          }]
        },
        "action": {
          "type" : "destroy"
        }
      }
    ]
  },
  "330":
  {
    "type": "spell",
    "rarity": "common",
    "element": "air",
    "costs":
    [
      {
        "element": "air",
        "amount": 1
      },
      {
        "element": "neutral",
        "amount": 1
      }
    ],
    "effects":
    [
      {
        "target": {
          "side": "enemy",
          "entity": "player",
          "quantity": "one"
        },
        "action": {
          "type" : "destroyEnergy",
          "parameter" : {
            "value": 2
          }
        }
      },
      {
        "target": {
          "side": "ally",
          "entity": "player",
          "quantity": "one"
        },
        "action": {
          "type" : "destroyEnergy",
          "parameter" : {
            "value": 1
          }
        }
      }
    ]
  },
  "331":
  {
    "type": "dinoz",
    "rarity": "common",
    "element": "wood",
    "costs":
    [
      {
        "element": "wood",
        "amount": 1
      }
    ],
    "typeData":
    {
      "dinozStats":
      {
        "hatchTime":      3,
        "strength":      2,
        "endurance":      4
      }
    }
  },
  "338":
  {
	"type": "spell",
    "rarity": "common",
    "element": "fire",
    "costs": [
      {
        "element": "fire",
        "amount": "1"
      },
      {
        "element": "neutral",
        "amount": "5"
      }
    ],
    "effects": [
      {
        "target": {
          "side": [
            "ally",
            "enemy"
          ],
          "entity": [
            "player",
            "dinoz",
            "egg"
          ],
          "quantity": "all"
        },
        "action": {
          "type": "damage",
          "parameter": {
            "value": "4"
          }
        }
      }
    ]
  },
  "346":
  {
	"type": "charm",
    "rarity": "common",
    "element": "wood",
    "costs": [
      {
        "element": "wood",
        "amount": "1"
      },{
        "element": "neutral",
        "amount": "1"
      }
    ],
    "typeData":
    {
      "charmTarget": {
        "side": "ally",
        "entity": ["dinoz", "egg"],
        "filter" : [{
          "stat" : "age",
          "operator" : "maximum"
        }]
      },
      "passiveEffects":
      [
        {
          "target": {
            "side": "ally",
            "entity": ["dinoz", "egg"],
            "quantity": "charmedOne"
          },
          "action": {
            "type" : "temporaryStats",
            "parameter" : {
              "strength": 1
            }
          }
        },
        {
          "target": {
            "side": "ally",
            "entity": ["dinoz", "egg"],
            "quantity": "charmedOne"
          },
          "action": {
            "type" : "gainKeyword",
            "parameter" : {
              "value": ["venomous","initiative"]
            }
          }
        }
      ]
    }
  },
  "347":
  {
    "type": "dinoz",
    "rarity": "common",
    "element": "water",
    "costs": [
      {
        "element": "water",
        "amount": 1
      }
    ],
    "keywords": [
      "poisoned"
    ],
    "typeData": {
      "dinozStats": {
        "hatchTime": 6,
        "strength": 4,
        "endurance": 8
      }
    }
  },
  "348":
  {
    "type": "dinoz",
    "rarity": "common",
    "element": "water",
    "costs":
    [
      {
        "element": "water",
        "amount": 1
      }
    ],
    "keywords":
    [
      "discharge"
    ],
    "typeData":
    {
      "dinozStats":
      {
        "hatchTime":      4,
        "strength":      3,
        "endurance":      4
      }
    }
  },
  "351":
  {
    "type": "dinoz",
    "rarity": "rare",
    "element": "water",
    "costs":
    [
      {
        "element": "water",
        "amount": 1
      }
    ],
    "keywords":
    [
      "wizard",
      "venomous",
      "armor"
    ],
    "typeData":
    {
      "dinozStats":
      {
        "hatchTime":      3,
        "strength":      2,
        "endurance":      3
      }
    }
  },
  "352":
  {
    "type": "dinoz",
    "rarity": "common",
    "element": "thunder",
    "costs":
    [
      {
        "element": "thunder",
        "amount": 1
      }
    ],
    "keywords":
    [
      "vaporous",
      "initiative",
      "brood"
    ],
    "typeData":
    {
      "dinozStats":
      {
        "hatchTime":      7,
        "strength":      7,
        "endurance":      3
      }
    }
  },
  "354":
  {
    "type": "spell",
    "rarity": "rare",
    "element": "thunder",
    "costs":
    [
      {
        "element": "thunder",
        "amount": 1
      },
      {
        "element": "neutral",
        "amount": 4
      }
    ],
    "effects":
    [
      {
        "target": {
          "side": "enemy",
          "entity": ["dinoz", "egg", "item", "charm"],
          "quantity": "all",
          "filter" : [{
            "element":"air"
          }]
        },
        "action": {
          "type" : "destroy"
        }
      }
    ]
  },
  "356":
  {
    "type": "dinoz",
    "rarity": "uncommon",
    "element": "thunder",
    "costs":
    [
      {
        "element": "thunder",
        "amount": 1
      }
    ],
    "keywords":
    [
      "focus"
    ],
    "typeData":
    {
      "dinozStats":
      {
        "hatchTime":      3,
        "strength":       2,
        "endurance":      3
      }
    }
  },
  "358":
  {
    "type": "spell",
    "rarity": "common",
    "element": "thunder",
    "costs":
    [
      {
        "element": "thunder",
        "amount": 1
      },
      {
        "element": "neutral",
        "amount": 3
      }
    ],
    "effects":
    [
      {
        "target": {
          "side": "enemy",
          "entity": ["dinoz","egg"],
          "quantity": "one",
          "filter" : [{
            "stat" : "endurance",
            "operator" : "minimum"
          }]
        },
        "action": {
          "type" : "destroy"
        }
      }
    ]
  },
  "360":
  {
    "type": "dinoz",
    "rarity": "common",
    "element": "air",
    "costs":
    [
      {
        "element": "air",
        "amount": 1
      }
    ],
    "typeData":
    {
      "dinozStats":
      {
        "hatchTime":      4,
        "strength":      3,
        "endurance":      4
      }
    }
  },
  "361":
  {
    "type": "dinoz",
    "rarity": "common",
    "element": "air",
    "costs":
    [
      {
        "element": "air",
        "amount": 1
      }
    ],
    "keywords":
    [
      "venomous"
    ],
    "typeData":
    {
      "dinozStats":
      {
        "hatchTime":      3,
        "strength":      2,
        "endurance":      3
      }
    }
  },
  "363":
  {
    "type": "dinoz",
    "rarity": "uncommon",
    "element": "air",
    "costs":
    [
      {
        "element": "air",
        "amount": 1
      }
    ],
    "keywords":
    [
      "stompy"
    ],
    "typeData":
    {
      "dinozStats":
      {
        "hatchTime":      7,
        "strength":      4,
        "endurance":      10
      }
    }
  },
  "372":
  {
	"type": "charm",
    "rarity": "common",
    "element": "wood",
    "costs": [
      {
        "element": "wood",
        "amount": "1"
      },{
        "element": "neutral",
        "amount": "5"
      }
    ],
    "keywords":
    [
      "eternal"
    ],
    "typeData":
    {
      "charmTarget": {
        "side": "ally",
        "entity": ["dinoz", "egg"],
        "filter" : [{
          "stat" : "age",
          "operator" : "maximum"
        }]
      },
      "passiveEffects":
      [
        {
          "target": {
            "side": "ally",
            "entity": ["dinoz", "egg"],
            "quantity": "charmedOne"
          },
          "action": {
            "type" : "temporaryStats",
            "parameter" : {
              "strength" : 4,
              "endurance" : 4
            }
          }
        }
      ]
    }
  },
  "373":
  {
	"type": "charm",
    "rarity": "common",
    "element": "water",
    "costs": [
      {
        "element": "water",
        "amount": "1"
      },{
        "element": "neutral",
        "amount": "1"
      }
    ],
    "typeData":
    {
      "charmTarget": {
        "side": "ally",
        "entity": ["dinoz", "egg"],
        "filter" : [{
          "stat" : "endurance",
          "operator" : "maximum"
        }]
      },
      "passiveEffects":
      [
        {
          "target": {
            "side": "ally",
            "entity": ["dinoz", "egg"],
            "quantity": "charmedOne"
          },
          "action": {
            "type" : "temporaryStats",
            "parameter" : {
              "strength" : 3,
              "endurance" : -1
            }
          }
        }
      ]
    }
  },
  "379":
  {
	"type": "spell",
    "rarity": "uncommon",
    "element": "thunder",
    "costs": [
      {
        "element": "thunder",
        "amount": "1"
      }
    ],
    "keywords":
    [
      "focus"
    ],
    "effects": [
      {
        "target": {
          "side": [
            "ally",
            "enemy"
          ],
          "entity": "player",
          "quantity": "all"
        },
        "action": {
          "type": "damage",
          "parameter": {
            "value": "3"
          }
        }
      }
    ]
  },
  "383":
  {
	"type": "spell",
    "rarity": "common",
    "element": "air",
    "costs": [
      {
        "element": "air",
        "amount": "1"
      },
      {
        "element": "neutral",
        "amount": "1"
      }
    ],
    "keywords":
    [
      "focus"
    ],
    "effects": [
      {
        "target": {
          "side": "enemy",
          "entity": "player",
          "quantity": "all"
        },
        "action": {
          "type": "discard",
          "parameter": {
            "value": "3"
          }
        }
      }
    ]
  },
  "392":
  {
    "type": "spell",
    "element": "wood",
    "costs": [
      {
        "element": "wood",
        "amount": "1"
      },
      {
        "element": "neutral",
        "amount": "2"
      }
    ],
    "effects": [
      {
        "target": {
          "side": "ally",
          "entity": "player",
          "quantity": "all"
        },
        "action": {
          "type": "shuffleGraveyard"
        }
      }
    ]
  },
  "407":
  {
    "type": "dinoz",
    "rarity": "uncommon",
    "element": "thunder",
    "costs":
    [
      {
        "element": "thunder",
        "amount": 1
      }
    ],
    "keywords":
    [
      "rock",
      "overflow",
      "wizard"
    ],
    "typeData":
    {
      "dinozStats":
      {
        "hatchTime":      3,
        "strength":      2,
        "endurance":      2
      }
    }
  },
  "414":
  {
    "type": "dinoz",
    "rarity": "common",
    "element": "fire",
    "costs":
    [
      {
        "element": "fire",
        "amount": 1
      },
      {
        "element": "neutral",
        "amount": 1
      }
    ],
    "typeData":
    {
      "dinozStats":
      {
        "hatchTime":      3,
        "strength":       3,
        "endurance":      3
      }
    }
  },
  "415":
  {
    "type": "dinoz",
    "rarity": "common",
    "element": "fire",
    "costs":
    [
      {
        "element": "fire",
        "amount": 1
      },
      {
        "element": "neutral",
        "amount": 3
      }
    ],
    "typeData":
    {
      "dinozStats":
      {
        "hatchTime":      1,
        "strength":       4,
        "endurance":      2
      }
    }
  },
  "420":
  {
    "type": "dinoz",
    "rarity": "uncommon",
    "element": "fire",
    "costs":
    [
      {
        "element": "fire",
        "amount": 1
      },{
      "element": "neutral",
      "amount": 2
    }
    ],
    "keywords":
    [
      "flying"
    ],
    "typeData":
    {
      "dinozStats":
      {
        "hatchTime":      3,
        "strength":      4,
        "endurance":      3
      }
    }
  },
  "424":
  {
    "type": "dinoz",
    "rarity": "rare",
    "element": "fire",
    "costs":
    [
      {
        "element": "fire",
        "amount": 1
      },
      {
        "element": "neutral",
        "amount": 2
      }
    ],
    "keywords":
    [
      "wizard",
      "hero"
    ],
    "typeData":
    {
      "dinozStats":
      {
        "hatchTime":      1,
        "strength":      3,
        "endurance":      4
      }
    }
  },
  "426":
  {
    "type": "dinoz",
    "rarity": "rare",
    "element": "wood",
    "costs":
    [
      {
        "element": "wood",
        "amount": 1
      }
    ],
    "keywords":
    [
      "overflow",
      "coward"
    ],
    "typeData":
    {
      "dinozStats":
      {
        "hatchTime":      3,
        "strength":      2,
        "endurance":      3
      }
    }
  },
  "428":
  {
    "type": "dinoz",
    "rarity": "common",
    "element": "wood",
    "costs":
    [
      {
        "element": "wood",
        "amount": 1
      },
      {
        "element": "neutral",
        "amount": 1
      }
    ],
    "keywords":
    [
      "berserk"
    ],
    "typeData":
    {
      "dinozStats":
      {
        "hatchTime":      3,
        "strength":      2,
        "endurance":      3
      }
    }
  },
  "429":
  {
    "type": "dinoz",
    "rarity": "common",
    "element": "wood",
    "costs":
    [
      {
        "element": "wood",
        "amount": 2
      }
    ],
    "typeData":
    {
      "dinozStats":
      {
        "hatchTime":      4,
        "strength":      4,
        "endurance":      5
      }
    }
  },
  "436":
  {
    "type": "dinoz",
    "rarity": "rare",
    "element": "wood",
    "costs":
    [
      {
        "element": "wood",
        "amount": 2
      }
    ],
    "keywords":
    [
      "hero",
      "armor"
    ],
    "typeData":
    {
      "dinozStats":
      {
        "hatchTime":      8,
        "strength":       4,
        "endurance":      15
      }
    }
  },
  "437":
  {
    "type": "dinoz",
    "rarity": "common",
    "element": "water",
    "costs":
    [
      {
        "element": "water",
        "amount": 1
      },{
      "element": "neutral",
      "amount": 3
    }
    ],
    "typeData":
    {
      "dinozStats":
      {
        "hatchTime":      2,
        "strength":      3,
        "endurance":      4
      }
    }
  },
  "440":
  {
    "type": "dinoz",
    "rarity": "common",
    "element": "water",
    "costs":
    [
      {
        "element": "water",
        "amount": 1
      }
    ],
    "keywords":
    [
      "coward"
    ],
    "typeData":
    {
      "dinozStats":
      {
        "hatchTime":      1,
        "strength":      1,
        "endurance":      1
      }
    }
  },
  "441":
  {
    "type": "dinoz",
    "rarity": "common",
    "element": "water",
    "costs":
    [
      {
        "element": "water",
        "amount": 1
      },
      {
        "element": "neutral",
        "amount": 4
      }
    ],
    "keywords":
    [
      "berserk",
      "pack"
    ],
    "typeData":
    {
      "dinozStats":
      {
        "hatchTime":      3,
        "strength":      3,
        "endurance":      9
      }
    }
  },
  "442":
  {
    "type": "dinoz",
    "rarity": "common",
    "element": "water",
    "costs":
    [
      {
        "element": "water",
        "amount": 1
      },{
      "element": "neutral",
      "amount": 1
    }
    ],
    "typeData":
    {
      "dinozStats":
      {
        "hatchTime":      1,
        "strength":      1,
        "endurance":      4
      }
    }
  },
  "443":
  {
    "type": "dinoz",
    "rarity": "uncommon",
    "element": "water",
    "costs":
    [
      {
        "element": "water",
        "amount": 2
      },{
      "element": "neutral",
      "amount": 5
    }
    ],
    "typeData":
    {
      "dinozStats":
      {
        "hatchTime":      4,
        "strength":      7,
        "endurance":      18
      }
    }
  },
  "444":
  {
    "type": "dinoz",
    "rarity": "uncommon",
    "element": "water",
    "costs":
    [
      {
        "element": "water",
        "amount": 1
      },{
      "element": "neutral",
      "amount": 1
    }
    ],
    "keywords":
    [
      "vaporous"
    ],
    "typeData":
    {
      "dinozStats":
      {
        "hatchTime":      2,
        "strength":      3,
        "endurance":      1
      }
    }
  },
  "449":
  {
    "type": "dinoz",
    "rarity": "rare",
    "element": "thunder",
    "costs":
    [
      {
        "element": "thunder",
        "amount": 1
      },
      {
        "element": "neutral",
        "amount": 2
      }
    ],
    "keywords":
    [
      "hero",
      "initiative"
    ],
    "typeData":
    {
      "dinozStats":
      {
        "hatchTime":      0,
        "strength":      3,
        "endurance":      2
      }
    }
  },
  "451":
  {
    "type": "dinoz",
    "rarity": "common",
    "element": "thunder",
    "costs":
    [
      {
        "element": "thunder",
        "amount": 1
      }
    ],
    "keywords":
    [
      "focus"
    ],
    "typeData":
    {
      "dinozStats":
      {
        "hatchTime":      1,
        "strength":       1,
        "endurance":      1
      }
    }
  },
  "453":
  {
    "type": "dinoz",
    "rarity": "common",
    "element": "thunder",
    "costs":
    [
      {
        "element": "thunder",
        "amount": 1
      },{
      "element": "neutral",
      "amount": 3
    }
    ],
    "typeData":
    {
      "dinozStats":
      {
        "hatchTime":      0,
        "strength":      3,
        "endurance":      3
      }
    }
  },
  "456":
  {
    "type": "dinoz",
    "rarity": "common",
    "element": "thunder",
    "costs":
    [
      {
        "element": "thunder",
        "amount": 1
      },
      {
        "element": "neutral",
        "amount": 2
      }
    ],
    "keywords":
    [
      "eternal"
    ],
    "typeData":
    {
      "dinozStats":
      {
        "hatchTime":      3,
        "strength":      3,
        "endurance":      3
      }
    }
  },
  "457":
  {
    "type": "dinoz",
    "rarity": "uncommon",
    "element": "thunder",
    "costs":
    [
      {
        "element": "thunder",
        "amount": 1
      },
      {
        "element": "neutral",
        "amount": 3
      }
    ],
    "keywords":
    [
      "eternal",
      "flying",
      "discharge"
    ],
    "typeData":
    {
      "dinozStats":
      {
        "hatchTime":      0,
        "strength":      3,
        "endurance":      2
      }
    }
  },
  "466":
  {
    "type": "dinoz",
    "rarity": "common",
    "element": "air",
    "costs":
    [
      {
        "element": "air",
        "amount": 1
      },
      {
        "element": "water",
        "amount": 1
      }
    ],
    "keywords":
    [
      "vaporous"
    ],
    "typeData":
    {
      "dinozStats":
      {
        "hatchTime":      3,
        "strength":      3,
        "endurance":      3
      }
    }
  },
  "468":
  {
    "type": "dinoz",
    "rarity": "uncommon",
    "element": "air",
    "costs":
    [
      {
        "element": "air",
        "amount": 1
      },
      {
        "element": "neutral",
        "amount": 2
      }
    ],
    "keywords":
    [
      "flying",
      "armor"
    ],
    "typeData":
    {
      "dinozStats":
      {
        "hatchTime":      1,
        "strength":      1,
        "endurance":      5
      }
    }
  },
  "469":
  {
    "type": "dinoz",
    "rarity": "common",
    "element": "air",
    "costs":
    [
      {
        "element": "air",
        "amount": 1
      },
      {
        "element": "neutral",
        "amount": 5
      }
    ],
    "keywords":
    [
      "flying"
    ],
    "typeData":
    {
      "dinozStats":
      {
        "hatchTime":      2,
        "strength":      6,
        "endurance":      6
      }
    }
  },
  "472":
  {
	"type": "charm",
    "rarity": "common",
    "element": "fire",
    "costs": [
      {
        "element": "fire",
        "amount": "1"
      },{
        "element": "neutral",
        "amount": "1"
      }
    ],
    "typeData":
    {
      "charmTarget": {
        "side": "ally",
        "entity": "dinoz",
        "filter" : [{
          "keyword" : "hero"
        }]
      },
      "passiveEffects":
      [
        {
          "target": {
            "side": "ally",
            "entity": "dinoz",
            "quantity": "charmedOne"
          },
          "action": {
            "type" : "temporaryStats",
            "parameter" : {
              "strength" : 3,
              "endurance" : 2
            }
          }
        }
      ]
    }
  },
  "477":
  {
	"type": "spell",
    "rarity": "common",
    "element": "fire",
    "costs": [
      {
        "element": "fire",
        "amount": "1"
      },
      {
        "element": "neutral",
        "amount": "2"
      }
    ],
    "effects": [
      {
        "target": {
          "side": "enemy",
          "entity": [
            "dinoz",
            "egg"
          ],
          "quantity": "one"
        },
        "action": {
          "type": "damage",
          "parameter": {
            "value": "3"
          }
        }
      }
    ]
  },
  "478":
  {
    "type": "spell",
    "rarity": "uncommon",
    "element": "wood",
    "costs":
    [
      {
        "element": "wood",
        "amount": 1
      }
    ],
    "effects":
    [
      {
        "target": {
          "side": "enemy",
          "entity": "dinoz",
          "quantity": "one",
          "filter" : [{
            "keyword":"hero"
          }]
        },
        "action": {
          "type" : "destroy"
        }
      }
    ]
  },
  "482":
  {
	"type": "charm",
    "rarity": "common",
    "element": "wood",
    "costs": [
      {
        "element": "wood",
        "amount": "1"
      },{
        "element": "neutral",
        "amount": "1"
      }
    ],
    "keywords":
    [
      "focus"
    ],
    "typeData":
    {
      "charmTarget": {
        "side": "enemy",
        "entity": "dinoz",
        "filter" : [{
          "keyword" : "flying"
        }]
      },
      "passiveEffects":
      [
        {
          "target": {
            "side": "enemy",
            "entity": "dinoz",
            "quantity": "charmedOne"
          },
          "action": {
            "type" : "removeKeyword",
            "parameter" : {
              "value" : "flying"
            }
          }
        },{
          "target": {
            "side": "enemy",
            "entity": "dinoz",
            "quantity": "charmedOne"
          },
          "action": {
            "type" : "damage",
            "parameter" : {
              "value" : 5
            }
          }
        }
      ]
    }
  },
  "488":
  {
    "type": "spell",
    "rarity": "uncommon",
    "element": "water",
    "costs":
    [
      {
        "element": "water",
        "amount": 2
      },
      {
        "element": "neutral",
        "amount": 2
      }
    ],
    "effects":
    [
      {
        "target": {
          "side": "enemy",
          "entity": "egg",
          "quantity": "all",
          "filter" : [{
            "element": "wood",
            "inverted":true
          }]
        },
        "action": {
          "type" : "destroy"
        }
      }
    ]
  },
  "491":
  {
    "type": "spell",
    "rarity": "uncommon",
    "element": "thunder",
    "expansion": "second",
    "costs": [
      {
        "element": "thunder",
        "amount": "1"
      },
      {
        "element": "neutral",
        "amount": "2"
      }
    ],
    "effects":
    [
      {
        "target": {
          "side": ["ally"],
          "entity": "dinoz",
          "quantity": "one",
          "filter": [{
            "keyword" : "hero"
          }]
        },
        "action": {
          "type" : "resurrect"
        }
      }
    ]
  },
  "492":
  {
    "type": "spell",
    "rarity": "common",
    "element": "thunder",
    "costs": [
      {
        "element": "thunder",
        "amount": "1"
      },
      {
        "element": "neutral",
        "amount": "1"
      }
    ],
    "keywords": [
      "eternal"
    ],
    "effects": [
      {
        "target": {
          "side": "enemy",
          "entity": "item",
          "quantity": "one"
        },
        "action": {
          "type": "destroy"
        }
      },
      {
        "target": {
          "side": "ally",
          "entity": "player",
          "quantity": "one"
        },
        "action": {
          "type": "damage",
          "parameter": {
            "value": "2"
          }
        }
      }
    ]
  },
  "493":
  {
    "type": "spell",
    "rarity": "rare",
    "element": "thunder",
    "costs":
    [
      {
        "element": "thunder",
        "amount": 1
      },
      {
        "element": "neutral",
        "amount": 3
      }
    ],
    "effects":
    [
      {
        "target": {
          "side": ["ally","enemy"],
          "entity": "dinoz",
          "quantity": "all",
          "filter" : [{
            "stat" : "cost",
            "operator" : "greaterOrEquals",
            "value" : "2"
          }]
        },
        "action": {
          "type" : "destroy"
        }
      }
    ]
  },
  "497":
  {
	"type": "charm",
    "rarity": "uncommon",
    "element": "air",
    "costs": [
      {
        "element": "air",
        "amount": "1"
      },
      {
        "element": "neutral",
        "amount": "1"
      }
    ],
    "effects": [
      {
        "target": {
          "side": "enemy",
          "entity": "charm",
          "quantity": "one"
        },
        "action": {
          "type" : "destroy"
        }
      }
    ],
    "typeData":
    {
      "charmTarget": {
        "side": "ally",
        "entity": ["dinoz", "egg"]
      },
      "passiveEffects":
      [
        {
          "target": {
            "side": "ally",
            "entity": "dinoz",
            "quantity": "charmedOne"
          },
          "action": {
            "type" : "temporaryStats",
            "parameter" : {
              "strength": 1,
              "endurance": 2
            }
          }
        },
        {
          "target": {
            "side": "ally",
            "entity": "dinoz",
            "quantity": "charmedOne"
          },
          "action": {
            "type" : "gainKeyword",
            "parameter" : {
              "value": "flying"
            }
          }
        }
      ]
    }
  },
  "504":
  {
    "type": "dinoz",
    "rarity": "rare",
    "element": "wood",
    "costs":
    [
      {
        "element": "wood",
        "amount": 1
      },
      {
        "element": "thunder",
        "amount": 1
      }
    ],
    "keywords":
    [
      "hero",
      "initiative",
      "tenacious"
    ],
    "typeData":
    {
      "dinozStats":
      {
        "hatchTime":      3,
        "strength":      4,
        "endurance":      4
      }
    }
  },
  "509":
  {
	"type": "charm",
    "rarity": "rare",
    "element": "wood",
    "costs": [
      {
        "element": "wood",
        "amount": "1"
      },
      {
        "element": "water",
        "amount": "1"
      }
    ],
    "typeData":
    {
      "charmTarget": {
        "side": "ally",
        "entity": ["dinoz", "egg"]
      },
      "passiveEffects":
      [
        {
          "target": {
            "side": "ally",
            "entity": "dinoz",
            "quantity": "charmedOne"
          },
          "action": {
            "type" : "temporaryStats",
            "parameter" : {
              "endurance": 8
            }
          }
        }
      ]
    }
  },
  "511":
  {
	"type": "spell",
    "rarity": "rare",
    "element": "thunder",
    "costs": [
      {
        "element": "thunder",
        "amount": "1"
      },
      {
        "element": "air",
        "amount": "2"
      },
      {
        "element": "neutral",
        "amount": "1"
      }
    ],
    "effects": [
      {
        "target": {
          "side": "enemy",
          "entity": "player",
          "quantity": "all"
        },
        "action": {
          "type": "damage",
          "parameter": {
            "value": "4"
          }
        }
      },
      {
        "target": {
          "side": "ally",
          "entity": "player",
          "quantity": "all"
        },
        "action": {
          "type": "heal",
          "parameter": {
            "value": "4"
          }
        }
      }
    ]
  },
  "517":
  {
    "type": "dinoz",
    "rarity": "rare",
    "element": "water",
    "costs":
    [
      {
        "element": "water",
        "amount": 1
      },
      {
        "element": "neutral",
        "amount": 2
      }
    ],
    "keywords":
    [
      "bubble",
      "hero"
    ],
    "typeData":
    {
      "dinozStats":
      {
        "hatchTime":      2,
        "strength":      3,
        "endurance":      4
      }
    }
  },
  "521":
  {
	"type": "charm",
    "rarity": "common",
    "element": "fire",
    "costs": [
      {
        "element": "fire",
        "amount": "1"
      },
      {
        "element": "neutral",
        "amount": "1"
      }
    ],
    "effects": [
      {
        "target": {
          "side": "ally",
          "entity": "player",
          "quantity": "one"
        },
        "action": {
          "type": "playCard",
          "parameter": {
            "value": "1"
          }
        }
      }
    ],
    "typeData":
    {
      "charmTarget": {
        "side": "ally",
        "entity": ["dinoz", "egg"]
      },
      "passiveEffects":
      [
        {
          "target": {
            "side": "ally",
            "entity": "dinoz",
            "quantity": "charmedOne"
          },
          "action": {
            "type" : "temporaryStats",
            "parameter" : {
              "strength": 1
            }
          }
        }
      ]
    }
  },
  "522":
  {
    "type": "dinoz",
    "rarity": "rare",
    "element": "air",
    "costs":
    [
      {
        "element": "air",
        "amount": 1
      },
      {
        "element": "neutral",
        "amount": 2
      }
    ],
    "keywords":
    [
      "assassin",
      "hero",
      "regeneration"
    ],
    "typeData":
    {
      "dinozStats":
      {
        "hatchTime":      2,
        "strength":      2,
        "endurance":      4
      }
    }
  },
  "531":
  {
    "type": "dinoz",
    "rarity": "uncommon",
    "element": "wood",
    "costs":
    [
      {
        "element": "wood",
        "amount": 1
      },{
        "element": "neutral",
        "amount": 2
      }
    ],
    "keywords":
    [
      "overflow"
    ],
    "typeData":
    {
      "dinozStats":
      {
        "hatchTime":      1,
        "strength":       3,
        "endurance":      3
      }
    }
  },
  "535":
  {
    "type": "dinoz",
    "rarity": "uncommon",
    "element": "fire",
    "costs":
    [
      {
        "element": "fire",
        "amount": 1
      },
      {
        "element": "neutral",
        "amount": 1
      }
    ],
    "keywords":
    [
      "assassin"
    ],
    "typeData":
    {
      "dinozStats":
      {
        "hatchTime":      2,
        "strength":      2,
        "endurance":      3
      }
    }
  },
  "536":
  {
    "type": "dinoz",
    "rarity": "common",
    "element": "fire",
    "costs":
    [
      {
        "element": "fire",
        "amount": 1
      },
      {
        "element": "neutral",
        "amount": 3
      }
    ],
    "keywords":
    [
      "tenacious"
    ],
    "typeData":
    {
      "dinozStats":
      {
        "hatchTime":      2,
        "strength":      6,
        "endurance":      1
      }
    }
  },
  "537":
  {
	"type": "charm",
    "rarity": "common",
    "element": "water",
    "costs": [
      {
        "element": "water",
        "amount": "1"
      },
      {
        "element": "neutral",
        "amount": "1"
      }
    ],
    "effects": [
      {
        "target": {
          "side": "ally",
          "entity": "player",
          "quantity": "one"
        },
        "action": {
          "type": "addEnergy",
          "parameter": {
            "element": "air"
          }
        }
      }
    ],
    "typeData":
    {
      "charmTarget": {
        "side": "ally",
        "entity": ["dinoz", "egg"]
      },
      "passiveEffects":
      [
        {
          "target": {
            "side": "ally",
            "entity": "dinoz",
            "quantity": "charmedOne"
          },
          "action": {
            "type" : "temporaryStats",
            "parameter" : {
              "endurance": 1
            }
          }
        },
        {
          "target": {
            "side": "ally",
            "entity": "dinoz",
            "quantity": "charmedOne"
          },
          "action": {
            "type" : "gainKeyword",
            "parameter" : {
              "value": "bubble"
            }
          }
        }
      ]
    }
  },



  "965":
  {
    "debug": 1,
    "type": "dinoz",
    "rarity": "common",
    "element": "fire",
    "costs":
    [
      {
        "element": "fire",
        "amount": 1
      }
    ],
    "typeData":
    {
      "dinozStats":
      {
        "hatchTime":      2,
        "strength":      1,
        "endurance":      3
      },
      "triggerEffects":[
        {
          "triggers": [
            "onAllyStartTurn"
          ],
          "effects":  [
            {
              "target": {
                "side": "enemy",
                "entity": "dinoz",
                "quantity": "one"
              },
              "action": {
                "type" : "gainKeyword",
                "parameter" : {
                  "value" : "pack"
                }
              }
            }
          ]
        }
      ]
    }
  },
  "966":
  {
    "debug": 1,
    "type": "dinoz",
    "rarity": "common",
    "element": "fire",
    "costs":
    [
      {
        "element": "fire",
        "amount": 1
      }
    ],
    "typeData":
    {
      "dinozStats":
      {
        "hatchTime":      2,
        "strength":      1,
        "endurance":      3
      },
      "triggerEffects":[
        {
          "triggers": [
            "onEnemyStartTurn"
          ],
          "effects":  [
            {
              "target": {
                "side": "enemy",
                "entity": "player",
                "quantity": "one"
              },
              "action": {
                "type" : "destroyEnergy",
                "parameter" : {
                  "value": 1
                }
              }
            },
            {
              "target": {
                "side": "ally",
                "entity": ["dinoz", "egg"],
                "quantity": "one"
              },
              "action": {
                "type" : "destroy"
              }
            }
          ]
        }
      ]
    }
  },
  "967":
  {
    "debug": 1,
    "type": "dinoz",
    "rarity": "common",
    "element": "fire",
    "costs":
    [
      {
        "element": "fire",
        "amount": 1
      }
    ],
    "typeData":
    {
      "dinozStats":
      {
        "hatchTime":      2,
        "strength":      1,
        "endurance":      3
      },
      "triggerEffects":[
        {
          "triggers": [
            "onAttackEnd"
          ],
          "effects":  [
            {
              "target": {
                "side": ["ally","enemy"],
                "entity": "player",
                "quantity": "all"
              },
              "action": {
                "type": "heal",
                "parameter": {
                  "value": "1"
                }
              }
            }
          ]
        },
        {
          "triggers": [
            "onAttackEnd", "onHatch"
          ],
          "effects":  [
            {
              "target": {
                "side": ["ally"],
                "entity": "player",
                "quantity": "all"
              },
              "action": {
                "type": "heal",
                "parameter": {
                  "value": "2"
                }
              }
            }
          ]
        }
      ]
    }
  },
  "968":
  {
    "debug": 1,
    "type": "dinoz",
    "rarity": "common",
    "element": "fire",
    "costs":
    [
      {
        "element": "fire",
        "amount": 1
      }
    ],
    "typeData":
    {
      "dinozStats":
      {
        "hatchTime":      2,
        "strength":      1,
        "endurance":      1
      },
      "triggerEffects":[
        {
          "triggers": [
            "onDeath"
          ],
          "effects":  [
            {
              "target": {
                "side": "enemy",
                "entity": "player",
                "quantity": "all"
              },
              "action": {
                "type": "damage",
                "parameter": {
                  "value": "1"
                }
              }
            }
          ]
        }
      ]
    }
  },
  "969":
  {
    "debug": 1,
    "type": "dinoz",
    "rarity": "common",
    "element": "fire",
    "costs":
    [
      {
        "element": "fire",
        "amount": 1
      }
    ],
    "typeData":
    {
      "dinozStats":
      {
        "hatchTime":      2,
        "strength":      1,
        "endurance":      1
      },
      "triggerEffects":[
        {
          "triggers": [
            "onHatch"
          ],
          "effects":  [
            {
              "target": {
                "side": "ally",
                "entity": "player",
                "quantity": "all"
              },
              "action": {
                "type": "damage",
                "parameter": {
                  "value": "1"
                }
              }
            }
          ]
        }
      ]
    }
  },


  "970":
  {
    "debug": 1,
    "type": "spell",
    "rarity": "uncommon",
    "element": "wood",
    "costs":
    [
      {
        "element": "wood",
        "amount": 1
      }
    ],
    "effects":
    [
      {
        "target": {
          "side": ["ally","enemy"],
          "entity": "dinoz",
          "quantity": "one"
        },
        "action": {
          "type" : "resurrect"
        }
      }
    ]
  },
  "971":
  {
    "debug": 1,
    "type": "spell",
    "rarity": "uncommon",
    "element": "wood",
    "costs":
    [
      {
        "element": "wood",
        "amount": 1
      }
    ],
    "effects":
    [
      {
        "target": {
          "side": "ally",
          "entity": "dinoz",
          "quantity": "all"
        },
        "action": {
          "type" : "resurrect"
        }
      }
    ]
  },
  "972":
  {
    "debug": 1,
    "type": "spell",
    "rarity": "uncommon",
    "element": "wood",
    "costs":
    [
      {
        "element": "wood",
        "amount": 1
      }
    ],
    "effects":
    [
      {
        "target": {
          "side": "ally",
          "entity": "dinoz",
          "quantity": "one"
        },
        "action": {
          "type" : "resurrect"
        }
      }
    ]
  },
  "973":
  {
    "debug": 1,
    "type": "spell",
    "rarity": "uncommon",
    "element": "wood",
    "costs":
    [
      {
        "element": "wood",
        "amount": 1
      }
    ],
    "effects":
    [
      {
        "target": {
          "side": "enemy",
          "entity": "dinoz",
          "quantity": "one",
          "filter" : [{
            "keyword" : "hero"
          },{
            "element":"thunder"
          }
          ]
        },
        "action": {
          "type" : "destroy"
        }
      }
    ]
  },
  "974":
  {
    "debug": 1,
	"type": "spell",
    "element": "air",
    "costs":
    [
      {
        "element": "air",
        "amount": 1
      }
    ],
    "effects":
    [
      {
        "target": {
          "side": "enemy",
          "entity": "egg",
          "quantity": "all"
        },
        "action": {
          "type" : "gainControl"
        }
      }
    ]
  },
  "975":
  {
    "debug": 1,
	"type": "spell",
    "element": "air",
    "costs":
    [
      {
        "element": "air",
        "amount": 1
      }
    ],
    "effects":
    [
      {
        "target": {
          "side": "enemy",
          "entity": "dinoz",
          "quantity": "one"
        },
        "action": {
          "type" : "gainControl"
        }
      }
    ]
  },
  "976":
  {
    "debug": 1,
	"type": "spell",
    "element": "air",
    "costs":
    [
      {
        "element": "air",
        "amount": 1
      }
    ],
    "effects":
    [
      {
        "target": {
          "side": "enemy",
          "entity": "player",
          "quantity": "all"
        },
        "action": {
          "type" : "skipRoundPhase",
          "parameter" : {
            "phase" : "attack"
          }
        }
      }
    ]
  },
  "977":
  {
    "debug": 1,
    "type": "spell",
    "rarity": "uncommon",
    "element": "wood",
    "costs":
    [
      {
        "element": "wood",
        "amount": 1
      }
    ],
    "effects":
    [
      {
        "target": {
          "side": "enemy",
          "entity": "player",
          "quantity": "all"
        },
        "action": {
          "type" : "addRoundPhase",
          "parameter" : {
            "phase" : "attack"
          }
        }
      }
    ]
  },
  "978":
  {
    "debug": 1,
	"type": "dinoz",
    "element": "fire",
    "costs": [
      {
        "element": "fire",
        "amount": 1
      },
      {
        "element": "neutral",
        "amount": 1
      }
    ],
    "keywords": [
      "survivor",
      "hero"
    ],
    "typeData": {
      "dinozStats": {
        "hatchTime": 1,
        "strength": 3,
        "endurance": 1
      }
    }
  },
  "979":
  {
    "debug": 1,
	"type": "spell",
    "element": "air",
    "costs":
    [
      {
        "element": "air",
        "amount": 1
      }
    ],
    "effects":
    [
      {
        "target": {
          "side": "enemy",
          "entity": "dinoz",
          "quantity": "one"
        },
        "action": {
          "type" : "gainKeyword",
          "parameter" : {
            "value" : "ephemeral"
          }
        }
      }
    ]
  },
  "980":
  {
    "debug": 1,
	"type": "spell",
    "element": "air",
    "costs":
    [
      {
        "element": "air",
        "amount": 1
      }
    ],
    "effects":
    [
      {
        "target": {
          "side": ["ally", "enemy"],
          "entity": "egg",
          "quantity": "all"
        },
        "action": {
          "type" : "gainKeyword",
          "parameter" : {
            "value" : ["rock", "armor", "armor"]
          }
        }
      }
    ]
  },
  "981":
  {
    "debug": 1,
	"type": "spell",
    "element": "air",
    "costs":
    [
      {
        "element": "air",
        "amount": 1
      }
    ],
    "effects":
    [
      {
        "target": {
          "side": ["ally","enemy"],
          "entity": ["dinoz","egg"],
          "quantity": "all"
        },
        "action": {
          "type" : "destroy"
        }
      }
    ]
  },
  "982":
  {
    "debug": 1,
	"type": "spell",
    "element": "air",
    "costs":
    [
      {
        "element": "air",
        "amount": 1
      }
    ],
    "effects":
    [
      {
        "target": {
          "side": "enemy",
          "entity": "dinoz",
          "quantity": "one"
        },
        "action": {
          "type" : "becomeEgg"
        }
      }
    ]
  },
  "983":
  {
    "debug": 1,
	"type": "spell",
    "element": "air",
    "costs":
    [
      {
        "element": "air",
        "amount": 1
      }
    ],
    "effects":
    [
      {
        "target": {
          "side": ["ally","enemy"],
          "entity": "egg",
          "quantity": "all"
        },
        "action": {
          "type" : "forceHatch"
        }
      }
    ]
  },
  "984":
  {
    "debug": 1,
	"type": "spell",
    "element": "air",
    "costs":
    [
      {
        "element": "air",
        "amount": 1
      }
    ],
    "effects":
    [
      {
        "target": {
          "side": "ally",
          "entity": "egg",
          "quantity": "all"
        },
        "action": {
          "type" : "hatchMarker",
          "parameter" : {
            "value": 1
          }
        }
      },
      {
        "target": {
          "side": "enemy",
          "entity": "egg",
          "quantity": "all"
        },
        "action": {
          "type" : "hatchMarker",
          "parameter" : {
            "value": -1
          }
        }
      }
    ]
  },
  "985":
  {
    "debug": 1,
	"type": "spell",
    "element": "air",
    "costs":
    [
      {
        "element": "air",
        "amount": 1
      }
    ],
    "effects":
    [
      {
        "target": {
          "side": ["ally","enemy"],
          "entity": "dinoz",
          "quantity": "one"
        },
        "action": {
          "type" : "overrideStat",
          "parameter" : {
            "strength": 5,
            "endurance": 1
          }
        }
      }
    ]
  },
  "986":
  {
    "debug": 1,
	"type": "spell",
    "element": "air",
    "costs":
    [
      {
        "element": "air",
        "amount": 1
      }
    ],
    "effects":
    [
      {
        "target": {
          "side": "enemy",
          "entity": "egg",
          "quantity": "one"
        },
        "action": {
          "type" : "changeStat",
          "parameter" : {
            "requiredEclosion": 1,
            "endurance": 3
          }
        }
      }
    ]
  },
  "988":
  {
    "debug": 1,
	"type": "spell",
    "element": "air",
    "costs":
    [
      {
        "element": "air",
        "amount": 1
      }
    ],
    "effects":
    [
      {
        "target": {
          "side": "ally",
          "entity": "dinoz",
          "quantity": "one"
        },
        "action": {
          "type" : "changeStat",
          "parameter" : {
            "strength": 3,
            "endurance": 3
          }
        }
      }
    ]
  },
  "990":
  {
    "debug": 1,
	"type": "spell",
    "element": "air",
    "costs":
    [
      {
        "element": "air",
        "amount": 1
      }
    ],
    "effects":
    [
      {
        "target": {
          "side": ["ally","enemy"],
          "entity": "player",
          "quantity": "all"
        },
        "action": {
          "type" : "destroyEnergy",
          "parameter" : {
            "value": 1
          }
        }
      }
    ]
  },
  "991":
  {
    "debug": 1,
	"type": "spell",
    "element": "air",
    "costs":
    [
      {
        "element": "air",
        "amount": 1
      }
    ],
    "effects":
    [
      {
        "target": {
          "side": "enemy",
          "entity": "player",
          "quantity": "all"
        },
        "action": {
          "type" : "discard",
          "parameter" : {
            "value": 10
          }
        }
      }
    ]
  },
  "992":
  {
    "debug": 1,
	"type": "spell",
    "element": "air",
    "costs":
    [
      {
        "element": "air",
        "amount": 1
      }
    ],
    "effects":
    [
      {
        "target": {
          "side": ["ally","enemy"],
          "entity": "player",
          "quantity": "all"
        },
        "action": {
          "type" : "setHP",
          "parameter" : {
            "value": 30
          }
        }
      }
    ]
  },
  "993":
  {
    "debug": 1,
	"type": "spell",
    "element": "air",
    "costs":
    [
      {
        "element": "air",
        "amount": 1
      }
    ],
    "effects":
    [
      {
        "target": {
          "side": ["ally","enemy"],
          "entity":["dinoz","egg","player"],
          "quantity": "all"
        },
        "action": {
          "type" : "damage",
          "parameter" : {
            "value": 1
          }
        }
      }
    ]
  },
  "994":
  {
    "debug": 1,
	"type": "spell",
    "element": "air",
    "costs":
    [
      {
        "element": "air",
        "amount": 1
      }
    ],
    "effects":
    [
      {
        "target": {
          "side": ["ally","enemy"],
          "entity": "dinoz",
          "quantity": "all"
        },
        "action": {
          "type" : "heal",
          "parameter" : {
            "value": 1
          }
        }
      }
    ]
  },
  "995":
  {
    "debug": 1,
	"type": "spell",
    "element": "air",
    "costs":
    [
      {
        "element": "air",
        "amount": 1
      }
    ],
    "effects":
    [
      {
        "target": {
          "side": ["ally","enemy"],
          "entity": "player",
          "quantity": "one"
        },
        "action": {
          "type" : "heal",
          "parameter" : {
            "value": 2
          }
        }
      }
    ]
  },
  "996":
  {
    "debug": 1,
	"type": "spell",
    "element": "air",
    "costs":
    [
      {
        "element": "air",
        "amount": 1
      }
    ],
    "effects":
    [
      {
        "target": {
          "side": ["ally","enemy"],
          "entity": "player",
          "quantity": "all"
        },
        "action": {
          "type" : "heal",
          "parameter" : {
            "value": 2
          }
        }
      },
      {
        "target": {
          "side": "enemy",
          "entity": ["dinoz","egg"],
          "quantity": "all"
        },
        "action": {
          "type" : "damage",
          "parameter" : {
            "value": 1
          }
        }
      }
    ]
  },
  "997":
  {
    "debug": 1,
	"type": "dinoz",
    "element": "fire",
    "costs": [
      {
        "element": "fire",
        "amount": 1
      }
    ],
    "keywords": [
      "ephemeral"
    ],
    "typeData": {
      "dinozStats": {
        "hatchTime": 0,
        "strength": 3,
        "endurance": 1
      }
    }
  },
  "998":
  {
    "debug": 1,
	"type": "dinoz",
    "element": "fire",
    "costs": [
      {
        "element": "fire",
        "amount": 1
      }
    ],
    "keywords": [
      "ephemeral",
      "stompy"
    ],
    "typeData": {
      "dinozStats": {
        "hatchTime": 0,
        "strength": 2,
        "endurance": 5
      }
    }
  },
  "999":
  {
    "debug": 1,
	"type": "dinoz",
    "element": "fire",
    "costs": [
      {
        "element": "fire",
        "amount": 1
      }
    ],
    "keywords": [
      "focus"
    ],
    "typeData": {
      "dinozStats": {
        "hatchTime": 0,
        "strength": 0,
        "endurance": 5
      }
    }
  }
}

