<?xml version="1.0" encoding="UTF-8" standalone="no"?>
<svg xmlns:xlink="http://www.w3.org/1999/xlink" height="16.0px" width="54.0px" xmlns="http://www.w3.org/2000/svg">
  <g transform="matrix(1.0, 0.0, 0.0, 1.0, 0.0, 16.0)">
    <pattern height="16" id="PatternID_310_1" overflow="visible" patternTransform="matrix(1.0, 0.0, 0.0, 1.0, 0.0, -16.0)" patternUnits="userSpaceOnUse" viewBox="0 0 54 16" width="54">
      <image height="16" width="54" xlink:href="data:image/PNG;base64,iVBORw0KGgoAAAANSUhEUgAAADYAAAAQCAYAAABdsIz2AAAAPUlEQVR42mNgIAFU2Gv+H2yYgRpgyHlsMDqYYg8PR08NS48N2+Q46rFRj416bNRjox4b9diox0Y9Rn+PAQB3S7ldM8s1OQAAAABJRU5ErkJggg=="/>
    </pattern>
    <path d="M54.0 -16.0 L54.0 0.0 0.0 0.0 0.0 -16.0 54.0 -16.0" style="fill:url(#PatternID_310_1)"/>
  </g>
</svg>
