<?xml version="1.0" encoding="UTF-8" standalone="no"?>
<svg xmlns:xlink="http://www.w3.org/1999/xlink" height="26.8px" width="18.2px" xmlns="http://www.w3.org/2000/svg">
  <g transform="matrix(1.0, 0.0, 0.0, 1.0, 11.0, 15.8)">
    <path d="M0.0 -7.1 Q-2.95 -7.1 -5.05 -5.05 -7.1 -2.95 -7.1 0.0 -7.1 2.95 -5.05 5.0 -2.95 7.1 0.0 7.1 L0.0 11.0 Q-4.55 11.0 -7.8 7.75 -11.0 4.55 -11.0 0.0 -11.0 -4.55 -7.8 -7.8 -4.55 -11.0 0.0 -11.0 L0.0 -7.1" fill="url(#gradient0)" fill-rule="evenodd" stroke="none"/>
    <path d="M0.45 -2.3 Q-2.3 -2.3 -4.3 -4.3 -6.3 -6.3 -6.3 -9.05 -6.3 -11.85 -4.3 -13.8 -2.3 -15.8 0.45 -15.8 3.2 -15.8 5.2 -13.8 7.2 -11.85 7.2 -9.05 7.2 -6.3 5.2 -4.3 3.2 -2.3 0.45 -2.3" fill="#ffffff" fill-opacity="0.49803922" fill-rule="evenodd" stroke="none"/>
    <path d="M0.45 -5.5 Q-1.0 -5.5 -2.05 -6.55 -3.1 -7.6 -3.1 -9.05 -3.1 -10.5 -2.05 -11.55 -1.0 -12.6 0.45 -12.6 1.9 -12.6 2.95 -11.55 4.0 -10.5 4.0 -9.05 4.0 -7.6 2.95 -6.55 1.9 -5.5 0.45 -5.5" fill="#ffffff" fill-rule="evenodd" stroke="none"/>
  </g>
  <defs>
    <linearGradient gradientTransform="matrix(0.0, 0.0093, -0.0067, 0.0, -5.5, -1.25)" gradientUnits="userSpaceOnUse" id="gradient0" spreadMethod="pad" x1="-819.2" x2="819.2">
      <stop offset="0.0" stop-color="#ffffff"/>
      <stop offset="1.0" stop-color="#ffffff" stop-opacity="0.0"/>
    </linearGradient>
  </defs>
</svg>
