<?xml version="1.0" encoding="UTF-8" standalone="no"?>
<svg xmlns:xlink="http://www.w3.org/1999/xlink" height="31.25px" width="5.3px" xmlns="http://www.w3.org/2000/svg">
  <g transform="matrix(1.0, 0.0, 0.0, 1.0, 3.4, -2.2)">
    <path d="M-1.05 2.6 L-0.7 2.2 Q0.3 4.7 0.4 10.25 0.5 15.25 1.9 17.55 L1.8 17.65 1.15 19.35 0.9 20.8 Q0.35 24.95 0.65 29.4 0.9 32.0 1.35 33.45 L0.6 32.1 Q-0.45 29.05 -1.0 25.85 -1.75 21.1 -1.75 18.4 L-1.6 16.55 -1.4 15.5 -1.3 15.0 Q-0.5 11.7 -0.5 7.4 L-0.75 4.25 -1.05 2.6" fill="#000000" fill-rule="evenodd" stroke="none"/>
    <path d="M-1.05 2.6 L-0.75 4.25 -0.5 7.4 Q-0.5 11.7 -1.3 15.0 L-1.4 15.5 -1.6 16.55 -1.75 18.4 Q-1.75 21.1 -1.0 25.85 -0.45 29.05 0.6 32.1 -1.65 27.85 -2.7 23.25 -3.65 18.95 -3.35 16.45 -1.45 11.65 -1.15 9.65 -0.7 6.3 -2.0 3.7 L-1.05 2.6" fill="#3a3d62" fill-rule="evenodd" stroke="none"/>
  </g>
</svg>
