<?xml version="1.0" encoding="UTF-8" standalone="no"?>
<svg xmlns:xlink="http://www.w3.org/1999/xlink" height="298.5px" width="570.0px" xmlns="http://www.w3.org/2000/svg">
  <g transform="matrix(1.0, 0.0, 0.0, 1.0, 0.0, 3.5)">
    <path d="M79.3 -2.2 L78.5 -3.0 78.75 -3.25 79.0 -3.5 81.25 -3.25 Q81.0 -2.5 80.25 -1.75 79.75 -1.75 79.3 -2.2 M570.0 29.0 Q569.55 30.4 568.0 31.0 566.75 30.5 566.0 29.75 566.9 28.45 567.75 27.95 L569.25 27.5 570.0 29.0 M516.0 20.0 Q515.55 21.4 514.0 22.0 512.75 21.5 512.0 20.75 512.9 19.45 513.75 18.95 L515.25 18.5 516.0 20.0 M532.0 68.0 Q531.8 68.6 530.8 69.3 529.75 70.0 529.0 70.0 527.75 69.5 527.0 68.75 528.75 66.0 530.0 66.0 531.55 66.6 532.0 68.0 M508.45 154.45 Q509.0 154.75 509.0 156.35 L508.75 158.25 508.45 158.65 506.5 159.0 504.75 158.5 504.4 158.7 Q504.0 158.55 504.0 157.0 504.0 156.1 505.5 154.85 507.0 153.6 507.0 154.0 L508.45 154.45 M429.0 2.0 L427.8 3.3 Q426.75 4.0 426.0 4.0 424.75 3.5 424.0 2.75 425.75 0.0 427.0 0.0 428.55 0.6 429.0 2.0 M431.25 17.75 L432.0 17.25 433.15 17.55 Q434.35 17.95 434.5 18.25 L432.8 18.4 Q431.4 18.25 431.25 17.75 M423.55 8.9 Q423.25 8.9 423.25 7.35 423.25 5.8 423.75 5.85 L425.0 6.25 427.25 6.75 Q426.85 8.0 425.0 8.75 L423.55 8.9 M427.0 70.0 L425.8 71.3 Q424.75 72.0 424.0 72.0 422.75 71.5 422.0 70.75 423.75 68.0 425.0 68.0 426.55 68.6 427.0 70.0 M457.0 87.0 Q458.55 87.6 459.0 89.0 458.8 89.6 457.8 90.3 L456.0 91.0 Q454.75 90.5 454.0 89.75 455.75 87.0 457.0 87.0 M400.65 12.55 L401.5 13.25 399.8 13.4 Q398.4 13.25 398.25 12.75 L399.05 12.4 400.0 12.25 400.65 12.55 M349.0 35.75 Q348.35 37.7 346.0 38.0 L344.55 37.55 Q344.0 37.2 344.0 35.6 L344.05 33.95 344.5 33.25 346.0 33.0 349.0 35.75 M361.0 92.75 Q361.9 91.45 362.75 90.95 L364.25 90.5 365.0 92.0 Q364.55 93.4 363.0 94.0 361.75 93.5 361.0 92.75 M433.0 141.0 Q432.55 142.4 431.0 143.0 429.75 142.5 429.0 141.75 429.9 140.45 430.75 139.95 L432.25 139.5 433.0 141.0 M430.05 176.55 Q431.35 176.9 431.5 177.25 L429.3 177.4 Q427.4 177.25 427.25 176.75 L428.0 176.25 430.05 176.55 M373.85 219.3 Q372.35 219.55 372.0 219.0 L372.25 217.5 Q374.15 217.5 375.5 218.5 375.3 219.1 373.85 219.3 M329.0 293.0 L328.35 294.3 Q327.65 295.0 326.0 295.0 L323.75 294.5 Q323.0 293.75 323.0 292.25 324.35 290.9 328.25 291.5 L329.0 293.0 M513.65 243.3 Q514.0 243.45 514.0 245.0 514.0 245.45 511.0 248.0 509.75 247.5 509.0 246.75 509.35 244.7 510.45 244.0 511.3 243.5 513.25 243.5 L513.65 243.3 M302.0 6.0 Q301.55 7.4 300.0 8.0 298.75 7.5 298.0 6.75 298.9 5.45 299.75 4.95 L301.25 4.5 302.0 6.0 M294.0 3.0 Q293.0 4.5 291.0 6.0 289.75 5.5 289.0 4.75 289.35 2.7 290.45 2.0 291.3 1.5 293.25 1.5 L293.65 1.3 Q294.0 1.45 294.0 3.0 M245.05 16.25 Q244.4 17.6 242.5 18.25 L243.65 16.7 Q244.45 15.3 245.25 14.75 245.45 15.4 245.05 16.25 M194.25 36.75 L195.4 37.5 Q196.4 38.0 196.5 38.25 196.0 38.5 193.5 38.25 L193.5 36.75 194.25 36.75 M200.25 44.25 L199.15 43.95 197.5 43.25 198.55 41.1 Q199.05 40.3 200.25 39.75 198.95 42.3 200.25 44.25 M185.0 59.0 Q183.75 58.5 183.0 57.75 183.9 56.45 184.75 55.95 L186.25 55.5 187.0 57.0 Q186.55 58.4 185.0 59.0 M191.65 92.7 Q193.35 92.95 193.5 93.25 193.0 93.5 189.5 93.25 189.5 92.95 189.75 92.8 L190.0 92.5 191.65 92.7 M234.8 56.3 Q233.75 57.0 233.0 57.0 231.75 56.5 231.0 55.75 232.75 53.0 234.0 53.0 235.55 53.6 236.0 55.0 235.8 55.6 234.8 56.3 M208.4 57.5 L209.5 58.25 Q209.0 58.5 206.5 58.25 L206.5 56.75 207.25 56.75 208.4 57.5 M204.4 143.9 L203.85 144.9 202.25 144.0 202.25 142.75 Q203.25 143.05 204.4 143.9 M190.0 121.0 Q189.55 122.4 188.0 123.0 186.75 122.5 186.0 121.75 186.9 120.45 187.75 119.95 L189.25 119.5 190.0 121.0 M174.25 190.75 Q173.75 192.25 171.5 192.25 171.5 190.75 172.0 190.5 L174.25 190.75 M225.65 177.2 L226.25 178.25 223.5 178.25 Q223.5 177.35 223.9 177.05 224.25 176.75 225.25 176.75 L225.65 177.2 M287.0 115.0 Q286.55 116.4 285.0 117.0 283.75 116.5 283.0 115.75 283.9 114.45 284.75 113.95 L286.25 113.5 287.0 115.0 M316.65 108.55 Q318.35 108.95 318.5 109.25 L315.95 109.9 313.25 110.0 Q314.15 108.7 315.0 108.25 L316.65 108.55 M268.7 117.6 Q270.0 117.5 270.75 118.25 L270.75 119.0 269.5 120.05 267.5 120.5 Q267.25 121.85 267.25 119.35 267.25 117.7 268.7 117.6 M254.75 126.0 L254.0 127.25 Q253.3 126.9 252.75 126.0 252.25 125.2 252.25 124.75 L253.25 124.5 254.75 126.0 M252.95 138.05 Q253.55 137.95 254.25 138.5 L254.5 140.0 253.5 140.25 Q252.5 139.5 252.25 138.75 252.45 138.15 252.95 138.05 M255.45 175.7 L255.5 177.25 255.45 178.7 255.0 178.5 Q254.05 178.35 253.65 177.4 L253.25 175.5 253.9 175.4 255.25 175.5 255.45 175.7 M311.0 177.0 Q310.8 177.6 309.8 178.3 308.75 179.0 308.0 179.0 306.75 178.5 306.0 177.75 307.75 175.0 309.0 175.0 310.55 175.6 311.0 177.0 M138.0 10.0 Q137.55 11.4 136.0 12.0 134.75 11.5 134.0 10.75 134.9 9.45 135.75 8.95 L137.25 8.5 138.0 10.0 M107.15 44.7 Q108.35 44.95 108.5 45.25 108.0 45.5 105.5 45.25 105.5 44.95 105.75 44.8 L106.0 44.5 107.15 44.7 M104.0 88.0 Q105.55 88.6 106.0 90.0 L104.8 91.3 Q103.75 92.0 103.0 92.0 101.75 91.5 101.0 90.75 102.75 88.0 104.0 88.0 M44.0 15.0 Q43.8 15.6 42.8 16.3 41.75 17.0 41.0 17.0 39.75 16.5 39.0 15.75 39.9 14.3 40.8 13.55 41.5 13.0 42.0 13.0 43.55 13.6 44.0 15.0 M14.4 17.55 L14.5 19.25 14.45 20.65 Q14.15 20.35 14.0 20.5 L13.25 20.95 Q12.5 21.05 12.5 19.5 12.5 17.95 13.3 17.7 L14.25 17.75 14.4 17.55 M59.65 66.2 L57.5 67.25 Q57.5 66.25 58.9 65.45 60.15 64.75 61.25 64.75 L59.65 66.2 M70.3 118.95 L71.5 120.0 69.3 119.85 Q67.45 119.3 67.25 118.75 L68.0 118.25 Q69.5 118.4 70.3 118.95 M5.0 144.0 Q4.8 144.6 3.8 145.3 2.75 146.0 2.0 146.0 0.75 145.5 0.0 144.75 0.9 143.3 1.8 142.55 2.5 142.0 3.0 142.0 4.55 142.6 5.0 144.0 M57.65 181.55 L58.5 182.25 56.6 182.85 54.5 183.25 Q54.7 182.7 55.45 182.05 56.25 181.45 57.0 181.25 L57.65 181.55 M130.65 106.55 L131.5 107.25 Q130.5 107.75 129.0 109.25 L128.45 109.05 Q128.25 108.9 128.25 107.35 128.25 105.85 128.75 105.95 L130.0 106.25 130.65 106.55 M115.0 191.0 Q114.55 192.4 113.0 193.0 111.75 192.5 111.0 191.75 111.9 190.45 112.75 189.95 L114.25 189.5 115.0 191.0 M137.0 180.0 Q136.8 180.6 135.8 181.3 134.75 182.0 134.0 182.0 132.75 181.5 132.0 180.75 132.9 179.3 133.8 178.55 134.5 178.0 135.0 178.0 136.55 178.6 137.0 180.0 M128.0 223.0 Q127.8 223.6 126.8 224.3 125.75 225.0 125.0 225.0 123.75 224.5 123.0 223.75 124.75 221.0 126.0 221.0 127.55 221.6 128.0 223.0 M34.45 208.95 L33.0 210.5 Q31.5 210.5 31.25 209.75 32.45 208.75 33.4 208.05 35.15 206.75 36.25 206.75 L34.45 208.95 M252.0 243.0 Q251.8 243.6 250.8 244.3 249.75 245.0 249.0 245.0 247.75 244.5 247.0 243.75 247.9 242.3 248.8 241.55 249.5 241.0 250.0 241.0 251.55 241.6 252.0 243.0" fill="#ffffff" fill-rule="evenodd" stroke="none"/>
  </g>
</svg>
