<?xml version="1.0" encoding="UTF-8" standalone="no"?>
<svg xmlns:xlink="http://www.w3.org/1999/xlink" height="7.0px" width="7.0px" xmlns="http://www.w3.org/2000/svg">
  <g transform="matrix(1.0, 0.0, 0.0, 1.0, 3.5, 0.0)">
    <pattern height="7" id="PatternID_71_1" overflow="visible" patternTransform="matrix(1.0, 0.0, 0.0, 1.0, -3.5, 0.0)" patternUnits="userSpaceOnUse" viewBox="0 0 7 7" width="7">
      <image height="7" width="7" xlink:href="data:image/PNG;base64,iVBORw0KGgoAAAANSUhEUgAAAAcAAAAHCAYAAADEUlfTAAAAQElEQVR42mNggAIrE8P/MMyADEACK2b2/r97cgeYhitAloBJwhXAJP+/uArGGJKFafEYGC4JMg6mE2Y8XBIXBgA8f2TkuTkp6wAAAABJRU5ErkJggg=="/>
    </pattern>
    <path d="M3.5 7.0 L-3.5 7.0 -3.5 0.0 3.5 0.0 3.5 7.0" style="fill:url(#PatternID_71_1)"/>
  </g>
</svg>
