[hotel.en.muxxu.com/index.html]
[backblue.gif]
[fade.gif]
[index.html]
[data.muxxu.com/css/designaca5.css]
[data.hotel.en.muxxu.com/css/stylea4f0.css]
[data.hotel.en.muxxu.com/css/style_ena4f0.css]
[data.muxxu.com/img/pixel.gif]
[hotel.en.muxxu.com/tid/forum.html]
[data.hotel.en.muxxu.com/js/appa4f0.js]
[hotel.en.muxxu.com/help.html]
[hotel.en.muxxu.com/visit/932852.html]
[hotel.en.muxxu.com/img/icons/fame.png]
[data.twinoid.com/js/259/std.js]
[hotel.en.muxxu.com/img/icons/item_buffet.png]
[data.muxxu.com/js/app0e34.js]
[hotel.en.muxxu.com/img/icons/item_research.png]
[hotel.en.muxxu.com/img/icons/tv.png]
[data.muxxu.com/img/design/basic/logo_mt.gif]
[hotel.en.muxxu.com/index.html]
[data.muxxu.com/img/design/basic/misc_img.png]
[data.muxxu.com/img/design/basic/reload.gif]
[data.muxxu.com/img/design/basic/bg_repeat.gif]
[data.muxxu.com/img/design/basic/head_bg_repeat_twinoid.jpg]
[data.muxxu.com/img/design/basic/head_twinoid.jpg]
[data.muxxu.com/img/design/basic/head_noel.jpg]
[data.muxxu.com/img/design/basic/topmaincontent.gif]
[data.muxxu.com/img/design/basic/bgmaincontent.gif]
[data.muxxu.com/img/design/basic/bottommaincontent.gif]
[data.muxxu.com/img/design/basic/bottom_bg.gif]
[data.muxxu.com/img/design/basic/top_bg.gif]
[data.muxxu.com/img/design/basic/navbut.png]
[data.muxxu.com/img/design/basic/navbut2.png]
[data.muxxu.com/img/design/basic/navbutover.png]
[data.muxxu.com/img/design/basic/navbut2over.png]
[data.muxxu.com/img/design/basic/minilogo.png]
[data.muxxu.com/img/token.png]
[data.muxxu.com/img/design/basic/loginbox.gif]
[data.muxxu.com/img/design/basic/buttons/entre.gif]
[data.twinoid.com/js/397/boot.js]
[data.muxxu.com/img/design/basic/buttons/entre_over.gif]
[data.muxxu.com/img/design/basic/mxnav2bg.png]
[data.muxxu.com/img/design/basic/mxnav2bottom.png]
[data.muxxu.com/img/design/basic/mxnavmuxxutop.png]
[data.muxxu.com/img/design/basic/mxnavbg.png]
[data.muxxu.com/img/design/basic/mxnavbottom.png]
[data.muxxu.com/img/design/basic/mxnavgamestop.png]
[data.muxxu.com/img/design/basic/mxnavmsgtop.png]
[data.muxxu.com/img/design/basic/linehoriz.gif]
[data.muxxu.com/img/design/basic/mxnav2top.png]
[data.muxxu.com/img/design/basic/tiptop.png]
[data.muxxu.com/img/design/basic/tipbottom.png]
[data.muxxu.com/img/design/basic/tipbg.png]
[data.muxxu.com/img/design/basic/tiph.gif]
[data.muxxu.com/img/design/basic/loginboxframe.gif]
[data.muxxu.com/img/design/basic/buttons/buttonblue_s.gif]
[data.muxxu.com/img/design/basic/buttons/buttonblue_s_over.gif]
[data.muxxu.com/img/design/basic/buttons/buttonblue.gif]
[data.muxxu.com/img/design/basic/buttons/buttonblue_over.gif]
[data.muxxu.com/img/design/basic/corneravatar80.png]
[data.muxxu.com/img/design/basic/confirm.gif]
[data.muxxu.com/img/design/basic/error.gif]
[data.muxxu.com/img/token_beta.png]
[data.muxxu.com/img/design/basic/comment1.gif]
[muxxu.com/img/design/basic/minilogo.png]
[muxxu.com/img/token.png]
[muxxu.com/img/design/basic/corneravatar40.png]
[muxxu.com/img/design/basic/corneravatar30.png]
[muxxu.com/img/design/basic/corneravatar40b.png]
[muxxu.com/img/design/basic/corneravatar80.png]
[muxxu.com/img/design/basic/roundedgamecorner.png]
[muxxu.com/img/design/basic/loginframe.png]
[muxxu.com/img/design/basic/navbut.png]
[muxxu.com/img/design/basic/navbutover.png]
[data.muxxu.com/css/designaca5.css]
[data.hotel.en.muxxu.com/img/design/inframe/site_header.png]
[data.hotel.en.muxxu.com/img/design/inframe/site_bg.png]
[data.hotel.en.muxxu.com/img/design/site_header.png]
[data.hotel.en.muxxu.com/img/design/site_bg.png]
[data.hotel.en.muxxu.com/img/design/content_header.png]
[data.hotel.en.muxxu.com/img/design/content_bg.png]
[data.hotel.en.muxxu.com/img/design/content_footer.png]
[data.hotel.en.muxxu.com/img/design/tip.png]
[data.hotel.en.muxxu.com/img/design/buttonblue.gif]
[data.hotel.en.muxxu.com/img/design/buttonblue_over.gif]
[data.hotel.en.muxxu.com/img/design/doorSignLarge.png]
[data.hotel.en.muxxu.com/img/design/doorSignSmall_0.png]
[data.hotel.en.muxxu.com/img/design/doorSignSmall_1.png]
[data.hotel.en.muxxu.com/img/design/doorSignSmall_2.png]
[data.hotel.en.muxxu.com/img/icons/lock.png]
[data.hotel.en.muxxu.com/img/icons/warning.png]
[data.hotel.en.muxxu.com/img/icons/fame.png]
[data.hotel.en.muxxu.com/img/icons/time.png]
[data.hotel.en.muxxu.com/img/icons/item_research.png]
[data.hotel.en.muxxu.com/img/design/design_offline.png]
[data.hotel.en.muxxu.com/css/stylea4f0.css]
[data.hotel.en.muxxu.com/img/design/en/site_header.png]
[data.hotel.en.muxxu.com/img/design/en/design_offline.png]
[data.hotel.en.muxxu.com/css/style_ena4f0.css]
[hotel.en.muxxu.com/tid/forum.html]
[data.hotel.en.muxxu.com/img/icons/staff.png]
[data.hotel.en.muxxu.com/img/icons/item_dj.png]
[data.hotel.en.muxxu.com/img/icons/item_isolation.png]
[data.hotel.en.muxxu.com/img/icons/bluep.png]
[data.hotel.en.muxxu.com/img/icons/item_mattress.png]
[data.hotel.en.muxxu.com/img/icons/spec_happy.png]
[data.hotel.en.muxxu.com/img/icons/spec_money.png]
[data.hotel.en.muxxu.com/img/icons/ishield.png]
[hotel.en.muxxu.com/visit/932852.html]
[hotel.en.muxxu.com/help96e7.html]
[hotel.en.muxxu.com/help23bc.html]
[hotel.en.muxxu.com/helpf64e.html]
[hotel.en.muxxu.com/help4755.html]
[hotel.en.muxxu.com/help7051.html]
[hotel.en.muxxu.com/help6bb1.html]
[hotel.en.muxxu.com/helpd84c.html]
[hotel.en.muxxu.com/help7003.html]
[hotel.en.muxxu.com/help5493.html]
[hotel.en.muxxu.com/help4739.html]
[hotel.en.muxxu.com/img/icons/money.png]
[hotel.en.muxxu.com/help.html]
[hotel.en.muxxu.com/dropshadow=0&glow=0&border=BE9D8B&bg=f7e2cd&text=994a6c&url=http_/data.hotel.en.muxxu.com/screenshots.html]
[muxxu.com/img/design/basic/shorttop.html]
[muxxu.com/img/design/basic/soon.html]
[muxxu.com/img/design/basic/gameslisttop.html]
[hotel.en.muxxu.com/help96e7.html]
[hotel.en.muxxu.com/help23bc.html]
[hotel.en.muxxu.com/helpf64e.html]
[hotel.en.muxxu.com/help4755.html]
[hotel.en.muxxu.com/help7051.html]
[hotel.en.muxxu.com/help6bb1.html]
[hotel.en.muxxu.com/helpd84c.html]
[hotel.en.muxxu.com/help7003.html]
[hotel.en.muxxu.com/help5493.html]
[hotel.en.muxxu.com/help4739.html]
