<?xml version="1.0" encoding="UTF-8" standalone="no"?>
<svg xmlns:xlink="http://www.w3.org/1999/xlink" height="9.2px" width="12.9px" xmlns="http://www.w3.org/2000/svg">
  <g transform="matrix(1.0, 0.0, 0.0, 1.0, 29.4, -13.2)">
    <pattern height="6" id="PatternID_603_1" overflow="visible" patternTransform="matrix(1.0, 0.0, 0.0, 1.0, -22.5, 13.2)" patternUnits="userSpaceOnUse" viewBox="0 0 6 6" width="6">
      <image height="6" width="6" xlink:href="data:image/PNG;base64,iVBORw0KGgoAAAANSUhEUgAAAAYAAAAGCAYAAADgzO9IAAAAbUlEQVR42k2NWwpAUABE7/5XQBIWYAu+yCOvWwofpFDk8UFC1HglTk1NZz6GkBOJxviHvNIoarxcXfBC3MOfYV7A28E3rNuOdpyQNh04k4KIfgQlyZG1PYKygkxDsJr7/HAWBat7YDQHjOrc8gA4MHByfkljGgAAAABJRU5ErkJggg=="/>
    </pattern>
    <path d="M-22.5 13.2 L-16.5 13.2 -16.5 19.2 -22.5 19.2 -22.5 13.2" style="fill:url(#PatternID_603_1)"/>
    <pattern height="4" id="PatternID_603_2" overflow="visible" patternTransform="matrix(1.0, 0.0, 0.0, 1.0, -29.4, 18.4)" patternUnits="userSpaceOnUse" viewBox="0 0 4 4" width="4">
      <image height="4" width="4" xlink:href="data:image/PNG;base64,iVBORw0KGgoAAAANSUhEUgAAAAQAAAAECAYAAACp8Z5+AAAAN0lEQVR42mNgAIKFF2/+B2EGGOfEk5dgvODCjf9ggaOPX/w/cP/J/3lnr0JUzTt39f/cM1fAHABbmihkIK5KqwAAAABJRU5ErkJggg=="/>
    </pattern>
    <path d="M-29.4 18.4 L-25.4 18.4 -25.4 22.4 -29.4 22.4 -29.4 18.4" style="fill:url(#PatternID_603_2)"/>
  </g>
</svg>
