<?xml version="1.0" encoding="UTF-8" standalone="no"?>
<svg xmlns:xlink="http://www.w3.org/1999/xlink" height="7.0px" width="43.0px" xmlns="http://www.w3.org/2000/svg">
  <g transform="matrix(1.0, 0.0, 0.0, 1.0, 0.0, 0.0)">
    <pattern height="7" id="PatternID_616_1" overflow="visible" patternTransform="matrix(1.0, 0.0, 0.0, 1.0, 0.0, 0.0)" patternUnits="userSpaceOnUse" viewBox="0 0 43 7" width="43">
      <image height="7" width="43" xlink:href="data:image/PNG;base64,iVBORw0KGgoAAAANSUhEUgAAACsAAAAHCAIAAAAeUSPaAAAAXklEQVR42mP4v7J6YBHDwLvATohtYBGDnzgHJsJUh0sWq3ZMlXikGAoUuXEhoPQ8NzEgajcRREZAKTQufkPQtENQk4FAjTYfUAE+FwBditV6khDQEGQrIbYio4FPiQCiMWyDxMIbMgAAAABJRU5ErkJggg=="/>
    </pattern>
    <path d="M43.0 7.0 L0.0 7.0 0.0 0.0 43.0 0.0 43.0 7.0" style="fill:url(#PatternID_616_1)"/>
  </g>
</svg>
