<?xml version="1.0" encoding="UTF-8" standalone="no"?>
<svg xmlns:xlink="http://www.w3.org/1999/xlink" height="15.7px" width="25.05px" xmlns="http://www.w3.org/2000/svg">
  <g transform="matrix(1.0, 0.0, 0.0, 1.0, -3.5, -8.15)">
    <path d="M16.05 8.15 L28.55 23.85 3.5 23.85 16.05 8.15" fill="#000000" fill-rule="evenodd" stroke="none"/>
  </g>
</svg>
