<?xml version="1.0" encoding="UTF-8" standalone="no"?>
<svg xmlns:xlink="http://www.w3.org/1999/xlink" height="7.0px" width="7.0px" xmlns="http://www.w3.org/2000/svg">
  <g transform="matrix(1.0, 0.0, 0.0, 1.0, 21.4, 11.0)">
    <pattern height="7" id="PatternID_168_1" overflow="visible" patternTransform="matrix(1.0, 0.0, 0.0, 1.0, -21.4, -11.0)" patternUnits="userSpaceOnUse" viewBox="0 0 7 7" width="7">
      <image height="7" width="7" xlink:href="data:image/PNG;base64,iVBORw0KGgoAAAANSUhEUgAAAAcAAAAHCAYAAADEUlfTAAAALklEQVR42mNgIAb8/v274T8Q/Pr1qxCrBAwAFVTCJf+jAbyS379/d8RqLAOxAACRuE9v6850PgAAAABJRU5ErkJggg=="/>
    </pattern>
    <path d="M-21.4 -11.0 L-14.4 -11.0 -14.4 -4.0 -21.4 -4.0 -21.4 -11.0" style="fill:url(#PatternID_168_1)"/>
  </g>
</svg>
