<?xml version="1.0" encoding="UTF-8" standalone="no"?>
<svg xmlns:xlink="http://www.w3.org/1999/xlink" height="16.0px" width="9.0px" xmlns="http://www.w3.org/2000/svg">
  <g transform="matrix(1.0, 0.0, 0.0, 1.0, 4.5, 0.0)">
    <pattern height="16" id="PatternID_94_1" overflow="visible" patternTransform="matrix(1.0, 0.0, 0.0, 1.0, -4.5, 0.0)" patternUnits="userSpaceOnUse" viewBox="0 0 9 16" width="9">
      <image height="16" width="9" xlink:href="data:image/PNG;base64,iVBORw0KGgoAAAANSUhEUgAAAAkAAAAQCAYAAADESFVDAAAAf0lEQVR42mNgQALO8gz/YZgBFwBJnq5UpIIiFSe1/wXr8/+DaLyKQIAyRSCJ5WeX/b/z6g6Yxqbw/xZLn/+HUkvAGMQGYZA4iqL5EhL/l0lK/p8gKgrGIDZORSATQIpAfAxFn++eBmMQACnCah26IoImgawlyjqsiohyOL4gAAB0vKzyZUQ/vgAAAABJRU5ErkJggg=="/>
    </pattern>
    <path d="M4.5 16.0 L-4.5 16.0 -4.5 0.0 4.5 0.0 4.5 16.0" style="fill:url(#PatternID_94_1)"/>
  </g>
</svg>
