<?xml version="1.0" encoding="UTF-8" standalone="no"?>
<svg xmlns:xlink="http://www.w3.org/1999/xlink" height="10.0px" width="13.5px" xmlns="http://www.w3.org/2000/svg">
  <g transform="matrix(1.0, 0.0, 0.0, 1.0, 0.0, 0.0)">
    <pattern height="6" id="PatternID_600_1" overflow="visible" patternTransform="matrix(-1.0, 0.0, 0.0, 1.0, 13.5, 0.0)" patternUnits="userSpaceOnUse" viewBox="0 0 6 6" width="6">
      <image height="6" width="6" xlink:href="data:image/PNG;base64,iVBORw0KGgoAAAANSUhEUgAAAAYAAAAGCAYAAADgzO9IAAAAbUlEQVR42k2NWwpAUABE7/5XQBIWYAu+yCOvWwofpFDk8UFC1HglTk1NZz6GkBOJxviHvNIoarxcXfBC3MOfYV7A28E3rNuOdpyQNh04k4KIfgQlyZG1PYKygkxDsJr7/HAWBat7YDQHjOrc8gA4MHByfkljGgAAAABJRU5ErkJggg=="/>
    </pattern>
    <path d="M13.5 0.0 L13.5 6.0 7.5 6.0 7.5 0.0 13.5 0.0" style="fill:url(#PatternID_600_1)"/>
    <pattern height="4" id="PatternID_600_2" overflow="visible" patternTransform="matrix(-1.0, 0.0, 0.0, 1.0, 4.0, 6.0)" patternUnits="userSpaceOnUse" viewBox="0 0 4 4" width="4">
      <image height="4" width="4" xlink:href="data:image/PNG;base64,iVBORw0KGgoAAAANSUhEUgAAAAQAAAAECAYAAACp8Z5+AAAAN0lEQVR42mNgAIKFF2/+B2EGGOfEk5dgvODCjf9ggaOPX/w/cP/J/3lnr0JUzTt39f/cM1fAHABbmihkIK5KqwAAAABJRU5ErkJggg=="/>
    </pattern>
    <path d="M4.0 6.0 L4.0 10.0 0.0 10.0 0.0 6.0 4.0 6.0" style="fill:url(#PatternID_600_2)"/>
  </g>
</svg>
