<?xml version="1.0" encoding="UTF-8" standalone="no"?>
<svg xmlns:xlink="http://www.w3.org/1999/xlink" height="30.9px" width="7.65px" xmlns="http://www.w3.org/2000/svg">
  <g transform="matrix(1.0, 0.0, 0.0, 1.0, 3.9, 29.7)">
    <path d="M1.3 -29.5 L1.45 -29.7 1.15 -28.0 0.95 -25.55 Q0.95 -22.4 1.45 -20.45 2.05 -18.0 3.75 -15.55 1.9 -12.75 1.0 -9.95 -0.35 -5.85 -0.65 1.2 L-1.0 0.85 -0.7 -2.35 Q-0.55 -4.05 -0.55 -7.25 -0.55 -10.5 -1.35 -13.5 -2.2 -16.5 -2.2 -18.9 -2.2 -21.5 -1.45 -23.85 -0.65 -26.25 1.3 -29.5" fill="#000000" fill-rule="evenodd" stroke="none"/>
    <path d="M-1.0 0.85 L-2.9 -0.9 Q-1.6 -4.55 -1.6 -7.75 -1.6 -9.3 -2.75 -12.3 -3.9 -15.3 -3.9 -16.75 -3.9 -19.05 -2.65 -22.65 -1.1 -26.95 1.3 -29.5 -0.65 -26.25 -1.45 -23.85 -2.2 -21.5 -2.2 -18.9 -2.2 -16.5 -1.35 -13.5 -0.55 -10.5 -0.55 -7.25 -0.55 -4.05 -0.7 -2.35 L-1.0 0.85" fill="#3a3d62" fill-rule="evenodd" stroke="none"/>
  </g>
</svg>
