puntoX,puntoY;puntoX,puntoY...
1,1;2,3;3.4,-3
21,31;12,32;213.4,-3
5,7;9,89;-9,6
20,5;4,-2
20,5;4,-2;8,-9;-10,9.3;-5,6.8
120,5;4,-2;8,-9;10,19.3;-5,16.8;1120,15;14,-12;18,-9;110,19.3;-15,16.8
10,19.3
