CODIGO;NOMBRES;CORREO
1151020;Estudiante1;Estudiante1@ufps.edu.co
1151471;Estudiante2;Estudiante2@ufps.edu.co
1151607;Estudiante3;Estudiante3@ufps.edu.co
1151726;Estudiante4;Estudiante4@ufps.edu.co
1151773;Estudiante5;Estudiante5@ufps.edu.co
1151880;Estudiante6;Estudiante6@ufps.edu.co
1151881;Estudiante7;Estudiante7@ufps.edu.co
1151961;Estudiante8;Estudiante8@ufps.edu.co
1151963;Estudiante9;Estudiante9@ufps.edu.co
1151965;Estudiante10;Estudiante10@ufps.edu.co
1151966;Estudiante11;Estudiante11@ufps.edu.co
1151978;Estudiante12;Estudiante12@ufps.edu.co
1151980;Estudiante13;Estudiante13@ufps.edu.co
1151992;Estudiante14;Estudiante14@ufps.edu.co
1151994;Estudiante15;Estudiante15@ufps.edu.co
1152015;Estudiante16;Estudiante16@ufps.edu.co
1152016;Estudiante17;Estudiante17@ufps.edu.co
1152017;Estudiante18;Estudiante18@ufps.edu.co
1152018;Estudiante19;Estudiante19@ufps.edu.co
1152019;Estudiante20;Estudiante20@ufps.edu.co
