@startuml

package Modelo{

class Estudiante{
-int codigo
-String nombre
-String email

}

class Semestre{
    -ListaCD estudiantes
}
Estudiante "*" <--"1" Semestre:Contiene
}

package Negocio{

class SIA{
-Semestre []semestres
}

}

Semestre "10" <--"1" SIA:Contiene



@enduml
