{
  "project_info": {
    "project_number": "853043058386",
    "firebase_url": "https://prueba3-39cbb.firebaseio.com",
    "project_id": "prueba3-39cbb",
    "storage_bucket": "prueba3-39cbb.appspot.com"
  },
  "client": [
    {
      "client_info": {
        "mobilesdk_app_id": "1:853043058386:android:2fa90fb596cf0c8fdcbf0b",
        "android_client_info": {
          "package_name": "com.example.prueba3"
        }
      },
      "oauth_client": [
        {
          "client_id": "853043058386-8io4vcttqoqnkagn4ok7d9okdd9amtfs.apps.googleusercontent.com",
          "client_type": 1,
          "android_info": {
            "package_name": "com.example.prueba3",
            "certificate_hash": "6c1a87185cc83ca97fcb1ff3479f2451a99ae6fc"
          }
        },
        {
          "client_id": "853043058386-gh994m4efs2g8ilrl98fomaur31sm9gh.apps.googleusercontent.com",
          "client_type": 1,
          "android_info": {
            "package_name": "com.example.prueba3",
            "certificate_hash": "d8a7ab621c66fecd144d140aef435c2892349b8c"
          }
        },
        {
          "client_id": "853043058386-kqluhsr8b73vnr7vnuogpe2mvq8cjof2.apps.googleusercontent.com",
          "client_type": 3
        }
      ],
      "api_key": [
        {
          "current_key": "AIzaSyANzCiscQsqutuVLCVZMHCHJdZ1iPitTJ0"
        }
      ],
      "services": {
        "appinvite_service": {
          "other_platform_oauth_client": [
            {
              "client_id": "853043058386-kqluhsr8b73vnr7vnuogpe2mvq8cjof2.apps.googleusercontent.com",
              "client_type": 3
            }
          ]
        }
      }
    }
  ],
  "configuration_version": "1"
}