{
  "appId": "io.ionic.starter",
  "appName": "inventory-app",
  "bundledWebRuntime": false,
  "npmClient": "npm",
  "webDir": "www",
  "cordova": {},
  "linuxAndroidStudioPath": "/opt/android-studio/bin/studio.sh"
}
