# This file uses centimeters as units for non-parametric coordinates.

mtllib Tree2.mtl
g default
v -0.141998 0.203505 -0.250584
v -0.103167 0.202853 -0.289408
v -0.000000 0.205236 -0.147431
v -0.054238 0.202435 -0.314335
v -0.166928 0.204326 -0.201661
v -0.000000 0.202290 -0.322925
v -0.175519 0.205226 -0.147477
v 0.054238 0.202434 -0.314335
v -0.166928 0.206136 -0.093245
v -0.100823 0.680682 -0.278044
v -0.138772 0.681660 -0.240108
v -0.053006 0.680053 -0.302399
v 0.103167 0.202853 -0.289408
v -0.141998 0.206956 -0.044324
v -0.000000 0.679837 -0.310792
v 0.141998 0.203505 -0.250584
v -0.103167 0.207607 -0.005498
v -0.171531 0.684261 -0.139318
v 0.166928 0.204326 -0.201661
v -0.054238 0.208025 0.019428
v 0.053006 0.680053 -0.302399
v -0.163136 0.685598 -0.086427
v 0.175519 0.205226 -0.147477
v -0.163136 0.682894 -0.192307
v -0.000000 0.208169 0.028018
v 0.166928 0.206136 -0.093245
v 0.054238 0.208025 0.019428
v 0.100823 0.680682 -0.278044
v -0.138772 0.686829 -0.038625
v 0.141998 0.206956 -0.044323
v 0.103167 0.207607 -0.005498
v 0.138772 0.681660 -0.240108
v -0.100823 0.687806 -0.000691
v -0.053006 0.688433 0.023667
v 0.171531 0.684261 -0.139318
v 0.053006 0.688433 0.023667
v 0.163136 0.685598 -0.086427
v 0.100823 0.687806 -0.000690
v -0.096857 1.159236 -0.274539
v 0.138772 0.686829 -0.038625
v 0.163136 0.682894 -0.192307
v -0.133313 1.160547 -0.238106
v -0.050921 1.158396 -0.297929
v -0.156719 1.162196 -0.192199
v -0.000000 1.158106 -0.305988
v -0.000000 0.688649 0.032059
v -0.164784 1.164026 -0.141312
v 0.050921 1.158396 -0.297929
v -0.156719 1.165855 -0.090425
v 0.096857 1.159237 -0.274539
v -0.133313 1.167454 -0.044640
v 0.133313 1.160546 -0.238106
v -0.096857 1.168761 -0.008209
v 0.156719 1.162196 -0.192199
v 0.164784 1.164026 -0.141312
v 0.156718 1.165855 -0.090425
v 0.096857 1.168761 -0.008209
v 0.133313 1.167453 -0.044641
v -0.091545 1.638129 -0.281170
v -0.050921 1.169600 0.015182
v -0.126001 1.639736 -0.246750
v -0.048128 1.637097 -0.303267
v -0.148123 1.641763 -0.203382
v -0.155745 1.643996 -0.155333
v 0.048128 1.637096 -0.303268
v 0.050921 1.169600 0.015182
v -0.148123 1.646240 -0.107257
v -0.000000 1.636740 -0.310881
v 0.091545 1.638129 -0.281169
v -0.126001 1.648266 -0.063888
v 0.126001 1.639737 -0.246751
v -0.091545 1.649874 -0.029469
v 0.148123 1.641763 -0.203382
v -0.000000 1.651195 0.000134
v -0.000000 1.169889 0.023241
v 0.155745 1.643996 -0.155333
v 0.148123 1.646241 -0.107258
v 0.091545 1.649874 -0.029469
v 0.126001 1.648266 -0.063888
v -0.048128 1.650906 -0.007371
v -0.117326 2.118713 -0.267159
v -0.085242 2.116868 -0.299189
v -0.137925 2.121036 -0.226798
v -0.044814 2.115685 -0.319753
v -0.145022 2.123598 -0.182074
v -0.137925 2.126174 -0.137333
v 0.048128 1.650906 -0.007371
v 0.085242 2.116867 -0.299189
v -0.117326 2.128496 -0.096971
v -0.000000 2.115276 -0.326839
v 0.117326 2.118711 -0.267159
v -0.085242 2.130339 -0.064942
v 0.044814 2.115685 -0.319753
v 0.137925 2.121036 -0.226797
v -0.044814 2.131523 -0.044376
v 0.145022 2.123598 -0.182074
v -0.000000 2.131929 -0.037289
v 0.137925 2.126173 -0.137333
v 0.044814 2.131523 -0.044376
v 0.117326 2.128496 -0.096972
v 0.085242 2.130339 -0.064941
v -0.107840 2.596934 -0.299301
v -0.126773 2.599451 -0.262228
v -0.133297 2.602234 -0.221137
v 0.041191 2.593654 -0.347614
v -0.126773 2.605025 -0.180040
v -0.078350 2.594935 -0.328723
v -0.107840 2.607544 -0.142967
v 0.107840 2.596935 -0.299303
v -0.078350 2.609541 -0.113545
v -0.000000 2.593213 -0.354122
v 0.126773 2.599453 -0.262228
v -0.041191 2.610823 -0.094655
v 0.133297 2.602234 -0.221137
v 0.078350 2.594935 -0.328722
v -0.000000 2.611265 -0.088145
v 0.126773 2.605025 -0.180041
v 0.041191 2.610823 -0.094655
v 0.107840 2.607543 -0.142967
v 0.078350 2.609540 -0.113545
v -0.115333 3.076542 -0.308298
v -0.121268 3.079429 -0.270935
v 0.037474 3.070546 -0.385925
v -0.115333 3.082302 -0.233572
v 0.071280 3.071872 -0.368751
v -0.098108 3.084905 -0.199866
v -0.098108 3.073938 -0.342003
v -0.071280 3.086970 -0.173118
v -0.000000 3.070089 -0.391843
v 0.115333 3.076542 -0.308297
v -0.037474 3.088296 -0.155944
v 0.121268 3.079429 -0.270935
v -0.000000 3.088754 -0.150026
v 0.115333 3.082302 -0.233572
v 0.037474 3.088298 -0.155944
v 0.098108 3.084905 -0.199866
v 0.098108 3.073938 -0.342003
v 0.071280 3.086969 -0.173118
v -0.071280 3.071873 -0.368751
v -0.064417 3.547356 -0.417189
v -0.037474 3.070545 -0.385925
v -0.104229 3.552001 -0.362591
v -0.109593 3.554870 -0.328846
v -0.104229 3.557741 -0.295102
v 0.064417 3.547355 -0.417189
v -0.088662 3.560330 -0.264661
v -0.088662 3.549410 -0.393031
v -0.033866 3.546037 -0.432700
v -0.000295 3.221916 -0.169575
v -0.064417 3.562385 -0.240502
v 0.017937 3.205739 -0.170023
v 0.111777 3.239985 -0.254797
v -0.013542 3.242571 -0.174715
v 0.104229 3.552000 -0.362591
v 0.105997 3.218777 -0.239035
v -0.033866 3.563704 -0.224993
v -0.000000 3.221877 -0.169522
v 0.082089 3.198090 -0.201395
v 0.033866 3.546036 -0.432700
v 0.041531 3.199259 -0.174578
v 0.112488 3.265295 -0.266442
v 0.063522 3.196502 -0.185468
v 0.097220 3.206625 -0.219491
v 0.109593 3.554870 -0.328846
v 0.088662 3.549410 -0.393032
v -0.011441 3.277302 -0.179466
v 0.003306 3.318695 -0.184229
v 0.111651 3.297321 -0.270017
v -0.023176 3.978026 -0.481628
v -0.079970 4.023238 -0.449280
v 0.109338 3.332101 -0.265581
v 0.021926 3.353693 -0.192328
v -0.000000 3.564158 -0.219648
v 0.091905 3.386777 -0.240800
v 0.102398 3.360985 -0.256884
v 0.092113 3.386638 -0.240989
v 0.112467 3.375160 -0.248654
v -0.000000 3.545582 -0.438045
v 0.007935 3.974076 -0.483624
v 0.043125 3.380471 -0.202423
v 0.052666 3.392526 -0.196002
v 0.066820 3.395936 -0.216911
v -0.098848 4.028501 -0.391417
v 0.104229 3.557740 -0.295102
v 0.033866 3.563703 -0.224993
v 0.088662 3.560329 -0.264661
v -0.094010 4.031268 -0.360997
v 0.079429 3.395019 -0.229493
v 0.064417 3.562385 -0.240503
v -0.079970 4.033764 -0.333555
v -0.058102 4.021256 -0.471059
v 0.221994 3.528380 -0.157465
v 0.207532 3.536899 -0.152575
v 0.079970 4.023238 -0.449280
v 0.173816 3.542372 -0.115053
v 0.047288 3.385736 -0.176103
v 0.169488 3.536899 -0.099020
v -0.058102 4.035745 -0.311776
v -0.094010 4.025734 -0.421837
v 0.160640 3.318963 -0.214433
v 0.154922 3.332289 -0.230581
v 0.260809 3.483104 -0.129893
v 0.037165 3.986109 -0.478030
v 0.095640 3.318963 -0.122931
v 0.208446 3.483104 -0.056181
v 0.078510 3.332289 -0.123013
v -0.030546 4.037016 -0.297793
v 0.098848 4.028501 -0.391417
v -0.000000 4.037454 -0.292975
v 0.193817 3.542372 -0.143209
v 0.182201 3.544257 -0.130279
v 0.058102 4.021257 -0.471059
v 0.094010 4.031268 -0.360997
v 0.256196 3.493844 -0.142906
v -0.021731 4.130960 -0.576516
v -0.062384 4.045841 -0.471071
v 0.030546 4.037016 -0.297793
v 0.079970 4.033763 -0.333555
v -0.045977 4.139407 -0.562068
v 0.058102 4.035745 -0.311776
v 0.194640 3.493844 -0.056252
v -0.059668 4.152574 -0.539549
v -0.042283 4.334496 -0.692571
v -0.054599 4.346175 -0.672791
v 0.007515 4.129167 -0.579581
v 0.005037 4.325279 -0.707875
v 0.094010 4.025733 -0.421837
v -0.020933 4.326966 -0.705239
v -0.050931 4.175847 -0.499747
v -0.059668 4.167445 -0.514117
v -0.060744 4.125433 -0.486543
v 0.035061 4.134440 -0.570563
v 0.029498 4.329843 -0.699887
v 0.057676 4.021237 -0.471274
v 0.057437 4.018935 -0.471152
v -0.060075 4.535358 -0.819119
v -0.054599 4.359270 -0.650396
v -0.078014 4.546334 -0.811112
v 0.063883 4.072413 -0.469988
v -0.092124 4.493599 -0.520126
v -0.038351 4.528484 -0.818156
v -0.104917 4.495469 -0.495178
v -0.088093 4.558721 -0.795854
v 0.054597 4.145571 -0.551526
v 0.046851 4.339602 -0.683100
v -0.109392 4.497908 -0.467570
v -0.042283 4.370779 -0.630517
v -0.045578 4.201133 -0.506588
v -0.088025 4.569667 -0.776860
v -0.017811 4.527336 -0.808494
v -0.009699 4.253172 -0.523072
v -0.105113 4.500676 -0.440034
v -0.072283 4.492481 -0.539951
v 0.061648 4.160009 -0.526833
v 0.047460 4.178514 -0.495185
v -0.077823 4.576636 -0.758463
v -0.003180 4.532064 -0.792232
v 0.005623 4.740480 -0.904351
v 0.329246 3.684269 -0.041977
v -0.020816 4.378120 -0.617738
v -0.007387 4.751677 -0.899112
v 0.021182 4.731730 -0.901742
v 0.247579 3.505744 -0.152382
v 0.370243 3.656337 -0.048975
v 0.313993 3.684269 -0.020505
v -0.092497 4.503504 -0.415266
v 0.046851 4.365030 -0.639612
v 0.376820 3.647228 -0.041744
v 0.002161 4.541485 -0.773058
v -0.059796 4.578154 -0.744948
v 0.053059 4.352297 -0.661345
v 0.380333 3.639040 -0.031824
v 0.260953 3.474584 -0.114626
v 0.005037 4.379596 -0.614979
v 0.006700 4.252910 -0.520410
v -0.014965 4.762606 -0.887096
v 0.380453 3.632482 -0.020174
v 0.256620 3.469114 -0.098596
v 0.035788 4.727552 -0.891935
v 0.034124 4.217467 -0.506649
v 0.182855 3.505744 -0.061269
v 0.320883 3.656337 0.020511
v -0.047304 4.492225 -0.552691
v 0.029498 4.374874 -0.622874
v 0.329876 3.647228 0.024341
v 0.222909 3.474584 -0.061072
v 0.340400 3.639040 0.024391
v 0.236619 3.469114 -0.070440
v 0.351439 3.632482 0.020668
v -0.038044 4.573975 -0.739449
v -0.072780 4.506114 -0.395693
v 0.046092 4.728910 -0.877164
v -0.003027 4.553387 -0.755378
v 0.052596 4.499055 -0.520824
v -0.017548 4.565072 -0.743233
v -0.008489 4.774303 -0.854764
v 0.007974 4.494310 -0.552916
v 0.065212 4.501883 -0.496096
v 0.004237 4.772657 -0.842025
v -0.015400 4.770713 -0.871042
v -0.047844 4.508249 -0.383145
v 0.032862 4.496448 -0.540414
v 0.049657 4.735353 -0.860740
v 0.019903 4.766237 -0.835770
v -0.019649 4.492856 -0.557146
v 0.339702 3.680097 -0.049122
v 0.069492 4.504651 -0.468641
v 0.045629 4.745321 -0.846418
v 0.034884 4.756450 -0.837404
v -0.020220 4.509701 -0.378975
v 0.310689 3.680097 -0.008279
v 0.377155 3.628272 -0.007944
v 0.065016 4.507089 -0.441132
v 0.361902 3.628272 0.013528
v 0.007435 4.510328 -0.383545
v 0.052223 4.508959 -0.416232
v 0.032365 4.510077 -0.396416
v 0.107265 4.915761 -0.960690
v 0.118962 4.906870 -0.965287
v 0.132299 4.900640 -0.963970
v 0.099862 4.925311 -0.951263
v 0.144110 4.898489 -0.956995
v 0.098437 4.933304 -0.939132
v 0.151693 4.900864 -0.945911
v 0.103295 4.937865 -0.927016
v -0.154279 4.963554 -0.583804
v 0.153358 4.907218 -0.933264
v -0.172484 4.963339 -0.565576
v -0.131453 4.964888 -0.595507
v 0.113350 4.937902 -0.917644
v 0.148776 4.916127 -0.922006
v 0.126237 4.933455 -0.913202
v -0.184286 4.964264 -0.542608
v -0.106242 4.967210 -0.599498
v -0.081112 4.970293 -0.595507
v -0.184802 4.969068 -0.491685
v 0.220431 4.996654 -1.096261
v 0.139004 4.925590 -0.914763
v 0.229875 4.990691 -1.101606
v 0.215014 5.003437 -1.087389
v -0.058523 4.973834 -0.583804
v 0.241337 4.986862 -1.102191
v 0.450867 3.850287 0.037871
v -0.173465 4.972477 -0.468715
v 0.350732 3.673600 -0.052852
v 0.459271 3.845491 0.035295
v 0.320387 3.685706 -0.032116
v 0.442978 3.853369 0.043033
v 0.361255 3.665413 -0.052801
v 0.467343 3.839450 0.035544
v 0.431709 3.853369 0.058897
v 0.474289 3.832756 0.038588
v 0.264132 5.062244 -1.234090
v 0.256432 5.067191 -1.229089
v 0.429432 3.850287 0.068047
v 0.479435 3.826063 0.044134
v 0.214865 5.009491 -1.077041
v 0.274079 5.059308 -1.235100
v 0.252751 5.073050 -1.221298
v 0.310798 3.673600 0.003363
v 0.429767 3.845491 0.076829
v 0.482273 3.820027 0.051635
v 0.283994 5.059055 -1.231886
v 0.314311 3.665413 0.013284
v 0.432659 3.839450 0.084369
v 0.482541 3.815239 0.060370
v 0.259667 4.988349 -1.089487
v 0.437820 3.832756 0.089926
v 0.252113 4.986027 -1.097838
v 0.480221 3.812169 0.069489
v 0.253926 5.078451 -1.212464
v 0.444751 3.826063 0.092959
v 0.370760 3.626835 0.003667
v 0.475545 3.811111 0.078102
v 0.452769 3.820027 0.093169
v 0.219992 5.013377 -1.067512
v 0.468951 3.812169 0.085353
v 0.461105 3.815239 0.090546
v 0.291614 5.061579 -1.225242
v -0.040688 4.977489 -0.565576
v -0.155629 4.976131 -0.450486
v 0.259687 5.082155 -1.204611
v 0.262274 4.993329 -1.079099
v -0.188530 4.966238 -0.517146
v 0.295186 5.066272 -1.216651
v 0.268718 5.083328 -1.199548
v 0.259331 4.999852 -1.069080
v 0.229270 5.014157 -1.060943
v 0.293893 5.072059 -1.208083
v 0.251534 5.006458 -1.061770
v 0.240686 5.011633 -1.058848
v 0.278944 5.081678 -1.198417
v -0.029351 4.980898 -0.542607
v 0.288033 5.077627 -1.201508
v -0.133041 4.979673 -0.438782
v 0.323749 5.311925 -1.264633
v 0.330206 5.310063 -1.265312
v 0.318717 5.314951 -1.261296
v 0.316260 5.318441 -1.256061
v -0.025622 4.983727 -0.517146
v 0.336608 5.309788 -1.263175
v -0.107911 4.982756 -0.434749
v 0.316943 5.321599 -1.250130
v 0.436374 3.854425 0.050277
v 0.341488 5.311167 -1.258714
v 0.320609 5.323703 -1.244861
v 0.343728 5.313877 -1.252947
v -0.082699 4.985077 -0.438782
v 0.326417 5.324265 -1.241460
v 0.342814 5.317300 -1.247196
v -0.029866 4.985702 -0.491685
v 0.338957 5.320653 -1.242781
v -0.059874 4.986411 -0.450486
v -0.041669 4.986627 -0.468715
v 0.333039 5.323164 -1.240709
v -0.198423 5.405427 -0.574508
v -0.215266 5.404070 -0.557429
v -0.177230 5.407412 -0.585588
v 0.329965 5.316994 -1.253022
v -0.226109 5.403474 -0.536018
v -0.153761 5.409832 -0.589555
v -0.229891 5.403699 -0.512350
v -0.226243 5.404721 -0.488705
v -0.130313 5.412449 -0.585588
v 0.500266 4.073180 0.078291
v 0.493804 4.074461 0.081939
v 0.507360 4.071187 0.076792
v 0.485180 4.074461 0.094079
v 0.514391 4.068676 0.077588
v 0.483862 4.073180 0.101383
v 0.520669 4.065903 0.080601
v 0.484782 4.071187 0.108575
v 0.525583 4.063119 0.085539
v 0.487849 4.068676 0.114952
v 0.528651 4.060597 0.091916
v 0.492761 4.065903 0.119887
v 0.529571 4.058605 0.099108
v 0.499041 4.063119 0.122902
v 0.528259 4.057295 0.106415
v 0.506074 4.060597 0.123700
v 0.524828 4.056886 0.113111
v -0.215520 5.406441 -0.467429
v 0.513168 4.058605 0.122200
v 0.519635 4.057295 0.118555
v -0.109181 5.415008 -0.574508
v -0.041191 2.593653 -0.347613
v -0.198774 5.408690 -0.450508
v -0.092435 5.417256 -0.557429
v -0.177642 5.411249 -0.439703
v 0.488603 4.074912 0.087379
v -0.081712 5.418977 -0.536018
v -0.078064 5.419999 -0.512350
v -0.130725 5.416286 -0.439703
v -0.081846 5.420223 -0.488705
v -0.109532 5.418271 -0.450509
v -0.092689 5.419628 -0.467429
v -0.154194 5.413866 -0.435932
v 0.501697 4.335209 0.088528
v 0.507566 4.335470 0.085343
v 0.494000 4.335209 0.099364
v 0.514053 4.335876 0.084115
v 0.492925 4.335470 0.105954
v 0.520522 4.336388 0.084964
v 0.493901 4.335876 0.112484
v 0.526339 4.336956 0.087804
v 0.496832 4.336388 0.118313
v 0.530933 4.337523 0.092359
v 0.501429 4.336956 0.122870
v 0.533857 4.338035 0.098183
v 0.507243 4.337523 0.125709
v 0.534823 4.338441 0.104705
v 0.513705 4.338035 0.126552
v 0.533740 4.338702 0.111290
v 0.520182 4.338441 0.125317
v 0.530746 4.338792 0.117315
v 0.526042 4.338702 0.122126
v -0.188077 5.863653 -0.583831
v -0.166064 5.867074 -0.587199
v 0.496994 4.335120 0.093339
v -0.143250 5.868465 -0.583273
v -0.104462 5.864832 -0.555917
v -0.198058 5.825012 -0.451838
v -0.343468 5.865058 -0.547238
v -0.210671 5.700448 -0.566042
v -0.092475 5.860161 -0.535267
v 0.513705 4.336955 0.105210
v -0.207245 5.858539 -0.573066
v -0.177139 5.824239 -0.441551
v -0.087190 5.854139 -0.512385
v -0.154431 5.825632 -0.438050
v -0.089084 5.847355 -0.489554
v -0.388384 5.833019 -0.521332
v -0.521657 6.141023 -0.512279
v -0.381798 5.837924 -0.536225
v -0.518046 6.143685 -0.520455
v -0.370771 5.845871 -0.546509
v -0.132312 5.829052 -0.441894
v -0.097872 5.840473 -0.468891
v -0.512000 6.147993 -0.526100
v -0.357215 5.855460 -0.550404
v -0.112792 5.834166 -0.452479
v -0.504566 6.153202 -0.528238
v -0.201956 5.674498 -0.455037
v -0.348081 5.860351 -0.469802
v -0.121978 5.867693 -0.572498
v -0.229650 5.764775 -0.535153
v -0.230439 5.845350 -0.534960
v -0.384651 5.835002 -0.488367
v -0.374971 5.841592 -0.475996
v -0.519608 6.142111 -0.494183
v -0.497028 6.158410 -0.526500
v -0.331917 5.872939 -0.537557
v -0.226916 5.762721 -0.488751
v -0.326523 5.875805 -0.489919
v -0.362036 5.850556 -0.469429
v -0.514302 6.145675 -0.487391
v -0.231914 5.775963 -0.511863
v -0.232254 5.838566 -0.511781
v -0.227048 5.832543 -0.488760
v -0.507209 6.150539 -0.483786
v -0.335519 5.869282 -0.477050
v -0.499555 6.155864 -0.483990
v -0.490689 6.162718 -0.521186
v -0.492664 6.160728 -0.487969
v -0.503777 6.153195 -0.505823
v -0.522210 6.140466 -0.502986
v -0.487728 6.164292 -0.495034
v -0.486647 6.165380 -0.513214
v -0.485599 6.165937 -0.503964
v -0.204241 6.296700 -0.356456
v -0.221821 5.852232 -0.556075
v -0.195371 6.309626 -0.372547
v -0.206327 6.283201 -0.338619
v -0.180585 6.320717 -0.385317
v -0.201423 6.270453 -0.320781
v -0.161329 6.328886 -0.393516
v -0.215231 5.827873 -0.468134
v -0.139490 6.333333 -0.396341
v -0.190012 6.259705 -0.304690
v -0.117204 6.333623 -0.393516
v -0.173208 6.252006 -0.291920
v -0.096654 6.329728 -0.385317
v -0.152658 6.248110 -0.283721
v -0.079850 6.322028 -0.372547
v -0.130372 6.248400 -0.280896
v -0.063535 6.298532 -0.338619
v -0.108533 6.252848 -0.283721
v -0.065621 6.285033 -0.320781
v -0.089277 6.261016 -0.291920
v -0.074491 6.272106 -0.304690
v -0.068438 6.311279 -0.356456
v -0.134931 6.290866 -0.338619
v 0.063881 3.347062 -0.129241
v 0.053184 3.361834 -0.141004
v 0.113593 3.308387 -0.129002
v 0.160818 3.308387 -0.195482
v 0.155440 3.301597 -0.175583
v 0.130612 3.301597 -0.140632
v 0.145032 3.299257 -0.156682
v 0.144225 3.347062 -0.242344
v 0.047466 3.375160 -0.157151
v 0.129596 3.361834 -0.248572
v 0.235794 3.517644 -0.157399
v 0.169632 3.528380 -0.083753
v 0.174238 3.517644 -0.070745
v 0.248235 3.467229 -0.083370
v -0.228115 5.584085 -0.532678
v -0.229471 5.582117 -0.505931
v -0.221917 5.586763 -0.480574
v -0.218322 5.592660 -0.556139
v -0.204103 5.609541 -0.571885
v -0.202885 5.634597 -0.573779
v -0.208453 5.599686 -0.461175
v -0.199193 5.628763 -0.452017
v -0.223206 5.745409 -0.549252
v -0.389390 5.832005 -0.504404
v -0.215328 5.725439 -0.468015
v -0.215302 5.725258 -0.467962
v -0.324554 5.877789 -0.523036
v -0.322646 5.878802 -0.506185
vt 0.373591 0.064409
vt 0.408159 0.029841
vt 0.500000 0.150000
vt 0.451716 0.007647
vt 0.351397 0.107966
vt 0.500000 -0.000000
vt 0.343750 0.156250
vt 0.548284 0.007647
vt 0.351397 0.204534
vt 0.450000 0.312500
vt 0.462500 0.312500
vt 0.450000 0.341418
vt 0.475000 0.312500
vt 0.462500 0.341418
vt 0.437500 0.312500
vt 0.437500 0.341418
vt 0.591842 0.029841
vt 0.373591 0.248091
vt 0.425000 0.312500
vt 0.425000 0.341418
vt 0.626409 0.064408
vt 0.408159 0.282659
vt 0.412500 0.312500
vt 0.487500 0.312500
vt 0.500000 0.312500
vt 0.487500 0.341418
vt 0.648603 0.107966
vt 0.451716 0.304853
vt 0.412500 0.341418
vt 0.400000 0.312500
vt 0.512500 0.312500
vt 0.500000 0.341418
vt 0.656250 0.156250
vt 0.475000 0.341418
vt 0.500000 0.312500
vt 0.648603 0.204534
vt 0.548284 0.304853
vt 0.400000 0.341418
vt 0.387500 0.312500
vt 0.525000 0.312500
vt 0.512500 0.341418
vt 0.626409 0.248091
vt 0.591841 0.282659
vt 0.387500 0.341418
vt 0.375000 0.312500
vt 0.537500 0.312500
vt 0.525000 0.341418
vt 0.550000 0.312500
vt 0.537500 0.341418
vt 0.612500 0.312500
vt 0.612500 0.341418
vt 0.600000 0.312500
vt 0.562500 0.312500
vt 0.562500 0.341418
vt 0.600000 0.341418
vt 0.587500 0.312500
vt 0.575000 0.312500
vt 0.575000 0.341418
vt 0.450000 0.370337
vt 0.587500 0.341418
vt 0.375000 0.341418
vt 0.462500 0.370337
vt 0.437500 0.370337
vt 0.475000 0.370337
vt 0.425000 0.370337
vt 0.550000 0.341418
vt 0.487500 0.370337
vt 0.412500 0.370337
vt 0.500000 0.370337
vt 0.400000 0.370337
vt 0.512500 0.370337
vt 0.387500 0.370337
vt 0.525000 0.370337
vt 0.625000 0.341418
vt 0.625000 0.370337
vt 0.612500 0.370337
vt 0.600000 0.370337
vt 0.575000 0.370337
vt 0.587500 0.370337
vt 0.375000 0.370337
vt 0.450000 0.399255
vt 0.537500 0.370337
vt 0.462500 0.399255
vt 0.437500 0.399255
vt 0.475000 0.399255
vt 0.487500 0.399255
vt 0.412500 0.399255
vt 0.562500 0.370337
vt 0.500000 0.399255
vt 0.425000 0.399255
vt 0.400000 0.399255
vt 0.512500 0.399255
vt 0.387500 0.399255
vt 0.525000 0.399255
vt 0.625000 0.399255
vt 0.550000 0.399255
vt 0.550000 0.370337
vt 0.612500 0.399255
vt 0.600000 0.399255
vt 0.575000 0.399255
vt 0.587500 0.399255
vt 0.375000 0.399255
vt 0.537500 0.399255
vt 0.462500 0.428174
vt 0.450000 0.428174
vt 0.475000 0.428174
vt 0.437500 0.428174
vt 0.487500 0.428174
vt 0.500000 0.428174
vt 0.562500 0.399255
vt 0.400000 0.428174
vt 0.512500 0.428174
vt 0.425000 0.428174
vt 0.387500 0.428174
vt 0.525000 0.428174
vt 0.412500 0.428174
vt 0.375000 0.428174
vt 0.537500 0.428174
vt 0.612500 0.428174
vt 0.550000 0.428174
vt 0.625000 0.312500
vt 0.600000 0.428174
vt 0.562500 0.428174
vt 0.587500 0.428174
vt 0.575000 0.428174
vt 0.462500 0.457092
vt 0.475000 0.457092
vt 0.625000 0.428174
vt 0.487500 0.457092
vt 0.412500 0.457092
vt 0.500000 0.457092
vt 0.450000 0.457092
vt 0.512500 0.457092
vt 0.387500 0.457092
vt 0.525000 0.457092
vt 0.425000 0.457092
vt 0.375000 0.457092
vt 0.537500 0.457092
vt 0.612500 0.457092
vt 0.400000 0.457092
vt 0.550000 0.457092
vt 0.600000 0.457092
vt 0.562500 0.457092
vt 0.587500 0.457092
vt 0.575000 0.457092
vt 0.625000 0.457092
vt 0.475000 0.486011
vt 0.487500 0.486011
vt 0.412500 0.486011
vt 0.500000 0.486011
vt 0.400000 0.486011
vt 0.512500 0.486011
vt 0.462500 0.486011
vt 0.525000 0.486011
vt 0.425000 0.486011
vt 0.375000 0.486011
vt 0.537500 0.486011
vt 0.612500 0.486011
vt 0.550000 0.486011
vt 0.600000 0.486011
vt 0.562500 0.486011
vt 0.587500 0.486011
vt 0.387500 0.486011
vt 0.575000 0.486011
vt 0.625000 0.486011
vt 0.450000 0.486011
vt 0.450000 0.514929
vt 0.437500 0.486011
vt 0.475000 0.514929
vt 0.487500 0.514929
vt 0.500000 0.514929
vt 0.400000 0.514929
vt 0.512500 0.514929
vt 0.462500 0.514929
vt 0.437500 0.514929
vt 0.549902 0.494111
vt 0.525000 0.514929
vt 0.555983 0.493140
vt 0.600285 0.495604
vt 0.545483 0.495377
vt 0.375000 0.514929
vt 0.595178 0.494251
vt 0.537500 0.514929
vt 0.550000 0.494108
vt 0.580790 0.492828
vt 0.412500 0.514929
vt 0.564340 0.492756
vt 0.603043 0.497184
vt 0.572500 0.492646
vt 0.588768 0.493418
vt 0.612500 0.514929
vt 0.387500 0.514929
vt 0.546183 0.497488
vt 0.625000 0.514929
vt 0.551229 0.500002
vt 0.602854 0.499129
vt 0.434374 0.541291
vt 0.462500 0.543848
vt 0.599719 0.501206
vt 0.557504 0.502143
vt 0.550000 0.514929
vt 0.587218 0.504381
vt 0.594819 0.502896
vt 0.587500 0.504364
vt 0.401727 0.375143
vt 0.387500 0.375157
vt 0.387500 0.369373
vt 0.425000 0.514929
vt 0.421678 0.541063
vt 0.438151 0.370266
vt 0.437500 0.375157
vt 0.422941 0.375829
vt 0.487500 0.543848
vt 0.600000 0.514929
vt 0.565641 0.503806
vt 0.562500 0.514929
vt 0.587500 0.514929
vt 0.574922 0.504806
vt 0.500000 0.543848
vt 0.581035 0.504809
vt 0.575000 0.514929
vt 0.512500 0.543848
vt 0.449479 0.543852
vt 0.387500 0.437813
vt 0.412500 0.376199
vt 0.400000 0.437813
vt 0.387500 0.543848
vt 0.437500 0.437813
vt 0.450000 0.375157
vt 0.450000 0.437813
vt 0.525000 0.543848
vt 0.475000 0.543848
vt 0.587500 0.375157
vt 0.600000 0.375157
vt 0.587500 0.437813
vt 0.409414 0.541761
vt 0.512500 0.375157
vt 0.512500 0.437813
vt 0.500000 0.375157
vt 0.537500 0.543848
vt 0.612500 0.543848
vt 0.550000 0.543848
vt 0.412500 0.437813
vt 0.425000 0.437813
vt 0.400000 0.543848
vt 0.600000 0.543848
vt 0.600000 0.437813
vt 0.462591 0.329003
vt 0.432692 0.359493
vt 0.432999 0.322395
vt 0.452089 0.545339
vt 0.562500 0.543848
vt 0.587500 0.543848
vt 0.471154 0.333338
vt 0.451923 0.359493
vt 0.575000 0.543848
vt 0.500000 0.437813
vt 0.471154 0.359492
vt 0.451923 0.406485
vt 0.471154 0.406485
vt 0.413462 0.359493
vt 0.413462 0.406485
vt 0.625000 0.543848
vt 0.432692 0.406485
vt 0.502656 0.359492
vt 0.490385 0.359492
vt 0.489946 0.349156
vt 0.394231 0.359492
vt 0.394231 0.406485
vt 0.400193 0.543848
vt 0.400425 0.543713
vt 0.432692 0.453477
vt 0.490385 0.406485
vt 0.451923 0.453477
vt 0.395039 0.546909
vt 0.462500 0.572766
vt 0.413462 0.453477
vt 0.475000 0.572766
vt 0.471154 0.453477
vt 0.375000 0.359492
vt 0.375000 0.406485
vt 0.487500 0.572766
vt 0.449626 0.550251
vt 0.509615 0.406485
vt 0.510019 0.364584
vt 0.490385 0.453477
vt 0.394231 0.453477
vt 0.537094 0.375283
vt 0.500000 0.572766
vt 0.450000 0.572766
vt 0.444629 0.553368
vt 0.605769 0.337960
vt 0.605769 0.359492
vt 0.579674 0.359445
vt 0.509615 0.453477
vt 0.375000 0.453477
vt 0.441643 0.554931
vt 0.432692 0.500470
vt 0.412500 0.500470
vt 0.528846 0.406485
vt 0.451923 0.500470
vt 0.413462 0.500470
vt 0.612500 0.437813
vt 0.612500 0.500470
vt 0.437500 0.500470
vt 0.512500 0.572766
vt 0.586539 0.406485
vt 0.600000 0.500470
vt 0.625000 0.453477
vt 0.605769 0.453477
vt 0.625000 0.406485
vt 0.528846 0.453477
vt 0.605769 0.406485
vt 0.587500 0.500470
vt 0.575000 0.437813
vt 0.548077 0.406485
vt 0.548412 0.374948
vt 0.471154 0.500470
vt 0.575000 0.500470
vt 0.562500 0.437813
vt 0.394231 0.500470
vt 0.567308 0.367409
vt 0.487500 0.437813
vt 0.487500 0.500470
vt 0.437500 0.572766
vt 0.425175 0.558123
vt 0.567308 0.406485
vt 0.500000 0.500470
vt 0.525000 0.437813
vt 0.512500 0.500470
vt 0.537500 0.437813
vt 0.525000 0.500470
vt 0.548077 0.453477
vt 0.525000 0.572766
vt 0.375000 0.500470
vt 0.586539 0.453477
vt 0.387500 0.572766
vt 0.567308 0.453477
vt 0.509615 0.500470
vt 0.625000 0.500470
vt 0.417954 0.558080
vt 0.412500 0.572766
vt 0.375000 0.543848
vt 0.375000 0.572766
vt 0.401050 0.553432
vt 0.406134 0.555826
vt 0.528846 0.500470
vt 0.490385 0.500470
vt 0.537500 0.572766
vt 0.400000 0.572766
vt 0.605769 0.500470
vt 0.548077 0.500470
vt 0.425000 0.572766
vt 0.400000 0.500470
vt 0.612500 0.572766
vt 0.586539 0.500470
vt 0.567308 0.500470
vt 0.550000 0.572766
vt 0.450000 0.500470
vt 0.562500 0.500470
vt 0.600000 0.572766
vt 0.537500 0.500470
vt 0.562500 0.572766
vt 0.587500 0.572766
vt 0.575000 0.572766
vt 0.451923 0.547462
vt 0.432692 0.547462
vt 0.413462 0.547462
vt 0.471154 0.547462
vt 0.394231 0.547462
vt 0.625000 0.572766
vt 0.490385 0.547462
vt 0.625000 0.547462
vt 0.509615 0.547462
vt 0.450000 0.601685
vt 0.605769 0.547462
vt 0.462500 0.601685
vt 0.437500 0.601685
vt 0.528846 0.547462
vt 0.586539 0.547462
vt 0.548077 0.547462
vt 0.475000 0.601685
vt 0.425000 0.601685
vt 0.375000 0.547462
vt 0.412500 0.601685
vt 0.500000 0.601685
vt 0.451923 0.594455
vt 0.567308 0.547462
vt 0.432692 0.594455
vt 0.471154 0.594455
vt 0.400000 0.601685
vt 0.413462 0.594455
vt 0.400000 0.563127
vt 0.512500 0.601685
vt 0.387500 0.500470
vt 0.387500 0.563127
vt 0.425000 0.500470
vt 0.412500 0.563127
vt 0.375000 0.500470
vt 0.375000 0.563127
vt 0.437500 0.563127
vt 0.625000 0.500470
vt 0.612500 0.563127
vt 0.432692 0.641447
vt 0.451923 0.641447
vt 0.450000 0.563127
vt 0.600000 0.563127
vt 0.490385 0.594455
vt 0.413462 0.641447
vt 0.471154 0.641447
vt 0.462500 0.500470
vt 0.462500 0.563127
vt 0.587500 0.563127
vt 0.394231 0.641447
vt 0.475000 0.500470
vt 0.475000 0.563127
vt 0.575000 0.563127
vt 0.375000 0.594455
vt 0.487500 0.563127
vt 0.394231 0.594455
vt 0.562500 0.563127
vt 0.490385 0.641447
vt 0.500000 0.563127
vt 0.550000 0.500470
vt 0.550000 0.563127
vt 0.512500 0.563127
vt 0.509615 0.594455
vt 0.537500 0.563127
vt 0.525000 0.563127
vt 0.375000 0.641447
vt 0.387500 0.601685
vt 0.525000 0.601685
vt 0.509615 0.641447
vt 0.605769 0.594455
vt 0.487500 0.601685
vt 0.625000 0.641447
vt 0.605769 0.641447
vt 0.625000 0.594455
vt 0.528846 0.641447
vt 0.586539 0.594455
vt 0.528846 0.594455
vt 0.586539 0.641447
vt 0.567308 0.594455
vt 0.548077 0.594455
vt 0.548077 0.641447
vt 0.375000 0.601684
vt 0.567308 0.641447
vt 0.537500 0.601685
vt 0.432692 0.688440
vt 0.413462 0.688440
vt 0.451923 0.688440
vt 0.471154 0.688440
vt 0.612500 0.601685
vt 0.394231 0.688440
vt 0.550000 0.601685
vt 0.490385 0.688440
vt 0.425000 0.563127
vt 0.625000 0.563127
vt 0.625000 0.688440
vt 0.509615 0.688440
vt 0.605769 0.688440
vt 0.562500 0.601685
vt 0.528846 0.688440
vt 0.586539 0.688440
vt 0.600000 0.601685
vt 0.567308 0.688440
vt 0.575000 0.601685
vt 0.587500 0.601685
vt 0.375000 0.688440
vt 0.625000 0.601684
vt 0.548077 0.688440
vt 0.450000 0.630603
vt 0.462500 0.630603
vt 0.437500 0.630603
vt 0.444593 0.989846
vt 0.383045 0.947363
vt 0.500000 0.837500
vt 0.475000 0.630603
vt 0.518834 0.998861
vt 0.348290 0.881143
vt 0.588760 0.972341
vt 0.348290 0.806357
vt 0.425000 0.630603
vt 0.638353 0.916363
vt 0.383045 0.740137
vt 0.656250 0.843750
vt 0.444593 0.697654
vt 0.638353 0.771137
vt 0.487500 0.630603
vt 0.518834 0.688639
vt 0.588760 0.715159
vt 0.500000 0.630603
vt 0.412500 0.630603
vt 0.400000 0.625783
vt 0.412500 0.625783
vt 0.387500 0.625783
vt 0.437500 0.625783
vt 0.375000 0.625783
vt 0.450000 0.625783
vt 0.612500 0.625783
vt 0.462500 0.625783
vt 0.600000 0.625783
vt 0.475000 0.625783
vt 0.587500 0.625783
vt 0.487500 0.625783
vt 0.575000 0.625783
vt 0.500000 0.625783
vt 0.562500 0.625783
vt 0.512500 0.625783
vt 0.550000 0.625783
vt 0.512500 0.630603
vt 0.525000 0.625783
vt 0.537500 0.625783
vt 0.400000 0.630603
vt 0.437500 0.457092
vt 0.525000 0.630603
vt 0.387500 0.630603
vt 0.537500 0.630603
vt 0.425000 0.625783
vt 0.625000 0.630603
vt 0.625000 0.625783
vt 0.612500 0.630603
vt 0.562500 0.630603
vt 0.600000 0.630603
vt 0.575000 0.630603
vt 0.587500 0.630603
vt 0.375000 0.630603
vt 0.550000 0.630603
vt 0.412500 0.688440
vt 0.400000 0.688440
vt 0.437500 0.688440
vt 0.387500 0.688440
vt 0.450000 0.688440
vt 0.375000 0.688440
vt 0.462500 0.688440
vt 0.612500 0.688440
vt 0.475000 0.688440
vt 0.600000 0.688440
vt 0.487500 0.688440
vt 0.587500 0.688440
vt 0.500000 0.688440
vt 0.575000 0.688440
vt 0.512500 0.688440
vt 0.562500 0.688440
vt 0.525000 0.688440
vt 0.550000 0.688440
vt 0.537500 0.688440
vt 0.437500 0.659521
vt 0.425000 0.659521
vt 0.425000 0.688440
vt 0.625000 0.688440
vt 0.412500 0.659521
vt 0.387500 0.659521
vt 0.525000 0.659521
vt 0.591667 0.500470
vt 0.591412 0.384189
vt 0.375000 0.659521
vt 0.548284 0.992353
vt 0.500000 1.000000
vt 0.500000 0.837500
vt 0.591841 0.970159
vt 0.451716 0.992353
vt 0.450000 0.659521
vt 0.626409 0.935591
vt 0.408159 0.970159
vt 0.537500 0.659521
vt 0.648603 0.892034
vt 0.373591 0.935591
vt 0.656250 0.843750
vt 0.351397 0.892034
vt 0.648603 0.795466
vt 0.343750 0.843750
vt 0.612500 0.659521
vt 0.626409 0.751908
vt 0.351397 0.795466
vt 0.550000 0.659521
vt 0.591842 0.717341
vt 0.373591 0.751909
vt 0.548284 0.695147
vt 0.408159 0.717341
vt 0.500000 0.687500
vt 0.451716 0.695147
vt 0.600000 0.659521
vt 0.408333 0.500470
vt 0.408333 0.688440
vt 0.391667 0.500470
vt 0.391667 0.688440
vt 0.375000 0.500470
vt 0.562500 0.659521
vt 0.587500 0.659521
vt 0.625000 0.500470
vt 0.625000 0.688440
vt 0.608333 0.500470
vt 0.575000 0.659521
vt 0.608333 0.688440
vt 0.491667 0.370664
vt 0.491667 0.500470
vt 0.400000 0.659521
vt 0.475342 0.654288
vt 0.475000 0.659521
vt 0.441667 0.500470
vt 0.458333 0.500470
vt 0.441667 0.688440
vt 0.591667 0.688440
vt 0.575000 0.500470
vt 0.375000 0.688440
vt 0.527214 0.418138
vt 0.525000 0.500470
vt 0.475000 0.500470
vt 0.458333 0.688440
vt 0.488010 0.655389
vt 0.487500 0.659521
vt 0.500452 0.654802
vt 0.500000 0.659521
vt 0.475000 0.688440
vt 0.508333 0.500470
vt 0.491667 0.688440
vt 0.625000 0.659521
vt 0.575000 0.688440
vt 0.508333 0.688440
vt 0.604552 0.959866
vt 0.548284 0.992353
vt 0.500000 0.837500
vt 0.642741 0.907303
vt 0.483667 0.999144
vt 0.656250 0.843750
vt 0.421875 0.979066
vt 0.642741 0.780197
vt 0.373591 0.935591
vt 0.525000 0.688440
vt 0.604552 0.727634
vt 0.347164 0.876236
vt 0.548284 0.695147
vt 0.347164 0.811264
vt 0.483667 0.688356
vt 0.373591 0.751909
vt 0.421875 0.708434
vt 0.475000 0.688440
vt 0.462500 0.659521
vt 0.462500 0.688440
vt 0.487500 0.688440
vt 0.450000 0.688440
vt 0.500000 0.688440
vt 0.437500 0.688440
vt 0.512500 0.659521
vt 0.425000 0.688440
vt 0.512500 0.688440
vt 0.412500 0.688440
vt 0.525000 0.688440
vt 0.400000 0.688440
vt 0.537500 0.688440
vt 0.387500 0.688440
vt 0.550000 0.688440
vt 0.612500 0.688440
vt 0.562500 0.688440
vt 0.600000 0.688440
vt 0.575000 0.688440
vt 0.587500 0.688440
vt 0.375000 0.688440
vt 0.625000 0.688440
vt 0.351397 0.892034
vt 0.343750 0.843750
vt 0.500000 0.837500
vt 0.373591 0.935591
vt 0.351397 0.795466
vt 0.408159 0.970159
vt 0.373591 0.751909
vt 0.451716 0.992353
vt 0.408159 0.717341
vt 0.500000 1.000000
vt 0.451716 0.695147
vt 0.548284 0.992353
vt 0.500000 0.687500
vt 0.591841 0.970159
vt 0.548284 0.695147
vt 0.626409 0.935591
vt 0.591842 0.717341
vt 0.648603 0.892034
vt 0.626409 0.751908
vt 0.656250 0.843750
vt 0.648603 0.795466
vt 0.500000 0.332161
vt 0.487500 0.375157
vt 0.487500 0.333808
vt 0.475000 0.375157
vt 0.475000 0.341169
vt 0.524737 0.333719
vt 0.525000 0.375157
vt 0.512500 0.331662
vt 0.587242 0.344877
vt 0.575000 0.375157
vt 0.575000 0.341107
vt 0.562500 0.375157
vt 0.562229 0.339362
vt 0.537809 0.335541
vt 0.537500 0.375157
vt 0.600000 0.349059
vt 0.550000 0.375157
vt 0.550000 0.337074
vt 0.612500 0.355474
vt 0.612500 0.375157
vt 0.462500 0.375157
vt 0.462898 0.352200
vt 0.624248 0.363341
vt 0.625000 0.375157
vt 0.450000 0.361929
vt 0.375000 0.375157
vt 0.375581 0.363755
vt 0.375000 0.437813
vt 0.625000 0.437813
vt 0.462500 0.437813
vt 0.475000 0.437813
vt 0.550000 0.437813
vt 0.413752 0.321894
vt 0.394539 0.323452
vt 0.375755 0.328598
vt 0.624721 0.328593
vt 0.625000 0.359492
vt 0.476751 0.642450
vt 0.490935 0.642510
vt 0.504933 0.642944
vt 0.463120 0.642778
vt 0.375000 0.341005
vt 0.407902 0.337417
vt 0.614716 0.351976
vt 0.625000 0.341005
vt 0.458431 0.338853
vt 0.475000 0.349155
vt 0.574869 0.408593
vt 0.466734 0.652795
vt 0.425000 0.500470
vt 0.425000 0.688440
vt 0.508333 0.397771
vt 0.508271 0.397681
vt 0.512500 0.652480
vt 0.512469 0.652493
vt 0.558333 0.500470
vt 0.558333 0.688440
vt 0.541667 0.500470
vt 0.541667 0.688440
vt 0.500135 0.332209
vt 0.451451 0.643677
vt 0.449742 0.645221
vt 0.517510 0.643883
vt 0.391315 0.338012
vt 0.441551 0.337100
vt 0.455458 0.649607
vt 0.424831 0.337172
vt 0.563794 0.419542
vt 0.545589 0.425497
vt 0.522283 0.649100
vt 0.524405 0.645897
vn -0.000001 -0.999859 0.016786
vn 0.000002 -0.999859 0.016784
vn -0.000000 -0.999860 0.016743
vn 0.000002 -0.999859 0.016783
vn 0.000027 -0.999861 0.016701
vn -0.000002 -0.999859 0.016784
vn 0.000054 -0.999861 0.016689
vn -0.000002 -0.999859 0.016784
vn 0.000051 -0.999860 0.016752
vn -0.587934 0.016549 -0.808740
vn -0.585754 0.022141 -0.810187
vn -0.807059 0.018375 -0.590185
vn -0.809210 0.015040 -0.587327
vn -0.949873 0.013639 -0.312339
vn -0.951179 0.013164 -0.308360
vn -0.309089 0.017527 -0.950872
vn -0.307735 0.024561 -0.951155
vn 0.000000 -0.999859 0.016786
vn 0.000043 -0.999860 0.016736
vn -0.000000 0.017866 -0.999840
vn 0.000000 0.025395 -0.999678
vn 0.000001 -0.999859 0.016786
vn 0.000035 -0.999860 0.016727
vn 0.307734 0.024560 -0.951155
vn 0.309089 0.017527 -0.950872
vn -0.999938 0.011109 0.000887
vn -0.999959 0.008390 -0.003462
vn -0.951962 0.003169 0.306201
vn -0.950647 0.009090 0.310140
vn -0.000027 -0.999861 0.016702
vn 0.000017 -0.999860 0.016720
vn 0.585753 0.022141 -0.810187
vn 0.587935 0.016549 -0.808739
vn -0.810481 -0.001505 0.585764
vn -0.808343 0.007331 0.588666
vn -0.000054 -0.999861 0.016689
vn 0.000000 -0.999860 0.016715
vn -0.000051 -0.999860 0.016752
vn -0.000017 -0.999860 0.016719
vn 0.807059 0.018375 -0.590186
vn 0.809210 0.015040 -0.587327
vn -0.589180 -0.005215 0.807985
vn -0.587176 0.005964 0.809437
vn -0.000043 -0.999860 0.016736
vn -0.000035 -0.999860 0.016727
vn 0.949873 0.013639 -0.312339
vn 0.951179 0.013164 -0.308360
vn -0.309849 -0.007594 0.950756
vn -0.308624 0.005084 0.951170
vn 0.000001 -0.008413 0.999965
vn 0.000000 0.004782 0.999989
vn 0.951962 0.003169 0.306201
vn 0.999959 0.008390 -0.003461
vn 0.999938 0.011109 0.000887
vn 0.950647 0.009090 0.310140
vn 0.309847 -0.007594 0.950756
vn 0.308623 0.005084 0.951171
vn 0.810482 -0.001505 0.585762
vn 0.808344 0.007332 0.588665
vn 0.589179 -0.005215 0.807986
vn 0.587176 0.005964 0.809437
vn -0.588143 0.003260 -0.808751
vn -0.809364 0.006833 -0.587267
vn -0.951216 0.011348 -0.308319
vn -0.309230 0.000970 -0.950987
vn -0.999866 0.016371 0.000784
vn -0.000003 0.000182 -1.000000
vn 0.309232 0.000970 -0.950986
vn -0.950521 0.021405 0.309923
vn 0.588146 0.003259 -0.808748
vn -0.808163 0.025940 0.588387
vn 0.809363 0.006833 -0.587268
vn -0.587155 0.029555 0.808935
vn 0.951216 0.011348 -0.308318
vn -0.308383 0.031912 0.950727
vn 0.999866 0.016371 0.000785
vn 0.950520 0.021405 0.309924
vn 0.808164 0.025940 0.588386
vn 0.587158 0.029555 0.808933
vn 0.308382 0.031911 0.950727
vn -0.588303 -0.013372 -0.808530
vn -0.809485 -0.004095 -0.587126
vn -0.951229 0.007589 -0.308392
vn -0.309342 -0.019331 -0.950754
vn -0.000007 -0.021385 -0.999771
vn -0.999789 0.020543 0.000458
vn -0.950439 0.033481 0.309104
vn 0.309344 -0.019331 -0.950754
vn 0.588306 -0.013373 -0.808528
vn -0.808109 0.045112 0.587303
vn 0.809484 -0.004095 -0.587127
vn -0.587042 0.054324 0.807732
vn 0.951230 0.007589 -0.308391
vn -0.308044 0.060268 0.949461
vn 0.999789 0.020543 0.000459
vn -0.000002 0.032738 0.999464
vn -0.000004 0.062282 0.998059
vn 0.950439 0.033481 0.309104
vn 0.308043 0.060268 0.949462
vn 0.808111 0.045111 0.587301
vn 0.587046 0.054324 0.807729
vn -0.809535 -0.016587 -0.586837
vn -0.588362 -0.031662 -0.807977
vn -0.309385 -0.041350 -0.950037
vn -0.951238 0.002383 -0.308449
vn -0.000006 -0.044690 -0.999001
vn -0.999727 0.023386 -0.000018
vn -0.950335 0.044348 0.308053
vn 0.588361 -0.031663 -0.807979
vn 0.309384 -0.041351 -0.950038
vn -0.808045 0.063230 0.585718
vn 0.809536 -0.016588 -0.586836
vn -0.586873 0.078196 0.805895
vn 0.951239 0.002383 -0.308446
vn -0.308186 0.087773 0.947269
vn 0.999727 0.023386 -0.000017
vn -0.000002 0.091039 0.995847
vn 0.308181 0.087774 0.947270
vn 0.950335 0.044348 0.308054
vn 0.586876 0.078196 0.805892
vn 0.808047 0.063230 0.585715
vn -0.809494 -0.029356 -0.586394
vn -0.588301 -0.049783 -0.807108
vn -0.951228 -0.003651 -0.308466
vn -0.999692 0.024798 -0.000587
vn 0.309341 -0.062910 -0.948868
vn -0.000006 -0.067435 -0.997724
vn -0.950241 0.053187 0.306941
vn -0.807886 0.078747 0.584055
vn 0.809495 -0.029356 -0.586393
vn 0.588298 -0.049783 -0.807110
vn -0.586693 0.098995 0.803736
vn 0.951230 -0.003651 -0.308462
vn -0.308356 0.111977 0.944657
vn 0.999692 0.024798 -0.000586
vn 0.000002 0.116448 0.993197
vn 0.308353 0.111978 0.944658
vn 0.950241 0.053187 0.306942
vn 0.586693 0.098995 0.803736
vn 0.807887 0.078747 0.584053
vn -0.951183 -0.009813 -0.308472
vn -0.809363 -0.041072 -0.585871
vn -0.999692 0.024790 -0.001155
vn 0.309225 -0.081854 -0.947460
vn -0.000001 -0.087352 -0.996177
vn -0.950230 0.059326 0.305848
vn 0.588133 -0.065903 -0.806074
vn -0.807826 0.090418 0.582445
vn -0.586595 0.115043 0.801668
vn 0.951184 -0.009812 -0.308470
vn 0.809365 -0.041072 -0.585868
vn -0.345731 0.127192 0.929673
vn 0.998990 0.020117 -0.040169
vn -0.001466 0.130296 0.991474
vn 0.313293 0.125287 0.941356
vn 0.951539 0.057261 0.302149
vn 0.583957 0.110764 0.804192
vn 0.809927 0.086665 0.580093
vn -0.309228 -0.081854 -0.947459
vn -0.588136 -0.065904 -0.806072
vn -0.578952 -0.078653 -0.811559
vn -0.299390 -0.095534 -0.949336
vn -0.951101 -0.015388 -0.308496
vn -0.809172 -0.050480 -0.585399
vn -0.999723 0.023477 -0.001644
vn -0.950326 0.062285 0.304961
vn 0.605353 -0.075922 -0.792328
vn 0.299145 -0.095169 -0.949450
vn -0.807926 0.097230 0.581207
vn -0.119541 -0.107794 0.986960
vn -0.326854 0.024490 0.944757
vn -0.332275 0.142249 0.932394
vn -0.016377 0.150854 0.988420
vn -0.316962 0.076349 0.945360
vn -0.613901 0.171528 0.770522
vn -0.447565 0.278581 0.849752
vn -0.586661 0.124911 0.800141
vn 0.058072 -0.152296 0.986627
vn 0.280361 -0.214042 0.935726
vn 0.965077 -0.226138 -0.132242
vn 0.999449 0.020340 -0.026239
vn 0.954927 0.060872 0.290531
vn 0.896074 -0.161831 -0.413356
vn 0.920382 0.136629 -0.366372
vn 0.984770 0.021052 -0.172580
vn 0.951102 -0.015388 -0.308495
vn 0.809173 -0.050480 -0.585398
vn 0.942077 -0.303615 0.142508
vn 0.856408 -0.385732 0.343186
vn 0.703891 -0.367843 0.607642
vn 0.493843 -0.263537 0.828654
vn -0.331639 -0.180832 -0.925913
vn -0.646202 -0.172515 -0.743412
vn -0.828142 -0.070488 -0.556069
vn -0.005548 0.638332 -0.769741
vn 0.964491 0.184604 0.188890
vn 0.888973 0.078587 0.451166
vn 0.807858 0.098726 0.581050
vn 0.133444 0.432784 -0.891566
vn 0.061708 -0.206063 -0.976591
vn 0.014982 -0.101151 -0.994758
vn 0.251887 0.243648 0.936583
vn -0.730010 0.667263 -0.147803
vn -0.049771 0.849326 0.525517
vn -0.999999 0.001453 0.000320
vn -0.950930 -0.042483 -0.306475
vn 0.377036 -0.216068 -0.900643
vn -0.178051 0.327907 0.927779
vn 0.314182 0.144741 0.938264
vn 0.576736 0.127778 0.806876
vn -0.950546 0.047286 0.306963
vn -0.056331 0.906846 -0.417680
vn -0.807426 0.090482 0.582989
vn 0.142115 0.455514 -0.878812
vn -0.105274 0.600357 -0.792773
vn -0.347648 0.699395 -0.624490
vn 0.833201 -0.043458 -0.551260
vn 0.706010 -0.070309 -0.704703
vn -0.702021 0.699031 -0.136096
vn -0.557377 0.730588 -0.394426
vn -0.807078 0.568445 0.159673
vn -0.782701 0.601292 0.160708
vn -0.585207 0.126743 0.800918
vn 0.849578 -0.355104 -0.390025
vn 0.864418 -0.339803 -0.370562
vn 0.777557 -0.160553 -0.607970
vn 0.765590 -0.163182 -0.622288
vn -0.338241 -0.144776 0.929856
vn -0.051375 -0.348500 0.935900
vn -0.088567 -0.355106 0.930621
vn -0.335530 -0.163182 0.927789
vn -0.306257 0.152552 0.939646
vn 0.999159 0.040965 -0.001700
vn 0.951507 -0.004743 -0.307590
vn 0.002157 0.165499 0.986208
vn 0.309703 0.164398 0.936513
vn 0.949074 0.084621 0.303475
vn -0.383298 -0.498949 -0.777260
vn -0.741558 -0.359049 -0.566723
vn -0.804053 -0.148637 -0.575678
vn -0.816378 -0.153696 -0.556690
vn -0.915188 -0.055731 -0.399156
vn -0.577886 -0.163498 -0.799573
vn 0.586617 0.149410 0.795963
vn 0.806743 0.121968 0.578178
vn -0.972270 -0.111111 -0.205779
vn -0.741877 -0.389741 -0.545637
vn -0.344585 -0.506523 -0.790377
vn -0.967150 -0.177846 -0.181638
vn 0.132947 -0.499418 -0.856100
vn 0.120275 -0.533278 -0.837346
vn -0.839600 0.029404 -0.542409
vn -0.993146 0.083461 0.081830
vn 0.575375 -0.371363 -0.728720
vn 0.564698 -0.438347 -0.699262
vn -0.453831 0.094521 0.886061
vn 0.739022 -0.264973 -0.619383
vn -0.364520 -0.405075 -0.838475
vn -0.749414 -0.261202 -0.608401
vn -0.967283 -0.052964 -0.248109
vn 0.862893 -0.079670 -0.499067
vn 0.827439 0.047777 -0.559520
vn 0.973202 0.120997 -0.195544
vn 0.595717 0.009931 -0.803133
vn 0.102528 -0.444483 -0.889901
vn -0.943587 -0.127710 -0.305505
vn 0.883124 -0.154727 -0.442890
vn 0.881308 -0.239555 -0.407320
vn -0.995738 -0.092209 0.001665
vn -0.978524 0.051849 0.199505
vn -0.702233 0.345408 0.622545
vn -0.830120 0.169971 -0.531047
vn -0.971959 0.167263 0.165287
vn 0.548277 -0.369315 -0.750332
vn -0.548790 0.332530 -0.766977
vn -0.353710 0.501486 0.789557
vn -0.949674 -0.045619 0.309901
vn -0.284706 -0.141361 -0.948135
vn 0.998617 0.048859 0.019394
vn -0.766484 0.349788 0.538656
vn 0.874535 -0.198085 -0.442663
vn -0.285766 -0.238622 -0.928115
vn -0.644858 -0.001162 -0.764302
vn -0.356222 0.683814 -0.636792
vn -0.106649 0.585640 -0.803525
vn -0.866058 0.244536 -0.436058
vn 0.141307 -0.418072 -0.897356
vn 0.610070 0.048936 -0.790835
vn 0.614133 0.035667 -0.788396
vn 0.767888 -0.172434 -0.616939
vn -0.718570 0.683816 -0.126699
vn -0.793836 0.585641 0.163857
vn -0.808573 0.007484 0.588348
vn 0.887443 0.334963 0.316613
vn 0.992727 0.114893 -0.035962
vn 0.850274 -0.359885 -0.384079
vn 0.999266 0.028022 -0.026123
vn -0.395155 0.465073 0.792187
vn 0.853500 -0.507860 -0.116689
vn 0.853521 -0.508853 -0.112119
vn 0.680443 0.660363 -0.317677
vn 0.157565 0.572408 0.804688
vn -0.895895 0.444236 -0.005197
vn 0.776566 -0.606311 0.171269
vn 0.776902 -0.605065 0.174125
vn 0.553854 -0.498415 -0.666954
vn 0.908956 0.398329 0.123013
vn 0.579782 0.515938 0.630604
vn -0.542240 0.035667 0.839466
vn -0.545880 0.048936 0.836433
vn -0.329720 -0.172433 0.928198
vn -0.010306 -0.107132 -0.994191
vn -0.082721 -0.359887 0.929322
vn 0.170826 -0.507860 0.844332
vn 0.175148 -0.508855 0.842846
vn 0.417399 -0.606309 0.676881
vn 0.420207 -0.605064 0.676257
vn 0.878794 0.253635 0.404215
vn 0.073018 0.493318 0.866779
vn -0.586231 0.061536 0.807803
vn 0.849317 -0.452021 -0.272649
vn 0.537331 0.421035 0.730756
vn -0.716162 0.549993 0.429675
vn 0.939420 -0.285575 0.189570
vn 0.313185 -0.050194 -0.948365
vn 0.946075 0.078544 -0.314281
vn -0.368739 0.536638 0.758980
vn -0.305596 0.110939 0.945676
vn 0.800905 -0.045918 0.597029
vn 0.061505 0.412196 0.909017
vn 0.992220 0.124029 -0.010790
vn 0.481169 0.204534 0.852433
vn 0.004789 0.150654 0.988575
vn 0.942886 0.159231 0.292596
vn 0.312473 0.176754 0.933337
vn 0.586842 0.187009 0.787810
vn 0.803321 0.180913 0.567403
vn -0.638309 0.013865 -0.769655
vn -0.335694 -0.342010 -0.877690
vn 0.065349 -0.624683 -0.778139
vn -0.792148 0.357150 -0.494920
vn 0.469117 -0.741641 -0.479478
vn -0.773927 0.623564 -0.110476
vn 0.755496 -0.651540 -0.068717
vn -0.576449 0.758632 0.303618
vn 0.852518 -0.401372 0.334834
vn -0.237801 0.730502 0.640170
vn -0.585315 -0.114004 -0.802751
vn -0.802262 -0.134631 -0.581592
vn 0.759412 -0.072922 0.646510
vn -0.941603 -0.141093 -0.305738
vn -0.310174 -0.080941 -0.947228
vn 0.154938 0.551015 0.819986
vn 0.510570 0.264238 0.818228
vn -0.991135 -0.132855 -0.000960
vn -0.002616 -0.038276 -0.999264
vn 0.304977 0.009850 -0.952309
vn -0.946010 -0.110613 0.304679
vn -0.752418 -0.287085 -0.592833
vn -0.440856 -0.653363 -0.615438
vn -0.057476 -0.849675 -0.524166
vn -0.884636 0.195898 -0.423136
vn 0.580519 0.058318 -0.812156
vn 0.339750 -0.876485 -0.341093
vn -0.216419 0.402666 -0.889395
vn -0.489277 0.468180 -0.735810
vn -0.809285 -0.076255 0.582446
vn 0.078597 0.300588 -0.950510
vn 0.155143 0.434030 -0.887439
vn -0.567604 0.717812 -0.403202
vn -0.710261 0.490883 -0.504542
vn 0.365216 0.172047 -0.914886
vn 0.403283 0.244521 -0.881801
vn -0.855875 0.468181 -0.219737
vn 0.614817 0.029336 -0.788124
vn -0.751556 -0.164223 -0.638902
vn -0.412381 -0.374606 -0.830429
vn -0.911062 0.402665 0.088473
vn 0.803168 -0.113378 -0.584864
vn -0.762866 0.632667 -0.133297
vn 0.009790 -0.506836 -0.861987
vn -0.943475 0.094798 -0.317598
vn -0.786883 0.434029 0.438672
vn -0.871638 0.300587 0.387162
vn 0.913697 -0.242015 -0.326477
vn 0.439343 -0.536631 -0.720420
vn -0.699865 0.244522 0.671117
vn -0.743637 0.172048 0.646068
vn 0.938252 -0.343780 -0.038709
vn 0.689807 -0.720406 -0.071978
vn -0.541761 0.029336 0.840021
vn 0.876588 -0.409215 0.253252
vn -0.930576 0.355631 0.086917
vn -0.287821 -0.113377 0.950949
vn 0.735360 -0.431704 0.522377
vn 0.627616 -0.638225 0.445834
vn 0.527740 -0.409213 0.744335
vn -0.007446 -0.242015 0.970244
vn -0.451958 0.874184 0.177586
vn 0.272363 -0.343782 0.898684
vn 0.787801 -0.448995 -0.421632
vn 0.798196 0.102198 -0.593665
vn -0.592566 -0.032866 0.804851
vn -0.681784 0.545416 0.487537
vn 0.891218 -0.385457 0.239069
vn -0.068986 0.900566 0.429212
vn 0.966450 -0.255882 -0.022340
vn -0.244744 0.595262 0.765352
vn 0.868797 0.047457 0.492890
vn 0.312962 0.750705 0.581804
vn 0.924570 0.004349 0.380988
vn 0.648319 0.454464 0.610857
vn 0.249651 0.491487 0.834335
vn 0.938041 0.137304 -0.318161
vn 0.668734 0.273662 0.691306
vn -0.316036 0.015435 0.948622
vn -0.347937 -0.014912 -0.937399
vn -0.727643 0.112647 -0.676643
vn 0.096010 -0.124051 -0.987620
vn -0.944917 0.230469 -0.232414
vn 0.526544 -0.196699 -0.827079
vn -0.912462 0.299291 0.278994
vn 0.986996 0.160301 -0.011903
vn 0.859671 -0.215822 -0.463019
vn -0.006501 0.063882 0.997936
vn -0.654201 0.300409 0.694100
vn 0.984983 -0.168648 0.036976
vn 0.940084 0.169006 0.296106
vn -0.275230 0.247181 0.929059
vn 0.853919 -0.068582 0.515866
vn 0.303633 0.107330 0.946724
vn 0.140493 0.159219 0.977196
vn 0.538781 0.049491 0.840991
vn 0.800901 0.162486 0.576330
vn 0.581950 0.141283 0.800857
vn -0.590700 -0.035730 -0.806100
vn -0.820918 -0.053560 -0.568529
vn -0.953771 -0.062159 -0.294035
vn -0.284268 -0.007573 -0.958715
vn 0.196474 0.855872 -0.478415
vn -0.997627 -0.066576 0.017569
vn -0.002610 0.013898 -0.999900
vn -0.943642 -0.064125 0.324697
vn 0.309667 0.034868 -0.950205
vn -0.808834 -0.059293 0.585039
vn 0.583465 0.052372 -0.810448
vn -0.321631 0.138324 -0.936707
vn -0.592399 0.156385 -0.790321
vn -0.804443 0.162236 -0.571447
vn -0.011610 0.108290 -0.994052
vn -0.941299 0.156385 -0.299167
vn 0.307092 0.067555 -0.949279
vn -0.990376 0.138326 0.004704
vn 0.596975 0.019463 -0.802024
vn -0.942453 0.108287 0.316316
vn 0.821156 -0.030267 -0.569900
vn -0.795247 0.067556 0.602510
vn 0.955691 -0.075429 -0.284543
vn -0.560760 0.019464 0.827750
vn 0.993695 -0.110514 0.018894
vn -0.267766 -0.030267 0.963008
vn 0.940887 -0.133045 0.311497
vn 0.045973 -0.075429 0.996091
vn 0.807203 -0.140082 0.573412
vn -0.558429 -0.036612 0.828744
vn 0.603909 -0.133045 0.785871
vn 0.345013 -0.110515 0.932069
vn 0.800773 0.064905 -0.595441
vn -0.309342 -0.062910 -0.948868
vn -0.312032 -0.013539 0.949975
vn 0.943744 0.071478 -0.322858
vn -0.003763 0.003895 0.999985
vn 0.997294 0.071695 -0.016291
vn 0.953308 0.065803 0.294743
vn 0.308053 0.022097 0.951113
vn 0.813422 0.054635 0.579103
vn 0.589979 0.039542 0.806450
vn -0.604031 0.071308 -0.793764
vn -0.813111 0.072258 -0.577606
vn -0.337148 0.067849 -0.939004
vn -0.948380 0.071307 -0.309017
vn -0.028139 0.061895 -0.997686
vn -0.997653 0.067848 -0.009185
vn 0.293195 0.053427 -0.954559
vn -0.951327 0.061896 0.301903
vn 0.588541 0.042994 -0.807323
vn -0.804811 0.053427 0.591122
vn 0.818964 0.031832 -0.572961
vn -0.568543 0.042995 0.821529
vn 0.958534 0.021493 -0.284167
vn -0.271378 0.031831 0.961947
vn 0.999659 0.013318 0.022482
vn 0.047262 0.021494 0.998651
vn 0.948626 0.008206 0.316294
vn 0.350366 0.013317 0.936518
vn 0.815224 0.006256 0.579113
vn 0.610992 0.008206 0.791595
vn -0.313062 0.234234 -0.920395
vn -0.020057 0.203863 -0.978794
vn 0.290780 0.192646 -0.937195
vn 0.562369 0.162742 -0.810714
vn 0.779246 0.118262 -0.615459
vn -0.542050 -0.170975 0.822770
vn -0.300638 -0.162344 0.939820
vn 0.235736 0.237318 -0.942395
vn -0.147206 0.132177 -0.980235
vn -0.344566 -0.013551 -0.938664
vn -0.077816 0.045851 -0.995913
vn 0.928452 0.063136 -0.366046
vn -0.072131 0.996078 -0.051238
vn -0.655206 0.263576 -0.707978
vn 0.020351 -0.178554 0.983720
vn 0.996863 0.002247 -0.079120
vn 0.346076 -0.176126 0.921527
vn 0.973135 -0.058424 0.222698
vn -0.682905 -0.347015 -0.642823
vn -0.843311 -0.457427 -0.282111
vn -0.890404 -0.355467 -0.284296
vn -0.713763 -0.262787 -0.649220
vn -0.427136 -0.176312 -0.886831
vn -0.417385 -0.111890 -0.901815
vn 0.634168 -0.153720 0.757761
vn 0.851071 -0.112660 0.512822
vn -0.052811 0.070892 -0.996085
vn 0.314203 0.252560 -0.915145
vn -0.073890 0.078166 0.994198
vn 0.114419 0.127246 0.985250
vn -0.204321 -0.063687 0.976830
vn -0.322824 -0.125701 0.938075
vn 0.034485 0.700536 -0.712783
vn -0.969859 0.116936 -0.213773
vn -0.852550 0.190499 -0.486691
vn -0.158836 0.321695 -0.933426
vn -0.793185 -0.317142 0.519884
vn -0.752920 -0.411799 0.513354
vn -0.518414 -0.263918 0.813385
vn -0.535148 -0.192358 0.822566
vn 0.567057 0.426051 -0.704931
vn 0.618409 0.400808 -0.675961
vn 0.359028 0.603542 0.711924
vn 0.719308 0.500137 0.482139
vn 0.507250 0.364362 0.780985
vn 0.340970 0.510721 0.789243
vn -0.188262 -0.021533 0.981883
vn 0.263901 0.959599 0.097596
vn -0.997191 0.024126 0.070911
vn -0.935706 -0.070200 0.345726
vn 0.185998 0.164992 0.968598
vn 0.519965 0.333433 0.786421
vn 0.755902 0.454660 0.471058
vn -0.570782 0.820960 0.015241
vn -0.918263 -0.374584 0.128376
vn 0.808613 0.490841 -0.324376
vn 0.856722 0.509642 0.079323
vn -0.963413 0.195524 -0.183320
vn -0.841863 0.297440 -0.450328
vn -0.630478 0.380169 -0.676734
vn -0.991292 0.084906 0.100653
vn -0.343814 0.430409 -0.834590
vn -0.925917 -0.024524 0.376930
vn -0.025193 0.438247 -0.898501
vn -0.788882 -0.159186 0.593570
vn -0.774289 -0.123578 0.620650
vn 0.282113 0.407110 -0.868720
vn -0.548504 -0.204897 0.810655
vn 0.554703 0.344734 -0.757273
vn -0.265783 -0.262172 0.927699
vn 0.774203 0.258727 -0.577642
vn 0.049471 -0.289178 0.955996
vn 0.926202 0.156063 -0.343211
vn 0.364944 -0.281504 0.887452
vn 0.996490 0.044750 -0.070750
vn 0.643641 -0.238233 0.727305
vn 0.974037 -0.065054 0.216841
vn 0.854578 -0.162916 0.493108
vn -0.085810 0.799279 0.594802
vn -0.540843 0.041133 0.840117
vn -0.702845 0.239705 0.669739
vn 0.192951 -0.480225 0.855660
vn 0.871148 -0.481716 -0.095137
vn 0.796998 -0.572686 0.191899
vn 0.440957 -0.572117 0.691548
vn 0.648805 -0.603876 0.463018
vn 0.619245 0.038561 -0.784250
vn -0.795186 0.421543 0.435867
vn 0.403042 0.240006 -0.883150
vn 0.398484 0.260470 -0.879412
vn -0.780662 0.450723 0.432916
vn -0.699189 0.260471 0.665800
vn 0.626234 -0.640265 0.444850
vn -0.907838 -0.299422 -0.293560
vn -0.741725 -0.257526 -0.619293
vn -0.942954 -0.315209 0.107150
vn -0.837467 -0.261478 0.479872
vn -0.635929 -0.211220 0.742281
vn -0.527058 -0.205657 -0.824570
vn -0.868026 -0.480246 0.126074
vn -0.078467 0.226533 0.970838
vn 0.773941 0.534248 -0.339992
vn 0.824895 0.561681 0.063745
vn 0.453831 -0.094521 -0.886061
s 1
g Tree2
usemtl initialShadingGroup
f 1/1/1 2/2/2 3/3/3
f 2/2/2 4/4/4 3/3/3
f 5/5/5 1/1/1 3/3/3
f 4/4/4 6/6/6 3/3/3
f 7/7/7 5/5/5 3/3/3
f 6/6/6 8/8/8 3/3/3
f 9/9/9 7/7/7 3/3/3
s 2
f 10/12/10 2/10/11 1/11/12 11/14/13
f 11/14/13 1/11/12 5/13/14 24/34/15
f 12/16/16 4/15/17 2/10/11 10/12/10
s 1
f 8/8/8 13/17/18 3/3/3
f 14/18/19 9/9/9 3/3/3
s 2
f 15/20/20 6/19/21 4/15/17 12/16/16
s 1
f 13/17/18 16/21/22 3/3/3
f 17/22/23 14/18/19 3/3/3
s 2
f 8/23/24 6/19/21 15/20/20 21/29/25
f 18/26/26 7/24/27 9/25/28 22/32/29
s 1
f 16/21/22 19/27/30 3/3/3
f 20/28/31 17/22/23 3/3/3
s 2
f 13/30/32 8/23/24 21/29/25 28/38/33
f 22/32/29 9/25/28 14/31/34 29/41/35
s 1
f 19/27/30 23/33/36 3/3/3
f 25/35/37 20/28/31 3/3/3
f 23/33/36 26/36/38 3/3/3
f 27/37/39 25/35/37 3/3/3
s 2
f 16/39/40 13/30/32 28/38/33 32/44/41
f 29/41/35 14/31/34 17/40/42 33/47/43
s 1
f 26/36/38 30/42/44 3/3/3
f 31/43/45 27/37/39 3/3/3
f 30/42/44 31/43/45 3/3/3
s 2
f 19/45/46 16/39/40 32/44/41 41/61/47
f 33/47/43 17/40/42 20/46/48 34/49/49
f 34/49/49 20/46/48 25/48/50 46/66/51
f 26/52/52 23/50/53 35/51/54 37/55/55
f 25/48/50 27/53/56 36/54/57 46/66/51
f 30/56/58 26/52/52 37/55/55 40/60/59
f 27/53/56 31/57/60 38/58/61 36/54/57
f 39/59/62 10/12/10 11/14/13 42/62/63
f 31/57/60 30/56/58 40/60/59 38/58/61
f 42/62/63 11/14/13 24/34/15 44/64/64
f 43/63/65 12/16/16 10/12/10 39/59/62
f 44/64/64 24/34/15 18/26/26 47/67/66
f 45/65/67 15/20/20 12/16/16 43/63/65
f 21/29/25 15/20/20 45/65/67 48/68/68
f 47/67/66 18/26/26 22/32/29 49/69/69
f 28/38/33 21/29/25 48/68/68 50/70/70
f 49/69/69 22/32/29 29/41/35 51/71/71
f 32/44/41 28/38/33 50/70/70 52/72/72
f 51/71/71 29/41/35 33/47/43 53/73/73
f 41/61/47 32/44/41 52/72/72 54/80/74
f 53/73/73 33/47/43 34/49/49 60/82/75
f 35/51/54 41/74/47 54/75/74 55/76/76
f 37/55/55 35/51/54 55/76/76 56/77/77
f 40/60/59 37/55/55 56/77/77 58/79/78
f 36/54/57 38/58/61 57/78/79 66/88/80
f 38/58/61 40/60/59 58/79/78 57/78/79
f 59/81/81 39/59/62 42/62/63 61/83/82
f 61/83/82 42/62/63 44/64/64 63/85/83
f 62/84/84 43/63/65 39/59/62 59/81/81
f 45/65/67 43/63/65 62/84/84 68/90/85
f 63/85/83 44/64/64 47/67/66 64/86/86
f 64/86/86 47/67/66 49/69/69 67/89/87
f 65/87/88 48/68/68 45/65/67 68/90/85
f 50/70/70 48/68/68 65/87/88 69/91/89
f 67/89/87 49/69/69 51/71/71 70/92/90
f 52/72/72 50/70/70 69/91/89 71/93/91
f 70/92/90 51/71/71 53/73/73 72/94/92
f 5/13/14 7/24/27 18/26/26 24/34/15
f 54/80/74 52/72/72 71/93/91 73/102/93
f 72/94/92 53/73/73 60/82/75 80/103/94
f 55/76/76 54/75/74 73/95/93 76/98/95
f 60/82/75 75/97/96 74/96/97 80/103/94
f 56/77/77 55/76/76 76/98/95 77/99/98
f 74/96/97 75/97/96 66/88/80 87/110/99
f 58/79/78 56/77/77 77/99/98 79/101/100
f 66/88/80 57/78/79 78/100/101 87/110/99
f 57/78/79 58/79/78 79/101/100 78/100/101
f 59/81/81 61/83/82 81/104/102 82/105/103
f 62/84/84 59/81/81 82/105/103 84/107/104
f 61/83/82 63/85/83 83/106/105 81/104/102
f 68/90/85 62/84/84 84/107/104 90/113/106
f 63/85/83 64/86/86 85/108/107 83/106/105
f 64/86/86 67/89/87 86/109/108 85/108/107
f 88/111/109 69/91/89 65/87/88 93/116/110
f 67/89/87 70/92/90 89/112/111 86/109/108
f 91/114/112 71/93/91 69/91/89 88/111/109
f 70/92/90 72/94/92 92/115/113 89/112/111
f 94/117/114 73/102/93 71/93/91 91/114/112
f 72/94/92 80/103/94 95/118/115 92/115/113
f 96/119/116 76/98/95 73/95/93 94/128/114
f 80/103/94 74/96/97 97/120/117 95/118/115
f 23/50/53 19/121/46 41/74/47 35/51/54
f 97/120/117 74/96/97 87/110/99 99/123/118
f 98/122/119 77/99/98 76/98/95 96/119/116
f 99/123/118 87/110/99 78/100/101 101/125/120
f 100/124/121 79/101/100 77/99/98 98/122/119
f 101/125/120 78/100/101 79/101/100 100/124/121
f 82/105/103 81/104/102 102/126/122 107/132/123
f 81/104/102 83/106/105 103/127/124 102/126/122
f 83/106/105 85/108/107 104/129/125 103/127/124
f 105/130/126 93/116/110 90/113/106 111/136/127
f 85/108/107 86/109/108 106/131/128 104/129/125
f 86/109/108 89/112/111 108/133/129 106/131/128
f 109/134/130 91/114/112 88/111/109 115/140/131
f 89/112/111 92/115/113 110/135/132 108/133/129
f 112/137/133 94/117/114 91/114/112 109/134/130
f 92/115/113 95/118/115 113/138/134 110/135/132
f 114/139/135 96/119/116 94/128/114 112/146/133
f 95/118/115 97/120/117 116/141/136 113/138/134
f 116/141/136 97/120/117 99/123/118 118/143/137
f 117/142/138 98/122/119 96/119/116 114/139/135
f 118/143/137 99/123/118 101/125/120 120/145/139
f 119/144/140 100/124/121 98/122/119 117/142/138
f 120/145/139 101/125/120 100/124/121 119/144/140
f 102/126/122 103/127/124 121/147/141 127/153/142
f 103/127/124 104/129/125 122/148/143 121/147/141
f 123/149/144 105/130/126 111/136/127 129/155/145
f 104/129/125 106/131/128 124/150/146 122/148/143
f 125/151/147 115/140/131 105/130/126 123/149/144
f 106/131/128 108/133/129 126/152/148 124/150/146
f 108/133/129 110/135/132 128/154/149 126/152/148
f 130/156/150 112/137/133 109/134/130 137/163/151
f 110/135/132 113/138/134 131/157/152 128/154/149
f 132/158/153 114/139/135 112/146/133 130/165/150
f 113/138/134 116/141/136 133/159/154 131/157/152
f 34/49/49 46/66/51 75/97/96 60/82/75
f 133/159/154 116/141/136 118/143/137 135/161/155
f 134/160/156 117/142/138 114/139/135 132/158/153
f 135/161/155 118/143/137 120/145/139 138/164/157
f 136/162/158 119/144/140 117/142/138 134/160/156
f 138/164/157 120/145/139 119/144/140 136/162/158
f 46/66/51 36/54/57 66/88/80 75/97/96
f 141/168/159 139/166/160 140/167/161 148/175/162
f 127/153/142 121/147/141 142/169/163 147/174/164
f 121/147/141 122/148/143 143/170/165 142/169/163
f 122/148/143 124/150/146 144/171/166 143/170/165
f 145/172/167 125/151/147 123/149/144 159/186/168
f 124/150/146 126/152/148 146/173/169 144/171/166
f 133/159/154 157/184/170 131/157/152
f 157/184/170 149/176/171 131/157/152
f 156/183/172 131/157/152 173/201/173
f 149/176/171 153/180/174 131/157/152
f 131/157/152 153/180/174 173/201/173
f 153/180/174 166/193/175 173/201/173
f 166/193/175 167/195/176 173/201/173
f 126/152/148 128/154/149 150/177/177 146/173/169
f 157/184/170 133/159/154 151/178/178
f 133/159/154 135/161/155 151/178/178
f 135/161/155 160/187/179 151/178/178
f 134/160/156 132/158/153 152/179/180
f 164/191/181 184/214/182 132/158/153
f 152/179/180 132/158/153 161/188/183
f 171/199/184 168/196/185 184/214/182
f 184/214/182 168/196/185 132/158/153
f 168/196/185 161/188/183 132/158/153
f 154/181/186 130/156/150 137/163/151 165/192/187
f 152/179/180 155/182/188 134/160/156
f 134/160/156 155/182/188 136/162/158
f 136/162/158 155/182/188 163/190/189
f 128/154/149 131/157/152 156/183/172 150/177/177
f 163/190/189 158/185/190 136/162/158
f 136/162/158 158/185/190 138/164/157
f 138/164/157 158/185/190 162/189/191
f 164/191/181 132/158/153 130/165/150 154/194/186
f 169/197/192 148/175/162 140/167/161 191/223/193
f 140/167/161 147/174/164 170/198/194 191/223/193
f 174/202/195 175/203/196 176/204/197
f 171/199/184 184/214/182 175/203/196
f 184/214/182 186/217/198 175/203/196
f 186/217/198 176/204/197 175/203/196
f 174/205/195 177/206/199 175/207/196
f 179/209/200 178/208/201 148/175/162 169/197/192
f 180/210/202 181/211/203 182/212/204
f 142/169/163 143/170/165 183/213/205 199/232/206
f 159/186/168 178/208/201 179/209/200 203/236/207
f 167/195/176 172/200/208 173/201/173
f 173/201/173 172/200/208 185/216/209
f 172/200/208 180/215/202 185/216/209
f 185/216/209 180/215/202 182/218/204 189/221/210
f 143/170/165 144/171/166 187/219/211 183/213/205
f 176/204/197 186/217/198 174/202/195
f 174/202/195 186/217/198 188/220/212
f 186/217/198 189/221/210 188/220/212
f 189/221/210 182/218/204 188/220/212
f 144/171/166 146/173/169 190/222/213 187/219/211
f 192/224/214 177/206/199 174/205/195 193/226/215
f 193/226/215 174/205/195 188/225/212 210/243/216
f 194/227/217 165/192/187 145/172/167 212/245/218
f 182/212/204 181/211/203 195/228/219 211/244/220
f 181/211/203 196/229/221 197/230/222 195/228/219
f 146/173/169 150/177/177 198/231/223 190/222/213
f 202/235/224 200/233/225 201/234/226 214/247/227
f 206/239/228 204/237/229 205/238/230 221/257/231
f 150/177/177 156/183/172 207/240/232 198/231/223
f 208/241/233 164/191/181 154/194/186 227/263/234
f 156/183/172 173/201/173 209/242/235 207/240/232
f 209/242/235 173/201/173 185/216/209 217/252/236
f 213/246/237 184/214/182 164/191/181 208/241/233
f 215/249/238 169/250/192 191/248/193 219/255/239
f 191/223/193 170/198/194 216/251/240
f 170/198/194 240/276/241 216/251/240
f 216/251/240 240/276/241 231/283/242
f 231/283/242 240/276/241 253/290/243
f 217/252/236 185/216/209 189/221/210 220/256/244
f 218/253/245 186/217/198 184/214/182 213/246/237
f 219/255/239 191/248/193 216/254/240 222/258/246
f 220/256/244 189/221/210 186/217/198 218/253/245
f 215/249/238 219/255/239 223/259/247 228/264/248
f 219/255/239 222/258/246 224/260/249 223/259/247
f 226/262/250 225/261/251 215/249/238 228/264/248
f 229/265/252 230/266/253 231/267/242
f 233/269/254 232/268/255 225/261/251 226/262/250
f 212/245/218 234/270/256 235/271/257
f 236/272/258 228/264/248 223/259/247 238/274/259
f 238/274/259 223/259/247 224/260/249 243/279/260
f 235/271/257 239/275/261 212/245/218
f 212/245/218 239/275/261 194/227/217
f 194/227/217 239/275/261 294/337/262
f 239/275/261 255/345/263 294/337/262
f 294/337/262 255/345/263 302/350/264
f 241/277/265 226/262/250 228/264/248 236/272/258
f 170/198/194 199/232/206 242/278/266 240/276/241
f 245/281/267 244/280/268 232/268/255 233/269/254
f 199/232/206 183/213/205 246/282/269 242/278/266
f 230/266/253 229/265/252 237/273/270
f 237/273/270 229/265/252 247/284/271
f 229/265/252 248/285/272 247/284/271
f 224/260/249 237/273/270 249/286/273 243/279/260
f 250/287/274 233/269/254 226/262/250 241/277/265
f 247/284/271 248/285/272 251/288/275 260/300/276
f 183/213/205 187/219/211 252/289/277 246/282/269
f 231/283/242 253/290/243 229/291/252
f 229/291/252 253/290/243 248/297/272
f 248/297/272 253/290/243 283/325/278
f 239/292/261 254/293/279 255/294/263
f 237/273/270 247/284/271 256/295/280 249/286/273
f 233/269/254 250/287/274 257/296/281 245/281/267
f 258/298/282 236/272/258 238/274/259 261/301/283
f 193/226/215 210/243/216 259/299/284 306/354/285
f 261/301/283 238/274/259 243/279/260 276/318/286
f 262/302/287 241/277/265 236/272/258 258/298/282
f 214/247/227 263/303/288 264/304/289 268/308/290
f 265/305/291 195/228/219 197/230/222 311/359/292
f 187/219/211 190/222/213 266/306/293 252/289/277
f 267/307/294 255/294/263 254/293/279 271/313/295
f 202/235/224 214/247/227 268/308/290 272/314/296
f 245/311/267 257/309/281 269/310/297 271/313/295
f 247/284/271 260/300/276 270/312/298 256/295/280
f 273/315/299 202/235/224 272/314/296 277/319/300
f 251/288/275 275/317/301 274/316/302 260/300/276
f 276/318/286 243/279/260 249/286/273 300/348/303
f 278/320/304 273/315/299 277/319/300 312/360/305
f 279/321/306 250/287/274 241/277/265 262/302/287
f 280/322/307 255/294/263 267/307/294 284/327/308
f 282/324/309 281/323/310 221/257/231 285/328/311
f 251/326/275 248/297/272 283/325/278 305/353/312
f 275/317/301 280/322/307 284/327/308 274/316/302
f 285/328/311 221/257/231 205/238/230 287/330/313
f 287/330/313 205/238/230 286/329/314 289/332/315
f 289/332/315 286/329/314 288/331/316 314/362/317
f 267/307/294 271/313/295 269/310/297 293/336/318
f 260/300/276 274/316/302 290/333/319 270/312/298
f 190/222/213 198/231/223 291/334/320 266/306/293
f 292/335/321 257/296/281 250/287/274 279/321/306
f 284/327/308 267/307/294 293/336/318 295/338/322
f 274/316/302 284/327/308 295/338/322 290/333/319
f 249/286/273 256/295/280 296/339/323 300/348/303
f 269/310/297 257/309/281 292/340/321 303/351/324
f 297/342/325 275/341/301 251/326/275 305/353/312
f 298/344/326 227/343/234 194/227/217 294/337/262
f 256/295/280 270/312/298 299/347/327 296/339/323
f 198/231/223 207/240/232 301/349/328 291/334/320
f 255/345/263 280/346/307 302/350/264
f 302/350/264 280/346/307 297/342/325
f 280/346/307 275/341/301 297/342/325
f 65/87/88 68/90/85 90/113/106 93/116/110
f 293/336/318 269/310/297 303/351/324 308/356/329
f 270/312/298 290/333/319 304/352/330 299/347/327
f 307/355/331 208/241/233 227/263/234 298/371/326
f 295/338/322 293/336/318 308/356/329 309/357/332
f 290/333/319 295/338/322 309/357/332 304/352/330
f 207/240/232 209/242/235 310/358/333 301/349/328
f 313/361/334 213/246/237 208/241/233 307/355/331
f 209/242/235 217/252/236 315/363/335 310/358/333
f 315/363/335 217/252/236 220/256/244 317/365/336
f 316/364/337 218/253/245 213/246/237 313/361/334
f 317/365/336 220/256/244 218/253/245 316/364/337
f 258/298/282 261/301/283 318/366/338 319/367/339
f 262/302/287 258/298/282 319/367/339 320/368/340
f 318/366/338 261/301/283 276/318/286 321/369/341
f 279/321/306 262/302/287 320/368/340 322/370/342
f 321/369/341 276/318/286 300/348/303 323/372/343
f 292/335/321 279/321/306 322/370/342 324/384/344
f 323/372/343 300/348/303 296/339/323 325/374/345
f 303/351/324 292/340/321 324/373/344 327/376/346
f 325/374/345 296/339/323 299/347/327 330/379/347
f 326/375/348 253/290/243 240/276/241 328/377/349
f 308/356/329 303/351/324 327/376/346 331/380/350
f 328/377/349 240/276/241 242/278/266 333/382/351
f 329/378/352 283/325/278 253/290/243 326/375/348
f 330/379/347 299/347/327 304/352/330 332/381/353
f 309/357/332 308/356/329 331/380/350 338/388/354
f 332/381/353 304/352/330 309/357/332 338/388/354
f 333/382/351 242/278/266 246/282/269 384/435/355
f 334/383/356 305/353/312 283/325/278 329/378/352
f 335/385/357 297/342/325 305/353/312 334/383/356
f 246/282/269 252/289/277 336/386/358 384/435/355
f 319/367/339 318/366/338 337/387/359 339/389/360
f 320/368/340 319/367/339 339/389/360 342/392/361
f 318/366/338 321/369/341 340/390/362 337/387/359
f 341/391/363 302/350/264 297/342/325 335/385/357
f 322/370/342 320/368/340 342/392/361 369/420/364
f 343/393/365 306/354/285 259/299/284 348/398/366
f 252/289/277 266/306/293 344/394/367 336/386/358
f 346/396/368 345/395/369 306/354/285 343/393/365
f 348/398/366 259/299/284 347/397/370 404/457/371
f 350/400/372 349/399/373 345/395/369 346/396/368
f 347/397/370 265/305/291 351/401/374 404/457/371
f 352/403/375 264/304/289 349/402/373 350/458/372
f 354/405/376 353/404/377 339/389/360 337/387/359
f 265/305/291 311/359/292 355/406/378 351/401/374
f 356/407/379 268/308/290 264/304/289 352/403/375
f 321/369/341 323/372/343 357/408/380 340/390/362
f 353/404/377 358/409/381 342/392/361 339/389/360
f 359/410/382 354/405/376 337/387/359 340/390/362
f 311/359/292 360/411/383 361/412/384 355/406/378
f 362/413/385 272/314/296 268/308/290 356/407/379
f 342/392/361 358/409/381 363/414/386 369/420/364
f 360/411/383 364/415/387 365/416/388 361/412/384
f 366/417/389 277/319/300 272/314/296 362/413/385
f 367/418/390 324/384/344 322/370/342 369/420/364
f 364/415/387 282/324/309 368/419/391 365/416/388
f 370/421/392 312/360/305 277/319/300 366/417/389
f 371/422/393 359/410/382 340/390/362 357/408/380
f 282/324/309 285/328/311 372/423/394 368/419/391
f 374/425/395 373/424/396 312/360/305 370/421/392
f 314/362/317 373/424/396 374/425/395 377/428/397
f 285/328/311 287/330/313 375/426/398 372/423/394
f 323/372/343 325/374/345 376/427/399 357/408/380
f 289/332/315 314/362/317 377/428/397 378/429/400
f 287/330/313 289/332/315 378/429/400 375/426/398
f 369/420/364 363/414/386 379/430/401 367/418/390
f 380/431/402 294/337/262 302/350/264 341/391/363
f 266/306/293 291/334/320 381/432/403 344/394/367
f 382/433/404 371/422/393 357/408/380 376/427/399
f 383/434/405 327/376/346 324/373/344 367/438/390
f 376/427/399 325/374/345 330/379/347 388/441/406
f 367/438/390 379/436/401 385/437/407 383/434/405
f 386/439/408 382/433/404 376/427/399 388/441/406
f 387/440/409 331/380/350 327/376/346 383/434/405
f 388/441/406 330/379/347 332/381/353 391/444/410
f 383/434/405 385/437/407 389/442/411 387/440/409
f 390/443/412 338/388/354 331/380/350 387/440/409
f 391/444/410 332/381/353 338/388/354 390/443/412
f 391/444/410 392/445/413 386/439/408 388/441/406
f 393/446/414 298/344/326 294/337/262 380/431/402
f 387/440/409 389/442/411 394/447/415 390/443/412
f 390/443/412 394/447/415 392/445/413 391/444/410
f 291/334/320 301/349/328 395/448/416 381/432/403
f 396/449/417 353/404/377 354/405/376 398/451/418
f 397/450/419 358/409/381 353/404/377 396/449/417
f 398/451/418 354/405/376 359/410/382 399/452/420
f 363/414/386 358/409/381 397/450/419 401/454/421
f 399/452/420 359/410/382 371/422/393 403/456/422
f 400/453/423 307/355/331 298/371/326 393/470/414
f 379/430/401 363/414/386 401/454/421 405/469/424
f 301/349/328 310/358/333 402/455/425 395/448/416
f 403/456/422 371/422/393 382/433/404 406/460/426
f 385/437/407 379/436/401 405/459/424 407/461/427
f 313/361/334 307/355/331 400/453/423 411/465/428
f 406/460/426 382/433/404 386/439/408 409/463/429
f 389/442/411 385/437/407 407/461/427 410/464/430
f 310/358/333 315/363/335 408/462/431 402/455/425
f 409/463/429 386/439/408 392/445/413 415/471/432
f 394/447/415 389/442/411 410/464/430 412/466/433
f 316/364/337 313/361/334 411/465/428 414/468/434
f 392/445/413 394/447/415 412/466/433 415/471/432
f 315/363/335 317/365/336 413/467/435 408/462/431
f 317/365/336 316/364/337 414/468/434 413/467/435
f 416/472/436 326/375/348 328/377/349 417/473/437
f 417/473/437 328/377/349 333/382/351 420/478/438
f 418/474/439 329/378/352 326/375/348 416/472/436
f 396/475/417 398/476/418 419/477/440
f 420/478/438 333/382/351 384/435/355 422/489/441
f 397/479/419 396/475/417 419/477/440
f 398/476/418 399/480/420 419/477/440
f 401/481/421 397/479/419 419/477/440
f 399/480/420 403/482/422 419/477/440
f 421/483/442 334/383/356 329/378/352 418/474/439
f 405/484/424 401/481/421 419/477/440
f 403/482/422 406/485/426 419/477/440
f 407/486/427 405/484/424 419/477/440
f 406/485/426 409/487/429 419/477/440
f 410/488/430 407/486/427 419/477/440
f 422/489/441 384/435/355 336/386/358 423/492/443
f 409/487/429 415/490/432 419/477/440
f 335/385/357 334/383/356 421/483/442 424/493/444
f 412/491/433 410/488/430 419/477/440
f 415/490/432 412/491/433 419/477/440
f 423/492/443 336/386/358 344/394/367 442/511/445
f 341/391/363 335/385/357 424/493/444 445/514/446
f 425/494/447 343/393/365 348/398/366 426/495/448
f 426/495/448 348/398/366 404/457/371 450/519/449
f 427/496/450 346/396/368 343/393/365 425/494/447
f 404/457/371 351/401/374 428/497/451 450/519/449
f 429/498/452 350/400/372 346/396/368 427/496/450
f 351/401/374 355/406/378 430/499/453 428/497/451
f 431/500/454 352/403/375 350/458/372 429/521/452
f 355/406/378 361/412/384 432/501/455 430/499/453
f 433/502/456 356/407/379 352/403/375 431/500/454
f 361/412/384 365/416/388 434/503/457 432/501/455
f 435/504/458 362/413/385 356/407/379 433/502/456
f 365/416/388 368/419/391 436/505/459 434/503/457
f 437/506/460 366/417/389 362/413/385 435/504/458
f 368/419/391 372/423/394 438/507/461 436/505/459
f 439/508/462 370/421/392 366/417/389 437/506/460
f 372/423/394 375/426/398 440/509/463 438/507/461
f 441/510/464 374/425/395 370/421/392 439/508/462
f 442/511/445 344/394/367 381/432/403 447/516/465
f 377/428/397 374/425/395 441/510/464 444/513/466
f 375/426/398 378/429/400 443/512/467 440/509/463
f 378/429/400 377/428/397 444/513/466 443/512/467
f 380/431/402 341/391/363 445/514/446 448/517/468
f 84/107/104 82/105/103 107/132/123 446/515/469
f 447/516/465 381/432/403 395/448/416 449/518/470
f 393/446/414 380/431/402 448/517/468 451/527/471
f 449/518/470 395/448/416 402/455/425 457/528/472
f 400/453/423 393/470/414 451/520/471 452/522/473
f 90/113/106 84/107/104 446/515/469 111/136/127
f 411/465/428 400/453/423 452/522/473 454/524/474
f 402/455/425 408/462/431 453/523/475 457/528/472
f 414/468/434 411/465/428 454/524/474 456/526/476
f 408/462/431 413/467/435 455/525/477 453/523/475
f 413/467/435 414/468/434 456/526/476 455/525/477
f 88/111/109 93/116/110 105/130/126 115/140/131
f 458/529/478 426/495/448 450/519/449 479/550/479
f 459/530/480 425/494/447 426/495/448 458/529/478
f 450/519/449 428/497/451 460/531/481 479/550/479
f 461/532/482 427/496/450 425/494/447 459/530/480
f 428/497/451 430/499/453 462/533/483 460/531/481
f 463/534/484 429/498/452 427/496/450 461/532/482
f 430/499/453 432/501/455 464/535/485 462/533/483
f 465/536/486 431/500/454 429/521/452 463/551/484
f 432/501/455 434/503/457 466/537/487 464/535/485
f 467/538/488 433/502/456 431/500/454 465/536/486
f 434/503/457 436/505/459 468/539/489 466/537/487
f 469/540/490 435/504/458 433/502/456 467/538/488
f 436/505/459 438/507/461 470/541/491 468/539/489
f 471/542/492 437/506/460 435/504/458 469/540/490
f 438/507/461 440/509/463 472/543/493 470/541/491
f 473/544/494 439/508/462 437/506/460 471/542/492
f 440/509/463 443/512/467 474/545/495 472/543/493
f 475/546/496 441/510/464 439/508/462 473/544/494
f 443/512/467 444/513/466 476/547/497 474/545/495
f 444/513/466 441/510/464 475/546/496 476/547/497
f 421/483/442 418/474/439 477/548/498 478/549/499
f 424/493/444 421/483/442 478/549/499 480/552/500
f 445/514/446 424/493/444 480/552/500 505/598/501
f 481/553/502 448/517/468 445/514/446 505/598/501
f 482/554/503 447/516/465 449/518/470 488/566/504
f 483/555/505 484/556/506 572/725/507 500/593/508
f 485/557/509 451/527/471 448/517/468 481/553/502
f 458/558/478 479/559/479 486/560/510
f 459/561/480 458/558/478 486/560/510
f 479/559/479 460/562/481 486/560/510
f 416/472/436 572/743/507 418/474/439
f 418/474/439 572/743/507 477/548/498
f 572/743/507 484/747/506 477/548/498
f 487/563/511 477/548/498 484/747/506
f 461/564/482 459/561/480 486/560/510
f 460/562/481 462/565/483 486/560/510
f 488/566/504 449/518/470 457/528/472 490/576/512
f 463/567/484 461/564/482 486/560/510
f 462/565/483 464/568/485 486/560/510
f 465/569/486 463/567/484 486/560/510
f 464/568/485 466/570/487 486/560/510
f 467/571/488 465/569/486 486/560/510
f 466/570/487 468/572/489 486/560/510
f 489/573/513 452/522/473 451/520/471 485/618/509
f 469/574/490 467/571/488 486/560/510
f 468/572/489 470/575/491 486/560/510
f 490/576/512 457/528/472 453/523/475 497/589/514
f 471/577/492 469/574/490 486/560/510
f 470/575/491 472/578/493 486/560/510
f 473/579/494 471/577/492 486/560/510
f 472/578/493 474/580/495 486/560/510
f 475/581/496 473/579/494 486/560/510
f 474/580/495 476/582/497 486/560/510
f 476/582/497 475/581/496 486/560/510
f 491/583/515 454/524/474 452/522/473 489/573/513
f 494/586/516 492/584/517 493/585/518 495/587/519
f 496/588/520 494/586/516 495/587/519 499/606/521
f 497/589/514 453/523/475 455/525/477 501/594/522
f 498/590/523 456/526/476 454/524/474 491/583/515
f 500/593/508 496/591/520 499/592/521 502/595/524
f 501/594/522 455/525/477 456/526/476 498/590/523
f 483/555/505 500/593/508 502/595/524 511/604/525
f 503/596/526 504/597/527 515/609/528 574/728/529
f 506/599/530 507/600/531 531/639/532 575/730/533
f 510/603/534 508/601/535 509/602/536 516/610/537
f 512/605/538 483/555/505 511/604/525 523/619/539
f 513/607/540 514/608/541 521/616/542 577/733/543
f 516/610/537 509/602/536 515/609/528 520/615/544
f 517/611/545 518/612/546 507/600/531 506/599/530
f 513/613/540 519/614/547 518/612/546 517/611/545
f 520/615/544 515/609/528 504/597/527 522/617/548
f 522/617/548 504/597/527 521/616/542 524/620/549
f 524/620/549 521/616/542 514/608/541 527/630/550
f 495/621/519 493/622/518 525/623/551
f 499/624/521 495/621/519 525/623/551
f 493/622/518 526/625/552 525/623/551
f 502/626/524 499/624/521 525/623/551
f 526/625/552 510/627/534 525/623/551
f 511/628/525 502/626/524 525/623/551
f 510/627/534 516/629/537 525/623/551
f 523/631/539 511/628/525 525/623/551
f 516/629/537 520/632/544 525/623/551
f 528/633/553 523/631/539 525/623/551
f 520/632/544 522/634/548 525/623/551
f 529/635/554 528/633/553 525/623/551
f 522/634/548 524/636/549 525/623/551
f 527/637/550 529/635/554 525/623/551
f 524/636/549 527/637/550 525/623/551
f 531/639/532 507/600/531 530/638/555 532/640/556
f 107/132/123 102/126/122 127/153/142 139/166/160
f 487/563/511 531/639/532 532/640/556 534/642/557
f 507/600/531 518/612/546 533/641/558 530/638/555
f 477/548/498 487/563/511 534/642/557 536/644/559
f 446/515/469 107/132/123 139/166/160 141/168/159
f 518/612/546 519/614/547 535/643/560 533/641/558
f 478/549/499 477/548/498 536/644/559 538/646/561
f 535/643/560 519/614/547 537/645/562 539/647/563
f 480/552/500 478/549/499 538/646/561 540/648/564
f 111/136/127 446/515/469 141/168/159 129/155/145
f 539/647/563 537/645/562 482/554/503 541/649/565
f 505/598/501 480/552/500 540/648/564 542/650/566
f 541/649/565 482/554/503 488/566/504 543/651/567
f 481/553/502 505/598/501 542/650/566 544/652/568
f 543/651/567 488/566/504 490/576/512 545/653/569
f 485/557/509 481/553/502 544/652/568 551/659/570
f 545/653/569 490/576/512 497/589/514 547/655/571
f 546/654/572 489/573/513 485/618/509 551/660/570
f 547/655/571 497/589/514 501/594/522 549/657/573
f 548/656/574 491/583/515 489/573/513 546/654/572
f 549/657/573 501/594/522 498/590/523 550/658/575
f 550/658/575 498/590/523 491/583/515 548/656/574
f 109/134/130 115/140/131 125/151/147 137/163/151
f 530/661/555 533/662/558 552/663/576
f 532/664/556 530/661/555 552/663/576
f 533/662/558 535/665/560 552/663/576
f 534/666/557 532/664/556 552/663/576
f 535/665/560 539/667/563 552/663/576
f 536/668/559 534/666/557 552/663/576
f 539/667/563 541/669/565 552/663/576
f 538/670/561 536/668/559 552/663/576
f 541/669/565 543/671/567 552/663/576
f 540/672/564 538/670/561 552/663/576
f 543/671/567 545/673/569 552/663/576
f 542/674/566 540/672/564 552/663/576
f 545/673/569 547/675/571 552/663/576
f 544/676/568 542/674/566 552/663/576
f 547/675/571 549/677/573 552/663/576
f 551/678/570 544/676/568 552/663/576
f 549/677/573 550/679/575 552/663/576
f 546/680/572 551/678/570 552/663/576
f 550/679/575 548/681/574 552/663/576
f 548/681/574 546/680/572 552/663/576
f 139/166/160 127/153/142 147/174/164 140/167/161
f 129/155/145 141/168/159 148/175/162 178/208/201
f 123/149/144 129/155/145 178/208/201 159/186/168
f 137/163/151 125/151/147 145/172/167 165/192/187
f 138/164/157 162/189/191 160/187/179 135/161/155
f 149/682/171 206/239/228 553/683/577 153/684/174
f 153/684/174 553/683/577 554/685/578 166/686/175
f 160/687/179 555/688/579 204/237/229 151/689/178
f 152/690/180 200/233/225 556/691/580 155/692/188
f 155/692/188 556/691/580 557/693/581 163/694/189
f 162/695/191 558/696/582 555/688/579 160/687/179
f 161/697/183 201/234/226 200/233/225 152/690/180
f 163/694/189 557/693/581 559/698/583 158/699/190
f 158/699/190 559/698/583 558/696/582 162/695/191
f 168/700/185 560/701/584 201/234/226 161/697/183
f 166/686/175 554/685/578 561/702/585 167/703/176
f 171/704/184 562/705/586 560/701/584 168/700/185
f 167/703/176 561/702/585 196/229/221 172/706/208
f 175/207/196 177/206/199 562/707/586 171/708/184
f 172/706/208 196/229/221 181/211/203 180/210/202
f 147/174/164 142/169/163 199/232/206 170/198/194
f 562/707/586 177/206/199 192/224/214 563/709/587
f 182/212/204 211/244/220 210/243/216 188/225/212
f 560/701/584 562/705/586 563/710/587 263/303/288
f 201/234/226 560/701/584 263/303/288 214/247/227
f 196/229/221 561/702/585 564/711/588 197/230/222
f 556/691/580 200/233/225 202/235/224 273/315/299
f 561/702/585 554/685/578 565/712/589 564/711/588
f 557/693/581 556/691/580 273/315/299 278/320/304
f 554/685/578 553/683/577 281/323/310 565/712/589
f 559/698/583 557/693/581 278/320/304 566/713/590
f 553/683/577 206/239/228 221/257/231 281/323/310
f 558/696/582 559/698/583 566/713/590 288/331/316
f 555/688/579 558/696/582 288/331/316 286/329/314
f 204/237/229 555/688/579 286/329/314 205/238/230
f 154/181/186 165/192/187 194/227/217 227/343/234
f 169/250/192 215/249/238 225/261/251 179/714/200
f 179/714/200 225/261/251 232/268/255 203/715/207
f 231/267/242 230/266/253 222/258/246 216/254/240
f 203/715/207 232/268/255 244/280/268 235/716/257
f 222/258/246 230/266/253 237/273/270 224/260/249
f 235/717/257 244/718/268 254/293/279 239/292/261
f 254/293/279 244/718/268 245/311/267 271/313/295
f 192/224/214 193/226/215 306/354/285 345/395/369
f 563/709/587 192/224/214 345/395/369 349/399/373
f 210/243/216 211/244/220 347/397/370 259/299/284
f 263/303/288 563/710/587 349/402/373 264/304/289
f 211/244/220 195/228/219 265/305/291 347/397/370
f 197/230/222 564/711/588 360/411/383 311/359/292
f 564/711/588 565/712/589 364/415/387 360/411/383
f 565/712/589 281/323/310 282/324/309 364/415/387
f 566/713/590 278/320/304 312/360/305 373/424/396
f 288/331/316 566/713/590 373/424/396 314/362/317
f 417/473/437 420/478/438 567/719/591 570/722/592
f 420/478/438 422/489/441 568/720/593 567/719/591
f 422/489/441 423/492/443 569/721/594 568/720/593
f 569/721/594 423/492/443 442/511/445 573/744/595
f 496/588/520 571/723/596 570/745/592 494/586/516
f 567/724/591 492/584/517 494/586/516 570/745/592
f 500/593/508 572/725/507 571/726/596 496/591/520
f 573/727/595 509/602/536 508/601/535 569/746/594
f 574/728/529 515/609/528 509/602/536 573/727/595
f 512/605/538 575/729/533 484/556/506 483/555/505
f 575/730/533 531/639/532 487/563/511 484/747/506
f 492/584/517 576/731/597 526/732/552 493/585/518
f 576/731/597 508/601/535 510/603/534 526/732/552
f 503/596/526 578/734/598 504/597/527
f 578/734/598 577/733/543 504/597/527
f 577/733/543 521/616/542 504/597/527
f 578/735/598 537/645/562 577/736/543
f 537/645/562 519/614/547 577/736/543
f 577/736/543 519/614/547 513/613/540
f 579/737/599 512/605/538 523/619/539 528/738/553
f 580/739/600 579/737/599 528/738/553 529/740/554
f 514/608/541 580/739/600 529/740/554 527/630/550
f 149/682/171 157/741/170 206/239/228
f 204/237/229 206/239/228 151/689/178
f 151/689/178 206/239/228 157/741/170
f 572/743/507 416/472/436 571/742/596
f 571/742/596 416/472/436 570/722/592
f 416/472/436 417/473/437 570/722/592
f 442/511/445 447/516/465 573/744/595
f 537/645/562 578/735/598 482/554/503
f 578/735/598 503/751/526 482/554/503
f 573/744/595 447/516/465 574/752/529
f 447/516/465 482/554/503 574/752/529
f 482/554/503 503/751/526 574/752/529
f 159/186/168 203/236/207 145/172/167
f 234/270/601 212/245/218 235/271/257
f 212/245/218 145/172/167 235/271/257
f 145/172/167 203/236/207 235/271/257
f 568/748/593 576/731/597 492/584/517 567/724/591
f 569/746/594 508/601/535 576/731/597 568/748/593
f 575/729/533 512/605/538 579/737/599 506/749/530
f 506/749/530 579/737/599 580/739/600 517/750/545
f 517/750/545 580/739/600 514/608/541 513/607/540
