# This file uses centimeters as units for non-parametric coordinates.

mtllib MachineBase_0.mtl
g default
v 0.354350 -1.489747 -0.146776
v 0.271208 -1.489747 -0.271207
v 0.146777 -1.489747 -0.354350
v 0.000000 -1.489747 -0.383545
v -0.146776 -1.489747 -0.354350
v -0.271207 -1.489747 -0.271208
v -0.354350 -1.489747 -0.146777
v -0.383545 -1.489747 -0.000000
v -0.354350 -1.489747 0.146776
v -0.271208 -1.489747 0.271207
v -0.146777 -1.489747 0.354350
v -0.000000 -1.489747 0.383545
v 0.146776 -1.489747 0.354350
v 0.271208 -1.489747 0.271208
v 0.354350 -1.489747 0.146776
v 0.383545 -1.489747 0.000000
v 1.986003 -2.511743 -1.985516
v 1.075004 -2.511743 -2.594388
v 0.000345 -2.511743 -2.808287
v -1.074367 -2.511743 -2.594651
v -1.985516 -2.511743 -1.986003
v -2.594388 -2.511743 -1.075004
v -2.808288 -2.511743 -0.000344
v -2.594652 -2.511743 1.074367
v -1.986002 -2.511743 1.985516
v -1.075003 -2.511743 2.594388
v -0.000344 -2.511743 2.808288
v 1.074368 -2.511743 2.594651
v 1.985516 -2.511743 1.986003
v 2.594388 -2.511743 1.075003
v 2.808288 -2.511743 0.000343
v 2.594651 -2.511743 -1.074368
v 1.986003 -2.071743 -1.985516
v 1.075004 -2.071743 -2.594388
v 0.000345 -2.071743 -2.808288
v -1.074367 -2.071743 -2.594651
v -1.985516 -2.071743 -1.986003
v -2.594388 -2.071743 -1.075004
v -2.808288 -2.071743 -0.000344
v -2.594652 -2.071743 1.074367
v -1.986002 -2.071743 1.985516
v -1.075003 -2.071743 2.594388
v -0.000346 -2.071743 2.808288
v 1.074370 -2.071743 2.594653
v 1.985515 -2.071743 1.986001
v 2.594388 -2.071743 1.075005
v 2.808289 -2.071743 0.000341
v 2.594649 -2.071743 -1.074367
v 0.741272 -2.071743 -0.741088
v 0.433341 -2.071743 -1.045817
v 0.000128 -2.071743 -1.048186
v -0.433085 -2.071743 -1.045924
v -0.741089 -2.071743 -0.741270
v -1.045817 -2.071743 -0.433342
v -1.048187 -2.071743 -0.000128
v -1.045925 -2.071743 0.433087
v -0.741270 -2.071743 0.741091
v -0.433341 -2.071743 1.045819
v -0.000128 -2.071743 1.048190
v 0.433086 -2.071743 1.045925
v 0.741090 -2.071743 0.741274
v 1.045818 -2.071743 0.433343
v 1.048188 -2.071743 0.000129
v 1.045925 -2.071743 -0.433086
v 2.701470 -2.071743 -0.537013
v 2.701339 -2.071743 0.537673
v 0.537012 -2.071743 2.701470
v -0.537675 -2.071743 2.701338
v -2.701463 -2.071743 0.537048
v -2.701470 -2.511743 0.537012
v -2.701337 -2.071743 -0.537674
v 0.537675 -2.071743 -2.701338
v -0.537011 -2.071743 -2.701470
v 0.548245 -1.863351 -0.548108
v 0.320499 -1.863351 -0.773486
v 0.000095 -1.863351 -0.775238
v -0.320309 -1.863351 -0.773565
v -0.548109 -1.863351 -0.548243
v -0.773486 -1.863351 -0.320499
v -0.775239 -1.863351 -0.000094
v -0.773566 -1.863351 0.320311
v -0.548244 -1.863351 0.548111
v -0.320499 -1.863351 0.773488
v -0.000095 -1.863351 0.775242
v 0.320311 -1.863351 0.773566
v 0.548110 -1.863351 0.548246
v 0.773487 -1.863351 0.320501
v 0.775240 -1.863351 0.000096
v 0.773566 -1.863351 -0.320310
v 0.450428 -1.863351 -0.450315
v 0.263317 -1.863351 -0.635481
v 0.000078 -1.863351 -0.636921
v -0.263160 -1.863351 -0.635546
v -0.450316 -1.863351 -0.450426
v -0.635482 -1.863351 -0.263316
v -0.636922 -1.863351 -0.000077
v -0.635547 -1.863351 0.263162
v -0.450426 -1.863351 0.450318
v -0.263315 -1.863351 0.635484
v -0.000078 -1.863351 0.636925
v 0.263161 -1.863351 0.635548
v 0.450317 -1.863351 0.450429
v 0.635483 -1.863351 0.263318
v 0.636923 -1.863351 0.000079
v 0.635548 -1.863351 -0.263160
v 0.450428 -1.496048 -0.450315
v 0.263317 -1.496048 -0.635481
v 0.000078 -1.496048 -0.636921
v -0.263160 -1.496048 -0.635546
v -0.450316 -1.496048 -0.450426
v -0.635482 -1.496048 -0.263316
v -0.636922 -1.496048 -0.000077
v -0.635547 -1.496048 0.263162
v -0.450426 -1.496048 0.450318
v -0.263315 -1.496048 0.635484
v -0.000078 -1.496048 0.636925
v 0.263161 -1.496048 0.635548
v 0.450317 -1.496048 0.450429
v 0.635483 -1.496048 0.263318
v 0.636923 -1.496048 0.000079
v 0.635548 -1.496048 -0.263160
v 0.361581 -1.633590 -0.149772
v 0.276743 -1.633590 -0.276742
v 0.149772 -1.633590 -0.361581
v 0.000000 -1.633590 -0.391373
v -0.149772 -1.633590 -0.361581
v -0.276742 -1.633590 -0.276742
v -0.361581 -1.634084 -0.149772
v -0.391373 -1.634084 -0.000000
v -0.361581 -1.634084 0.149772
v -0.276742 -1.633590 0.276742
v -0.149772 -1.633590 0.361581
v -0.000000 -1.633590 0.391373
v 0.149772 -1.633590 0.361581
v 0.276742 -1.633590 0.276742
v 0.361581 -1.633590 0.149772
v 0.391373 -1.633590 0.000000
v 0.537675 -1.710096 -2.701338
v 0.000345 -1.573648 -2.808288
v -0.537011 -1.710096 -2.701470
v -2.701337 -1.710096 -0.537674
v -2.808288 -1.573648 -0.000344
v -2.701463 -1.710096 0.537048
v -0.537675 -1.710096 2.701338
v -0.000346 -1.573648 2.808288
v 0.537012 -1.710096 2.701470
v 2.701339 -1.710096 0.537673
v 2.808289 -1.573648 0.000341
v 2.701470 -1.710096 -0.537013
v 0.603008 -2.064364 -3.029580
v 0.000386 -2.064364 -3.149526
v 0.000394 -1.575012 -3.210603
v 0.614702 -1.708732 -3.088332
v -0.602264 -2.064364 -3.029728
v -0.613943 -1.708732 -3.088483
v -3.029580 -2.064364 -0.603007
v -3.149527 -2.064364 -0.000386
v -3.210604 -1.575012 -0.000394
v -3.088331 -1.708732 -0.614701
v -3.029721 -2.064364 0.602305
v -3.088475 -1.708732 0.613986
v -0.603008 -2.064364 3.029580
v -0.000388 -2.064364 3.149526
v -0.000396 -1.575012 3.210603
v -0.614702 -1.708732 3.088332
v 0.602265 -2.064364 3.029729
v 0.613944 -1.708732 3.088483
v 3.029581 -2.064364 0.603007
v 3.149528 -2.064364 0.000382
v 3.210605 -1.575012 0.000390
v 3.088333 -1.708732 0.614701
v 3.029728 -2.064364 -0.602266
v 3.088482 -1.708732 -0.613945
v 0.731440 -2.576677 -3.674839
v 0.000450 -2.576677 -3.669548
v -0.730538 -2.576677 -3.675019
v -3.674839 -2.576677 -0.731439
v -3.669548 -2.576677 -0.000450
v -3.675009 -2.576677 0.730588
v -0.731441 -2.576677 3.674839
v -0.000452 -2.576677 3.669548
v 0.730539 -2.576677 3.675020
v 3.674840 -2.576677 0.731439
v 3.669550 -2.576677 0.000446
v 3.675018 -2.576677 -0.730540
v -0.820579 -2.187208 -4.127978
v 0.000506 -2.188040 -4.126155
v 0.821593 -2.187208 -4.127777
v -4.127968 -2.187208 0.820636
v -4.126156 -2.188040 -0.000506
v -4.127776 -2.187208 -0.821592
v 0.820580 -2.187208 4.127979
v -0.000509 -2.188040 4.126155
v -0.821594 -2.187208 4.127777
v 4.127977 -2.187208 -0.820582
v 4.126158 -2.188040 0.000501
v 4.127777 -2.187208 0.821591
v 0.000516 -2.457992 -4.206995
v 0.834236 -2.457992 -4.191298
v 0.838703 -2.584615 -4.213742
v 0.000519 -2.584615 -4.229523
v -0.833207 -2.457992 -4.191502
v -0.837669 -2.584615 -4.213948
v -4.206995 -2.457992 -0.000516
v -4.191297 -2.457992 -0.834235
v -4.213741 -2.584615 -0.838702
v -4.229524 -2.584615 -0.000518
v -4.191492 -2.457992 0.833264
v -4.213937 -2.584615 0.837726
v -0.000519 -2.457992 4.206995
v -0.834237 -2.457992 4.191298
v -0.838704 -2.584615 4.213742
v -0.000521 -2.584615 4.229523
v 0.833208 -2.457992 4.191503
v 0.837670 -2.584615 4.213949
v 4.206997 -2.457992 0.000511
v 4.191298 -2.457992 0.834234
v 4.213743 -2.584615 0.838702
v 4.229526 -2.584615 0.000514
v 4.191501 -2.457992 -0.833209
v 4.213946 -2.584615 -0.837671
v -0.659986 -1.761630 -3.320105
v 0.000423 -1.766735 -3.450872
v 0.660802 -1.761630 -3.319943
v -3.320097 -1.761630 0.660032
v -3.450873 -1.766735 -0.000423
v -3.319943 -1.761630 -0.660801
v 0.659987 -1.761630 3.320106
v -0.000425 -1.766735 3.450872
v -0.660802 -1.761630 3.319943
v 3.320105 -1.761630 -0.659988
v 3.450875 -1.766735 0.000419
v 3.319944 -1.761630 0.660800
v 0.637752 -1.871408 -3.204137
v 0.000409 -1.737007 -3.330994
v -0.636965 -1.871408 -3.204294
v -3.204137 -1.871408 -0.637751
v -3.330995 -1.737007 -0.000408
v -3.204286 -1.871408 0.637009
v -0.637752 -1.871408 3.204137
v -0.000410 -1.737007 3.330994
v 0.636966 -1.871408 3.204295
v 3.204138 -1.871408 0.637750
v 3.330996 -1.737007 0.000404
v 3.204293 -1.871408 -0.636967
vt 0.780020 0.268820
vt 0.736048 0.260077
vt 0.735846 0.260279
vt 0.779817 0.269022
vt 0.698565 0.235375
vt 0.717206 0.247827
vt 0.698768 0.235172
vt 0.686108 0.216737
vt 0.673854 0.197898
vt 0.673651 0.198100
vt 0.665099 0.153929
vt 0.664896 0.154131
vt 0.673836 0.109959
vt 0.673634 0.110161
vt 0.698534 0.072884
vt 0.686084 0.091522
vt 0.698736 0.072681
vt 0.717170 0.060428
vt 0.717372 0.060227
vt 0.736007 0.047772
vt 0.735805 0.047975
vt 0.779975 0.039024
vt 0.779773 0.039226
vt 0.823946 0.047767
vt 0.823744 0.047969
vt 0.861024 0.072874
vt 0.842384 0.060421
vt 0.861227 0.072671
vt 0.885939 0.110148
vt 0.873482 0.091511
vt 0.886141 0.109946
vt 0.894896 0.153915
vt 0.894693 0.154117
vt 0.886158 0.197885
vt 0.885956 0.198087
vt 0.861056 0.235365
vt 0.873506 0.216726
vt 0.861258 0.235162
vt 0.823785 0.260273
vt 0.842420 0.247819
vt 0.823987 0.260071
vt 0.762079 0.196916
vt 0.916878 0.384036
vt 0.317144 0.473126
vt 0.311128 0.476934
vt 0.311051 0.474036
vt 0.863358 0.352573
vt 0.863235 0.330407
vt 0.737001 0.136402
vt 0.301777 0.412270
vt 0.307419 0.407401
vt 0.307741 0.411460
vt 0.894691 0.276891
vt 0.916857 0.276771
vt 0.797511 0.111332
vt 0.360796 0.466838
vt 0.365993 0.462480
vt 0.366586 0.465149
vt 0.970378 0.308234
vt 0.970500 0.330400
vt 0.822589 0.171846
vt 0.354782 0.407338
vt 0.360487 0.402334
vt 0.360833 0.406509
vt 0.939044 0.383917
vt 0.367445 0.405876
vt 0.366870 0.407412
vt 0.371954 0.465095
vt 0.370397 0.465178
vt 0.314162 0.410895
vt 0.313711 0.412257
vt 0.304346 0.473434
vt 0.304841 0.472935
vt 0.897606 0.376635
vt 0.916669 0.376736
vt 0.878951 0.368330
vt 0.884052 0.363228
vt 0.870641 0.349677
vt 0.870536 0.330614
vt 0.870634 0.311551
vt 0.878936 0.292482
vt 0.884039 0.297999
vt 0.897588 0.284590
vt 0.916651 0.284487
vt 0.935714 0.284588
vt 0.954784 0.292477
vt 0.949268 0.297994
vt 0.962678 0.311545
vt 0.962784 0.330608
vt 0.962686 0.349671
vt 0.954799 0.368325
vt 0.949281 0.363224
vt 0.935732 0.376632
vt 0.768864 0.180292
vt 0.779634 0.180349
vt 0.761206 0.172718
vt 0.753629 0.165062
vt 0.753570 0.154292
vt 0.753625 0.143522
vt 0.761199 0.135865
vt 0.768854 0.128289
vt 0.779624 0.128231
vt 0.790394 0.128288
vt 0.798052 0.135862
vt 0.805628 0.143518
vt 0.805688 0.154288
vt 0.805632 0.165059
vt 0.798059 0.172716
vt 0.790404 0.180291
vt 0.772991 0.170026
vt 0.779422 0.170060
vt 0.768418 0.165503
vt 0.763894 0.160932
vt 0.763859 0.154501
vt 0.763892 0.148070
vt 0.768414 0.143498
vt 0.772985 0.138975
vt 0.779416 0.138940
vt 0.785847 0.138974
vt 0.790419 0.143497
vt 0.794943 0.148068
vt 0.794979 0.154499
vt 0.794946 0.160930
vt 0.790423 0.165502
vt 0.785853 0.170025
vt 0.779433 0.159745
vt 0.781445 0.159345
vt 0.783151 0.158205
vt 0.784291 0.156499
vt 0.784692 0.154487
vt 0.784291 0.152474
vt 0.783151 0.150768
vt 0.781445 0.149628
vt 0.779432 0.149227
vt 0.777419 0.149627
vt 0.775713 0.150767
vt 0.774573 0.152473
vt 0.774173 0.154486
vt 0.774574 0.156499
vt 0.775714 0.158205
vt 0.777420 0.159345
vt 0.779453 0.163454
vt 0.782892 0.162770
vt 0.776013 0.162770
vt 0.773097 0.160821
vt 0.771149 0.157905
vt 0.770465 0.154466
vt 0.771149 0.151027
vt 0.773097 0.148111
vt 0.776012 0.146163
vt 0.779451 0.145479
vt 0.782891 0.146163
vt 0.785807 0.148112
vt 0.787755 0.151028
vt 0.788440 0.154467
vt 0.787756 0.157906
vt 0.785808 0.160822
vt 0.313693 0.468613
vt 0.305740 0.469134
vt 0.303595 0.416648
vt 0.362408 0.469758
vt 0.369525 0.469141
vt 0.356951 0.411697
vt 0.366431 0.411067
vt 0.308202 0.468172
vt 0.309416 0.465521
vt 0.317046 0.468748
vt 0.317661 0.474440
vt 0.311589 0.479314
vt 0.303374 0.469626
vt 0.304586 0.474624
vt 0.309482 0.417186
vt 0.308458 0.419694
vt 0.300503 0.416379
vt 0.300341 0.410356
vt 0.307187 0.405210
vt 0.315178 0.415908
vt 0.314662 0.409718
vt 0.359980 0.469603
vt 0.365046 0.470390
vt 0.366257 0.472845
vt 0.360840 0.465570
vt 0.365951 0.459993
vt 0.372575 0.468425
vt 0.371839 0.463843
vt 0.353752 0.411591
vt 0.363026 0.412096
vt 0.362086 0.414713
vt 0.353352 0.405499
vt 0.360161 0.400043
vt 0.368909 0.410541
vt 0.368032 0.404397
vt 0.330622 0.462321
vt 0.308824 0.457022
vt 0.326867 0.605953
vt 0.325731 0.654543
vt 0.318226 0.654737
vt 0.319346 0.605756
vt 0.331922 0.481951
vt 0.320649 0.476096
vt 0.288799 0.465143
vt 0.301666 0.477275
vt 0.344519 0.558322
vt 0.328285 0.557372
vt 0.320800 0.556783
vt 0.308744 0.428072
vt 0.289216 0.422178
vt 0.369497 0.604050
vt 0.369318 0.556798
vt 0.376607 0.556411
vt 0.376812 0.604044
vt 0.287571 0.403015
vt 0.297789 0.408696
vt 0.327238 0.420368
vt 0.317006 0.407806
vt 0.353600 0.650811
vt 0.369402 0.651305
vt 0.376692 0.651680
vt 0.366976 0.481426
vt 0.344414 0.476807
vt 0.403461 0.601757
vt 0.401695 0.556911
vt 0.408601 0.556297
vt 0.410404 0.601504
vt 0.344812 0.456267
vt 0.356962 0.463001
vt 0.388978 0.472937
vt 0.375080 0.461263
vt 0.389950 0.646676
vt 0.404966 0.646612
vt 0.411898 0.646721
vt 0.362691 0.423371
vt 0.342132 0.417880
vt 0.296253 0.608559
vt 0.295840 0.653433
vt 0.288913 0.653710
vt 0.289306 0.608474
vt 0.339842 0.398314
vt 0.350665 0.403868
vt 0.381627 0.414952
vt 0.370438 0.402313
vt 0.311927 0.564353
vt 0.296927 0.563688
vt 0.290009 0.563243
vt 0.311818 0.482314
vt 0.313078 0.496784
vt 0.307034 0.402511
vt 0.306274 0.389153
vt 0.365698 0.456774
vt 0.364580 0.441493
vt 0.359940 0.397235
vt 0.358722 0.383422
vt 0.325868 0.686062
vt 0.330077 0.525903
vt 0.368352 0.526170
vt 0.368492 0.681936
vt 0.399745 0.527870
vt 0.405136 0.675718
vt 0.296378 0.682530
vt 0.298170 0.534612
vt 0.302729 0.474527
vt 0.311822 0.480957
vt 0.318964 0.473429
vt 0.316109 0.410660
vt 0.307058 0.403693
vt 0.298994 0.411430
vt 0.373617 0.463975
vt 0.365879 0.458265
vt 0.358673 0.465360
vt 0.369614 0.405209
vt 0.359967 0.398472
vt 0.352024 0.406631
vt 0.930135 0.363128
vt 0.916666 0.363201
vt 0.939709 0.353654
vt 0.949180 0.344078
vt 0.949249 0.330609
vt 0.949175 0.317140
vt 0.939700 0.307566
vt 0.930123 0.298093
vt 0.916654 0.298022
vt 0.903184 0.298095
vt 0.893611 0.307568
vt 0.884140 0.317144
vt 0.884070 0.330613
vt 0.884145 0.344083
vt 0.893620 0.353657
vt 0.903197 0.363130
vt 0.797528 0.196914
vt 0.779803 0.197010
vt 0.822680 0.154121
vt 0.970386 0.352567
vt 0.822582 0.136397
vt 0.779787 0.111238
vt 0.939024 0.276888
vt 0.762062 0.111334
vt 0.736909 0.154127
vt 0.863349 0.308241
vt 0.737008 0.171851
vt 0.894712 0.383919
vt 0.311443 0.608743
vt 0.310852 0.653131
vt 0.380089 0.394814
vt 0.343314 0.606386
vt 0.341993 0.654446
vt 0.291589 0.485375
vt 0.353501 0.604065
vt 0.353516 0.557321
vt 0.326496 0.400873
vt 0.388278 0.602310
vt 0.386714 0.557941
vt 0.386098 0.453171
vt 0.366431 0.411067
vt 0.354155 0.406526
vt 0.356951 0.411697
vt 0.369525 0.469141
vt 0.360714 0.466760
vt 0.362408 0.469758
vt 0.312779 0.416281
vt 0.312779 0.416281
vt 0.301102 0.411394
vt 0.303595 0.416648
vt 0.305740 0.469134
vt 0.317285 0.473258
vt 0.313693 0.468613
vt 0.184090 0.552686
vt 0.135374 0.552686
vt 0.136368 0.508470
vt 0.184274 0.500556
vt 0.061053 0.431972
vt 0.109769 0.431972
vt 0.109953 0.484105
vt 0.062047 0.476190
vt 0.106392 0.622392
vt 0.057677 0.622392
vt 0.058671 0.578176
vt 0.106576 0.570262
vt 0.200789 0.434223
vt 0.249505 0.434223
vt 0.249688 0.486356
vt 0.201783 0.478441
vt 0.059706 0.500556
vt 0.108421 0.500556
vt 0.107427 0.544772
vt 0.059522 0.552686
vt 0.138254 0.431972
vt 0.186969 0.431972
vt 0.187153 0.484105
vt 0.139248 0.476190
vt 0.180216 0.622393
vt 0.131501 0.622393
vt 0.132495 0.578176
vt 0.180400 0.570262
vt 0.248872 0.552688
vt 0.200156 0.552688
vt 0.199972 0.500556
vt 0.247878 0.508470
vn 0.707194 0.000001 -0.707020
vn 0.408883 -0.000000 -0.912587
vn 0.408883 -0.000000 -0.912587
vn 0.707194 0.000001 -0.707020
vn 0.000123 -0.000001 -1.000000
vn 0.165935 -0.000000 -0.986137
vn 0.000122 -0.000000 -1.000000
vn -0.165694 -0.000000 -0.986177
vn -0.408659 -0.000000 -0.912687
vn -0.408659 -0.000000 -0.912687
vn -0.707020 0.000000 -0.707194
vn -0.707020 0.000000 -0.707194
vn -0.912587 0.000000 -0.408883
vn -0.912587 0.000000 -0.408883
vn -0.997817 0.000000 0.066039
vn -0.980762 0.000001 -0.195210
vn -0.999975 0.000001 0.007014
vn -0.980809 0.000000 0.194970
vn -0.980809 0.000000 0.194970
vn -0.896590 0.000000 0.442861
vn -0.896590 0.000000 0.442861
vn -0.707193 0.000000 0.707020
vn -0.707193 0.000000 0.707020
vn -0.408883 -0.000000 0.912587
vn -0.408883 -0.000000 0.912587
vn 0.098846 0.000001 0.995103
vn -0.195211 -0.000000 0.980761
vn 0.046409 0.000000 0.998923
vn 0.489367 -0.000001 0.872078
vn 0.194970 0.000000 0.980809
vn 0.448441 -0.000000 0.893812
vn 0.707020 0.000001 0.707193
vn 0.707021 0.000001 0.707193
vn 0.912587 0.000000 0.408883
vn 0.912586 0.000000 0.408884
vn 0.995103 -0.000002 -0.098847
vn 0.980761 -0.000000 0.195210
vn 0.998923 -0.000001 -0.046409
vn 0.872079 0.000003 -0.489365
vn 0.980809 -0.000001 -0.194972
vn 0.893813 0.000002 -0.448440
vn 0.000000 1.000000 0.000000
vn 0.000000 1.000000 0.000000
vn 0.000000 1.000000 0.000000
vn 0.000000 1.000000 0.000000
vn 0.135259 0.984935 0.107743
vn 0.131499 0.970427 0.202432
vn -0.000023 0.982045 0.188649
vn -0.000017 0.989846 0.142145
vn 0.000000 1.000000 0.000000
vn 0.000000 1.000000 0.000000
vn 0.000000 1.000000 0.000000
vn 0.000000 1.000000 -0.000000
vn 0.000000 1.000000 -0.000000
vn 0.000000 1.000000 -0.000000
vn 0.000000 1.000000 -0.000000
vn 0.000000 1.000000 0.000000
vn 0.000000 1.000000 0.000000
vn 0.000000 1.000000 0.000000
vn 0.000000 1.000000 0.000000
vn 0.107743 0.984935 -0.135259
vn 0.202432 0.970427 -0.131498
vn 0.188649 0.982045 0.000023
vn 0.142147 0.989846 0.000016
vn 0.000000 1.000000 0.000000
vn 0.000000 1.000000 0.000000
vn 0.000000 1.000000 0.000000
vn 0.000000 1.000000 -0.000000
vn 0.000000 1.000000 -0.000000
vn 0.000000 1.000000 -0.000000
vn 0.000000 1.000000 -0.000000
vn 0.000000 1.000000 0.000000
vn 0.000000 1.000000 0.000000
vn 0.000000 1.000000 0.000000
vn 0.000000 1.000000 0.000000
vn -0.135259 0.984935 -0.107743
vn -0.131498 0.970427 -0.202433
vn 0.000023 0.982044 -0.188650
vn 0.000018 0.989846 -0.142146
vn 0.000000 1.000000 0.000000
vn 0.000000 1.000000 0.000000
vn 0.000000 1.000000 0.000000
vn 0.000000 1.000000 0.000000
vn 0.000000 1.000000 0.000000
vn 0.000000 1.000000 0.000000
vn 0.000000 1.000000 0.000000
vn 0.000000 1.000000 0.000000
vn 0.000000 1.000000 0.000000
vn 0.000000 1.000000 0.000000
vn 0.000000 1.000000 0.000000
vn -0.107742 0.984935 0.135259
vn -0.202432 0.970428 0.131498
vn -0.188649 0.982045 -0.000023
vn -0.142145 0.989846 -0.000017
vn 0.000000 1.000000 -0.000001
vn 0.000000 1.000000 -0.000001
vn 0.000000 1.000000 -0.000001
vn 0.000000 1.000000 0.000000
vn 0.000000 1.000000 0.000000
vn 0.000000 1.000000 0.000000
vn 0.000000 1.000000 0.000000
vn -0.202401 0.970427 -0.131548
vn -0.107710 0.984935 -0.135285
vn 0.000000 1.000000 0.000000
vn 0.000000 1.000000 0.000000
vn 0.000000 1.000000 0.000000
vn 0.131548 0.970428 -0.202400
vn 0.135285 0.984935 -0.107710
vn 0.000000 1.000000 0.000000
vn 0.000000 1.000000 0.000000
vn 0.000000 1.000000 0.000000
vn 0.202400 0.970428 0.131541
vn 0.107717 0.984935 0.135280
vn 0.000000 1.000000 -0.000001
vn 0.000000 1.000000 -0.000001
vn 0.000000 1.000000 -0.000001
vn 0.000000 1.000000 -0.000000
vn 0.000000 1.000000 -0.000000
vn 0.000000 1.000000 -0.000000
vn -0.131548 0.970427 0.202400
vn -0.135286 0.984935 0.107710
vn 0.429151 0.794825 -0.429048
vn 0.220971 0.816564 -0.533287
vn 0.429151 0.794825 -0.429048
vn 0.000075 0.794825 -0.606839
vn -0.220841 0.816564 -0.533341
vn -0.429047 0.794825 -0.429152
vn -0.429047 0.794825 -0.429152
vn -0.533287 0.816564 -0.220972
vn -0.606839 0.794825 -0.000076
vn -0.533341 0.816564 0.220841
vn -0.429152 0.794825 0.429048
vn -0.429152 0.794825 0.429048
vn -0.220973 0.816563 0.533287
vn -0.000074 0.794825 0.606838
vn 0.220841 0.816563 0.533342
vn 0.429047 0.794825 0.429152
vn 0.429047 0.794825 0.429152
vn 0.533288 0.816564 0.220971
vn 0.606839 0.794825 0.000075
vn 0.533341 0.816564 -0.220840
vn 0.000000 1.000000 0.000000
vn 0.000000 1.000000 0.000000
vn 0.000000 1.000000 0.000000
vn 0.000000 1.000000 0.000000
vn 0.000000 1.000000 0.000000
vn 0.000000 1.000000 0.000000
vn 0.000000 1.000000 0.000000
vn 0.000000 1.000000 0.000000
vn 0.000000 1.000000 0.000001
vn 0.000000 1.000000 0.000001
vn 0.000000 1.000000 0.000001
vn 0.000000 1.000000 0.000001
vn 0.000000 1.000000 -0.000000
vn 0.000000 1.000000 -0.000000
vn 0.000000 1.000000 -0.000000
vn 0.000000 1.000000 -0.000000
vn 0.000000 1.000000 0.000000
vn 0.000000 1.000000 0.000000
vn 0.000000 1.000000 0.000000
vn 0.000000 1.000000 0.000000
vn 0.000000 1.000000 0.000001
vn 0.000000 1.000000 0.000001
vn 0.000000 1.000000 0.000001
vn 0.000000 1.000000 0.000001
vn 0.000000 1.000000 0.000000
vn 0.000000 1.000000 0.000000
vn 0.000000 1.000000 0.000000
vn 0.000000 1.000000 0.000000
vn 0.000000 1.000000 0.000001
vn 0.000000 1.000000 0.000001
vn 0.000000 1.000000 0.000001
vn 0.000000 1.000000 0.000001
vn 0.000000 1.000000 0.000000
vn 0.000000 1.000000 0.000000
vn 0.000000 1.000000 0.000000
vn 0.000000 1.000000 0.000000
vn 0.000000 1.000000 -0.000000
vn 0.000000 1.000000 -0.000000
vn 0.000000 1.000000 -0.000000
vn 0.000000 1.000000 -0.000000
vn 0.000000 1.000000 -0.000000
vn 0.000000 1.000000 -0.000000
vn 0.000000 1.000000 -0.000000
vn 0.000000 1.000000 -0.000000
vn 0.000000 1.000000 -0.000000
vn 0.000000 1.000000 -0.000000
vn 0.000000 1.000000 -0.000000
vn 0.000000 1.000000 -0.000000
vn 0.000000 1.000000 0.000000
vn 0.000000 1.000000 0.000000
vn 0.000000 1.000000 0.000000
vn 0.000000 1.000000 0.000000
vn 0.000000 1.000000 0.000001
vn 0.000000 1.000000 0.000001
vn 0.000000 1.000000 0.000001
vn 0.000000 1.000000 0.000001
vn 0.000000 1.000000 0.000000
vn 0.000000 1.000000 0.000000
vn 0.000000 1.000000 0.000000
vn 0.000000 1.000000 0.000000
vn 0.000000 1.000000 0.000000
vn 0.000000 1.000000 0.000000
vn 0.000000 1.000000 0.000000
vn 0.000000 1.000000 0.000000
vn 0.707192 0.000000 -0.707022
vn 0.382796 0.000000 -0.923833
vn 0.382796 0.000000 -0.923833
vn 0.707192 0.000000 -0.707022
vn 0.000123 0.000000 -1.000000
vn 0.000123 0.000000 -1.000000
vn -0.382571 0.000000 -0.923926
vn -0.382571 0.000000 -0.923926
vn -0.707020 0.000000 -0.707193
vn -0.707020 0.000000 -0.707193
vn -0.923832 0.000000 -0.382797
vn -0.923832 0.000000 -0.382797
vn -1.000000 0.000000 -0.000124
vn -1.000000 0.000000 -0.000124
vn -0.923926 0.000000 0.382570
vn -0.923926 0.000000 0.382570
vn -0.707192 0.000000 0.707021
vn -0.707192 0.000000 0.707021
vn -0.382799 0.000000 0.923832
vn -0.382799 0.000000 0.923832
vn -0.000123 0.000000 1.000000
vn -0.000123 0.000000 1.000000
vn 0.382571 0.000000 0.923926
vn 0.382571 0.000000 0.923926
vn 0.707020 0.000000 0.707193
vn 0.707020 0.000000 0.707193
vn 0.923833 0.000000 0.382796
vn 0.923833 0.000000 0.382796
vn 1.000000 0.000000 0.000124
vn 1.000000 0.000000 0.000124
vn 0.923927 0.000000 -0.382570
vn 0.923927 0.000000 -0.382570
vn 0.017624 0.999730 -0.015173
vn 0.017624 0.999730 -0.015173
vn 0.017624 0.999730 -0.015173
vn 0.017624 0.999730 -0.015173
vn 0.023190 0.999730 -0.001729
vn 0.023190 0.999730 -0.001729
vn 0.023190 0.999730 -0.001729
vn 0.023190 0.999730 -0.001729
vn 0.023191 0.999730 0.001733
vn 0.023191 0.999730 0.001733
vn 0.023191 0.999730 0.001733
vn 0.023191 0.999730 0.001733
vn 0.017620 0.999730 0.015175
vn 0.017620 0.999730 0.015175
vn 0.017620 0.999730 0.015175
vn 0.017620 0.999730 0.015175
vn 0.015173 0.999730 0.017624
vn 0.015173 0.999730 0.017624
vn 0.015173 0.999730 0.017624
vn 0.015173 0.999730 0.017624
vn 0.001729 0.999730 0.023189
vn 0.001729 0.999730 0.023189
vn 0.001729 0.999730 0.023189
vn 0.001729 0.999730 0.023189
vn -0.001733 0.999730 0.023191
vn -0.001733 0.999730 0.023191
vn -0.001733 0.999730 0.023191
vn -0.001733 0.999730 0.023191
vn -0.015175 0.999730 0.017621
vn -0.015175 0.999730 0.017621
vn -0.015175 0.999730 0.017621
vn -0.015175 0.999730 0.017621
vn -0.017624 0.999730 0.015174
vn -0.017624 0.999730 0.015174
vn -0.017624 0.999730 0.015174
vn -0.017624 0.999730 0.015174
vn -0.023190 0.999730 0.001729
vn -0.023190 0.999730 0.001729
vn -0.023190 0.999730 0.001729
vn -0.023190 0.999730 0.001729
vn -0.023191 0.999730 -0.001733
vn -0.023191 0.999730 -0.001733
vn -0.023191 0.999730 -0.001733
vn -0.023191 0.999730 -0.001733
vn -0.017621 0.999730 -0.015176
vn -0.017621 0.999730 -0.015176
vn -0.017621 0.999730 -0.015176
vn -0.017621 0.999730 -0.015176
vn -0.015173 0.999730 -0.017624
vn -0.015173 0.999730 -0.017624
vn -0.015173 0.999730 -0.017624
vn -0.015173 0.999730 -0.017624
vn -0.001729 0.999730 -0.023190
vn -0.001729 0.999730 -0.023190
vn -0.001729 0.999730 -0.023190
vn -0.001729 0.999730 -0.023190
vn 0.001733 0.999730 -0.023191
vn 0.001733 0.999730 -0.023191
vn 0.001733 0.999730 -0.023191
vn 0.001733 0.999730 -0.023191
vn 0.015175 0.999730 -0.017621
vn 0.015175 0.999730 -0.017621
vn 0.015175 0.999730 -0.017621
vn 0.015175 0.999730 -0.017621
vn -0.922515 -0.054337 0.382118
vn -0.706062 -0.054336 0.706062
vn -0.706062 -0.054336 0.706062
vn -0.922515 -0.054337 0.382118
vn -0.382119 -0.054337 0.922514
vn -0.382119 -0.054337 0.922514
vn -0.000001 -0.054337 0.998523
vn -0.000001 -0.054337 0.998523
vn 0.382117 -0.054337 0.922515
vn 0.382117 -0.054337 0.922515
vn 0.706215 -0.054290 0.705913
vn 0.706360 -0.054290 0.705768
vn 0.922603 -0.054197 0.381924
vn 0.922682 -0.054197 0.381734
vn 0.998533 -0.054151 0.000000
vn 0.998533 -0.054151 0.000000
vn 0.922603 -0.054197 -0.381924
vn 0.922682 -0.054197 -0.381733
vn 0.706216 -0.054290 -0.705912
vn 0.706361 -0.054290 -0.705767
vn 0.382118 -0.054337 -0.922515
vn 0.382118 -0.054337 -0.922515
vn 0.000000 -0.054337 -0.998523
vn 0.000000 -0.054337 -0.998523
vn -0.382118 -0.054336 -0.922515
vn -0.382118 -0.054336 -0.922515
vn -0.706062 -0.054336 -0.706062
vn -0.706062 -0.054336 -0.706062
vn -0.922515 -0.054337 -0.382118
vn -0.922515 -0.054337 -0.382118
vn -0.998523 -0.054337 -0.000000
vn -0.998523 -0.054337 -0.000000
vn 0.998020 0.000000 0.062897
vn 0.994698 0.000000 0.102839
vn 0.994201 0.000000 0.107543
vn -0.994723 0.000000 0.102594
vn -0.998035 0.000000 0.062651
vn -0.994227 0.000000 0.107298
vn 0.062896 0.000000 -0.998020
vn 0.102838 0.000000 -0.994698
vn 0.107542 0.000000 -0.994201
vn 0.102614 -0.000000 0.994721
vn 0.062673 0.000000 0.998034
vn 0.107317 -0.000000 0.994225
vn -0.998020 0.000000 -0.062897
vn -0.994698 -0.000000 -0.102839
vn -0.994201 -0.000000 -0.107543
vn 0.994723 0.000000 -0.102595
vn 0.998035 0.000000 -0.062651
vn 0.994227 0.000000 -0.107298
vn -0.062895 0.000000 0.998020
vn -0.102838 -0.000000 0.994698
vn -0.107541 -0.000000 0.994201
vn -0.102595 0.000000 -0.994723
vn -0.062652 0.000000 -0.998035
vn -0.107299 0.000000 -0.994227
vn 0.004303 -0.999757 -0.021619
vn 0.000003 -0.999766 -0.021619
vn -0.000064 -0.851179 0.524875
vn 0.454191 -0.726710 0.515367
vn 0.224206 0.974296 0.021894
vn -0.000003 0.999748 0.022438
vn 0.980761 0.000000 0.195210
vn 0.980761 0.000000 0.195210
vn -0.004298 -0.999757 -0.021620
vn -0.454318 -0.726709 0.515256
vn -0.980809 0.000000 0.194970
vn -0.980809 0.000000 0.194970
vn -0.224212 0.974296 0.021839
vn -0.021619 -0.999757 -0.004303
vn -0.021619 -0.999766 -0.000002
vn 0.524875 -0.851179 0.000061
vn 0.515367 -0.726710 -0.454191
vn 0.021894 0.974296 -0.224207
vn 0.022438 0.999748 0.000003
vn 0.195210 0.000000 -0.980761
vn 0.195210 0.000000 -0.980761
vn -0.021620 -0.999757 0.004298
vn 0.515266 -0.726722 0.454287
vn 0.194984 -0.000000 0.980807
vn 0.194984 -0.000000 0.980807
vn 0.021839 0.974299 0.224197
vn -0.454192 -0.726709 -0.515367
vn -0.004303 -0.999757 0.021618
vn -0.000003 -0.999766 0.021619
vn 0.000065 -0.851179 -0.524875
vn -0.224207 0.974296 -0.021894
vn 0.000003 0.999748 -0.022438
vn -0.980761 -0.000000 -0.195211
vn -0.980761 -0.000000 -0.195211
vn 0.004298 -0.999757 0.021619
vn 0.454317 -0.726710 -0.515256
vn 0.980809 0.000000 -0.194970
vn 0.980809 0.000000 -0.194970
vn 0.224211 0.974296 -0.021839
vn -0.515367 -0.726711 0.454189
vn 0.021619 -0.999757 0.004303
vn 0.021619 -0.999766 0.000003
vn -0.524875 -0.851179 -0.000064
vn 0.305946 0.912921 0.270133
vn 0.316179 0.948700 0.000039
vn -0.195210 -0.000000 0.980761
vn -0.195210 -0.000000 0.980761
vn 0.021620 -0.999757 -0.004298
vn -0.515256 -0.726710 -0.454318
vn -0.194971 0.000000 -0.980809
vn -0.194971 0.000000 -0.980809
vn 0.306010 0.912921 -0.270061
vn 0.648601 -0.501019 0.572971
vn -0.000081 -0.754052 0.656814
vn 0.018534 0.175138 -0.984370
vn 0.018534 0.175138 -0.984370
vn 0.018534 0.175138 -0.984370
vn 0.018534 0.175138 -0.984370
vn 0.980761 -0.000000 0.195210
vn 0.980761 -0.000000 0.195210
vn -0.648742 -0.501019 0.572812
vn -0.980809 -0.000000 0.194970
vn -0.980809 -0.000000 0.194970
vn -0.018292 0.175140 -0.984374
vn -0.018292 0.175140 -0.984374
vn -0.018292 0.175140 -0.984374
vn -0.018292 0.175140 -0.984374
vn 0.656814 -0.754052 0.000077
vn 0.572972 -0.501020 -0.648601
vn -0.984370 0.175136 -0.018536
vn -0.984370 0.175136 -0.018536
vn -0.984370 0.175136 -0.018536
vn -0.984370 0.175136 -0.018536
vn 0.195211 -0.000000 -0.980761
vn 0.195211 -0.000000 -0.980761
vn 0.572832 -0.501036 0.648712
vn 0.194983 0.000000 0.980807
vn 0.194983 0.000000 0.980807
vn -0.984373 0.175140 0.018304
vn -0.984373 0.175140 0.018304
vn -0.984373 0.175140 0.018304
vn -0.984373 0.175140 0.018304
vn 0.000081 -0.754052 -0.656814
vn -0.648602 -0.501019 -0.572971
vn -0.018534 0.175135 0.984370
vn -0.018534 0.175135 0.984370
vn -0.018534 0.175135 0.984370
vn -0.018534 0.175135 0.984370
vn -0.980761 -0.000000 -0.195211
vn -0.980761 -0.000000 -0.195211
vn 0.648742 -0.501020 -0.572812
vn 0.980809 0.000000 -0.194970
vn 0.980809 0.000000 -0.194970
vn 0.018291 0.175138 0.984374
vn 0.018291 0.175138 0.984374
vn 0.018291 0.175138 0.984374
vn 0.018291 0.175138 0.984374
vn -0.656814 -0.754052 -0.000080
vn -0.572973 -0.501021 0.648599
vn 0.984370 0.175135 0.018536
vn 0.984370 0.175135 0.018536
vn 0.984370 0.175134 0.018536
vn 0.984370 0.175135 0.018536
vn -0.195210 0.000000 0.980761
vn -0.195210 0.000000 0.980761
vn -0.572813 -0.501019 -0.648741
vn -0.194971 0.000000 -0.980809
vn -0.194971 0.000000 -0.980809
vn 0.984374 0.175135 -0.018297
vn 0.984374 0.175135 -0.018297
vn 0.984374 0.175135 -0.018297
vn 0.984374 0.175135 -0.018297
vn -0.039360 0.869559 -0.492259
vn 0.000060 0.870235 -0.492637
vn 0.000060 0.870235 -0.492637
vn -0.039360 0.869559 -0.492259
vn 0.039480 0.869559 -0.492249
vn 0.039480 0.869559 -0.492249
vn -0.492259 0.869558 0.039364
vn -0.492637 0.870235 -0.000058
vn -0.492637 0.870235 -0.000058
vn -0.492259 0.869559 0.039364
vn -0.492249 0.869559 -0.039481
vn -0.492249 0.869559 -0.039481
vn 0.039359 0.869559 0.492259
vn -0.000061 0.870235 0.492637
vn -0.000061 0.870235 0.492637
vn 0.039359 0.869559 0.492259
vn -0.039480 0.869559 0.492249
vn -0.039480 0.869559 0.492249
vn 0.492259 0.869559 -0.039362
vn 0.492637 0.870235 0.000060
vn 0.492637 0.870235 0.000060
vn 0.492259 0.869559 -0.039362
vn 0.492249 0.869559 0.039482
vn 0.492249 0.869559 0.039482
vn 0.008087 0.258104 -0.966083
vn 0.008087 0.258104 -0.966083
vn 0.008087 0.258104 -0.966083
vn 0.008087 0.258104 -0.966083
vn 0.980761 0.000000 0.195210
vn 0.980761 0.000000 0.195210
vn 0.980761 0.000000 0.195210
vn 0.980761 0.000000 0.195210
vn -0.007850 0.258103 -0.966085
vn -0.007850 0.258103 -0.966085
vn -0.007850 0.258103 -0.966086
vn -0.007850 0.258103 -0.966086
vn -0.980809 -0.000000 0.194970
vn -0.980809 -0.000000 0.194970
vn -0.980809 -0.000000 0.194970
vn -0.980809 -0.000000 0.194970
vn -0.966083 0.258105 -0.008090
vn -0.966083 0.258105 -0.008090
vn -0.966083 0.258105 -0.008090
vn -0.966083 0.258105 -0.008090
vn 0.195211 0.000000 -0.980761
vn 0.195211 0.000000 -0.980761
vn 0.195211 0.000000 -0.980761
vn 0.195211 0.000000 -0.980761
vn -0.966085 0.258104 0.007863
vn -0.966085 0.258104 0.007863
vn -0.966085 0.258104 0.007863
vn -0.966085 0.258104 0.007863
vn 0.194983 0.000000 0.980807
vn 0.194983 0.000000 0.980807
vn 0.194983 0.000000 0.980807
vn 0.194983 0.000000 0.980807
vn -0.008087 0.258104 0.966083
vn -0.008087 0.258104 0.966083
vn -0.008087 0.258104 0.966083
vn -0.008087 0.258104 0.966083
vn -0.980761 -0.000000 -0.195211
vn -0.980761 -0.000000 -0.195211
vn -0.980761 -0.000000 -0.195211
vn -0.980761 -0.000000 -0.195211
vn 0.007849 0.258103 0.966085
vn 0.007849 0.258103 0.966085
vn 0.007849 0.258103 0.966086
vn 0.007849 0.258103 0.966085
vn 0.980809 0.000000 -0.194970
vn 0.980809 0.000000 -0.194970
vn 0.980809 0.000000 -0.194970
vn 0.980809 0.000000 -0.194970
vn 0.966083 0.258106 0.008090
vn 0.966083 0.258106 0.008090
vn 0.966083 0.258106 0.008090
vn 0.966083 0.258106 0.008090
vn -0.195210 -0.000000 0.980761
vn -0.195210 -0.000000 0.980761
vn -0.195210 -0.000000 0.980761
vn -0.195210 -0.000000 0.980761
vn 0.966085 0.258104 -0.007855
vn 0.966085 0.258104 -0.007855
vn 0.966085 0.258104 -0.007855
vn 0.966085 0.258104 -0.007855
vn -0.194971 0.000000 -0.980809
vn -0.194971 0.000000 -0.980809
vn -0.194971 0.000000 -0.980809
vn -0.194971 0.000000 -0.980809
vn -0.980809 0.000000 0.194970
vn -0.980809 0.000000 0.194970
vn -0.980809 0.000000 0.194970
vn -0.276440 0.578104 -0.767709
vn 0.000098 0.601562 -0.798826
vn 0.000051 0.909798 -0.415051
vn -0.219822 0.882651 -0.415458
vn 0.276628 0.578104 -0.767641
vn 0.219924 0.882651 -0.415403
vn 0.980761 0.000001 0.195211
vn 0.980761 0.000001 0.195211
vn 0.980761 0.000001 0.195211
vn 0.194983 -0.000000 0.980807
vn 0.194983 0.000000 0.980807
vn 0.194983 -0.000001 0.980807
vn -0.767710 0.578106 0.276433
vn -0.798825 0.601563 -0.000092
vn -0.415048 0.909799 -0.000049
vn -0.415455 0.882654 0.219813
vn -0.767640 0.578104 -0.276630
vn -0.415403 0.882651 -0.219925
vn 0.195210 0.000000 -0.980761
vn 0.195210 0.000000 -0.980762
vn 0.195209 0.000000 -0.980762
vn 0.980809 -0.000000 -0.194970
vn 0.980809 -0.000000 -0.194970
vn 0.980809 0.000001 -0.194969
vn 0.276438 0.578104 0.767710
vn -0.000098 0.601562 0.798826
vn -0.000051 0.909798 0.415051
vn 0.219821 0.882651 0.415458
vn -0.276629 0.578104 0.767641
vn -0.219925 0.882651 0.415403
vn -0.980761 0.000000 -0.195212
vn -0.980761 0.000000 -0.195212
vn -0.980761 0.000000 -0.195211
vn -0.194970 0.000000 -0.980809
vn -0.194970 0.000000 -0.980809
vn -0.194970 0.000000 -0.980809
vn 0.798825 0.601563 0.000097
vn 0.767707 0.578104 -0.276445
vn 0.767640 0.578104 0.276629
vn -0.195210 -0.000001 0.980761
vn -0.195210 -0.000001 0.980761
vn -0.195210 -0.000001 0.980761
vn 0.980761 0.000000 0.195211
vn 0.029832 0.945558 0.324082
vn -0.000039 0.945981 0.324223
vn -0.029911 0.945559 0.324074
vn -0.980810 0.000000 0.194964
vn 0.195199 0.000000 -0.980764
vn 0.324079 0.945560 -0.029831
vn 0.324221 0.945982 0.000038
vn 0.324073 0.945559 0.029905
vn 0.194986 -0.000009 0.980806
vn -0.980763 0.000000 -0.195203
vn -0.029832 0.945559 -0.324082
vn 0.000040 0.945981 -0.324223
vn 0.029912 0.945559 -0.324074
vn 0.980810 0.000009 -0.194964
vn -0.195204 -0.000009 0.980763
vn -0.195204 -0.000009 0.980763
vn -0.195204 -0.000009 0.980763
vn -0.324221 0.945981 -0.000039
vn -0.324081 0.945559 0.029831
vn -0.324081 0.945559 0.029831
vn -0.324221 0.945981 -0.000039
vn -0.324072 0.945560 -0.029910
vn -0.324072 0.945559 -0.029910
vn -0.194977 0.000000 -0.980808
vn -0.194977 0.000000 -0.980808
vn -0.194977 0.000000 -0.980808
s 1
g MachineBase_0 polySurface24 polySurface9
usemtl lambert2SG
f 17/1/1 18/2/2 34/3/3 33/4/4
f 35/5/5 72/6/6 19/7/7 73/8/8
f 18/2/2 19/7/7 72/6/6 34/3/3
f 20/9/9 36/10/10 73/8/8 19/7/7
f 20/9/9 21/11/11 37/12/12 36/10/10
f 21/11/11 22/13/13 38/14/14 37/12/12
f 39/15/15 71/16/16 23/17/17
f 22/13/13 23/17/17 71/16/16 38/14/14
f 69/18/18 70/19/19 24/20/20 40/21/21
f 24/20/20 25/22/22 41/23/23 40/21/21
f 25/22/22 26/24/24 42/25/25 41/23/23
f 43/26/26 68/27/27 27/28/28
f 26/24/24 27/28/28 68/27/27 42/25/25
f 44/29/29 67/30/30 28/31/31
f 27/28/28 28/31/31 67/30/30 43/26/26
f 28/31/31 29/32/32 45/33/33 44/29/29
f 29/32/32 30/34/34 46/35/35 45/33/33
f 47/36/36 66/37/37 31/38/38
f 30/34/34 31/38/38 66/37/37 46/35/35
f 48/39/39 65/40/40 32/41/41
f 31/38/38 32/41/41 65/40/40 47/36/36
f 32/41/41 17/1/1 33/4/4 48/39/39
s off
f 33/4/42 34/3/43 50/42/44 49/290/45
s 2
f 50/44/46 138/324/47 139/45/48 51/46/49
s off
f 52/299/50 73/8/51 36/10/52
f 36/10/53 37/12/54 53/297/55 52/299/56
f 37/12/57 38/14/58 54/49/59 53/297/60
s 2
f 54/50/61 141/321/62 142/51/63 55/52/64
s off
f 56/296/65 69/18/66 40/21/67
f 40/21/68 41/23/69 57/294/70 56/296/71
f 41/23/72 42/25/73 58/55/74 57/294/75
s 2
f 58/56/76 144/317/77 145/57/78 59/58/79
s off
f 60/293/80 67/30/81 44/29/82
f 44/29/83 45/33/84 61/291/85 60/293/86
f 45/33/87 46/35/88 62/61/89 61/291/90
s 2
f 62/62/91 147/314/92 148/63/93 63/64/94
s off
f 64/289/95 65/40/96 48/39/97
f 48/39/98 33/4/99 49/290/100 64/289/101
s 2
f 148/63/93 149/66/102 64/67/103 63/64/94
s off
f 46/35/104 66/37/105 62/61/106
s 2
f 145/57/78 146/68/107 60/69/108 59/58/79
s off
f 42/25/109 68/27/110 58/55/111
s 2
f 142/51/63 143/70/112 56/71/113 55/52/64
s 1
f 23/17/17 70/19/19 69/18/18 39/15/15
s off
f 38/14/114 71/16/115 54/49/116
f 34/3/117 72/6/118 50/42/119
s 2
f 139/45/48 140/72/120 52/73/121 51/46/49
f 49/43/122 50/300/46 75/74/123 74/75/124
f 50/300/46 51/76/49 76/77/125 75/74/123
f 51/76/49 52/47/121 77/78/126 76/77/125
f 52/47/121 53/48/127 78/79/128 77/78/126
f 53/48/127 54/298/61 79/80/129 78/79/128
f 54/298/61 55/81/64 80/82/130 79/80/129
f 55/81/64 56/53/113 81/83/131 80/82/130
f 56/53/113 57/54/132 82/84/133 81/83/131
f 57/54/132 58/295/76 83/85/134 82/84/133
f 58/295/76 59/86/79 84/87/135 83/85/134
f 59/86/79 60/59/108 85/88/136 84/87/135
f 60/59/108 61/60/137 86/89/138 85/88/136
f 61/60/137 62/292/91 87/90/139 86/89/138
f 62/292/91 63/91/94 88/92/140 87/90/139
f 63/91/94 64/65/103 89/93/141 88/92/140
f 64/65/103 49/43/122 74/75/124 89/93/141
s off
f 74/75/142 75/74/143 91/288/144 90/274/145
f 75/74/146 76/77/147 92/287/148 91/288/149
f 76/77/150 77/78/151 93/286/152 92/287/153
f 77/78/154 78/79/155 94/285/156 93/286/157
f 78/79/158 79/80/159 95/284/160 94/285/161
f 79/80/162 80/82/163 96/283/164 95/284/165
f 80/82/166 81/83/167 97/282/168 96/283/169
f 81/83/170 82/84/171 98/281/172 97/282/173
f 82/84/174 83/85/175 99/280/176 98/281/177
f 83/85/178 84/87/179 100/279/180 99/280/181
f 84/87/182 85/88/183 101/278/184 100/279/185
f 85/88/186 86/89/187 102/277/188 101/278/189
f 86/89/190 87/90/191 103/276/192 102/277/193
f 87/90/194 88/92/195 104/275/196 103/276/197
f 88/92/198 89/93/199 105/273/200 104/275/201
f 89/93/202 74/75/203 90/274/204 105/273/205
s 6
f 90/95/206 91/94/207 107/110/208 106/111/209
f 91/94/207 92/96/210 108/112/211 107/110/208
f 92/96/210 93/97/212 109/113/213 108/112/211
f 93/97/212 94/98/214 110/114/215 109/113/213
f 94/98/214 95/99/216 111/115/217 110/114/215
f 95/99/216 96/100/218 112/116/219 111/115/217
f 96/100/218 97/101/220 113/117/221 112/116/219
f 97/101/220 98/102/222 114/118/223 113/117/221
f 98/102/222 99/103/224 115/119/225 114/118/223
f 99/103/224 100/104/226 116/120/227 115/119/225
f 100/104/226 101/105/228 117/121/229 116/120/227
f 101/105/228 102/106/230 118/122/231 117/121/229
f 102/106/230 103/107/232 119/123/233 118/122/231
f 103/107/232 104/108/234 120/124/235 119/123/233
f 104/108/234 105/109/236 121/125/237 120/124/235
f 105/109/236 90/95/206 106/111/209 121/125/237
s off
f 2/126/238 1/127/239 121/125/240 106/111/241
f 1/127/242 16/128/243 120/124/244 121/125/245
f 16/128/246 15/129/247 119/123/248 120/124/249
f 15/129/250 14/130/251 118/122/252 119/123/253
f 14/130/254 13/131/255 117/121/256 118/122/257
f 13/131/258 12/132/259 116/120/260 117/121/261
f 12/132/262 11/133/263 115/119/264 116/120/265
f 11/133/266 10/134/267 114/118/268 115/119/269
f 10/134/270 9/135/271 113/117/272 114/118/273
f 9/135/274 8/136/275 112/116/276 113/117/277
f 8/136/278 7/137/279 111/115/280 112/116/281
f 7/137/282 6/138/283 110/114/284 111/115/285
f 6/138/286 5/139/287 109/113/288 110/114/289
f 5/139/290 4/140/291 108/112/292 109/113/293
f 4/140/294 3/141/295 107/110/296 108/112/297
f 3/141/298 2/126/299 106/111/300 107/110/301
s 7
f 1/127/302 2/126/303 123/142/304 122/143/305
f 2/126/303 3/141/306 124/144/307 123/142/304
f 3/141/306 4/140/308 125/145/309 124/144/307
f 4/140/308 5/139/310 126/146/311 125/145/309
f 5/139/310 6/138/312 127/147/313 126/146/311
f 6/138/312 7/137/314 128/148/315 127/147/313
f 7/137/314 8/136/316 129/149/317 128/148/315
f 8/136/316 9/135/318 130/150/319 129/149/317
f 9/135/318 10/134/320 131/151/321 130/150/319
f 10/134/320 11/133/322 132/152/323 131/151/321
f 11/133/322 12/132/324 133/153/325 132/152/323
f 12/132/324 13/131/326 134/154/327 133/153/325
f 13/131/326 14/130/328 135/155/329 134/154/327
f 14/130/328 15/129/330 136/156/331 135/155/329
f 15/129/330 16/128/332 137/157/333 136/156/331
f 16/128/332 1/127/302 122/143/305 137/157/333
s 8
f 50/44/334 72/158/335 138/324/336
s 9
f 73/323/337 52/73/338 140/72/339
s 10
f 54/50/340 71/160/341 141/321/342
s 11
f 69/319/343 56/71/344 143/70/345
s 12
f 58/56/346 68/161/347 144/317/348
s 13
f 67/316/349 60/69/350 146/68/351
s 14
f 62/62/352 66/163/353 147/314/354
s 15
f 65/313/355 64/67/356 149/66/357
s 16
f 72/325/358 35/165/359 151/166/360 150/167/361
s 2
f 139/45/48 138/324/47 153/168/362 152/169/363
s 8
f 138/326/336 72/327/335 150/328/364 153/329/365
s 16
f 35/165/359 73/159/366 154/170/367 151/166/360
s 9
f 73/330/337 140/331/339 155/332/368 154/333/369
s 2
f 140/72/120 139/45/48 152/169/363 155/171/370
s 17
f 71/322/371 39/172/372 157/173/373 156/174/374
s 2
f 142/51/63 141/321/62 159/175/375 158/176/376
s 10
f 141/342/342 71/343/341 156/344/377 159/345/378
s 17
f 39/172/372 69/320/379 160/177/380 157/173/373
s 11
f 69/346/343 143/347/345 161/348/381 160/349/382
s 2
f 143/70/112 142/51/63 158/176/376 161/178/383
s 18
f 162/179/384 68/318/385 43/180/386 163/181/387
s 2
f 145/57/78 144/317/77 165/182/388 164/183/389
s 12
f 144/334/348 68/335/347 162/336/390 165/337/391
s 18
f 43/180/386 67/162/392 166/184/393 163/181/387
s 13
f 67/338/349 146/339/351 167/340/394 166/341/395
s 2
f 146/68/107 145/57/78 164/183/389 167/185/396
s 19
f 168/186/397 66/315/398 47/187/399 169/188/400
s 2
f 148/63/93 147/314/92 171/189/401 170/190/402
s 14
f 147/350/354 66/351/353 168/352/403 171/353/404
s 19
f 47/187/399 65/164/405 172/191/406 169/188/400
s 15
f 65/354/355 149/355/357 173/356/407 172/357/408
s 2
f 149/66/102 148/63/93 170/190/402 173/192/409
s 16
f 174/193/410 150/167/361 151/166/360 175/194/411
s off
f 198/195/412 199/196/413 200/197/414 201/198/415
s 16
f 174/193/410 188/199/416 224/200/417 150/167/361
f 151/166/360 154/170/367 176/201/418 175/194/411
f 222/202/419 186/306/420 176/201/418 154/170/367
s off
f 202/204/421 198/195/422 201/198/423 203/205/424
s 17
f 156/174/374 157/173/373 178/206/425 177/207/426
s off
f 204/208/427 205/209/428 206/210/429 207/211/430
s 17
f 177/207/426 191/212/431 227/213/432 156/174/374
f 157/173/373 160/177/380 179/214/433 178/206/425
f 225/215/434 189/309/435 179/214/433 160/177/380
s off
f 208/217/436 204/208/437 207/211/438 209/218/439
s 18
f 162/179/384 163/181/387 181/219/440 180/220/441
s off
f 210/221/442 211/222/443 212/223/444 213/224/445
s 18
f 180/220/441 194/225/446 230/226/447 162/179/384
f 163/181/387 166/184/393 182/227/448 181/219/440
f 228/228/449 192/312/450 182/227/448 166/184/393
s off
f 214/230/451 210/221/452 213/224/453 215/231/454
s 19
f 168/186/397 169/188/400 184/232/455 183/233/456
s off
f 216/234/457 217/235/458 218/236/459 219/237/460
s 19
f 183/233/456 197/238/461 233/239/462 168/186/397
f 169/188/400 172/191/406 185/240/463 184/232/455
f 231/241/464 195/303/465 185/240/463 172/191/406
s off
f 220/243/466 216/234/467 219/237/468 221/244/469
s 20
f 222/202/470 223/245/471 187/246/472 186/306/473
f 223/245/471 224/200/474 188/199/475 187/246/472
s 21
f 225/215/476 226/247/477 190/248/478 189/309/479
f 226/247/477 227/213/480 191/212/481 190/248/478
s 22
f 228/228/482 229/249/483 193/250/484 192/312/485
f 229/249/483 230/226/486 194/225/487 193/250/484
s 23
f 231/241/488 232/251/489 196/252/490 195/303/491
f 232/251/489 233/239/492 197/238/493 196/252/490
s off
f 187/304/494 188/305/495 199/196/496 198/195/497
f 188/305/498 174/253/499 200/197/500 199/196/501
f 186/203/502 187/304/503 198/195/504 202/204/505
f 176/254/506 186/203/507 202/204/508 203/205/509
f 190/307/510 191/308/511 205/209/512 204/208/513
f 191/308/514 177/255/515 206/210/516 205/209/517
f 189/216/518 190/307/519 204/208/520 208/217/521
f 179/256/522 189/216/523 208/217/524 209/218/525
f 193/310/526 194/311/527 211/222/528 210/221/529
f 194/311/530 180/257/531 212/223/532 211/222/533
f 192/229/534 193/310/535 210/221/536 214/230/537
f 182/258/538 192/229/539 214/230/540 215/231/541
f 196/301/542 197/302/543 217/235/544 216/234/545
f 197/302/546 183/259/547 218/236/548 217/235/549
f 195/242/550 196/301/551 216/234/552 220/243/553
f 185/260/554 195/242/555 220/243/556 221/244/557
s 24
f 154/170/558 155/171/559 236/261/560
s 25
f 155/171/561 152/169/562 235/262/563 236/261/564
f 152/169/562 153/168/565 234/263/566 235/262/563
s 26
f 153/168/567 150/167/568 234/263/569
s 27
f 160/177/570 161/178/571 239/264/572
s 28
f 161/178/573 158/176/574 238/265/575 239/264/576
f 158/176/574 159/175/577 237/266/578 238/265/575
s 29
f 159/175/579 156/174/580 237/266/581
s 30
f 166/184/582 167/185/583 242/267/584
s 31
f 167/185/585 164/183/586 241/268/587 242/267/588
f 164/183/586 165/182/589 240/269/590 241/268/587
s 32
f 165/182/591 162/179/592 240/269/593
s off
f 172/191/594 173/192/595 245/270/596
s 2
f 173/192/409 170/190/402 244/271/597 245/270/598
f 170/190/402 171/189/401 243/272/599 244/271/597
s off
f 171/189/600 168/186/601 243/272/602
s 26
f 234/263/569 150/167/568 224/200/603
s 25
f 235/262/563 234/263/566 224/200/604 223/245/605
f 236/261/564 235/262/563 223/245/605 222/202/606
s 24
f 154/170/558 236/261/560 222/202/607
s 29
f 237/266/581 156/174/580 227/213/608
s 28
f 238/265/575 237/266/578 227/213/609 226/247/610
f 239/264/576 238/265/575 226/247/610 225/215/611
s 27
f 160/177/570 239/264/572 225/215/612
s 32
f 240/269/593 162/179/592 230/226/613
s 31
f 241/268/587 240/269/590 230/226/614 229/249/615
f 242/267/588 241/268/587 229/249/615 228/228/616
s 30
f 166/184/582 242/267/584 228/228/617
s off
f 243/272/618 168/186/619 233/239/620
s 33
f 244/271/621 243/272/622 233/239/623 232/251/624
f 245/270/625 244/271/621 232/251/624 231/241/626
s off
f 172/191/627 245/270/628 231/241/629
