# This file uses centimeters as units for non-parametric coordinates.

mtllib Environment1_Columnas.mtl
g default
v 3.536434 4.653680 -6.576122
v 3.536434 4.653680 -6.026031
v 3.536434 7.375785 -6.576122
v 3.536434 7.375785 -6.026031
v 4.086521 4.653680 -6.576122
v 4.086521 4.653680 -6.026031
v 3.536434 4.653680 -10.088081
v 3.536434 4.653680 -9.537991
v 3.536434 7.375785 -10.088081
v 3.536434 7.375785 -9.537991
v 4.086521 4.653680 -10.088081
v 4.086521 4.653680 -9.537991
v -1.186064 4.631787 -23.336329
v -1.736155 4.631787 -23.336329
v -1.186064 7.353893 -23.336329
v -1.736155 7.353893 -23.336329
v -1.186064 4.631787 -22.786242
v -1.736155 4.631787 -22.786242
v 7.976097 4.631787 -23.336325
v 7.426010 4.631787 -23.336325
v 7.976097 7.353893 -23.336325
v 7.426010 7.353893 -23.336325
v 7.976097 4.631787 -22.786238
v 7.426010 4.631787 -22.786238
v 14.891777 -0.476004 10.154261
v 14.891777 -0.476004 10.704350
v 14.891777 3.223996 10.154261
v 14.891777 3.223996 10.704350
v 15.441864 -0.476004 10.154261
v 15.441864 -0.476004 10.704350
v -16.521143 -0.476004 6.850510
v -16.521143 -0.476004 6.300420
v -16.521143 3.223996 6.850510
v -16.521143 3.223996 6.300420
v -17.071234 -0.476004 6.850510
v -17.071234 -0.476004 6.300420
v -16.521143 -0.476004 10.704350
v -16.521143 -0.476004 10.154261
v -16.521143 3.223996 10.704350
v -16.521143 3.223996 10.154261
v -17.071234 -0.476004 10.704350
v -17.071234 -0.476004 10.154261
v 14.891777 -0.476004 -7.247011
v 14.891777 -0.476004 -6.696920
v 14.891777 3.223996 -7.247011
v 14.891777 3.223996 -6.696920
v 15.441864 -0.476004 -7.247011
v 15.441864 -0.476004 -6.696920
v 14.891777 -0.476004 6.300420
v 14.891777 -0.476004 6.850510
v 14.891777 3.223996 6.300420
v 14.891777 3.223996 6.850510
v 15.441864 -0.476004 6.300420
v 15.441864 -0.476004 6.850510
v 9.451740 4.648491 13.612942
v 10.001827 4.648491 13.612942
v 9.451740 7.370595 13.612942
v 10.001827 7.370595 13.612942
v 9.451740 4.648491 13.062852
v 10.001827 4.648491 13.062852
v -40.624565 -0.476004 2.679951
v -40.624565 -0.476004 3.230042
v -40.624565 3.223996 2.679951
v -40.624565 3.223996 3.230042
v -40.074471 -0.476004 2.679951
v -40.074471 -0.476004 3.230042
v 33.622852 -0.348916 -23.318640
v 33.072765 -0.348916 -23.318640
v 33.622852 3.351084 -23.318640
v 33.072765 3.351084 -23.318640
v 33.622852 -0.348916 -22.768553
v 33.072765 -0.348916 -22.768553
v -18.715254 -0.476004 -23.299082
v -19.265345 -0.476004 -23.299082
v -18.715254 3.223996 -23.299082
v -19.265345 3.223996 -23.299082
v -18.715254 -0.476004 -22.748995
v -19.265345 -0.476004 -22.748995
v 24.692528 -0.348916 -23.318640
v 24.142441 -0.348916 -23.318640
v 24.692528 3.351084 -23.318640
v 24.142441 3.351084 -23.318640
v 24.692528 -0.348916 -22.768553
v 24.142441 -0.348916 -22.768553
v 29.066795 -0.348916 -23.318640
v 28.516708 -0.348916 -23.318640
v 29.066795 3.351084 -23.318640
v 28.516708 3.351084 -23.318640
v 29.066795 -0.348916 -22.768553
v 28.516708 -0.348916 -22.768553
v 38.719776 -0.476004 -8.746609
v 38.719776 -0.476004 -9.296700
v 38.719776 3.223996 -8.746609
v 38.719776 3.223996 -9.296700
v 38.169682 -0.476004 -8.746609
v 38.169682 -0.476004 -9.296700
v 38.719776 -0.476004 -12.932024
v 38.719776 -0.476004 -13.482115
v 38.719776 3.223996 -12.932024
v 38.719776 3.223996 -13.482115
v 38.169682 -0.476004 -12.932024
v 38.169682 -0.476004 -13.482115
v 38.719776 -0.476004 3.230042
v 38.719776 -0.476004 2.679951
v 38.719776 3.223996 3.230042
v 38.719776 3.223996 2.679951
v 38.169682 -0.476004 3.230042
v 38.169682 -0.476004 2.679951
v 38.719776 -0.476004 -1.084207
v 38.719776 -0.476004 -1.634297
v 38.719776 3.223996 -1.084207
v 38.719776 3.223996 -1.634297
v 38.169682 -0.476004 -1.084207
v 38.169682 -0.476004 -1.634297
v 38.719776 -0.476004 -4.532137
v 38.719776 -0.476004 -5.082228
v 38.719776 3.223996 -4.532137
v 38.719776 3.223996 -5.082228
v 38.169682 -0.476004 -4.532137
v 38.169682 -0.476004 -5.082228
v -37.180450 -0.476004 13.627039
v -36.630360 -0.476004 13.627039
v -37.180450 3.223996 13.627039
v -36.630360 3.223996 13.627039
v -37.180450 -0.476004 13.076949
v -36.630360 -0.476004 13.076949
v -41.252625 -0.476004 13.627039
v -40.702534 -0.476004 13.627039
v -41.252625 3.223996 13.627039
v -40.702534 3.223996 13.627039
v -41.252625 -0.476004 13.076949
v -40.702534 -0.476004 13.076949
v -23.758287 -0.476004 13.627039
v -23.208197 -0.476004 13.627039
v -23.758287 3.223996 13.627039
v -23.208197 3.223996 13.627039
v -23.758287 -0.476004 13.076949
v -23.208197 -0.476004 13.076949
v -28.214125 -0.476004 13.627039
v -27.664036 -0.476004 13.627039
v -28.214125 3.223996 13.627039
v -27.664036 3.223996 13.627039
v -28.214125 -0.476004 13.076949
v -27.664036 -0.476004 13.076949
v -32.609993 -0.476004 13.627039
v -32.059906 -0.476004 13.627039
v -32.609993 3.223996 13.627039
v -32.059906 3.223996 13.627039
v -32.609993 -0.476004 13.076949
v -32.059906 -0.476004 13.076949
v -40.624565 -0.476004 -5.082228
v -40.624565 -0.476004 -4.532137
v -40.624565 3.223996 -5.082228
v -40.624565 3.223996 -4.532137
v -40.074471 -0.476004 -5.082228
v -40.074471 -0.476004 -4.532137
v -40.624565 -0.476004 -1.634297
v -40.624565 -0.476004 -1.084207
v -40.624565 3.223996 -1.634297
v -40.624565 3.223996 -1.084207
v -40.074471 -0.476004 -1.634297
v -40.074471 -0.476004 -1.084207
v -40.624565 -0.476004 -13.482115
v -40.624565 -0.476004 -12.932024
v -40.624565 3.223996 -13.482115
v -40.624565 3.223996 -12.932024
v -40.074471 -0.476004 -13.482115
v -40.074471 -0.476004 -12.932024
v -40.624565 -0.476004 -9.296700
v -40.624565 -0.476004 -8.746609
v -40.624565 3.223996 -9.296700
v -40.624565 3.223996 -8.746609
v -40.074471 -0.476004 -9.296700
v -40.074471 -0.476004 -8.746609
v -9.011940 4.631787 -23.336325
v -9.562031 4.631787 -23.336325
v -9.011940 7.353893 -23.336325
v -9.562031 7.353893 -23.336325
v -9.011940 4.631787 -22.786238
v -9.562031 4.631787 -22.786238
v -30.387808 -0.476004 -23.311907
v -30.937897 -0.476004 -23.311907
v -30.387808 3.223996 -23.311907
v -30.937897 3.223996 -23.311907
v -30.387808 -0.476004 -22.761820
v -30.937897 -0.476004 -22.761820
v -35.863415 -0.476004 -23.311907
v -36.413506 -0.476004 -23.311907
v -35.863415 3.223996 -23.311907
v -36.413506 3.223996 -23.311907
v -35.863415 -0.476004 -22.761820
v -36.413506 -0.476004 -22.761820
v -40.624565 -0.476004 -17.476046
v -40.624565 -0.476004 -16.925955
v -40.624565 3.223996 -17.476046
v -40.624565 3.223996 -16.925955
v -40.074471 -0.476004 -17.476046
v -40.074471 -0.476004 -16.925955
v -26.106569 -0.476004 -23.311907
v -26.656660 -0.476004 -23.311907
v -26.106569 3.223996 -23.311907
v -26.656660 3.223996 -23.311907
v -26.106569 -0.476004 -22.761820
v -26.656660 -0.476004 -22.761820
v -16.785332 -0.476004 -6.696920
v -16.785332 -0.476004 -7.247011
v -16.785332 3.223996 -6.696920
v -16.785332 3.223996 -7.247011
v -17.335423 -0.476004 -6.696920
v -17.335423 -0.476004 -7.247011
v -16.785332 -0.476004 -10.550760
v -16.785332 -0.476004 -11.100851
v -16.785332 3.223996 -10.550760
v -16.785332 3.223996 -11.100851
v -17.335423 -0.476004 -10.550760
v -17.335423 -0.476004 -11.100851
v -16.256731 4.648491 5.078979
v -16.256731 4.648491 5.629068
v -16.256731 7.370595 5.078979
v -16.256731 7.370595 5.629068
v -15.706640 4.648491 5.078979
v -15.706640 4.648491 5.629068
v -16.256731 4.648491 -6.128941
v -16.256731 4.648491 -5.578850
v -16.256731 7.370595 -6.128941
v -16.256731 7.370595 -5.578850
v -15.706640 4.648491 -6.128941
v -15.706640 4.648491 -5.578850
v -16.256731 4.648491 -10.088081
v -16.256731 4.648491 -9.537991
v -16.256731 7.370595 -10.088081
v -16.256731 7.370595 -9.537991
v -15.706640 4.648491 -10.088081
v -15.706640 4.648491 -9.537991
v -11.314285 4.648491 13.612942
v -10.764194 4.648491 13.612942
v -11.314285 7.370595 13.612942
v -10.764194 7.370595 13.612942
v -11.314285 4.648491 13.062852
v -10.764194 4.648491 13.062852
v -16.256731 4.648491 10.121960
v -16.256731 4.648491 10.672050
v -16.256731 7.370595 10.121960
v -16.256731 7.370595 10.672050
v -15.706640 4.648491 10.121960
v -15.706640 4.648491 10.672050
v 14.847820 4.648491 -5.578850
v 14.847820 4.648491 -6.128941
v 14.847820 7.370595 -5.578850
v 14.847820 7.370595 -6.128941
v 14.297733 4.648491 -5.578850
v 14.297733 4.648491 -6.128941
v 14.847820 4.648491 -9.537991
v 14.847820 4.648491 -10.088081
v 14.847820 7.370595 -9.537991
v 14.847820 7.370595 -10.088081
v 14.297733 4.648491 -9.537991
v 14.297733 4.648491 -10.088081
v 14.847820 4.648491 5.629068
v 14.847820 4.648491 5.078979
v 14.847820 7.370595 5.629068
v 14.847820 7.370595 5.078979
v 14.297733 4.648491 5.629068
v 14.297733 4.648491 5.078979
v 14.847820 4.648491 10.672050
v 14.847820 4.648491 10.121960
v 14.847820 7.370595 10.672050
v 14.847820 7.370595 10.121960
v 14.297733 4.648491 10.672050
v 14.297733 4.648491 10.121960
v 31.587551 -0.476004 13.630864
v 32.137638 -0.476004 13.630864
v 31.587551 3.223996 13.630864
v 32.137638 3.223996 13.630864
v 31.587551 -0.476004 13.080774
v 32.137638 -0.476004 13.080774
v 36.043385 -0.476004 13.630864
v 36.593479 -0.476004 13.630864
v 36.043385 3.223996 13.630864
v 36.593479 3.223996 13.630864
v 36.043385 -0.476004 13.080774
v 36.593479 -0.476004 13.080774
v 18.549053 -0.476004 13.630864
v 19.099140 -0.476004 13.630864
v 18.549053 3.223996 13.630864
v 19.099140 3.223996 13.630864
v 18.549053 -0.476004 13.080774
v 19.099140 -0.476004 13.080774
v 22.621227 -0.476004 13.630864
v 23.171314 -0.476004 13.630864
v 22.621227 3.223996 13.630864
v 23.171314 3.223996 13.630864
v 22.621227 -0.476004 13.080774
v 23.171314 -0.476004 13.080774
v 27.191685 -0.476004 13.630864
v 27.741772 -0.476004 13.630864
v 27.191685 3.223996 13.630864
v 27.741772 3.223996 13.630864
v 27.191685 -0.476004 13.080774
v 27.741772 -0.476004 13.080774
v 38.719776 -0.476004 -16.925955
v 38.719776 -0.476004 -17.476046
v 38.719776 3.223996 -16.925955
v 38.719776 3.223996 -17.476046
v 38.169682 -0.476004 -16.925955
v 38.169682 -0.476004 -17.476046
v -5.316750 4.653680 -6.696920
v -5.316750 4.653680 -7.247011
v -5.316750 7.375785 -6.696920
v -5.316750 7.375785 -7.247011
v -5.866840 4.653680 -6.696920
v -5.866840 4.653680 -7.247011
v 14.891777 -0.476004 -11.100851
v 14.891777 -0.476004 -10.550760
v 14.891777 3.223996 -11.100851
v 14.891777 3.223996 -10.550760
v 15.441864 -0.476004 -11.100851
v 15.441864 -0.476004 -10.550760
v -5.316750 4.653680 -9.863119
v -5.316750 4.653680 -10.413210
v -5.316750 7.375785 -9.863119
v -5.316750 7.375785 -10.413210
v -5.866840 4.653680 -9.863119
v -5.866840 4.653680 -10.413210
vt 0.375000 0.000000
vt 0.625000 0.000000
vt 0.374999 0.249999
vt 0.620753 0.254245
vt 0.375000 0.750000
vt 0.625000 0.750000
vt 0.375000 1.000000
vt 0.625000 1.000000
vt 0.875000 0.000000
vt 0.125000 0.000000
vt 0.375000 0.000000
vt 0.625000 0.000000
vt 0.620753 0.254245
vt 0.374999 0.249999
vt 0.625000 0.750000
vt 0.375000 0.750000
vt 0.625000 1.000000
vt 0.375000 1.000000
vt 0.875000 0.000000
vt 0.125000 0.000000
vt 0.375000 0.000000
vt 0.625000 0.000000
vt 0.620753 0.254245
vt 0.374999 0.249999
vt 0.625000 0.750000
vt 0.375000 0.750000
vt 0.625000 1.000000
vt 0.375000 1.000000
vt 0.875000 0.000000
vt 0.125000 0.000000
vt 0.375000 0.000000
vt 0.625000 0.000000
vt 0.620753 0.254245
vt 0.374999 0.249999
vt 0.625000 0.750000
vt 0.375000 0.750000
vt 0.625000 1.000000
vt 0.375000 1.000000
vt 0.875000 0.000000
vt 0.125000 0.000000
vt 0.375000 0.000000
vt 0.625000 0.000000
vt 0.620753 0.254245
vt 0.374999 0.249999
vt 0.625000 0.750000
vt 0.375000 0.750000
vt 0.625000 1.000000
vt 0.375000 1.000000
vt 0.875000 0.000000
vt 0.125000 0.000000
vt 0.375000 0.000000
vt 0.625000 0.000000
vt 0.620753 0.254245
vt 0.374999 0.249999
vt 0.625000 0.750000
vt 0.375000 0.750000
vt 0.625000 1.000000
vt 0.375000 1.000000
vt 0.875000 0.000000
vt 0.125000 0.000000
vt 0.375000 0.000000
vt 0.625000 0.000000
vt 0.620753 0.254245
vt 0.374999 0.249999
vt 0.625000 0.750000
vt 0.375000 0.750000
vt 0.625000 1.000000
vt 0.375000 1.000000
vt 0.875000 0.000000
vt 0.125000 0.000000
vt 0.375000 0.000000
vt 0.625000 0.000000
vt 0.620753 0.254245
vt 0.374999 0.249999
vt 0.625000 0.750000
vt 0.375000 0.750000
vt 0.625000 1.000000
vt 0.375000 1.000000
vt 0.875000 0.000000
vt 0.125000 0.000000
vt 0.375000 0.000000
vt 0.625000 0.000000
vt 0.620753 0.254245
vt 0.374999 0.249999
vt 0.625000 0.750000
vt 0.375000 0.750000
vt 0.625000 1.000000
vt 0.375000 1.000000
vt 0.875000 0.000000
vt 0.125000 0.000000
vt 0.375000 0.000000
vt 0.625000 0.000000
vt 0.620753 0.254245
vt 0.374999 0.249999
vt 0.625000 0.750000
vt 0.375000 0.750000
vt 0.625000 1.000000
vt 0.375000 1.000000
vt 0.875000 0.000000
vt 0.125000 0.000000
vt 0.375000 0.000000
vt 0.625000 0.000000
vt 0.620753 0.254245
vt 0.374999 0.249999
vt 0.625000 0.750000
vt 0.375000 0.750000
vt 0.625000 1.000000
vt 0.375000 1.000000
vt 0.875000 0.000000
vt 0.125000 0.000000
vt 0.375000 0.000000
vt 0.625000 0.000000
vt 0.620753 0.254245
vt 0.374999 0.249999
vt 0.625000 0.750000
vt 0.375000 0.750000
vt 0.625000 1.000000
vt 0.375000 1.000000
vt 0.875000 0.000000
vt 0.125000 0.000000
vt 0.375000 0.000000
vt 0.625000 0.000000
vt 0.620753 0.254245
vt 0.374999 0.249999
vt 0.625000 0.750000
vt 0.375000 0.750000
vt 0.625000 1.000000
vt 0.375000 1.000000
vt 0.875000 0.000000
vt 0.125000 0.000000
vt 0.375000 0.000000
vt 0.625000 0.000000
vt 0.620753 0.254245
vt 0.374999 0.249999
vt 0.625000 0.750000
vt 0.375000 0.750000
vt 0.625000 1.000000
vt 0.375000 1.000000
vt 0.875000 0.000000
vt 0.125000 0.000000
vt 0.375000 0.000000
vt 0.625000 0.000000
vt 0.620753 0.254245
vt 0.374999 0.249999
vt 0.625000 0.750000
vt 0.375000 0.750000
vt 0.625000 1.000000
vt 0.375000 1.000000
vt 0.875000 0.000000
vt 0.125000 0.000000
vt 0.375000 0.000000
vt 0.625000 0.000000
vt 0.620753 0.254245
vt 0.374999 0.249999
vt 0.625000 0.750000
vt 0.375000 0.750000
vt 0.625000 1.000000
vt 0.375000 1.000000
vt 0.875000 0.000000
vt 0.125000 0.000000
vt 0.375000 0.000000
vt 0.625000 0.000000
vt 0.620753 0.254245
vt 0.374999 0.249999
vt 0.625000 0.750000
vt 0.375000 0.750000
vt 0.625000 1.000000
vt 0.375000 1.000000
vt 0.875000 0.000000
vt 0.125000 0.000000
vt 0.375000 0.000000
vt 0.625000 0.000000
vt 0.620753 0.254245
vt 0.374999 0.249999
vt 0.625000 0.750000
vt 0.375000 0.750000
vt 0.625000 1.000000
vt 0.375000 1.000000
vt 0.875000 0.000000
vt 0.125000 0.000000
vt 0.375000 0.000000
vt 0.625000 0.000000
vt 0.620753 0.254245
vt 0.374999 0.249999
vt 0.625000 0.750000
vt 0.375000 0.750000
vt 0.625000 1.000000
vt 0.375000 1.000000
vt 0.875000 0.000000
vt 0.125000 0.000000
vt 0.375000 0.000000
vt 0.625000 0.000000
vt 0.620753 0.254245
vt 0.374999 0.249999
vt 0.625000 0.750000
vt 0.375000 0.750000
vt 0.625000 1.000000
vt 0.375000 1.000000
vt 0.875000 0.000000
vt 0.125000 0.000000
vt 0.375000 0.000000
vt 0.625000 0.000000
vt 0.620753 0.254245
vt 0.374999 0.249999
vt 0.625000 0.750000
vt 0.375000 0.750000
vt 0.625000 1.000000
vt 0.375000 1.000000
vt 0.875000 0.000000
vt 0.125000 0.000000
vt 0.375000 0.000000
vt 0.625000 0.000000
vt 0.620753 0.254245
vt 0.374999 0.249999
vt 0.625000 0.750000
vt 0.375000 0.750000
vt 0.625000 1.000000
vt 0.375000 1.000000
vt 0.875000 0.000000
vt 0.125000 0.000000
vt 0.375000 0.000000
vt 0.625000 0.000000
vt 0.620753 0.254245
vt 0.374999 0.249999
vt 0.625000 0.750000
vt 0.375000 0.750000
vt 0.625000 1.000000
vt 0.375000 1.000000
vt 0.875000 0.000000
vt 0.125000 0.000000
vt 0.375000 0.000000
vt 0.625000 0.000000
vt 0.620753 0.254245
vt 0.374999 0.249999
vt 0.625000 0.750000
vt 0.375000 0.750000
vt 0.625000 1.000000
vt 0.375000 1.000000
vt 0.875000 0.000000
vt 0.125000 0.000000
vt 0.375000 0.000000
vt 0.625000 0.000000
vt 0.620753 0.254245
vt 0.374999 0.249999
vt 0.625000 0.750000
vt 0.375000 0.750000
vt 0.625000 1.000000
vt 0.375000 1.000000
vt 0.875000 0.000000
vt 0.125000 0.000000
vt 0.375000 0.000000
vt 0.625000 0.000000
vt 0.620753 0.254245
vt 0.374999 0.249999
vt 0.625000 0.750000
vt 0.375000 0.750000
vt 0.625000 1.000000
vt 0.375000 1.000000
vt 0.875000 0.000000
vt 0.125000 0.000000
vt 0.375000 0.000000
vt 0.625000 0.000000
vt 0.620753 0.254245
vt 0.374999 0.249999
vt 0.625000 0.750000
vt 0.375000 0.750000
vt 0.625000 1.000000
vt 0.375000 1.000000
vt 0.875000 0.000000
vt 0.125000 0.000000
vt 0.375000 0.000000
vt 0.625000 0.000000
vt 0.620753 0.254245
vt 0.374999 0.249999
vt 0.625000 0.750000
vt 0.375000 0.750000
vt 0.625000 1.000000
vt 0.375000 1.000000
vt 0.875000 0.000000
vt 0.125000 0.000000
vt 0.375000 0.000000
vt 0.625000 0.000000
vt 0.620753 0.254245
vt 0.374999 0.249999
vt 0.625000 0.750000
vt 0.375000 0.750000
vt 0.625000 1.000000
vt 0.375000 1.000000
vt 0.875000 0.000000
vt 0.125000 0.000000
vt 0.375000 0.000000
vt 0.625000 0.000000
vt 0.620753 0.254245
vt 0.374999 0.249999
vt 0.625000 0.750000
vt 0.375000 0.750000
vt 0.625000 1.000000
vt 0.375000 1.000000
vt 0.875000 0.000000
vt 0.125000 0.000000
vt 0.375000 0.000000
vt 0.625000 0.000000
vt 0.620753 0.254245
vt 0.374999 0.249999
vt 0.625000 0.750000
vt 0.375000 0.750000
vt 0.625000 1.000000
vt 0.375000 1.000000
vt 0.875000 0.000000
vt 0.125000 0.000000
vt 0.375000 0.000000
vt 0.625000 0.000000
vt 0.620753 0.254245
vt 0.374999 0.249999
vt 0.625000 0.750000
vt 0.375000 0.750000
vt 0.625000 1.000000
vt 0.375000 1.000000
vt 0.875000 0.000000
vt 0.125000 0.000000
vt 0.375000 0.000000
vt 0.625000 0.000000
vt 0.620753 0.254245
vt 0.374999 0.249999
vt 0.625000 0.750000
vt 0.375000 0.750000
vt 0.625000 1.000000
vt 0.375000 1.000000
vt 0.875000 0.000000
vt 0.125000 0.000000
vt 0.375000 0.000000
vt 0.625000 0.000000
vt 0.620753 0.254245
vt 0.374999 0.249999
vt 0.625000 0.750000
vt 0.375000 0.750000
vt 0.625000 1.000000
vt 0.375000 1.000000
vt 0.875000 0.000000
vt 0.125000 0.000000
vt 0.375000 0.000000
vt 0.625000 0.000000
vt 0.620753 0.254245
vt 0.374999 0.249999
vt 0.625000 0.750000
vt 0.375000 0.750000
vt 0.625000 1.000000
vt 0.375000 1.000000
vt 0.875000 0.000000
vt 0.125000 0.000000
vt 0.375000 0.000000
vt 0.625000 0.000000
vt 0.620753 0.254245
vt 0.374999 0.249999
vt 0.625000 0.750000
vt 0.375000 0.750000
vt 0.625000 1.000000
vt 0.375000 1.000000
vt 0.875000 0.000000
vt 0.125000 0.000000
vt 0.375000 0.000000
vt 0.625000 0.000000
vt 0.620753 0.254245
vt 0.374999 0.249999
vt 0.625000 0.750000
vt 0.375000 0.750000
vt 0.625000 1.000000
vt 0.375000 1.000000
vt 0.875000 0.000000
vt 0.125000 0.000000
vt 0.375000 0.000000
vt 0.625000 0.000000
vt 0.620753 0.254245
vt 0.374999 0.249999
vt 0.625000 0.750000
vt 0.375000 0.750000
vt 0.625000 1.000000
vt 0.375000 1.000000
vt 0.875000 0.000000
vt 0.125000 0.000000
vt 0.375000 0.000000
vt 0.625000 0.000000
vt 0.620753 0.254245
vt 0.374999 0.249999
vt 0.625000 0.750000
vt 0.375000 0.750000
vt 0.625000 1.000000
vt 0.375000 1.000000
vt 0.875000 0.000000
vt 0.125000 0.000000
vt 0.375000 0.000000
vt 0.625000 0.000000
vt 0.620753 0.254245
vt 0.374999 0.249999
vt 0.625000 0.750000
vt 0.375000 0.750000
vt 0.625000 1.000000
vt 0.375000 1.000000
vt 0.875000 0.000000
vt 0.125000 0.000000
vt 0.375000 0.000000
vt 0.625000 0.000000
vt 0.620753 0.254245
vt 0.374999 0.249999
vt 0.625000 0.750000
vt 0.375000 0.750000
vt 0.625000 1.000000
vt 0.375000 1.000000
vt 0.875000 0.000000
vt 0.125000 0.000000
vt 0.375000 0.000000
vt 0.625000 0.000000
vt 0.620753 0.254245
vt 0.374999 0.249999
vt 0.625000 0.750000
vt 0.375000 0.750000
vt 0.625000 1.000000
vt 0.375000 1.000000
vt 0.875000 0.000000
vt 0.125000 0.000000
vt 0.375000 0.000000
vt 0.625000 0.000000
vt 0.620753 0.254245
vt 0.374999 0.249999
vt 0.625000 0.750000
vt 0.375000 0.750000
vt 0.625000 1.000000
vt 0.375000 1.000000
vt 0.875000 0.000000
vt 0.125000 0.000000
vt 0.375000 0.000000
vt 0.625000 0.000000
vt 0.620753 0.254245
vt 0.374999 0.249999
vt 0.625000 0.750000
vt 0.375000 0.750000
vt 0.625000 1.000000
vt 0.375000 1.000000
vt 0.875000 0.000000
vt 0.125000 0.000000
vt 0.375000 0.000000
vt 0.625000 0.000000
vt 0.620753 0.254245
vt 0.374999 0.249999
vt 0.625000 0.750000
vt 0.375000 0.750000
vt 0.625000 1.000000
vt 0.375000 1.000000
vt 0.875000 0.000000
vt 0.125000 0.000000
vt 0.375000 0.000000
vt 0.625000 0.000000
vt 0.620753 0.254245
vt 0.374999 0.249999
vt 0.625000 0.750000
vt 0.375000 0.750000
vt 0.625000 1.000000
vt 0.375000 1.000000
vt 0.875000 0.000000
vt 0.125000 0.000000
vt 0.375000 0.000000
vt 0.625000 0.000000
vt 0.620753 0.254245
vt 0.374999 0.249999
vt 0.625000 0.750000
vt 0.375000 0.750000
vt 0.625000 1.000000
vt 0.375000 1.000000
vt 0.875000 0.000000
vt 0.125000 0.000000
vt 0.375000 0.000000
vt 0.625000 0.000000
vt 0.620753 0.254245
vt 0.374999 0.249999
vt 0.625000 0.750000
vt 0.375000 0.750000
vt 0.625000 1.000000
vt 0.375000 1.000000
vt 0.875000 0.000000
vt 0.125000 0.000000
vt 0.375000 0.000000
vt 0.625000 0.000000
vt 0.620753 0.254245
vt 0.374999 0.249999
vt 0.625000 0.750000
vt 0.375000 0.750000
vt 0.625000 1.000000
vt 0.375000 1.000000
vt 0.875000 0.000000
vt 0.125000 0.000000
vt 0.375000 0.000000
vt 0.625000 0.000000
vt 0.620753 0.254245
vt 0.374999 0.249999
vt 0.625000 0.750000
vt 0.375000 0.750000
vt 0.625000 1.000000
vt 0.375000 1.000000
vt 0.875000 0.000000
vt 0.125000 0.000000
vt 0.375000 0.000000
vt 0.625000 0.000000
vt 0.620753 0.254245
vt 0.374999 0.249999
vt 0.625000 0.750000
vt 0.375000 0.750000
vt 0.625000 1.000000
vt 0.375000 1.000000
vt 0.875000 0.000000
vt 0.125000 0.000000
vt 0.375000 0.000000
vt 0.625000 0.000000
vt 0.620753 0.254245
vt 0.374999 0.249999
vt 0.625000 0.750000
vt 0.375000 0.750000
vt 0.625000 1.000000
vt 0.375000 1.000000
vt 0.875000 0.000000
vt 0.125000 0.000000
vt 0.375000 0.000000
vt 0.625000 0.000000
vt 0.620753 0.254245
vt 0.374999 0.249999
vt 0.625000 0.750000
vt 0.375000 0.750000
vt 0.625000 1.000000
vt 0.375000 1.000000
vt 0.875000 0.000000
vt 0.125000 0.000000
vt 0.375000 0.000000
vt 0.625000 0.000000
vt 0.620753 0.254245
vt 0.374999 0.249999
vt 0.625000 0.750000
vt 0.375000 0.750000
vt 0.625000 1.000000
vt 0.375000 1.000000
vt 0.875000 0.000000
vt 0.125000 0.000000
vn -1.000000 0.000000 -0.000000
vn -1.000000 0.000000 -0.000000
vn -1.000000 0.000000 -0.000000
vn -1.000000 0.000000 -0.000000
vn 0.980186 0.198078 0.000000
vn 0.980186 0.198078 0.000000
vn 0.980186 0.198078 0.000000
vn 0.980186 0.198078 0.000000
vn 0.000000 -1.000000 0.000000
vn 0.000000 -1.000000 0.000000
vn 0.000000 -1.000000 0.000000
vn 0.000000 -1.000000 0.000000
vn -0.000000 0.000000 1.000000
vn -0.000000 0.000000 1.000000
vn -0.000000 0.000000 1.000000
vn 0.000000 0.000000 -1.000000
vn 0.000000 0.000000 -1.000000
vn 0.000000 0.000000 -1.000000
vn -1.000000 0.000000 -0.000000
vn -1.000000 0.000000 -0.000000
vn -1.000000 0.000000 -0.000000
vn -1.000000 0.000000 -0.000000
vn 0.980186 0.198078 0.000000
vn 0.980186 0.198078 0.000000
vn 0.980186 0.198078 0.000000
vn 0.980186 0.198078 0.000000
vn 0.000000 -1.000000 0.000000
vn 0.000000 -1.000000 0.000000
vn 0.000000 -1.000000 0.000000
vn 0.000000 -1.000000 0.000000
vn -0.000000 0.000000 1.000000
vn -0.000000 0.000000 1.000000
vn -0.000000 0.000000 1.000000
vn 0.000000 0.000000 -1.000000
vn 0.000000 0.000000 -1.000000
vn 0.000000 0.000000 -1.000000
vn 0.000000 0.000000 -1.000000
vn 0.000000 0.000000 -1.000000
vn 0.000000 0.000000 -1.000000
vn 0.000000 0.000000 -1.000000
vn -0.000000 0.198078 0.980186
vn -0.000000 0.198078 0.980186
vn -0.000000 0.198078 0.980186
vn -0.000000 0.198078 0.980186
vn 0.000000 -1.000000 0.000000
vn 0.000000 -1.000000 0.000000
vn 0.000000 -1.000000 0.000000
vn 0.000000 -1.000000 0.000000
vn -1.000000 0.000000 -0.000000
vn -1.000000 0.000000 -0.000000
vn -1.000000 0.000000 -0.000000
vn 1.000000 0.000000 0.000000
vn 1.000000 0.000000 0.000000
vn 1.000000 0.000000 0.000000
vn 0.000000 0.000000 -1.000000
vn 0.000000 0.000000 -1.000000
vn 0.000000 0.000000 -1.000000
vn 0.000000 0.000000 -1.000000
vn -0.000000 0.198078 0.980186
vn -0.000000 0.198078 0.980186
vn -0.000000 0.198078 0.980186
vn -0.000000 0.198078 0.980186
vn 0.000000 -1.000000 0.000000
vn 0.000000 -1.000000 0.000000
vn 0.000000 -1.000000 0.000000
vn 0.000000 -1.000000 0.000000
vn -1.000000 0.000000 -0.000000
vn -1.000000 0.000000 -0.000000
vn -1.000000 0.000000 -0.000000
vn 1.000000 0.000000 0.000000
vn 1.000000 0.000000 0.000000
vn 1.000000 0.000000 0.000000
vn -1.000000 0.000000 0.000000
vn -1.000000 0.000000 0.000000
vn -1.000000 0.000000 0.000000
vn -1.000000 0.000000 0.000000
vn 0.989128 0.147057 -0.000000
vn 0.989128 0.147057 -0.000000
vn 0.989128 0.147057 -0.000000
vn 0.989128 0.147057 -0.000000
vn 0.000000 -1.000000 0.000000
vn 0.000000 -1.000000 0.000000
vn 0.000000 -1.000000 0.000000
vn 0.000000 -1.000000 0.000000
vn 0.000000 0.000000 1.000000
vn 0.000000 0.000000 1.000000
vn 0.000000 0.000000 1.000000
vn -0.000000 0.000000 -1.000000
vn -0.000000 0.000000 -1.000000
vn -0.000000 0.000000 -1.000000
vn 1.000000 0.000000 0.000000
vn 1.000000 0.000000 0.000000
vn 1.000000 0.000000 0.000000
vn 1.000000 0.000000 0.000000
vn -0.989128 0.147057 -0.000000
vn -0.989128 0.147057 -0.000000
vn -0.989128 0.147057 -0.000000
vn -0.989128 0.147057 -0.000000
vn 0.000000 -1.000000 0.000000
vn 0.000000 -1.000000 0.000000
vn 0.000000 -1.000000 0.000000
vn 0.000000 -1.000000 0.000000
vn 0.000000 0.000000 -1.000000
vn 0.000000 0.000000 -1.000000
vn 0.000000 0.000000 -1.000000
vn -0.000000 0.000000 1.000000
vn -0.000000 0.000000 1.000000
vn -0.000000 0.000000 1.000000
vn 1.000000 0.000000 0.000000
vn 1.000000 0.000000 0.000000
vn 1.000000 0.000000 0.000000
vn 1.000000 0.000000 0.000000
vn -0.989128 0.147057 -0.000000
vn -0.989128 0.147057 -0.000000
vn -0.989128 0.147057 -0.000000
vn -0.989128 0.147057 -0.000000
vn 0.000000 -1.000000 0.000000
vn 0.000000 -1.000000 0.000000
vn 0.000000 -1.000000 0.000000
vn 0.000000 -1.000000 0.000000
vn 0.000000 0.000000 -1.000000
vn 0.000000 0.000000 -1.000000
vn 0.000000 0.000000 -1.000000
vn -0.000000 0.000000 1.000000
vn -0.000000 0.000000 1.000000
vn -0.000000 0.000000 1.000000
vn -1.000000 0.000000 0.000000
vn -1.000000 0.000000 0.000000
vn -1.000000 0.000000 0.000000
vn -1.000000 0.000000 0.000000
vn 0.989128 0.147057 -0.000000
vn 0.989128 0.147057 -0.000000
vn 0.989128 0.147057 -0.000000
vn 0.989128 0.147057 -0.000000
vn 0.000000 -1.000000 0.000000
vn 0.000000 -1.000000 0.000000
vn 0.000000 -1.000000 0.000000
vn 0.000000 -1.000000 0.000000
vn 0.000000 0.000000 1.000000
vn 0.000000 0.000000 1.000000
vn 0.000000 0.000000 1.000000
vn -0.000000 0.000000 -1.000000
vn -0.000000 0.000000 -1.000000
vn -0.000000 0.000000 -1.000000
vn -1.000000 0.000000 0.000000
vn -1.000000 0.000000 0.000000
vn -1.000000 0.000000 0.000000
vn -1.000000 0.000000 0.000000
vn 0.989128 0.147057 -0.000000
vn 0.989128 0.147057 -0.000000
vn 0.989128 0.147057 -0.000000
vn 0.989128 0.147057 -0.000000
vn 0.000000 -1.000000 0.000000
vn 0.000000 -1.000000 0.000000
vn 0.000000 -1.000000 0.000000
vn 0.000000 -1.000000 0.000000
vn 0.000000 0.000000 1.000000
vn 0.000000 0.000000 1.000000
vn 0.000000 0.000000 1.000000
vn -0.000000 0.000000 -1.000000
vn -0.000000 0.000000 -1.000000
vn -0.000000 0.000000 -1.000000
vn 0.000000 0.000000 1.000000
vn 0.000000 0.000000 1.000000
vn 0.000000 0.000000 1.000000
vn 0.000000 0.000000 1.000000
vn 0.000000 0.198078 -0.980186
vn 0.000000 0.198078 -0.980186
vn 0.000000 0.198078 -0.980186
vn 0.000000 0.198078 -0.980186
vn 0.000000 -1.000000 0.000000
vn 0.000000 -1.000000 0.000000
vn 0.000000 -1.000000 0.000000
vn 0.000000 -1.000000 0.000000
vn 1.000000 0.000000 0.000000
vn 1.000000 0.000000 0.000000
vn 1.000000 0.000000 0.000000
vn -1.000000 0.000000 0.000000
vn -1.000000 0.000000 0.000000
vn -1.000000 0.000000 0.000000
vn -1.000000 0.000000 -0.000000
vn -1.000000 0.000000 -0.000000
vn -1.000000 0.000000 -0.000000
vn -1.000000 0.000000 -0.000000
vn 0.989128 0.147057 0.000000
vn 0.989128 0.147057 0.000000
vn 0.989128 0.147057 0.000000
vn 0.989128 0.147057 0.000000
vn 0.000000 -1.000000 0.000000
vn 0.000000 -1.000000 0.000000
vn 0.000000 -1.000000 0.000000
vn 0.000000 -1.000000 0.000000
vn -0.000000 0.000000 1.000000
vn -0.000000 0.000000 1.000000
vn -0.000000 0.000000 1.000000
vn 0.000000 0.000000 -1.000000
vn 0.000000 0.000000 -1.000000
vn 0.000000 0.000000 -1.000000
vn 0.000000 0.000000 -1.000000
vn 0.000000 0.000000 -1.000000
vn 0.000000 0.000000 -1.000000
vn 0.000000 0.000000 -1.000000
vn -0.000000 0.147057 0.989128
vn -0.000000 0.147057 0.989128
vn -0.000000 0.147057 0.989128
vn -0.000000 0.147057 0.989128
vn 0.000000 -1.000000 0.000000
vn 0.000000 -1.000000 0.000000
vn 0.000000 -1.000000 0.000000
vn 0.000000 -1.000000 0.000000
vn -1.000000 0.000000 -0.000000
vn -1.000000 0.000000 -0.000000
vn -1.000000 0.000000 -0.000000
vn 1.000000 0.000000 0.000000
vn 1.000000 0.000000 0.000000
vn 1.000000 0.000000 0.000000
vn 0.000000 0.000000 -1.000000
vn 0.000000 0.000000 -1.000000
vn 0.000000 0.000000 -1.000000
vn 0.000000 0.000000 -1.000000
vn -0.000000 0.147057 0.989128
vn -0.000000 0.147057 0.989128
vn -0.000000 0.147057 0.989128
vn -0.000000 0.147057 0.989128
vn 0.000000 -1.000000 0.000000
vn 0.000000 -1.000000 0.000000
vn 0.000000 -1.000000 0.000000
vn 0.000000 -1.000000 0.000000
vn -1.000000 0.000000 -0.000000
vn -1.000000 0.000000 -0.000000
vn -1.000000 0.000000 -0.000000
vn 1.000000 0.000000 0.000000
vn 1.000000 0.000000 0.000000
vn 1.000000 0.000000 0.000000
vn 0.000000 0.000000 -1.000000
vn 0.000000 0.000000 -1.000000
vn 0.000000 0.000000 -1.000000
vn 0.000000 0.000000 -1.000000
vn -0.000000 0.147057 0.989128
vn -0.000000 0.147057 0.989128
vn -0.000000 0.147057 0.989128
vn -0.000000 0.147057 0.989128
vn 0.000000 -1.000000 0.000000
vn 0.000000 -1.000000 0.000000
vn 0.000000 -1.000000 0.000000
vn 0.000000 -1.000000 0.000000
vn -1.000000 0.000000 -0.000000
vn -1.000000 0.000000 -0.000000
vn -1.000000 0.000000 -0.000000
vn 1.000000 0.000000 0.000000
vn 1.000000 0.000000 0.000000
vn 1.000000 0.000000 0.000000
vn 0.000000 0.000000 -1.000000
vn 0.000000 0.000000 -1.000000
vn 0.000000 0.000000 -1.000000
vn 0.000000 0.000000 -1.000000
vn -0.000000 0.147057 0.989128
vn -0.000000 0.147057 0.989128
vn -0.000000 0.147057 0.989128
vn -0.000000 0.147057 0.989128
vn 0.000000 -1.000000 0.000000
vn 0.000000 -1.000000 0.000000
vn 0.000000 -1.000000 0.000000
vn 0.000000 -1.000000 0.000000
vn -1.000000 0.000000 -0.000000
vn -1.000000 0.000000 -0.000000
vn -1.000000 0.000000 -0.000000
vn 1.000000 0.000000 0.000000
vn 1.000000 0.000000 0.000000
vn 1.000000 0.000000 0.000000
vn 1.000000 0.000000 0.000000
vn 1.000000 0.000000 0.000000
vn 1.000000 0.000000 0.000000
vn 1.000000 0.000000 0.000000
vn -0.989128 0.147057 -0.000000
vn -0.989128 0.147057 -0.000000
vn -0.989128 0.147057 -0.000000
vn -0.989128 0.147057 -0.000000
vn 0.000000 -1.000000 0.000000
vn 0.000000 -1.000000 0.000000
vn 0.000000 -1.000000 0.000000
vn 0.000000 -1.000000 0.000000
vn 0.000000 0.000000 -1.000000
vn 0.000000 0.000000 -1.000000
vn 0.000000 0.000000 -1.000000
vn -0.000000 0.000000 1.000000
vn -0.000000 0.000000 1.000000
vn -0.000000 0.000000 1.000000
vn 1.000000 0.000000 0.000000
vn 1.000000 0.000000 0.000000
vn 1.000000 0.000000 0.000000
vn 1.000000 0.000000 0.000000
vn -0.989128 0.147057 -0.000000
vn -0.989128 0.147057 -0.000000
vn -0.989128 0.147057 -0.000000
vn -0.989128 0.147057 -0.000000
vn 0.000000 -1.000000 0.000000
vn 0.000000 -1.000000 0.000000
vn 0.000000 -1.000000 0.000000
vn 0.000000 -1.000000 0.000000
vn 0.000000 0.000000 -1.000000
vn 0.000000 0.000000 -1.000000
vn 0.000000 0.000000 -1.000000
vn -0.000000 0.000000 1.000000
vn -0.000000 0.000000 1.000000
vn -0.000000 0.000000 1.000000
vn 1.000000 0.000000 0.000000
vn 1.000000 0.000000 0.000000
vn 1.000000 0.000000 0.000000
vn 1.000000 0.000000 0.000000
vn -0.989128 0.147057 -0.000000
vn -0.989128 0.147057 -0.000000
vn -0.989128 0.147057 -0.000000
vn -0.989128 0.147057 -0.000000
vn 0.000000 -1.000000 0.000000
vn 0.000000 -1.000000 0.000000
vn 0.000000 -1.000000 0.000000
vn 0.000000 -1.000000 0.000000
vn 0.000000 0.000000 -1.000000
vn 0.000000 0.000000 -1.000000
vn 0.000000 0.000000 -1.000000
vn -0.000000 0.000000 1.000000
vn -0.000000 0.000000 1.000000
vn -0.000000 0.000000 1.000000
vn 1.000000 0.000000 0.000000
vn 1.000000 0.000000 0.000000
vn 1.000000 0.000000 0.000000
vn 1.000000 0.000000 0.000000
vn -0.989128 0.147057 -0.000000
vn -0.989128 0.147057 -0.000000
vn -0.989128 0.147057 -0.000000
vn -0.989128 0.147057 -0.000000
vn 0.000000 -1.000000 0.000000
vn 0.000000 -1.000000 0.000000
vn 0.000000 -1.000000 0.000000
vn 0.000000 -1.000000 0.000000
vn 0.000000 0.000000 -1.000000
vn 0.000000 0.000000 -1.000000
vn 0.000000 0.000000 -1.000000
vn -0.000000 0.000000 1.000000
vn -0.000000 0.000000 1.000000
vn -0.000000 0.000000 1.000000
vn 1.000000 0.000000 0.000000
vn 1.000000 0.000000 0.000000
vn 1.000000 0.000000 0.000000
vn 1.000000 0.000000 0.000000
vn -0.989128 0.147057 -0.000000
vn -0.989128 0.147057 -0.000000
vn -0.989128 0.147057 -0.000000
vn -0.989128 0.147057 -0.000000
vn 0.000000 -1.000000 0.000000
vn 0.000000 -1.000000 0.000000
vn 0.000000 -1.000000 0.000000
vn 0.000000 -1.000000 0.000000
vn 0.000000 0.000000 -1.000000
vn 0.000000 0.000000 -1.000000
vn 0.000000 0.000000 -1.000000
vn -0.000000 0.000000 1.000000
vn -0.000000 0.000000 1.000000
vn -0.000000 0.000000 1.000000
vn 0.000000 0.000000 1.000000
vn 0.000000 0.000000 1.000000
vn 0.000000 0.000000 1.000000
vn 0.000000 0.000000 1.000000
vn 0.000000 0.147057 -0.989128
vn 0.000000 0.147057 -0.989128
vn 0.000000 0.147057 -0.989128
vn 0.000000 0.147057 -0.989128
vn 0.000000 -1.000000 0.000000
vn 0.000000 -1.000000 0.000000
vn 0.000000 -1.000000 0.000000
vn 0.000000 -1.000000 0.000000
vn 1.000000 0.000000 0.000000
vn 1.000000 0.000000 0.000000
vn 1.000000 0.000000 0.000000
vn -1.000000 0.000000 0.000000
vn -1.000000 0.000000 0.000000
vn -1.000000 0.000000 0.000000
vn 0.000000 0.000000 1.000000
vn 0.000000 0.000000 1.000000
vn 0.000000 0.000000 1.000000
vn 0.000000 0.000000 1.000000
vn 0.000000 0.147057 -0.989128
vn 0.000000 0.147057 -0.989128
vn 0.000000 0.147057 -0.989128
vn 0.000000 0.147057 -0.989128
vn 0.000000 -1.000000 0.000000
vn 0.000000 -1.000000 0.000000
vn 0.000000 -1.000000 0.000000
vn 0.000000 -1.000000 0.000000
vn 1.000000 0.000000 0.000000
vn 1.000000 0.000000 0.000000
vn 1.000000 0.000000 0.000000
vn -1.000000 0.000000 0.000000
vn -1.000000 0.000000 0.000000
vn -1.000000 0.000000 0.000000
vn 0.000000 0.000000 1.000000
vn 0.000000 0.000000 1.000000
vn 0.000000 0.000000 1.000000
vn 0.000000 0.000000 1.000000
vn 0.000000 0.147057 -0.989128
vn 0.000000 0.147057 -0.989128
vn 0.000000 0.147057 -0.989128
vn 0.000000 0.147057 -0.989128
vn 0.000000 -1.000000 0.000000
vn 0.000000 -1.000000 0.000000
vn 0.000000 -1.000000 0.000000
vn 0.000000 -1.000000 0.000000
vn 1.000000 0.000000 0.000000
vn 1.000000 0.000000 0.000000
vn 1.000000 0.000000 0.000000
vn -1.000000 0.000000 0.000000
vn -1.000000 0.000000 0.000000
vn -1.000000 0.000000 0.000000
vn 0.000000 0.000000 1.000000
vn 0.000000 0.000000 1.000000
vn 0.000000 0.000000 1.000000
vn 0.000000 0.000000 1.000000
vn 0.000000 0.147057 -0.989128
vn 0.000000 0.147057 -0.989128
vn 0.000000 0.147057 -0.989128
vn 0.000000 0.147057 -0.989128
vn 0.000000 -1.000000 0.000000
vn 0.000000 -1.000000 0.000000
vn 0.000000 -1.000000 0.000000
vn 0.000000 -1.000000 0.000000
vn 1.000000 0.000000 0.000000
vn 1.000000 0.000000 0.000000
vn 1.000000 0.000000 0.000000
vn -1.000000 0.000000 0.000000
vn -1.000000 0.000000 0.000000
vn -1.000000 0.000000 0.000000
vn 0.000000 0.000000 1.000000
vn 0.000000 0.000000 1.000000
vn 0.000000 0.000000 1.000000
vn 0.000000 0.000000 1.000000
vn 0.000000 0.147057 -0.989128
vn 0.000000 0.147057 -0.989128
vn 0.000000 0.147057 -0.989128
vn 0.000000 0.147057 -0.989128
vn 0.000000 -1.000000 0.000000
vn 0.000000 -1.000000 0.000000
vn 0.000000 -1.000000 0.000000
vn 0.000000 -1.000000 0.000000
vn 1.000000 0.000000 0.000000
vn 1.000000 0.000000 0.000000
vn 1.000000 0.000000 0.000000
vn -1.000000 0.000000 0.000000
vn -1.000000 0.000000 0.000000
vn -1.000000 0.000000 0.000000
vn -1.000000 0.000000 -0.000000
vn -1.000000 0.000000 -0.000000
vn -1.000000 0.000000 -0.000000
vn -1.000000 0.000000 -0.000000
vn 0.989128 0.147057 0.000000
vn 0.989128 0.147057 0.000000
vn 0.989128 0.147057 0.000000
vn 0.989128 0.147057 0.000000
vn 0.000000 -1.000000 0.000000
vn 0.000000 -1.000000 0.000000
vn 0.000000 -1.000000 0.000000
vn 0.000000 -1.000000 0.000000
vn -0.000000 0.000000 1.000000
vn -0.000000 0.000000 1.000000
vn -0.000000 0.000000 1.000000
vn 0.000000 0.000000 -1.000000
vn 0.000000 0.000000 -1.000000
vn 0.000000 0.000000 -1.000000
vn -1.000000 0.000000 -0.000000
vn -1.000000 0.000000 -0.000000
vn -1.000000 0.000000 -0.000000
vn -1.000000 0.000000 -0.000000
vn 0.989128 0.147057 0.000000
vn 0.989128 0.147057 0.000000
vn 0.989128 0.147057 0.000000
vn 0.989128 0.147057 0.000000
vn 0.000000 -1.000000 0.000000
vn 0.000000 -1.000000 0.000000
vn 0.000000 -1.000000 0.000000
vn 0.000000 -1.000000 0.000000
vn -0.000000 0.000000 1.000000
vn -0.000000 0.000000 1.000000
vn -0.000000 0.000000 1.000000
vn 0.000000 0.000000 -1.000000
vn 0.000000 0.000000 -1.000000
vn 0.000000 0.000000 -1.000000
vn -1.000000 0.000000 -0.000000
vn -1.000000 0.000000 -0.000000
vn -1.000000 0.000000 -0.000000
vn -1.000000 0.000000 -0.000000
vn 0.989128 0.147057 0.000000
vn 0.989128 0.147057 0.000000
vn 0.989128 0.147057 0.000000
vn 0.989128 0.147057 0.000000
vn 0.000000 -1.000000 0.000000
vn 0.000000 -1.000000 0.000000
vn 0.000000 -1.000000 0.000000
vn 0.000000 -1.000000 0.000000
vn -0.000000 0.000000 1.000000
vn -0.000000 0.000000 1.000000
vn -0.000000 0.000000 1.000000
vn 0.000000 0.000000 -1.000000
vn 0.000000 0.000000 -1.000000
vn 0.000000 0.000000 -1.000000
vn -1.000000 0.000000 -0.000000
vn -1.000000 0.000000 -0.000000
vn -1.000000 0.000000 -0.000000
vn -1.000000 0.000000 -0.000000
vn 0.989128 0.147057 0.000000
vn 0.989128 0.147057 0.000000
vn 0.989128 0.147057 0.000000
vn 0.989128 0.147057 0.000000
vn 0.000000 -1.000000 0.000000
vn 0.000000 -1.000000 0.000000
vn 0.000000 -1.000000 0.000000
vn 0.000000 -1.000000 0.000000
vn -0.000000 0.000000 1.000000
vn -0.000000 0.000000 1.000000
vn -0.000000 0.000000 1.000000
vn 0.000000 0.000000 -1.000000
vn 0.000000 0.000000 -1.000000
vn 0.000000 0.000000 -1.000000
vn 0.000000 0.000000 -1.000000
vn 0.000000 0.000000 -1.000000
vn 0.000000 0.000000 -1.000000
vn 0.000000 0.000000 -1.000000
vn -0.000000 0.198078 0.980186
vn -0.000000 0.198078 0.980186
vn -0.000000 0.198078 0.980186
vn -0.000000 0.198078 0.980186
vn 0.000000 -1.000000 0.000000
vn 0.000000 -1.000000 0.000000
vn 0.000000 -1.000000 0.000000
vn 0.000000 -1.000000 0.000000
vn -1.000000 0.000000 -0.000000
vn -1.000000 0.000000 -0.000000
vn -1.000000 0.000000 -0.000000
vn 1.000000 0.000000 0.000000
vn 1.000000 0.000000 0.000000
vn 1.000000 0.000000 0.000000
vn 0.000000 0.000000 -1.000000
vn 0.000000 0.000000 -1.000000
vn 0.000000 0.000000 -1.000000
vn 0.000000 0.000000 -1.000000
vn -0.000000 0.147057 0.989128
vn -0.000000 0.147057 0.989128
vn -0.000000 0.147057 0.989128
vn -0.000000 0.147057 0.989128
vn 0.000000 -1.000000 0.000000
vn 0.000000 -1.000000 0.000000
vn 0.000000 -1.000000 0.000000
vn 0.000000 -1.000000 0.000000
vn -1.000000 0.000000 -0.000000
vn -1.000000 0.000000 -0.000000
vn -1.000000 0.000000 -0.000000
vn 1.000000 0.000000 0.000000
vn 1.000000 0.000000 0.000000
vn 1.000000 0.000000 0.000000
vn 0.000000 0.000000 -1.000000
vn 0.000000 0.000000 -1.000000
vn 0.000000 0.000000 -1.000000
vn 0.000000 0.000000 -1.000000
vn -0.000000 0.147057 0.989128
vn -0.000000 0.147057 0.989128
vn -0.000000 0.147057 0.989128
vn -0.000000 0.147057 0.989128
vn 0.000000 -1.000000 0.000000
vn 0.000000 -1.000000 0.000000
vn 0.000000 -1.000000 0.000000
vn 0.000000 -1.000000 0.000000
vn -1.000000 0.000000 -0.000000
vn -1.000000 0.000000 -0.000000
vn -1.000000 0.000000 -0.000000
vn 1.000000 0.000000 0.000000
vn 1.000000 0.000000 0.000000
vn 1.000000 0.000000 0.000000
vn -1.000000 0.000000 -0.000000
vn -1.000000 0.000000 -0.000000
vn -1.000000 0.000000 -0.000000
vn -1.000000 0.000000 -0.000000
vn 0.989128 0.147057 0.000000
vn 0.989128 0.147057 0.000000
vn 0.989128 0.147057 0.000000
vn 0.989128 0.147057 0.000000
vn 0.000000 -1.000000 0.000000
vn 0.000000 -1.000000 0.000000
vn 0.000000 -1.000000 0.000000
vn 0.000000 -1.000000 0.000000
vn -0.000000 0.000000 1.000000
vn -0.000000 0.000000 1.000000
vn -0.000000 0.000000 1.000000
vn 0.000000 0.000000 -1.000000
vn 0.000000 0.000000 -1.000000
vn 0.000000 0.000000 -1.000000
vn 0.000000 0.000000 -1.000000
vn 0.000000 0.000000 -1.000000
vn 0.000000 0.000000 -1.000000
vn 0.000000 0.000000 -1.000000
vn -0.000000 0.147057 0.989128
vn -0.000000 0.147057 0.989128
vn -0.000000 0.147057 0.989128
vn -0.000000 0.147057 0.989128
vn 0.000000 -1.000000 0.000000
vn 0.000000 -1.000000 0.000000
vn 0.000000 -1.000000 0.000000
vn 0.000000 -1.000000 0.000000
vn -1.000000 0.000000 -0.000000
vn -1.000000 0.000000 -0.000000
vn -1.000000 0.000000 -0.000000
vn 1.000000 0.000000 0.000000
vn 1.000000 0.000000 0.000000
vn 1.000000 0.000000 0.000000
vn 1.000000 0.000000 0.000000
vn 1.000000 0.000000 0.000000
vn 1.000000 0.000000 0.000000
vn 1.000000 0.000000 0.000000
vn -0.989128 0.147057 -0.000000
vn -0.989128 0.147057 -0.000000
vn -0.989128 0.147057 -0.000000
vn -0.989128 0.147057 -0.000000
vn 0.000000 -1.000000 0.000000
vn 0.000000 -1.000000 0.000000
vn 0.000000 -1.000000 0.000000
vn 0.000000 -1.000000 0.000000
vn 0.000000 0.000000 -1.000000
vn 0.000000 0.000000 -1.000000
vn 0.000000 0.000000 -1.000000
vn -0.000000 0.000000 1.000000
vn -0.000000 0.000000 1.000000
vn -0.000000 0.000000 1.000000
vn 1.000000 0.000000 0.000000
vn 1.000000 0.000000 0.000000
vn 1.000000 0.000000 0.000000
vn 1.000000 0.000000 0.000000
vn -0.989128 0.147057 -0.000000
vn -0.989128 0.147057 -0.000000
vn -0.989128 0.147057 -0.000000
vn -0.989128 0.147057 -0.000000
vn 0.000000 -1.000000 0.000000
vn 0.000000 -1.000000 0.000000
vn 0.000000 -1.000000 0.000000
vn 0.000000 -1.000000 0.000000
vn 0.000000 0.000000 -1.000000
vn 0.000000 0.000000 -1.000000
vn 0.000000 0.000000 -1.000000
vn -0.000000 0.000000 1.000000
vn -0.000000 0.000000 1.000000
vn -0.000000 0.000000 1.000000
vn -1.000000 0.000000 -0.000000
vn -1.000000 0.000000 -0.000000
vn -1.000000 0.000000 -0.000000
vn -1.000000 0.000000 -0.000000
vn 0.980186 0.198078 0.000000
vn 0.980186 0.198078 0.000000
vn 0.980186 0.198078 0.000000
vn 0.980186 0.198078 0.000000
vn 0.000000 -1.000000 0.000000
vn 0.000000 -1.000000 0.000000
vn 0.000000 -1.000000 0.000000
vn 0.000000 -1.000000 0.000000
vn -0.000000 0.000000 1.000000
vn -0.000000 0.000000 1.000000
vn -0.000000 0.000000 1.000000
vn 0.000000 0.000000 -1.000000
vn 0.000000 0.000000 -1.000000
vn 0.000000 0.000000 -1.000000
vn -1.000000 0.000000 -0.000000
vn -1.000000 0.000000 -0.000000
vn -1.000000 0.000000 -0.000000
vn -1.000000 0.000000 -0.000000
vn 0.980186 0.198078 0.000000
vn 0.980186 0.198078 0.000000
vn 0.980186 0.198078 0.000000
vn 0.980186 0.198078 0.000000
vn 0.000000 -1.000000 0.000000
vn 0.000000 -1.000000 0.000000
vn 0.000000 -1.000000 0.000000
vn 0.000000 -1.000000 0.000000
vn -0.000000 0.000000 1.000000
vn -0.000000 0.000000 1.000000
vn -0.000000 0.000000 1.000000
vn 0.000000 0.000000 -1.000000
vn 0.000000 0.000000 -1.000000
vn 0.000000 0.000000 -1.000000
vn -1.000000 0.000000 -0.000000
vn -1.000000 0.000000 -0.000000
vn -1.000000 0.000000 -0.000000
vn -1.000000 0.000000 -0.000000
vn 0.980186 0.198078 0.000000
vn 0.980186 0.198078 0.000000
vn 0.980186 0.198078 0.000000
vn 0.980186 0.198078 0.000000
vn 0.000000 -1.000000 0.000000
vn 0.000000 -1.000000 0.000000
vn 0.000000 -1.000000 0.000000
vn 0.000000 -1.000000 0.000000
vn -0.000000 0.000000 1.000000
vn -0.000000 0.000000 1.000000
vn -0.000000 0.000000 1.000000
vn 0.000000 0.000000 -1.000000
vn 0.000000 0.000000 -1.000000
vn 0.000000 0.000000 -1.000000
vn 0.000000 0.000000 1.000000
vn 0.000000 0.000000 1.000000
vn 0.000000 0.000000 1.000000
vn 0.000000 0.000000 1.000000
vn 0.000000 0.198078 -0.980186
vn 0.000000 0.198078 -0.980186
vn 0.000000 0.198078 -0.980186
vn 0.000000 0.198078 -0.980186
vn 0.000000 -1.000000 0.000000
vn 0.000000 -1.000000 0.000000
vn 0.000000 -1.000000 0.000000
vn 0.000000 -1.000000 0.000000
vn 1.000000 0.000000 0.000000
vn 1.000000 0.000000 0.000000
vn 1.000000 0.000000 0.000000
vn -1.000000 0.000000 0.000000
vn -1.000000 0.000000 0.000000
vn -1.000000 0.000000 0.000000
vn -1.000000 0.000000 -0.000000
vn -1.000000 0.000000 -0.000000
vn -1.000000 0.000000 -0.000000
vn -1.000000 0.000000 -0.000000
vn 0.980186 0.198078 0.000000
vn 0.980186 0.198078 0.000000
vn 0.980186 0.198078 0.000000
vn 0.980186 0.198078 0.000000
vn 0.000000 -1.000000 0.000000
vn 0.000000 -1.000000 0.000000
vn 0.000000 -1.000000 0.000000
vn 0.000000 -1.000000 0.000000
vn -0.000000 0.000000 1.000000
vn -0.000000 0.000000 1.000000
vn -0.000000 0.000000 1.000000
vn 0.000000 0.000000 -1.000000
vn 0.000000 0.000000 -1.000000
vn 0.000000 0.000000 -1.000000
vn 1.000000 0.000000 0.000000
vn 1.000000 0.000000 0.000000
vn 1.000000 0.000000 0.000000
vn 1.000000 0.000000 0.000000
vn -0.980186 0.198078 -0.000000
vn -0.980186 0.198078 -0.000000
vn -0.980186 0.198078 -0.000000
vn -0.980186 0.198078 -0.000000
vn 0.000000 -1.000000 0.000000
vn 0.000000 -1.000000 0.000000
vn 0.000000 -1.000000 0.000000
vn 0.000000 -1.000000 0.000000
vn 0.000000 0.000000 -1.000000
vn 0.000000 0.000000 -1.000000
vn 0.000000 0.000000 -1.000000
vn -0.000000 0.000000 1.000000
vn -0.000000 0.000000 1.000000
vn -0.000000 0.000000 1.000000
vn 1.000000 0.000000 0.000000
vn 1.000000 0.000000 0.000000
vn 1.000000 0.000000 0.000000
vn 1.000000 0.000000 0.000000
vn -0.980186 0.198078 -0.000000
vn -0.980186 0.198078 -0.000000
vn -0.980186 0.198078 -0.000000
vn -0.980186 0.198078 -0.000000
vn 0.000000 -1.000000 0.000000
vn 0.000000 -1.000000 0.000000
vn 0.000000 -1.000000 0.000000
vn 0.000000 -1.000000 0.000000
vn 0.000000 0.000000 -1.000000
vn 0.000000 0.000000 -1.000000
vn 0.000000 0.000000 -1.000000
vn -0.000000 0.000000 1.000000
vn -0.000000 0.000000 1.000000
vn -0.000000 0.000000 1.000000
vn 1.000000 0.000000 0.000000
vn 1.000000 0.000000 0.000000
vn 1.000000 0.000000 0.000000
vn 1.000000 0.000000 0.000000
vn -0.980186 0.198078 -0.000000
vn -0.980186 0.198078 -0.000000
vn -0.980186 0.198078 -0.000000
vn -0.980186 0.198078 -0.000000
vn 0.000000 -1.000000 0.000000
vn 0.000000 -1.000000 0.000000
vn 0.000000 -1.000000 0.000000
vn 0.000000 -1.000000 0.000000
vn 0.000000 0.000000 -1.000000
vn 0.000000 0.000000 -1.000000
vn 0.000000 0.000000 -1.000000
vn -0.000000 0.000000 1.000000
vn -0.000000 0.000000 1.000000
vn -0.000000 0.000000 1.000000
vn 1.000000 0.000000 0.000000
vn 1.000000 0.000000 0.000000
vn 1.000000 0.000000 0.000000
vn 1.000000 0.000000 0.000000
vn -0.980186 0.198078 -0.000000
vn -0.980186 0.198078 -0.000000
vn -0.980186 0.198078 -0.000000
vn -0.980186 0.198078 -0.000000
vn 0.000000 -1.000000 0.000000
vn 0.000000 -1.000000 0.000000
vn 0.000000 -1.000000 0.000000
vn 0.000000 -1.000000 0.000000
vn 0.000000 0.000000 -1.000000
vn 0.000000 0.000000 -1.000000
vn 0.000000 0.000000 -1.000000
vn -0.000000 0.000000 1.000000
vn -0.000000 0.000000 1.000000
vn -0.000000 0.000000 1.000000
vn 0.000000 0.000000 1.000000
vn 0.000000 0.000000 1.000000
vn 0.000000 0.000000 1.000000
vn 0.000000 0.000000 1.000000
vn 0.000000 0.147057 -0.989128
vn 0.000000 0.147057 -0.989128
vn 0.000000 0.147057 -0.989128
vn 0.000000 0.147057 -0.989128
vn 0.000000 -1.000000 0.000000
vn 0.000000 -1.000000 0.000000
vn 0.000000 -1.000000 0.000000
vn 0.000000 -1.000000 0.000000
vn 1.000000 0.000000 0.000000
vn 1.000000 0.000000 0.000000
vn 1.000000 0.000000 0.000000
vn -1.000000 0.000000 0.000000
vn -1.000000 0.000000 0.000000
vn -1.000000 0.000000 0.000000
vn 0.000000 0.000000 1.000000
vn 0.000000 0.000000 1.000000
vn 0.000000 0.000000 1.000000
vn 0.000000 0.000000 1.000000
vn 0.000000 0.147057 -0.989128
vn 0.000000 0.147057 -0.989128
vn 0.000000 0.147057 -0.989128
vn 0.000000 0.147057 -0.989128
vn 0.000000 -1.000000 0.000000
vn 0.000000 -1.000000 0.000000
vn 0.000000 -1.000000 0.000000
vn 0.000000 -1.000000 0.000000
vn 1.000000 0.000000 0.000000
vn 1.000000 0.000000 0.000000
vn 1.000000 0.000000 0.000000
vn -1.000000 0.000000 0.000000
vn -1.000000 0.000000 0.000000
vn -1.000000 0.000000 0.000000
vn 0.000000 0.000000 1.000000
vn 0.000000 0.000000 1.000000
vn 0.000000 0.000000 1.000000
vn 0.000000 0.000000 1.000000
vn 0.000000 0.147057 -0.989128
vn 0.000000 0.147057 -0.989128
vn 0.000000 0.147057 -0.989128
vn 0.000000 0.147057 -0.989128
vn 0.000000 -1.000000 0.000000
vn 0.000000 -1.000000 0.000000
vn 0.000000 -1.000000 0.000000
vn 0.000000 -1.000000 0.000000
vn 1.000000 0.000000 0.000000
vn 1.000000 0.000000 0.000000
vn 1.000000 0.000000 0.000000
vn -1.000000 0.000000 0.000000
vn -1.000000 0.000000 0.000000
vn -1.000000 0.000000 0.000000
vn 0.000000 0.000000 1.000000
vn 0.000000 0.000000 1.000000
vn 0.000000 0.000000 1.000000
vn 0.000000 0.000000 1.000000
vn 0.000000 0.147057 -0.989128
vn 0.000000 0.147057 -0.989128
vn 0.000000 0.147057 -0.989128
vn 0.000000 0.147057 -0.989128
vn 0.000000 -1.000000 0.000000
vn 0.000000 -1.000000 0.000000
vn 0.000000 -1.000000 0.000000
vn 0.000000 -1.000000 0.000000
vn 1.000000 0.000000 0.000000
vn 1.000000 0.000000 0.000000
vn 1.000000 0.000000 0.000000
vn -1.000000 0.000000 0.000000
vn -1.000000 0.000000 0.000000
vn -1.000000 0.000000 0.000000
vn 0.000000 0.000000 1.000000
vn 0.000000 0.000000 1.000000
vn 0.000000 0.000000 1.000000
vn 0.000000 0.000000 1.000000
vn 0.000000 0.147057 -0.989128
vn 0.000000 0.147057 -0.989128
vn 0.000000 0.147057 -0.989128
vn 0.000000 0.147057 -0.989128
vn 0.000000 -1.000000 0.000000
vn 0.000000 -1.000000 0.000000
vn 0.000000 -1.000000 0.000000
vn 0.000000 -1.000000 0.000000
vn 1.000000 0.000000 0.000000
vn 1.000000 0.000000 0.000000
vn 1.000000 0.000000 0.000000
vn -1.000000 0.000000 0.000000
vn -1.000000 0.000000 0.000000
vn -1.000000 0.000000 0.000000
vn 1.000000 0.000000 0.000000
vn 1.000000 0.000000 0.000000
vn 1.000000 0.000000 0.000000
vn 1.000000 0.000000 0.000000
vn -0.989128 0.147057 -0.000000
vn -0.989128 0.147057 -0.000000
vn -0.989128 0.147057 -0.000000
vn -0.989128 0.147057 -0.000000
vn 0.000000 -1.000000 0.000000
vn 0.000000 -1.000000 0.000000
vn 0.000000 -1.000000 0.000000
vn 0.000000 -1.000000 0.000000
vn 0.000000 0.000000 -1.000000
vn 0.000000 0.000000 -1.000000
vn 0.000000 0.000000 -1.000000
vn -0.000000 0.000000 1.000000
vn -0.000000 0.000000 1.000000
vn -0.000000 0.000000 1.000000
vn 1.000000 0.000000 0.000000
vn 1.000000 0.000000 0.000000
vn 1.000000 0.000000 0.000000
vn 1.000000 0.000000 0.000000
vn -0.980186 0.198078 -0.000000
vn -0.980186 0.198078 -0.000000
vn -0.980186 0.198078 -0.000000
vn -0.980186 0.198078 -0.000000
vn 0.000000 -1.000000 0.000000
vn 0.000000 -1.000000 0.000000
vn 0.000000 -1.000000 0.000000
vn 0.000000 -1.000000 0.000000
vn 0.000000 0.000000 -1.000000
vn 0.000000 0.000000 -1.000000
vn 0.000000 0.000000 -1.000000
vn -0.000000 0.000000 1.000000
vn -0.000000 0.000000 1.000000
vn -0.000000 0.000000 1.000000
vn -1.000000 0.000000 0.000000
vn -1.000000 0.000000 0.000000
vn -1.000000 0.000000 0.000000
vn -1.000000 0.000000 0.000000
vn 0.989128 0.147057 -0.000000
vn 0.989128 0.147057 -0.000000
vn 0.989128 0.147057 -0.000000
vn 0.989128 0.147057 -0.000000
vn 0.000000 -1.000000 0.000000
vn 0.000000 -1.000000 0.000000
vn 0.000000 -1.000000 0.000000
vn 0.000000 -1.000000 0.000000
vn 0.000000 0.000000 1.000000
vn 0.000000 0.000000 1.000000
vn 0.000000 0.000000 1.000000
vn -0.000000 0.000000 -1.000000
vn -0.000000 0.000000 -1.000000
vn -0.000000 0.000000 -1.000000
vn 1.000000 0.000000 0.000000
vn 1.000000 0.000000 0.000000
vn 1.000000 0.000000 0.000000
vn 1.000000 0.000000 0.000000
vn -0.980186 0.198078 -0.000000
vn -0.980186 0.198078 -0.000000
vn -0.980186 0.198078 -0.000000
vn -0.980186 0.198078 -0.000000
vn 0.000000 -1.000000 0.000000
vn 0.000000 -1.000000 0.000000
vn 0.000000 -1.000000 0.000000
vn 0.000000 -1.000000 0.000000
vn 0.000000 0.000000 -1.000000
vn 0.000000 0.000000 -1.000000
vn 0.000000 0.000000 -1.000000
vn -0.000000 0.000000 1.000000
vn -0.000000 0.000000 1.000000
vn -0.000000 0.000000 1.000000
s off
g Environment1_Columnas
usemtl pCube31SG
f 1/1/1 2/2/2 4/4/3 3/3/4
f 3/3/5 4/4/6 6/6/7 5/5/8
f 5/5/9 6/6/10 2/8/11 1/7/12
f 2/2/13 6/9/14 4/4/15
f 5/10/16 1/1/17 3/3/18
f 7/11/19 8/12/20 10/13/21 9/14/22
f 9/14/23 10/13/24 12/15/25 11/16/26
f 11/16/27 12/15/28 8/17/29 7/18/30
f 8/12/31 12/19/32 10/13/33
f 11/20/34 7/11/35 9/14/36
f 13/21/37 14/22/38 16/23/39 15/24/40
f 15/24/41 16/23/42 18/25/43 17/26/44
f 17/26/45 18/25/46 14/27/47 13/28/48
f 14/22/49 18/29/50 16/23/51
f 17/30/52 13/21/53 15/24/54
f 19/31/55 20/32/56 22/33/57 21/34/58
f 21/34/59 22/33/60 24/35/61 23/36/62
f 23/36/63 24/35/64 20/37/65 19/38/66
f 20/32/67 24/39/68 22/33/69
f 23/40/70 19/31/71 21/34/72
f 25/41/73 26/42/74 28/43/75 27/44/76
f 27/44/77 28/43/78 30/45/79 29/46/80
f 29/46/81 30/45/82 26/47/83 25/48/84
f 26/42/85 30/49/86 28/43/87
f 29/50/88 25/41/89 27/44/90
f 31/51/91 32/52/92 34/53/93 33/54/94
f 33/54/95 34/53/96 36/55/97 35/56/98
f 35/56/99 36/55/100 32/57/101 31/58/102
f 32/52/103 36/59/104 34/53/105
f 35/60/106 31/51/107 33/54/108
f 37/61/109 38/62/110 40/63/111 39/64/112
f 39/64/113 40/63/114 42/65/115 41/66/116
f 41/66/117 42/65/118 38/67/119 37/68/120
f 38/62/121 42/69/122 40/63/123
f 41/70/124 37/61/125 39/64/126
f 43/71/127 44/72/128 46/73/129 45/74/130
f 45/74/131 46/73/132 48/75/133 47/76/134
f 47/76/135 48/75/136 44/77/137 43/78/138
f 44/72/139 48/79/140 46/73/141
f 47/80/142 43/71/143 45/74/144
f 49/81/145 50/82/146 52/83/147 51/84/148
f 51/84/149 52/83/150 54/85/151 53/86/152
f 53/86/153 54/85/154 50/87/155 49/88/156
f 50/82/157 54/89/158 52/83/159
f 53/90/160 49/81/161 51/84/162
f 55/91/163 56/92/164 58/93/165 57/94/166
f 57/94/167 58/93/168 60/95/169 59/96/170
f 59/96/171 60/95/172 56/97/173 55/98/174
f 56/92/175 60/99/176 58/93/177
f 59/100/178 55/91/179 57/94/180
f 61/101/181 62/102/182 64/103/183 63/104/184
f 63/104/185 64/103/186 66/105/187 65/106/188
f 65/106/189 66/105/190 62/107/191 61/108/192
f 62/102/193 66/109/194 64/103/195
f 65/110/196 61/101/197 63/104/198
f 67/111/199 68/112/200 70/113/201 69/114/202
f 69/114/203 70/113/204 72/115/205 71/116/206
f 71/116/207 72/115/208 68/117/209 67/118/210
f 68/112/211 72/119/212 70/113/213
f 71/120/214 67/111/215 69/114/216
f 73/121/217 74/122/218 76/123/219 75/124/220
f 75/124/221 76/123/222 78/125/223 77/126/224
f 77/126/225 78/125/226 74/127/227 73/128/228
f 74/122/229 78/129/230 76/123/231
f 77/130/232 73/121/233 75/124/234
f 79/131/235 80/132/236 82/133/237 81/134/238
f 81/134/239 82/133/240 84/135/241 83/136/242
f 83/136/243 84/135/244 80/137/245 79/138/246
f 80/132/247 84/139/248 82/133/249
f 83/140/250 79/131/251 81/134/252
f 85/141/253 86/142/254 88/143/255 87/144/256
f 87/144/257 88/143/258 90/145/259 89/146/260
f 89/146/261 90/145/262 86/147/263 85/148/264
f 86/142/265 90/149/266 88/143/267
f 89/150/268 85/141/269 87/144/270
f 91/151/271 92/152/272 94/153/273 93/154/274
f 93/154/275 94/153/276 96/155/277 95/156/278
f 95/156/279 96/155/280 92/157/281 91/158/282
f 92/152/283 96/159/284 94/153/285
f 95/160/286 91/151/287 93/154/288
f 97/161/289 98/162/290 100/163/291 99/164/292
f 99/164/293 100/163/294 102/165/295 101/166/296
f 101/166/297 102/165/298 98/167/299 97/168/300
f 98/162/301 102/169/302 100/163/303
f 101/170/304 97/161/305 99/164/306
f 103/171/307 104/172/308 106/173/309 105/174/310
f 105/174/311 106/173/312 108/175/313 107/176/314
f 107/176/315 108/175/316 104/177/317 103/178/318
f 104/172/319 108/179/320 106/173/321
f 107/180/322 103/171/323 105/174/324
f 109/181/325 110/182/326 112/183/327 111/184/328
f 111/184/329 112/183/330 114/185/331 113/186/332
f 113/186/333 114/185/334 110/187/335 109/188/336
f 110/182/337 114/189/338 112/183/339
f 113/190/340 109/181/341 111/184/342
f 115/191/343 116/192/344 118/193/345 117/194/346
f 117/194/347 118/193/348 120/195/349 119/196/350
f 119/196/351 120/195/352 116/197/353 115/198/354
f 116/192/355 120/199/356 118/193/357
f 119/200/358 115/191/359 117/194/360
f 121/201/361 122/202/362 124/203/363 123/204/364
f 123/204/365 124/203/366 126/205/367 125/206/368
f 125/206/369 126/205/370 122/207/371 121/208/372
f 122/202/373 126/209/374 124/203/375
f 125/210/376 121/201/377 123/204/378
f 127/211/379 128/212/380 130/213/381 129/214/382
f 129/214/383 130/213/384 132/215/385 131/216/386
f 131/216/387 132/215/388 128/217/389 127/218/390
f 128/212/391 132/219/392 130/213/393
f 131/220/394 127/211/395 129/214/396
f 133/221/397 134/222/398 136/223/399 135/224/400
f 135/224/401 136/223/402 138/225/403 137/226/404
f 137/226/405 138/225/406 134/227/407 133/228/408
f 134/222/409 138/229/410 136/223/411
f 137/230/412 133/221/413 135/224/414
f 139/231/415 140/232/416 142/233/417 141/234/418
f 141/234/419 142/233/420 144/235/421 143/236/422
f 143/236/423 144/235/424 140/237/425 139/238/426
f 140/232/427 144/239/428 142/233/429
f 143/240/430 139/231/431 141/234/432
f 145/241/433 146/242/434 148/243/435 147/244/436
f 147/244/437 148/243/438 150/245/439 149/246/440
f 149/246/441 150/245/442 146/247/443 145/248/444
f 146/242/445 150/249/446 148/243/447
f 149/250/448 145/241/449 147/244/450
f 151/251/451 152/252/452 154/253/453 153/254/454
f 153/254/455 154/253/456 156/255/457 155/256/458
f 155/256/459 156/255/460 152/257/461 151/258/462
f 152/252/463 156/259/464 154/253/465
f 155/260/466 151/251/467 153/254/468
f 157/261/469 158/262/470 160/263/471 159/264/472
f 159/264/473 160/263/474 162/265/475 161/266/476
f 161/266/477 162/265/478 158/267/479 157/268/480
f 158/262/481 162/269/482 160/263/483
f 161/270/484 157/261/485 159/264/486
f 163/271/487 164/272/488 166/273/489 165/274/490
f 165/274/491 166/273/492 168/275/493 167/276/494
f 167/276/495 168/275/496 164/277/497 163/278/498
f 164/272/499 168/279/500 166/273/501
f 167/280/502 163/271/503 165/274/504
f 169/281/505 170/282/506 172/283/507 171/284/508
f 171/284/509 172/283/510 174/285/511 173/286/512
f 173/286/513 174/285/514 170/287/515 169/288/516
f 170/282/517 174/289/518 172/283/519
f 173/290/520 169/281/521 171/284/522
f 175/291/523 176/292/524 178/293/525 177/294/526
f 177/294/527 178/293/528 180/295/529 179/296/530
f 179/296/531 180/295/532 176/297/533 175/298/534
f 176/292/535 180/299/536 178/293/537
f 179/300/538 175/291/539 177/294/540
f 181/301/541 182/302/542 184/303/543 183/304/544
f 183/304/545 184/303/546 186/305/547 185/306/548
f 185/306/549 186/305/550 182/307/551 181/308/552
f 182/302/553 186/309/554 184/303/555
f 185/310/556 181/301/557 183/304/558
f 187/311/559 188/312/560 190/313/561 189/314/562
f 189/314/563 190/313/564 192/315/565 191/316/566
f 191/316/567 192/315/568 188/317/569 187/318/570
f 188/312/571 192/319/572 190/313/573
f 191/320/574 187/311/575 189/314/576
f 193/321/577 194/322/578 196/323/579 195/324/580
f 195/324/581 196/323/582 198/325/583 197/326/584
f 197/326/585 198/325/586 194/327/587 193/328/588
f 194/322/589 198/329/590 196/323/591
f 197/330/592 193/321/593 195/324/594
f 199/331/595 200/332/596 202/333/597 201/334/598
f 201/334/599 202/333/600 204/335/601 203/336/602
f 203/336/603 204/335/604 200/337/605 199/338/606
f 200/332/607 204/339/608 202/333/609
f 203/340/610 199/331/611 201/334/612
f 205/341/613 206/342/614 208/343/615 207/344/616
f 207/344/617 208/343/618 210/345/619 209/346/620
f 209/346/621 210/345/622 206/347/623 205/348/624
f 206/342/625 210/349/626 208/343/627
f 209/350/628 205/341/629 207/344/630
f 211/351/631 212/352/632 214/353/633 213/354/634
f 213/354/635 214/353/636 216/355/637 215/356/638
f 215/356/639 216/355/640 212/357/641 211/358/642
f 212/352/643 216/359/644 214/353/645
f 215/360/646 211/351/647 213/354/648
f 217/361/649 218/362/650 220/363/651 219/364/652
f 219/364/653 220/363/654 222/365/655 221/366/656
f 221/366/657 222/365/658 218/367/659 217/368/660
f 218/362/661 222/369/662 220/363/663
f 221/370/664 217/361/665 219/364/666
f 223/371/667 224/372/668 226/373/669 225/374/670
f 225/374/671 226/373/672 228/375/673 227/376/674
f 227/376/675 228/375/676 224/377/677 223/378/678
f 224/372/679 228/379/680 226/373/681
f 227/380/682 223/371/683 225/374/684
f 229/381/685 230/382/686 232/383/687 231/384/688
f 231/384/689 232/383/690 234/385/691 233/386/692
f 233/386/693 234/385/694 230/387/695 229/388/696
f 230/382/697 234/389/698 232/383/699
f 233/390/700 229/381/701 231/384/702
f 235/391/703 236/392/704 238/393/705 237/394/706
f 237/394/707 238/393/708 240/395/709 239/396/710
f 239/396/711 240/395/712 236/397/713 235/398/714
f 236/392/715 240/399/716 238/393/717
f 239/400/718 235/391/719 237/394/720
f 241/401/721 242/402/722 244/403/723 243/404/724
f 243/404/725 244/403/726 246/405/727 245/406/728
f 245/406/729 246/405/730 242/407/731 241/408/732
f 242/402/733 246/409/734 244/403/735
f 245/410/736 241/401/737 243/404/738
f 247/411/739 248/412/740 250/413/741 249/414/742
f 249/414/743 250/413/744 252/415/745 251/416/746
f 251/416/747 252/415/748 248/417/749 247/418/750
f 248/412/751 252/419/752 250/413/753
f 251/420/754 247/411/755 249/414/756
f 253/421/757 254/422/758 256/423/759 255/424/760
f 255/424/761 256/423/762 258/425/763 257/426/764
f 257/426/765 258/425/766 254/427/767 253/428/768
f 254/422/769 258/429/770 256/423/771
f 257/430/772 253/421/773 255/424/774
f 259/431/775 260/432/776 262/433/777 261/434/778
f 261/434/779 262/433/780 264/435/781 263/436/782
f 263/436/783 264/435/784 260/437/785 259/438/786
f 260/432/787 264/439/788 262/433/789
f 263/440/790 259/431/791 261/434/792
f 265/441/793 266/442/794 268/443/795 267/444/796
f 267/444/797 268/443/798 270/445/799 269/446/800
f 269/446/801 270/445/802 266/447/803 265/448/804
f 266/442/805 270/449/806 268/443/807
f 269/450/808 265/441/809 267/444/810
f 271/451/811 272/452/812 274/453/813 273/454/814
f 273/454/815 274/453/816 276/455/817 275/456/818
f 275/456/819 276/455/820 272/457/821 271/458/822
f 272/452/823 276/459/824 274/453/825
f 275/460/826 271/451/827 273/454/828
f 277/461/829 278/462/830 280/463/831 279/464/832
f 279/464/833 280/463/834 282/465/835 281/466/836
f 281/466/837 282/465/838 278/467/839 277/468/840
f 278/462/841 282/469/842 280/463/843
f 281/470/844 277/461/845 279/464/846
f 283/471/847 284/472/848 286/473/849 285/474/850
f 285/474/851 286/473/852 288/475/853 287/476/854
f 287/476/855 288/475/856 284/477/857 283/478/858
f 284/472/859 288/479/860 286/473/861
f 287/480/862 283/471/863 285/474/864
f 289/481/865 290/482/866 292/483/867 291/484/868
f 291/484/869 292/483/870 294/485/871 293/486/872
f 293/486/873 294/485/874 290/487/875 289/488/876
f 290/482/877 294/489/878 292/483/879
f 293/490/880 289/481/881 291/484/882
f 295/491/883 296/492/884 298/493/885 297/494/886
f 297/494/887 298/493/888 300/495/889 299/496/890
f 299/496/891 300/495/892 296/497/893 295/498/894
f 296/492/895 300/499/896 298/493/897
f 299/500/898 295/491/899 297/494/900
f 301/501/901 302/502/902 304/503/903 303/504/904
f 303/504/905 304/503/906 306/505/907 305/506/908
f 305/506/909 306/505/910 302/507/911 301/508/912
f 302/502/913 306/509/914 304/503/915
f 305/510/916 301/501/917 303/504/918
f 307/511/919 308/512/920 310/513/921 309/514/922
f 309/514/923 310/513/924 312/515/925 311/516/926
f 311/516/927 312/515/928 308/517/929 307/518/930
f 308/512/931 312/519/932 310/513/933
f 311/520/934 307/511/935 309/514/936
f 313/521/937 314/522/938 316/523/939 315/524/940
f 315/524/941 316/523/942 318/525/943 317/526/944
f 317/526/945 318/525/946 314/527/947 313/528/948
f 314/522/949 318/529/950 316/523/951
f 317/530/952 313/521/953 315/524/954
f 319/531/955 320/532/956 322/533/957 321/534/958
f 321/534/959 322/533/960 324/535/961 323/536/962
f 323/536/963 324/535/964 320/537/965 319/538/966
f 320/532/967 324/539/968 322/533/969
f 323/540/970 319/531/971 321/534/972
