# This file uses centimeters as units for non-parametric coordinates.

mtllib Tutorial_Paredes_Centrales.mtl
g default
v 1.463974 1.236173 -6.538662
v 3.180828 1.236173 -2.770926
v 1.463974 5.374165 -6.538662
v 3.180828 5.374165 -2.770926
v 0.824440 5.374165 -5.128168
v 2.126163 5.374165 -2.290342
v 0.824440 1.236173 -5.128168
v 2.126163 1.236173 -2.290342
v 0.357021 1.236173 -6.591455
v -1.791500 1.236173 -3.052067
v 0.357021 5.374165 -6.591455
v -1.791500 5.374165 -3.052067
v -0.800858 5.374165 -2.450716
v -0.800858 1.236173 -2.450716
v -5.961391 1.236173 2.972977
v -3.631508 1.236173 -0.449751
v -5.961391 5.374165 2.972977
v -3.631508 5.374165 -0.449751
v -4.423798 5.374165 2.787754
v -2.673416 5.374165 0.202431
v -4.423798 1.236173 2.787754
v -2.673416 1.236173 0.202431
v -5.432114 1.236173 3.946629
v -1.291653 1.236173 3.946629
v -5.432114 5.374165 3.946629
v -1.291653 5.374165 3.946629
v -1.291653 5.374165 2.787754
v -1.291653 1.236173 2.787754
v 2.165062 0.853386 4.705307
v 2.908966 0.853386 4.842708
v 2.165062 5.121082 4.705307
v 2.908966 5.121082 4.842708
v 2.036465 5.371127 4.448193
v 3.120926 5.371127 4.648495
v 2.036465 0.853386 4.448193
v 3.120926 0.853386 4.648495
v 3.832169 0.853386 5.013222
v 4.576077 0.853386 5.150626
v 3.832169 5.121082 5.013222
v 4.576077 5.121082 5.150626
v 3.703571 5.371127 4.756111
v 4.788033 5.371127 4.956413
v 3.703571 0.853386 4.756111
v 4.788033 0.853386 4.956413
v 5.279938 1.236173 5.068660
v 1.211704 1.236173 4.298664
v 5.279938 5.374165 5.068660
v 1.211704 5.374165 4.298664
v 4.496361 5.374165 3.732805
v 1.427242 5.374165 3.159883
v 4.496361 1.236173 3.732805
v 1.427242 1.236173 3.159883
v 5.961391 1.236173 4.194729
v 4.308670 1.236173 0.398424
v 5.961391 5.374165 4.194729
v 4.308670 5.374165 0.398424
v 3.246124 5.374165 0.861006
v 3.246124 1.236173 0.861006
v 5.870037 0.853386 3.453892
v 5.568069 0.853386 2.760279
v 5.870037 5.121082 3.453892
v 5.568069 5.121082 2.760279
v 5.728748 5.371127 3.704256
v 5.288548 5.371127 2.693115
v 5.728748 0.853386 3.704256
v 5.288548 0.853386 2.693115
v 5.193333 0.853386 1.899502
v 4.891369 0.853386 1.205889
v 5.193333 5.121082 1.899502
v 4.891369 5.121082 1.205889
v 5.052044 5.371127 2.149866
v 4.611843 5.371127 1.138725
v 5.052044 0.853386 2.149866
v 4.611843 0.853386 1.138725
v 2.963303 0.853386 -3.784300
v 2.646587 0.853386 -4.471298
v 2.963303 5.121082 -3.784300
v 2.646587 5.121082 -4.471298
v 2.827396 5.371127 -3.530972
v 2.365692 5.371127 -4.532475
v 2.827396 0.853386 -3.530972
v 2.365692 0.853386 -4.532475
v 2.253536 0.853386 -5.323874
v 1.936821 0.853386 -6.010876
v 2.253536 5.121082 -5.323874
v 1.936821 5.121082 -6.010876
v 2.117634 5.371127 -5.070549
v 1.655926 5.371127 -6.072052
v 2.117634 0.853386 -5.070549
v 1.655926 0.853386 -6.072052
v -3.021084 0.853386 4.158581
v -2.264591 0.853386 4.158581
v -3.021084 5.121082 4.158581
v -2.264591 5.121082 4.158581
v -3.194241 5.371127 3.929100
v -2.091434 5.371127 3.929100
v -3.194241 0.853386 3.929100
v -2.091434 0.853386 3.929100
v -4.716389 0.853386 4.158581
v -3.959896 0.853386 4.158581
v -4.716389 5.121082 4.158581
v -3.959896 5.121082 4.158581
v -4.889545 5.371127 3.929100
v -3.786739 5.371127 3.929100
v -4.889545 0.853386 3.929100
v -3.786739 0.853386 3.929100
v -1.075264 0.853386 -4.640421
v -1.467815 0.853386 -3.993748
v -1.075264 5.121082 -4.640421
v -1.467815 5.121082 -3.993748
v -0.789246 5.371127 -4.669359
v -1.361500 5.371127 -3.726648
v -0.789246 0.853386 -4.669359
v -1.361500 0.853386 -3.726648
v -0.195557 0.853386 -6.089617
v -0.588108 0.853386 -5.442945
v -0.195557 5.121082 -6.089617
v -0.588108 5.121082 -5.442945
v 0.090462 5.371127 -6.118557
v -0.481792 5.371127 -5.175844
v 0.090462 0.853386 -6.118557
v -0.481792 0.853386 -5.175844
v -4.384895 0.853386 0.262045
v -4.807816 0.853386 0.889273
v -4.384895 5.121082 0.262045
v -4.807816 5.121082 0.889273
v -4.097820 5.371127 0.246767
v -4.714352 5.371127 1.161135
v -4.097820 0.853386 0.246767
v -4.714352 0.853386 1.161135
v -5.332664 0.853386 1.667673
v -5.755589 0.853386 2.294901
v -5.332664 5.121082 1.667673
v -5.755589 5.121082 2.294901
v -5.045593 5.371127 1.652395
v -5.662125 5.371127 2.566763
v -5.045593 0.853386 1.652395
v -5.662125 0.853386 2.566763
vt 0.244220 0.017996
vt 0.251279 0.191534
vt 0.104367 0.214838
vt 0.087681 0.034880
vt 0.266789 0.242377
vt 0.129296 0.257755
vt 0.271904 0.435145
vt 0.135078 0.418980
vt 0.275205 0.490513
vt 0.129736 0.461059
vt 0.052625 0.205293
vt 0.042069 0.035298
vt 0.287397 0.018363
vt 0.443252 0.033428
vt 0.427931 0.210562
vt 0.279158 0.189806
vt 0.404598 0.251884
vt 0.408274 0.404755
vt 0.414654 0.440365
vt 0.278580 0.487048
vt 0.488253 0.034579
vt 0.479645 0.198681
vt 0.725597 0.010308
vt 0.733029 0.185289
vt 0.584927 0.209055
vt 0.567775 0.027618
vt 0.748762 0.236531
vt 0.610143 0.252287
vt 0.754270 0.430906
vt 0.616267 0.414854
vt 0.757698 0.486733
vt 0.610957 0.457295
vt 0.532735 0.199524
vt 0.521781 0.028122
vt 0.769136 0.010599
vt 0.926327 0.025508
vt 0.911198 0.204156
vt 0.761139 0.183496
vt 0.887744 0.245867
vt 0.891729 0.400014
vt 0.898226 0.435911
vt 0.761095 0.483233
vt 0.971707 0.026587
vt 0.963324 0.192081
vt 0.570732 0.549977
vt 0.642537 0.550634
vt 0.651340 0.951411
vt 0.578031 0.952275
vt 0.678162 0.980072
vt 0.552683 0.983526
vt 0.544676 0.538701
vt 0.667661 0.536920
vt 0.570732 0.549977
vt 0.642537 0.550634
vt 0.651340 0.951411
vt 0.578031 0.952275
vt 0.678162 0.980072
vt 0.552683 0.983526
vt 0.544676 0.538701
vt 0.667661 0.536920
vt 0.245229 0.501095
vt 0.256455 0.667082
vt 0.116417 0.720158
vt 0.061019 0.541216
vt 0.272838 0.723953
vt 0.135352 0.760080
vt 0.274919 0.909040
vt 0.145457 0.928640
vt 0.323967 0.953331
vt 0.150848 0.977858
vt 0.067968 0.733530
vt 0.013366 0.555589
vt 0.297857 0.501914
vt 0.481968 0.539164
vt 0.429252 0.717499
vt 0.287380 0.666195
vt 0.411418 0.757480
vt 0.405242 0.925781
vt 0.400898 0.975073
vt 0.227287 0.954041
vt 0.529825 0.552729
vt 0.477888 0.730242
vt 0.873906 0.554394
vt 0.944684 0.554135
vt 0.958420 0.949012
vt 0.886180 0.950789
vt 0.985216 0.976920
vt 0.861593 0.981909
vt 0.848085 0.543610
vt 0.969271 0.540302
vt 0.570732 0.549977
vt 0.642537 0.550635
vt 0.651340 0.951410
vt 0.578031 0.952275
vt 0.678162 0.980071
vt 0.552683 0.983525
vt 0.544676 0.538702
vt 0.667661 0.536921
vt 0.802326 0.970466
vt 0.730650 0.968660
vt 0.728305 0.568394
vt 0.801508 0.568707
vt 0.701988 0.539349
vt 0.827320 0.537926
vt 0.828158 0.982140
vt 0.705348 0.981949
vt 0.570731 0.549977
vt 0.642537 0.550634
vt 0.651340 0.951411
vt 0.578030 0.952275
vt 0.678162 0.980072
vt 0.552683 0.983526
vt 0.544676 0.538701
vt 0.667661 0.536920
vt 0.570732 0.549977
vt 0.642537 0.550635
vt 0.651340 0.951410
vt 0.578031 0.952275
vt 0.678162 0.980071
vt 0.552683 0.983525
vt 0.544676 0.538702
vt 0.667661 0.536920
vt 0.570732 0.549977
vt 0.642537 0.550635
vt 0.651340 0.951410
vt 0.578031 0.952275
vt 0.678162 0.980071
vt 0.552683 0.983525
vt 0.544676 0.538702
vt 0.667661 0.536920
vt 0.570731 0.549977
vt 0.642537 0.550635
vt 0.651340 0.951410
vt 0.578030 0.952275
vt 0.678162 0.980072
vt 0.552683 0.983525
vt 0.544676 0.538702
vt 0.667661 0.536920
vt 0.570732 0.549977
vt 0.642537 0.550635
vt 0.651340 0.951410
vt 0.578030 0.952275
vt 0.678162 0.980071
vt 0.552683 0.983525
vt 0.544676 0.538702
vt 0.667661 0.536920
vt 0.570732 0.549977
vt 0.642537 0.550635
vt 0.651340 0.951411
vt 0.578031 0.952275
vt 0.678162 0.980072
vt 0.552683 0.983526
vt 0.544676 0.538701
vt 0.667661 0.536920
vt 0.570731 0.549977
vt 0.642537 0.550634
vt 0.651340 0.951411
vt 0.578031 0.952275
vt 0.678162 0.980072
vt 0.552683 0.983526
vt 0.544676 0.538701
vt 0.667661 0.536920
vn 0.909980 0.000000 -0.414653
vn 0.909980 0.000000 -0.414653
vn 0.909980 0.000000 -0.414653
vn 0.909980 0.000000 -0.414653
vn 0.000000 1.000000 -0.000000
vn 0.000000 1.000000 -0.000000
vn 0.000000 1.000000 -0.000000
vn 0.000000 1.000000 -0.000000
vn -0.908937 0.000000 0.416934
vn -0.908937 0.000000 0.416934
vn -0.908937 0.000000 0.416934
vn -0.908937 0.000000 0.416934
vn 0.000000 -1.000000 0.000000
vn 0.000000 -1.000000 0.000000
vn 0.000000 -1.000000 0.000000
vn 0.000000 -1.000000 0.000000
vn 0.414654 0.000000 0.909979
vn 0.414654 0.000000 0.909979
vn 0.414654 0.000000 0.909979
vn 0.414654 0.000000 0.909979
vn -0.854830 0.000000 -0.518909
vn -0.854830 0.000000 -0.518909
vn -0.854830 0.000000 -0.518909
vn -0.854830 0.000000 -0.518909
vn 0.000000 1.000000 0.000000
vn 0.000000 1.000000 0.000000
vn 0.000000 1.000000 0.000000
vn 0.000000 1.000000 0.000000
vn 0.854830 0.000000 0.518909
vn 0.854830 0.000000 0.518909
vn 0.854830 0.000000 0.518909
vn 0.854830 0.000000 0.518909
vn 0.000000 -1.000000 -0.000000
vn 0.000000 -1.000000 -0.000000
vn 0.000000 -1.000000 -0.000000
vn 0.000000 -1.000000 -0.000000
vn -0.518908 0.000000 0.854830
vn -0.518908 0.000000 0.854830
vn -0.518908 0.000000 0.854830
vn -0.518908 0.000000 0.854830
vn 0.047638 0.000000 -0.998865
vn 0.047638 0.000000 -0.998865
vn 0.047638 0.000000 -0.998865
vn 0.047638 0.000000 -0.998865
vn 0.000000 1.000000 0.000000
vn 0.000000 1.000000 0.000000
vn 0.000000 1.000000 0.000000
vn -0.826654 0.000000 -0.562711
vn -0.826654 0.000000 -0.562711
vn -0.826654 0.000000 -0.562711
vn -0.826654 0.000000 -0.562711
vn 0.000000 1.000000 0.000000
vn 0.000000 1.000000 0.000000
vn 0.000000 1.000000 0.000000
vn 0.000000 1.000000 0.000000
vn 0.828062 0.000000 0.560636
vn 0.828062 0.000000 0.560636
vn 0.828062 0.000000 0.560636
vn 0.828062 0.000000 0.560636
vn 0.000000 -1.000000 0.000000
vn 0.000000 -1.000000 0.000000
vn 0.000000 -1.000000 0.000000
vn 0.000000 -1.000000 0.000000
vn 0.562711 0.000000 -0.826654
vn 0.562711 0.000000 -0.826654
vn 0.562711 0.000000 -0.826654
vn 0.562711 0.000000 -0.826654
vn 0.000000 0.000000 1.000000
vn 0.000000 0.000000 1.000000
vn 0.000000 0.000000 1.000000
vn 0.000000 0.000000 1.000000
vn 0.000000 1.000000 0.000000
vn 0.000000 1.000000 0.000000
vn 0.000000 1.000000 0.000000
vn 0.000000 1.000000 0.000000
vn 0.000000 0.000000 -1.000000
vn 0.000000 0.000000 -1.000000
vn 0.000000 0.000000 -1.000000
vn 0.000000 0.000000 -1.000000
vn 0.000000 -1.000000 0.000000
vn 0.000000 -1.000000 0.000000
vn 0.000000 -1.000000 0.000000
vn 0.000000 -1.000000 0.000000
vn 1.000000 0.000000 0.000000
vn 1.000000 0.000000 0.000000
vn 1.000000 0.000000 0.000000
vn 1.000000 0.000000 0.000000
vn -0.878579 0.000000 0.477596
vn -0.878579 0.000000 0.477596
vn -0.878579 0.000000 0.477596
vn -0.878579 0.000000 0.477596
vn 0.000000 1.000000 0.000000
vn 0.000000 1.000000 0.000000
vn 0.000000 1.000000 0.000000
vn -0.181630 0.000000 0.983367
vn -0.181630 0.000000 0.983367
vn -0.181630 0.000000 0.983367
vn -0.181630 0.000000 0.983367
vn -0.133816 0.676161 0.724499
vn -0.133816 0.676161 0.724499
vn -0.133816 0.676161 0.724499
vn -0.133816 0.676161 0.724499
vn 0.000000 -1.000000 0.000000
vn 0.000000 -1.000000 0.000000
vn 0.000000 -1.000000 0.000000
vn 0.000000 -1.000000 0.000000
vn 0.675567 0.000000 0.737299
vn 0.675567 0.000000 0.737299
vn 0.675567 0.000000 0.737299
vn 0.675567 0.000000 0.737299
vn -0.894371 0.000000 0.447325
vn -0.894371 0.000000 0.447325
vn -0.894371 0.000000 0.447325
vn -0.894371 0.000000 0.447325
vn -0.181633 0.000000 0.983366
vn -0.181633 0.000000 0.983366
vn -0.181633 0.000000 0.983366
vn -0.181633 0.000000 0.983366
vn -0.133818 0.676158 0.724502
vn -0.133818 0.676158 0.724502
vn -0.133818 0.676158 0.724502
vn -0.133818 0.676158 0.724502
vn 0.000000 -1.000000 0.000000
vn 0.000000 -1.000000 0.000000
vn 0.000000 -1.000000 0.000000
vn 0.000000 -1.000000 0.000000
vn 0.675573 0.000000 0.737293
vn 0.675573 0.000000 0.737293
vn 0.675573 0.000000 0.737293
vn 0.675573 0.000000 0.737293
vn -0.894369 0.000000 0.447330
vn -0.894369 0.000000 0.447330
vn -0.894369 0.000000 0.447330
vn -0.894369 0.000000 0.447330
vn -0.185969 0.000000 0.982556
vn -0.185969 0.000000 0.982556
vn -0.185969 0.000000 0.982556
vn -0.185969 0.000000 0.982556
vn 0.000000 1.000000 0.000000
vn 0.000000 1.000000 0.000000
vn 0.000000 1.000000 0.000000
vn 0.000000 1.000000 0.000000
vn 0.183503 0.000000 -0.983019
vn 0.183503 0.000000 -0.983019
vn 0.183503 0.000000 -0.983019
vn 0.183503 0.000000 -0.983019
vn 0.000000 -1.000000 -0.000000
vn 0.000000 -1.000000 -0.000000
vn 0.000000 -1.000000 -0.000000
vn 0.000000 -1.000000 -0.000000
vn -0.982556 0.000000 -0.185969
vn -0.982556 0.000000 -0.185969
vn -0.982556 0.000000 -0.185969
vn -0.982556 0.000000 -0.185969
vn 0.916880 0.000000 -0.399164
vn 0.916880 0.000000 -0.399164
vn 0.916880 0.000000 -0.399164
vn 0.916880 0.000000 -0.399164
vn 0.000000 1.000000 0.000000
vn 0.000000 1.000000 0.000000
vn 0.000000 1.000000 0.000000
vn 0.000000 1.000000 0.000000
vn -0.916880 0.000000 0.399163
vn -0.916880 0.000000 0.399163
vn -0.916880 0.000000 0.399163
vn -0.916880 0.000000 0.399163
vn 0.000000 -1.000000 0.000000
vn 0.000000 -1.000000 0.000000
vn 0.000000 -1.000000 0.000000
vn 0.000000 -1.000000 0.000000
vn -0.399165 0.000000 -0.916879
vn -0.399165 0.000000 -0.916879
vn -0.399165 0.000000 -0.916879
vn -0.399165 0.000000 -0.916879
vn 0.788595 0.000000 0.614913
vn 0.788595 0.000000 0.614913
vn 0.788595 0.000000 0.614913
vn 0.788595 0.000000 0.614913
vn 0.000000 1.000000 0.000000
vn 0.000000 1.000000 0.000000
vn 0.000000 1.000000 0.000000
vn 0.916878 0.000000 -0.399167
vn 0.916878 0.000000 -0.399167
vn 0.916878 0.000000 -0.399167
vn 0.916878 0.000000 -0.399167
vn 0.675514 0.676161 -0.294087
vn 0.675514 0.676161 -0.294087
vn 0.675514 0.676161 -0.294087
vn 0.675514 0.676161 -0.294087
vn 0.000000 -1.000000 0.000000
vn 0.000000 -1.000000 0.000000
vn 0.000000 -1.000000 0.000000
vn 0.000000 -1.000000 0.000000
vn 0.233630 0.000000 -0.972326
vn 0.233630 0.000000 -0.972326
vn 0.233630 0.000000 -0.972326
vn 0.233630 0.000000 -0.972326
vn 0.870893 0.000000 0.491473
vn 0.870893 0.000000 0.491473
vn 0.870893 0.000000 0.491473
vn 0.870893 0.000000 0.491473
vn 0.916880 0.000000 -0.399163
vn 0.916880 0.000000 -0.399163
vn 0.916880 0.000000 -0.399163
vn 0.916880 0.000000 -0.399163
vn 0.675513 0.676163 -0.294085
vn 0.675513 0.676163 -0.294085
vn 0.675514 0.676163 -0.294085
vn 0.675513 0.676163 -0.294085
vn 0.000000 -1.000000 0.000000
vn 0.000000 -1.000000 0.000000
vn 0.000000 -1.000000 0.000000
vn 0.000000 -1.000000 0.000000
vn 0.233627 0.000000 -0.972326
vn 0.233627 0.000000 -0.972326
vn 0.233627 0.000000 -0.972326
vn 0.233627 0.000000 -0.972326
vn 0.870893 0.000000 0.491473
vn 0.870893 0.000000 0.491473
vn 0.870893 0.000000 0.491473
vn 0.870893 0.000000 0.491473
vn 0.908141 0.000000 -0.418665
vn 0.908141 0.000000 -0.418665
vn 0.908141 0.000000 -0.418665
vn 0.908141 0.000000 -0.418665
vn 0.669076 0.676161 -0.308452
vn 0.669076 0.676161 -0.308452
vn 0.669076 0.676161 -0.308452
vn 0.669076 0.676161 -0.308452
vn 0.000000 -1.000000 0.000000
vn 0.000000 -1.000000 0.000000
vn 0.000000 -1.000000 0.000000
vn 0.000000 -1.000000 0.000000
vn 0.212802 0.000000 -0.977095
vn 0.212802 0.000000 -0.977095
vn 0.212802 0.000000 -0.977095
vn 0.212802 0.000000 -0.977095
vn 0.881198 0.000000 0.472748
vn 0.881198 0.000000 0.472748
vn 0.881198 0.000000 0.472747
vn 0.881198 0.000000 0.472748
vn 0.908142 0.000000 -0.418663
vn 0.908142 0.000000 -0.418663
vn 0.908142 0.000000 -0.418663
vn 0.908142 0.000000 -0.418663
vn 0.669079 0.676158 -0.308455
vn 0.669079 0.676158 -0.308455
vn 0.669079 0.676158 -0.308455
vn 0.669079 0.676158 -0.308455
vn 0.000000 -1.000000 0.000000
vn 0.000000 -1.000000 0.000000
vn 0.000000 -1.000000 0.000000
vn 0.000000 -1.000000 0.000000
vn 0.212802 0.000000 -0.977095
vn 0.212802 0.000000 -0.977095
vn 0.212802 0.000000 -0.977095
vn 0.212802 0.000000 -0.977095
vn 0.881201 0.000000 0.472743
vn 0.881201 0.000000 0.472743
vn 0.881201 0.000000 0.472743
vn 0.881201 0.000000 0.472743
vn 0.000000 0.000000 1.000000
vn 0.000000 0.000000 1.000000
vn 0.000000 0.000000 1.000000
vn 0.000000 0.000000 1.000000
vn 0.000000 0.676162 0.736753
vn 0.000000 0.676162 0.736753
vn 0.000000 0.676162 0.736753
vn 0.000000 0.676162 0.736753
vn 0.000000 -1.000000 -0.000000
vn 0.000000 -1.000000 -0.000000
vn 0.000000 -1.000000 -0.000000
vn 0.000000 -1.000000 -0.000000
vn 0.798249 0.000000 0.602327
vn 0.798249 0.000000 0.602327
vn 0.798249 0.000000 0.602327
vn 0.798250 0.000000 0.602327
vn -0.798249 0.000000 0.602327
vn -0.798249 0.000000 0.602327
vn -0.798250 0.000000 0.602327
vn -0.798249 0.000000 0.602327
vn 0.000000 0.000000 1.000000
vn 0.000000 0.000000 1.000000
vn 0.000000 0.000000 1.000000
vn 0.000000 0.000000 1.000000
vn 0.000000 0.676162 0.736753
vn 0.000000 0.676162 0.736753
vn 0.000000 0.676162 0.736753
vn 0.000000 0.676162 0.736753
vn 0.000000 -1.000000 -0.000000
vn 0.000000 -1.000000 -0.000000
vn 0.000000 -1.000000 -0.000000
vn 0.000000 -1.000000 -0.000000
vn 0.798249 0.000000 0.602327
vn 0.798249 0.000000 0.602327
vn 0.798249 0.000000 0.602327
vn 0.798250 0.000000 0.602327
vn -0.798249 0.000000 0.602327
vn -0.798249 0.000000 0.602327
vn -0.798250 0.000000 0.602327
vn -0.798249 0.000000 0.602327
vn -0.854830 0.000000 -0.518909
vn -0.854830 0.000000 -0.518909
vn -0.854830 0.000000 -0.518909
vn -0.854830 0.000000 -0.518909
vn -0.629798 0.676162 -0.382307
vn -0.629798 0.676162 -0.382307
vn -0.629798 0.676162 -0.382307
vn -0.629798 0.676162 -0.382307
vn 0.000000 -1.000000 0.000000
vn 0.000000 -1.000000 0.000000
vn 0.000000 -1.000000 0.000000
vn 0.000000 -1.000000 0.000000
vn -0.929104 0.000000 0.369819
vn -0.929104 0.000000 0.369819
vn -0.929104 0.000000 0.369819
vn -0.929104 0.000000 0.369819
vn -0.100663 0.000000 -0.994921
vn -0.100663 0.000000 -0.994921
vn -0.100663 0.000000 -0.994921
vn -0.100663 0.000000 -0.994921
vn -0.854829 0.000000 -0.518910
vn -0.854829 0.000000 -0.518910
vn -0.854829 0.000000 -0.518910
vn -0.854829 0.000000 -0.518910
vn -0.629798 0.676163 -0.382307
vn -0.629798 0.676163 -0.382307
vn -0.629798 0.676163 -0.382307
vn -0.629798 0.676163 -0.382307
vn 0.000000 -1.000000 0.000000
vn 0.000000 -1.000000 0.000000
vn 0.000000 -1.000000 0.000000
vn 0.000000 -1.000000 0.000000
vn -0.929105 0.000000 0.369816
vn -0.929105 0.000000 0.369816
vn -0.929105 0.000000 0.369816
vn -0.929105 0.000000 0.369816
vn -0.100669 0.000000 -0.994920
vn -0.100669 0.000000 -0.994920
vn -0.100669 0.000000 -0.994920
vn -0.100669 0.000000 -0.994920
vn -0.829130 0.000000 -0.559056
vn -0.829130 0.000000 -0.559056
vn -0.829130 0.000000 -0.559056
vn -0.829130 0.000000 -0.559056
vn -0.610864 0.676162 -0.411887
vn -0.610864 0.676162 -0.411887
vn -0.610864 0.676162 -0.411887
vn -0.610864 0.676162 -0.411887
vn 0.000000 -1.000000 -0.000000
vn 0.000000 -1.000000 -0.000000
vn 0.000000 -1.000000 -0.000000
vn 0.000000 -1.000000 -0.000000
vn -0.945675 0.000000 0.325115
vn -0.945675 0.000000 0.325115
vn -0.945675 0.000000 0.325115
vn -0.945675 0.000000 0.325115
vn -0.053144 0.000000 -0.998587
vn -0.053144 0.000000 -0.998587
vn -0.053144 0.000000 -0.998587
vn -0.053144 0.000000 -0.998587
vn -0.829127 0.000000 -0.559060
vn -0.829127 0.000000 -0.559060
vn -0.829127 0.000000 -0.559060
vn -0.829127 0.000000 -0.559060
vn -0.610866 0.676158 -0.411889
vn -0.610866 0.676158 -0.411889
vn -0.610866 0.676158 -0.411890
vn -0.610866 0.676158 -0.411889
vn 0.000000 -1.000000 -0.000000
vn 0.000000 -1.000000 -0.000000
vn 0.000000 -1.000000 -0.000000
vn 0.000000 -1.000000 -0.000000
vn -0.945674 0.000000 0.325115
vn -0.945674 0.000000 0.325115
vn -0.945675 0.000000 0.325115
vn -0.945674 0.000000 0.325115
vn -0.053145 0.000000 -0.998587
vn -0.053145 0.000000 -0.998587
vn -0.053145 0.000000 -0.998587
vn -0.053145 0.000000 -0.998587
s off
g Paredes_Centrales
usemtl lambert10SG
f 1/1/1 3/2/2 4/3/3 2/4/4
f 3/2/5 5/5/6 6/6/7 4/3/8
f 5/5/9 7/7/10 8/8/11 6/6/12
f 7/7/13 1/9/14 2/10/15 8/8/16
f 2/4/17 4/3/18 6/11/19 8/12/20
f 9/13/21 10/14/22 12/15/23 11/16/24
f 11/16/25 12/15/26 13/17/27 5/5/28
f 5/5/29 13/17/30 14/18/31 7/7/32
f 7/7/33 14/18/34 10/19/35 9/20/36
f 10/14/37 14/21/38 13/22/39 12/15/40
f 3/2/41 1/1/42 9/13/43 11/16/44
f 5/5/45 3/2/46 11/16/47
f 15/23/48 17/24/49 18/25/50 16/26/51
f 17/24/52 19/27/53 20/28/54 18/25/55
f 19/27/56 21/29/57 22/30/58 20/28/59
f 21/29/60 15/31/61 16/32/62 22/30/63
f 16/26/64 18/25/65 20/33/66 22/34/67
f 23/35/68 24/36/69 26/37/70 25/38/71
f 25/38/72 26/37/73 27/39/74 19/27/75
f 19/27/76 27/39/77 28/40/78 21/29/79
f 21/29/80 28/40/81 24/41/82 23/42/83
f 24/36/84 28/43/85 27/44/86 26/37/87
f 17/24/88 15/23/89 23/35/90 25/38/91
f 19/27/92 17/24/93 25/38/94
f 29/45/95 30/46/96 32/47/97 31/48/98
f 31/48/99 32/47/100 34/49/101 33/50/102
f 35/51/103 36/52/104 30/46/105 29/45/106
f 30/46/107 36/52/108 34/49/109 32/47/110
f 35/51/111 29/45/112 31/48/113 33/50/114
f 37/53/115 38/54/116 40/55/117 39/56/118
f 39/56/119 40/55/120 42/57/121 41/58/122
f 43/59/123 44/60/124 38/54/125 37/53/126
f 38/54/127 44/60/128 42/57/129 40/55/130
f 43/59/131 37/53/132 39/56/133 41/58/134
f 45/61/135 47/62/136 48/63/137 46/64/138
f 47/62/139 49/65/140 50/66/141 48/63/142
f 49/65/143 51/67/144 52/68/145 50/66/146
f 51/67/147 45/69/148 46/70/149 52/68/150
f 46/64/151 48/63/152 50/71/153 52/72/154
f 53/73/155 54/74/156 56/75/157 55/76/158
f 55/76/159 56/75/160 57/77/161 49/65/162
f 49/65/163 57/77/164 58/78/165 51/67/166
f 51/67/167 58/78/168 54/79/169 53/80/170
f 54/74/171 58/81/172 57/82/173 56/75/174
f 47/62/175 45/61/176 53/73/177 55/76/178
f 49/65/179 47/62/180 55/76/181
f 59/83/182 60/84/183 62/85/184 61/86/185
f 61/86/186 62/85/187 64/87/188 63/88/189
f 65/89/190 66/90/191 60/84/192 59/83/193
f 60/84/194 66/90/195 64/87/196 62/85/197
f 65/89/198 59/83/199 61/86/200 63/88/201
f 67/91/202 68/92/203 70/93/204 69/94/205
f 69/94/206 70/93/207 72/95/208 71/96/209
f 73/97/210 74/98/211 68/92/212 67/91/213
f 68/92/214 74/98/215 72/95/216 70/93/217
f 73/97/218 67/91/219 69/94/220 71/96/221
f 75/99/222 76/100/223 78/101/224 77/102/225
f 77/102/226 78/101/227 80/103/228 79/104/229
f 81/105/230 82/106/231 76/100/232 75/99/233
f 76/100/234 82/106/235 80/103/236 78/101/237
f 81/105/238 75/99/239 77/102/240 79/104/241
f 83/107/242 84/108/243 86/109/244 85/110/245
f 85/110/246 86/109/247 88/111/248 87/112/249
f 89/113/250 90/114/251 84/108/252 83/107/253
f 84/108/254 90/114/255 88/111/256 86/109/257
f 89/113/258 83/107/259 85/110/260 87/112/261
f 91/115/262 92/116/263 94/117/264 93/118/265
f 93/118/266 94/117/267 96/119/268 95/120/269
f 97/121/270 98/122/271 92/116/272 91/115/273
f 92/116/274 98/122/275 96/119/276 94/117/277
f 97/121/278 91/115/279 93/118/280 95/120/281
f 99/123/282 100/124/283 102/125/284 101/126/285
f 101/126/286 102/125/287 104/127/288 103/128/289
f 105/129/290 106/130/291 100/124/292 99/123/293
f 100/124/294 106/130/295 104/127/296 102/125/297
f 105/129/298 99/123/299 101/126/300 103/128/301
f 107/131/302 108/132/303 110/133/304 109/134/305
f 109/134/306 110/133/307 112/135/308 111/136/309
f 113/137/310 114/138/311 108/132/312 107/131/313
f 108/132/314 114/138/315 112/135/316 110/133/317
f 113/137/318 107/131/319 109/134/320 111/136/321
f 115/139/322 116/140/323 118/141/324 117/142/325
f 117/142/326 118/141/327 120/143/328 119/144/329
f 121/145/330 122/146/331 116/140/332 115/139/333
f 116/140/334 122/146/335 120/143/336 118/141/337
f 121/145/338 115/139/339 117/142/340 119/144/341
f 123/147/342 124/148/343 126/149/344 125/150/345
f 125/150/346 126/149/347 128/151/348 127/152/349
f 129/153/350 130/154/351 124/148/352 123/147/353
f 124/148/354 130/154/355 128/151/356 126/149/357
f 129/153/358 123/147/359 125/150/360 127/152/361
f 131/155/362 132/156/363 134/157/364 133/158/365
f 133/158/366 134/157/367 136/159/368 135/160/369
f 137/161/370 138/162/371 132/156/372 131/155/373
f 132/156/374 138/162/375 136/159/376 134/157/377
f 137/161/378 131/155/379 133/158/380 135/160/381
