# This file uses centimeters as units for non-parametric coordinates.

mtllib Tutorial_Apoyo_Pared.mtl
g default
v -46.057621 1.258429 8.034925
v -46.607712 1.258429 8.034925
v -46.057621 4.033406 8.034925
v -46.607712 4.033406 8.034925
v -46.057621 1.258429 8.585014
v -46.607712 1.258429 8.585014
v -40.094215 1.258429 8.034925
v -40.644302 1.258429 8.034925
v -40.094215 4.033406 8.034925
v -40.644302 4.033406 8.034925
v -40.094215 1.258429 8.585014
v -40.644302 1.258429 8.585014
v -34.363777 1.258429 8.034925
v -34.913864 1.258429 8.034925
v -34.363777 4.033406 8.034925
v -34.913864 4.033406 8.034925
v -34.363777 1.258429 8.585014
v -34.913864 1.258429 8.585014
v -29.302122 1.258429 8.034925
v -29.852213 1.258429 8.034925
v -29.302122 4.033406 8.034925
v -29.852213 4.033406 8.034925
v -29.302122 1.258429 8.585014
v -29.852213 1.258429 8.585014
v -25.404268 1.258429 8.034925
v -25.954357 1.258429 8.034925
v -25.404268 4.033406 8.034925
v -25.954357 4.033406 8.034925
v -25.404268 1.258429 8.585014
v -25.954357 1.258429 8.585014
v -24.253601 1.258429 7.224336
v -23.777210 1.258429 7.499380
v -24.253601 4.033406 7.224336
v -23.978558 4.033406 6.747944
v -23.978558 1.258429 6.747944
v -23.502165 1.258429 7.022988
v -21.401892 1.282300 2.285028
v -20.925499 1.282300 2.560072
v -21.401892 4.022369 2.285028
v -21.126846 4.022369 1.808636
v -21.126846 1.282300 1.808636
v -20.650455 1.282300 2.083681
v -17.387215 1.258429 -4.668596
v -16.910824 1.258429 -4.393551
v -17.387215 4.033406 -4.668596
v -17.112171 4.033406 -5.144987
v -17.112171 1.258429 -5.144987
v -16.635777 1.258429 -4.869944
v -11.905964 1.258429 -14.162397
v -11.429573 1.258429 -13.887354
v -11.905964 4.033406 -14.162397
v -11.630920 4.033406 -14.638788
v -11.630920 1.258429 -14.638788
v -11.154530 1.258429 -14.363745
v -9.087910 1.258429 -19.043413
v -8.611519 1.258429 -18.768370
v -9.087910 4.033406 -19.043413
v -8.812866 4.033406 -19.519804
v -8.812866 1.258429 -19.519804
v -8.336475 1.258429 -19.244761
v -5.954132 1.258429 -24.471273
v -5.477741 1.258429 -24.196230
v -5.954132 4.033406 -24.471273
v -5.679089 4.033406 -24.947664
v -5.679089 1.258429 -24.947664
v -5.202698 1.258429 -24.672621
v 8.577854 1.258429 -25.749697
v 8.101463 1.258429 -26.024740
v 8.577854 4.033406 -25.749697
v 8.302807 4.033406 -25.273302
v 8.302807 1.258429 -25.273302
v 7.826416 1.258429 -25.548349
v 16.575443 1.258429 -39.601921
v 16.099049 1.258429 -39.876968
v 16.575443 4.033406 -39.601921
v 16.300396 4.033406 -39.125526
v 16.300396 1.258429 -39.125526
v 15.824001 1.258429 -39.400574
v 10.194660 1.258429 -28.550089
v 9.718269 1.258429 -28.825132
v 10.194660 4.033406 -28.550089
v 9.919617 4.033406 -28.073694
v 9.919617 1.258429 -28.073694
v 9.443222 1.258429 -28.348742
v 14.468910 1.258429 -35.953308
v 13.992519 1.258429 -36.228348
v 14.468910 4.033406 -35.953308
v 14.193867 4.033406 -35.476913
v 14.193867 1.258429 -35.476913
v 13.717472 1.258429 -35.751961
v 12.078575 1.258429 -31.813120
v 11.602180 1.258429 -32.088165
v 12.078575 4.033406 -31.813120
v 11.803528 4.033406 -31.336729
v 11.803528 1.258429 -31.336729
v 11.327137 1.258429 -31.611773
v -3.554398 1.258429 -28.627741
v -3.078007 1.258429 -28.352694
v -3.554398 4.033406 -28.627741
v -3.279350 4.033406 -29.104132
v -3.279350 1.258429 -29.104132
v -2.802959 1.258429 -28.829088
v 0.465054 1.258429 -35.589630
v 0.941444 1.258429 -35.314583
v 0.465054 4.033406 -35.589630
v 0.740097 4.033406 -36.066017
v 0.740097 1.258429 -36.066017
v 1.216488 1.258429 -35.790977
v 6.125828 1.258429 -45.394386
v 6.602222 1.258429 -45.119339
v 6.125828 4.033406 -45.394386
v 6.400875 4.033406 -45.870773
v 6.400875 1.258429 -45.870773
v 6.877266 1.258429 -45.595734
v 3.759422 1.258429 -41.295647
v 4.235813 1.258429 -41.020599
v 3.759422 4.033406 -41.295647
v 4.034466 4.033406 -41.772034
v 4.034466 1.258429 -41.772034
v 4.510857 1.258429 -41.496994
v 36.120701 1.238152 33.339584
v 36.395748 1.238152 33.815979
v 36.597095 4.053683 33.064541
v 36.872143 4.053683 33.540932
v 36.597095 1.238152 33.064541
v 36.872143 1.238152 33.540932
v 32.967144 1.238152 27.877455
v 33.242184 1.238152 28.353846
v 33.443531 4.053683 27.602409
v 33.718578 4.053683 28.078800
v 33.443531 1.238152 27.602409
v 33.718578 1.238152 28.078800
v 27.180576 1.238152 39.550232
v 26.905529 1.238152 39.073841
v 26.704182 4.053683 39.825279
v 26.429134 4.053683 39.348885
v 26.704182 1.238152 39.825279
v 26.429134 1.238152 39.348885
v 24.087757 1.238152 34.193321
v 23.812717 1.238152 33.716930
v 23.611370 4.053683 34.468369
v 23.336323 4.053683 33.991974
v 23.611370 1.238152 34.468369
v 23.336323 1.238152 33.991974
v 21.520603 1.238152 29.746876
v 21.245556 1.238152 29.270485
v 21.044209 4.053683 30.021919
v 20.769169 4.053683 29.545528
v 21.044209 1.238152 30.021919
v 20.769169 1.238152 29.545528
v 19.113781 1.238152 25.578142
v 18.838741 1.238152 25.101749
v 18.637394 4.053683 25.853188
v 18.362347 4.053683 25.376795
v 18.637394 1.238152 25.853188
v 18.362347 1.238152 25.376795
v 16.530102 1.238152 21.103073
v 16.255054 1.238152 20.626682
v 16.053707 4.053683 21.378119
v 15.778667 4.053683 20.901726
v 16.053707 1.238152 21.378119
v 15.778667 1.238152 20.901726
v 30.190586 1.238152 23.068327
v 30.465633 1.238152 23.544718
v 30.666981 4.053683 22.793282
v 30.942028 4.053683 23.269672
v 30.666981 1.238152 22.793282
v 30.942028 1.238152 23.269672
v 28.086765 1.238152 19.424400
v 28.361813 1.238152 19.900793
v 28.563160 4.053683 19.149355
v 28.838207 4.053683 19.625748
v 28.563160 1.238152 19.149355
v 28.838207 1.238152 19.625748
v 25.649441 1.238152 15.202829
v 25.924488 1.238152 15.679222
v 26.125835 4.053683 14.927785
v 26.400883 4.053683 15.404177
v 26.125835 1.238152 14.927785
v 26.400883 1.238152 15.404177
v 17.179440 1.238152 0.532349
v 17.454479 1.238152 1.008739
v 17.655827 4.053683 0.257303
v 17.930874 4.053683 0.733694
v 17.655827 1.238152 0.257303
v 17.930874 1.238152 0.733694
v 14.509613 1.238152 -4.091923
v 14.784657 1.238152 -3.615532
v 14.986004 4.053683 -4.366968
v 15.261051 4.053683 -3.890575
v 14.986004 1.238152 -4.366968
v 15.261051 1.238152 -3.890575
v 6.177723 1.238152 -18.523176
v 6.452770 1.238152 -18.046785
v 6.654118 4.053683 -18.798223
v 6.929161 4.053683 -18.321829
v 6.654118 1.238152 -18.798223
v 6.929161 1.238152 -18.321829
v 11.573753 1.238152 -9.176983
v 11.848797 1.238152 -8.700590
v 12.050144 4.053683 -9.452026
v 12.325188 4.053683 -8.975636
v 12.050144 1.238152 -9.452026
v 12.325188 1.238152 -8.975636
v 19.646252 1.238152 4.804998
v 19.921299 1.238152 5.281390
v 20.122646 4.053683 4.529953
v 20.397686 4.053683 5.006345
v 20.122646 1.238152 4.529953
v 20.397686 1.238152 5.006345
v 22.458958 1.238152 9.676746
v 22.734005 1.238152 10.153138
v 22.935352 4.053683 9.401701
v 23.210392 4.053683 9.878093
v 22.935352 1.238152 9.401701
v 23.210392 1.238152 9.878093
v 5.898342 1.258429 20.022800
v 6.448433 1.258429 20.022800
v 5.898342 4.033406 20.022800
v 6.448433 4.033406 20.022800
v 5.898342 1.258429 19.472712
v 6.448433 1.258429 19.472712
v -4.770519 1.258429 20.022800
v -4.220428 1.258429 20.022800
v -4.770519 4.033406 20.022800
v -4.220428 4.033406 20.022800
v -4.770519 1.258429 19.472712
v -4.220428 1.258429 19.472712
v -11.942322 1.277536 20.022800
v -11.392231 1.277536 20.022800
v -11.942322 3.757995 20.022800
v -11.392231 3.757995 20.022800
v -11.942322 1.277536 19.472712
v -11.392231 1.277536 19.472712
v -20.843220 1.277536 20.022800
v -20.293131 1.277536 20.022800
v -20.843220 3.757995 20.022800
v -20.293131 3.757995 20.022800
v -20.843220 1.277536 19.472712
v -20.293131 1.277536 19.472712
v -35.441715 1.250006 20.022800
v -34.891624 1.250006 20.022800
v -35.441715 3.954254 20.022800
v -34.891624 3.954254 20.022800
v -35.441715 1.250006 19.472712
v -34.891624 1.250006 19.472712
v -46.607712 1.258429 20.022800
v -46.057621 1.258429 20.022800
v -46.607712 4.033406 20.022800
v -46.057621 4.033406 20.022800
v -46.607712 1.258429 19.472712
v -46.057621 1.258429 19.472712
vt 0.793319 0.052980
vt 0.617058 0.053093
vt 0.675622 0.347532
vt 0.735133 0.347494
vt 0.675426 0.041484
vt 0.734936 0.041446
vt 0.147388 0.411375
vt 0.076127 0.410369
vt 0.081302 0.043889
vt 0.152563 0.044895
vt 0.011205 0.056758
vt 0.222268 0.059739
vt 0.738636 0.342274
vt 0.678224 0.342618
vt 0.676454 0.031930
vt 0.736867 0.031586
vt 0.617262 0.044015
vt 0.796193 0.042996
vt 0.741209 0.349704
vt 0.681200 0.350527
vt 0.676964 0.041922
vt 0.736971 0.041098
vt 0.618261 0.054399
vt 0.795994 0.051959
vt 0.738339 0.345963
vt 0.677021 0.346046
vt 0.676593 0.030701
vt 0.737912 0.030618
vt 0.616461 0.042706
vt 0.798076 0.042460
vt 0.821160 0.038730
vt 0.866375 0.096428
vt 0.864020 0.478314
vt 0.962568 0.473622
vt 0.933083 0.086872
vt 0.978243 0.038006
vt 0.816270 0.031226
vt 0.861697 0.090606
vt 0.854633 0.475904
vt 0.955458 0.472199
vt 0.929812 0.081624
vt 0.976386 0.032365
vt 0.816334 0.522387
vt 0.861712 0.581691
vt 0.854823 0.970657
vt 0.955260 0.967037
vt 0.929775 0.572741
vt 0.976350 0.523496
vt 0.816605 0.030586
vt 0.861834 0.089696
vt 0.854967 0.477392
vt 0.955076 0.473783
vt 0.929674 0.080776
vt 0.976098 0.031692
vt 0.816605 0.030586
vt 0.861834 0.089696
vt 0.854967 0.477392
vt 0.955076 0.473783
vt 0.929674 0.080776
vt 0.976098 0.031692
vt 0.626214 0.487214
vt 0.674711 0.550593
vt 0.667348 0.966294
vt 0.774688 0.962426
vt 0.747451 0.541029
vt 0.797228 0.488400
vt 0.815207 0.027217
vt 0.859750 0.086630
vt 0.849100 0.473337
vt 0.949007 0.470719
vt 0.927516 0.078396
vt 0.974311 0.029883
vt 0.820887 0.038195
vt 0.866250 0.096083
vt 0.863888 0.479219
vt 0.962759 0.474512
vt 0.933177 0.086495
vt 0.978486 0.037469
vt 0.223105 0.489715
vt 0.271112 0.554691
vt 0.256580 0.975319
vt 0.365292 0.973231
vt 0.344899 0.546249
vt 0.396178 0.493828
vt 0.820888 0.038195
vt 0.866250 0.096082
vt 0.863888 0.479219
vt 0.962759 0.474512
vt 0.933177 0.086495
vt 0.978486 0.037468
vt 0.820888 0.038195
vt 0.866251 0.096082
vt 0.863888 0.479219
vt 0.962758 0.474512
vt 0.933178 0.086495
vt 0.978486 0.037468
vt 0.816680 0.030628
vt 0.861877 0.089728
vt 0.854910 0.477272
vt 0.954982 0.473691
vt 0.929693 0.080829
vt 0.976112 0.031776
vt 0.816334 0.030039
vt 0.861712 0.089343
vt 0.854823 0.478310
vt 0.955260 0.474690
vt 0.929775 0.080394
vt 0.976350 0.031148
vt 0.816227 0.030197
vt 0.861854 0.089174
vt 0.854845 0.478094
vt 0.955162 0.474848
vt 0.929874 0.080429
vt 0.976292 0.031183
vt 0.816334 0.030039
vt 0.861712 0.089343
vt 0.854823 0.478310
vt 0.955260 0.474690
vt 0.929775 0.080394
vt 0.976350 0.031148
vt 0.866244 0.078249
vt 0.932120 0.088530
vt 0.946600 0.473815
vt 0.846755 0.476397
vt 0.819687 0.030782
vt 0.977266 0.030307
vt 0.862309 0.079476
vt 0.928325 0.087934
vt 0.956114 0.471235
vt 0.856523 0.477520
vt 0.814168 0.033775
vt 0.971233 0.028140
vt 0.866305 0.078508
vt 0.932038 0.088762
vt 0.946515 0.473209
vt 0.846886 0.475791
vt 0.819845 0.031148
vt 0.977082 0.030663
vt 0.866318 0.078521
vt 0.932041 0.088779
vt 0.946488 0.473175
vt 0.846873 0.475751
vt 0.819868 0.031164
vt 0.977084 0.030691
vt 0.866318 0.078521
vt 0.932041 0.088778
vt 0.946488 0.473177
vt 0.846873 0.475752
vt 0.819868 0.031163
vt 0.977083 0.030690
vt 0.866318 0.078521
vt 0.932041 0.088779
vt 0.946488 0.473176
vt 0.846873 0.475751
vt 0.819868 0.031164
vt 0.977084 0.030691
vt 0.866318 0.078521
vt 0.932041 0.088778
vt 0.946488 0.473176
vt 0.846873 0.475752
vt 0.819868 0.031163
vt 0.977083 0.030690
vt 0.866318 0.078521
vt 0.932041 0.088779
vt 0.946488 0.473176
vt 0.846873 0.475751
vt 0.819868 0.031164
vt 0.977084 0.030690
vt 0.866318 0.078521
vt 0.932041 0.088779
vt 0.946488 0.473175
vt 0.846873 0.475751
vt 0.819868 0.031164
vt 0.977084 0.030690
vt 0.866244 0.078249
vt 0.932120 0.088530
vt 0.946600 0.473815
vt 0.846755 0.476397
vt 0.819687 0.030782
vt 0.977266 0.030308
vt 0.071504 0.546077
vt 0.142327 0.554988
vt 0.170059 0.966844
vt 0.063291 0.972777
vt 0.020173 0.496759
vt 0.188792 0.491247
vt 0.868516 0.087940
vt 0.933522 0.098024
vt 0.950952 0.477466
vt 0.852387 0.481070
vt 0.822147 0.041525
vt 0.977480 0.040067
vt 0.866562 0.086311
vt 0.928048 0.093963
vt 0.952601 0.451430
vt 0.859931 0.456705
vt 0.821947 0.043562
vt 0.968306 0.038581
vt 0.864550 0.081221
vt 0.929564 0.089995
vt 0.951647 0.468726
vt 0.853477 0.473297
vt 0.817783 0.035472
vt 0.972792 0.031800
vt 0.866244 0.078249
vt 0.932120 0.088530
vt 0.946600 0.473816
vt 0.846755 0.476398
vt 0.819687 0.030781
vt 0.977266 0.030307
vt 0.866244 0.078249
vt 0.932120 0.088530
vt 0.946600 0.473816
vt 0.846755 0.476398
vt 0.819687 0.030781
vt 0.977266 0.030307
vt 0.578749 0.982753
vt 0.463220 0.986521
vt 0.483735 0.532732
vt 0.559567 0.544795
vt 0.429674 0.478555
vt 0.611075 0.477129
vt 0.560351 0.431014
vt 0.471605 0.434624
vt 0.484494 0.085584
vt 0.542870 0.094382
vt 0.442596 0.044311
vt 0.582075 0.042143
vt 0.954659 0.462515
vt 0.845810 0.468059
vt 0.862086 0.086403
vt 0.931495 0.097570
vt 0.812479 0.037697
vt 0.978470 0.034997
vt 0.964929 0.468619
vt 0.855093 0.476929
vt 0.862036 0.090920
vt 0.932441 0.100474
vt 0.810704 0.042944
vt 0.978345 0.036084
vt 0.396664 0.449762
vt 0.300944 0.456323
vt 0.306337 0.088896
vt 0.369136 0.096909
vt 0.260546 0.045649
vt 0.410078 0.039943
vt 0.960552 0.483770
vt 0.857279 0.490163
vt 0.863686 0.083317
vt 0.931893 0.092125
vt 0.813870 0.036279
vt 0.976269 0.030316
vn 0.000000 0.194448 0.980913
vn 0.000000 0.194448 0.980913
vn 0.000000 0.194448 0.980913
vn 0.000000 0.194448 0.980913
vn -1.000000 0.000000 0.000000
vn -1.000000 0.000000 0.000000
vn -1.000000 0.000000 0.000000
vn 1.000000 0.000000 0.000000
vn 1.000000 0.000000 0.000000
vn 1.000000 0.000000 0.000000
vn 0.000000 0.194448 0.980913
vn 0.000000 0.194448 0.980913
vn 0.000000 0.194448 0.980913
vn 0.000000 0.194448 0.980913
vn -1.000000 0.000000 0.000000
vn -1.000000 0.000000 0.000000
vn -1.000000 0.000000 0.000000
vn 1.000000 0.000000 0.000000
vn 1.000000 0.000000 0.000000
vn 1.000000 0.000000 0.000000
vn 0.000000 0.194448 0.980913
vn 0.000000 0.194448 0.980913
vn 0.000000 0.194448 0.980913
vn 0.000000 0.194448 0.980913
vn -1.000000 0.000000 0.000000
vn -1.000000 0.000000 0.000000
vn -1.000000 0.000000 0.000000
vn 1.000000 0.000000 0.000000
vn 1.000000 0.000000 0.000000
vn 1.000000 0.000000 0.000000
vn 0.000000 0.194448 0.980913
vn 0.000000 0.194448 0.980913
vn 0.000000 0.194448 0.980913
vn 0.000000 0.194448 0.980913
vn -1.000000 0.000000 0.000000
vn -1.000000 0.000000 0.000000
vn -1.000000 0.000000 0.000000
vn 1.000000 0.000000 0.000000
vn 1.000000 0.000000 0.000000
vn 1.000000 0.000000 0.000000
vn 0.000000 0.194449 0.980913
vn 0.000000 0.194449 0.980913
vn 0.000000 0.194449 0.980913
vn 0.000000 0.194449 0.980913
vn -1.000000 0.000000 0.000000
vn -1.000000 0.000000 0.000000
vn -1.000000 0.000000 0.000000
vn 1.000000 0.000000 0.000000
vn 1.000000 0.000000 0.000000
vn 1.000000 0.000000 0.000000
vn -0.500000 0.000000 0.866026
vn -0.500000 0.000000 0.866026
vn -0.499999 0.000000 0.866026
vn 0.499998 0.000000 -0.866027
vn 0.499998 0.000000 -0.866027
vn 0.499998 0.000000 -0.866027
vn 0.000000 -1.000000 -0.000000
vn 0.000000 -1.000000 -0.000000
vn 0.000000 -1.000000 -0.000000
vn 0.000000 -1.000000 -0.000000
vn 0.849496 0.194449 0.490456
vn 0.849496 0.194449 0.490456
vn 0.849496 0.194449 0.490456
vn 0.849496 0.194449 0.490456
vn -0.499997 0.000000 0.866027
vn -0.499997 0.000000 0.866027
vn -0.499997 0.000000 0.866027
vn 0.500002 0.000000 -0.866024
vn 0.500002 0.000000 -0.866024
vn 0.500002 0.000000 -0.866024
vn 0.000000 -1.000000 0.000000
vn 0.000000 -1.000000 0.000000
vn 0.000000 -1.000000 0.000000
vn 0.000000 -1.000000 0.000000
vn 0.849084 0.196831 0.490218
vn 0.849084 0.196831 0.490218
vn 0.849084 0.196831 0.490218
vn 0.849084 0.196831 0.490218
vn -0.500001 0.000000 0.866025
vn -0.500001 0.000000 0.866025
vn -0.500001 0.000000 0.866025
vn 0.499996 0.000000 -0.866028
vn 0.499996 0.000000 -0.866028
vn 0.499996 0.000000 -0.866028
vn 0.000000 -1.000000 -0.000000
vn 0.000000 -1.000000 -0.000000
vn 0.000000 -1.000000 -0.000000
vn 0.000000 -1.000000 -0.000000
vn 0.849495 0.194449 0.490457
vn 0.849495 0.194449 0.490457
vn 0.849495 0.194449 0.490457
vn 0.849495 0.194449 0.490457
vn -0.500001 0.000000 0.866025
vn -0.500001 0.000000 0.866025
vn -0.500001 0.000000 0.866025
vn 0.499998 0.000000 -0.866027
vn 0.499998 0.000000 -0.866027
vn 0.499998 0.000000 -0.866027
vn 0.000000 -1.000000 0.000000
vn 0.000000 -1.000000 0.000000
vn 0.000000 -1.000000 0.000000
vn 0.000000 -1.000000 0.000000
vn 0.849496 0.194448 0.490455
vn 0.849496 0.194448 0.490455
vn 0.849496 0.194448 0.490455
vn 0.849496 0.194448 0.490455
vn -0.500001 0.000000 0.866025
vn -0.500001 0.000000 0.866025
vn -0.500001 0.000000 0.866025
vn 0.499998 0.000000 -0.866027
vn 0.499998 0.000000 -0.866027
vn 0.499998 0.000000 -0.866027
vn 0.000000 -1.000000 0.000000
vn 0.000000 -1.000000 0.000000
vn 0.000000 -1.000000 0.000000
vn 0.000000 -1.000000 0.000000
vn 0.849497 0.194448 0.490455
vn 0.849497 0.194448 0.490455
vn 0.849497 0.194448 0.490455
vn 0.849497 0.194448 0.490455
vn -0.500001 0.000000 0.866025
vn -0.500001 0.000000 0.866025
vn -0.500001 0.000000 0.866025
vn 0.500001 0.000000 -0.866025
vn 0.500001 0.000000 -0.866025
vn 0.500001 0.000000 -0.866025
vn 0.000000 -1.000000 0.000000
vn 0.000000 -1.000000 0.000000
vn 0.000000 -1.000000 0.000000
vn 0.000000 -1.000000 0.000000
vn 0.849497 0.194448 0.490455
vn 0.849497 0.194448 0.490455
vn 0.849497 0.194448 0.490455
vn 0.849497 0.194448 0.490455
vn 0.500001 0.000000 -0.866025
vn 0.500001 0.000000 -0.866025
vn 0.500001 0.000000 -0.866025
vn -0.500009 0.000000 0.866020
vn -0.500009 0.000000 0.866020
vn -0.500009 0.000000 0.866020
vn 0.000000 -1.000000 0.000000
vn 0.000000 -1.000000 0.000000
vn 0.000000 -1.000000 0.000000
vn 0.000000 -1.000000 0.000000
vn -0.849493 0.194449 -0.490460
vn -0.849493 0.194449 -0.490460
vn -0.849493 0.194449 -0.490460
vn -0.849493 0.194449 -0.490460
vn 0.499998 0.000000 -0.866026
vn 0.499998 0.000000 -0.866026
vn 0.499998 0.000000 -0.866026
vn -0.500006 0.000000 0.866022
vn -0.500006 0.000000 0.866022
vn -0.500006 0.000000 0.866022
vn 0.000000 -1.000000 0.000000
vn 0.000000 -1.000000 0.000000
vn 0.000000 -1.000000 0.000000
vn 0.000000 -1.000000 0.000000
vn -0.849494 0.194450 -0.490458
vn -0.849494 0.194450 -0.490458
vn -0.849494 0.194450 -0.490458
vn -0.849494 0.194450 -0.490458
vn 0.500001 0.000000 -0.866025
vn 0.500001 0.000000 -0.866025
vn 0.500001 0.000000 -0.866025
vn -0.499998 0.000000 0.866026
vn -0.499998 0.000000 0.866026
vn -0.499998 0.000000 0.866026
vn 0.000000 -1.000000 0.000000
vn 0.000000 -1.000000 0.000000
vn 0.000000 -1.000000 0.000000
vn 0.000000 -1.000000 0.000000
vn -0.849496 0.194448 -0.490455
vn -0.849496 0.194448 -0.490455
vn -0.849496 0.194448 -0.490455
vn -0.849496 0.194448 -0.490455
vn 0.499994 0.000000 -0.866029
vn 0.499994 0.000000 -0.866029
vn 0.499994 0.000000 -0.866029
vn -0.500006 0.000000 0.866022
vn -0.500006 0.000000 0.866022
vn -0.500006 0.000000 0.866022
vn 0.000000 -1.000000 0.000000
vn 0.000000 -1.000000 0.000000
vn 0.000000 -1.000000 0.000000
vn 0.000000 -1.000000 0.000000
vn -0.849494 0.194449 -0.490459
vn -0.849494 0.194449 -0.490459
vn -0.849494 0.194449 -0.490459
vn -0.849494 0.194449 -0.490459
vn 0.499991 0.000000 -0.866031
vn 0.499991 0.000000 -0.866031
vn 0.499991 0.000000 -0.866031
vn -0.500001 0.000000 0.866025
vn -0.500001 0.000000 0.866025
vn -0.500001 0.000000 0.866025
vn 0.000000 -1.000000 -0.000000
vn 0.000000 -1.000000 -0.000000
vn 0.000000 -1.000000 -0.000000
vn 0.000000 -1.000000 -0.000000
vn -0.849494 0.194450 -0.490459
vn -0.849494 0.194450 -0.490459
vn -0.849494 0.194450 -0.490459
vn -0.849494 0.194450 -0.490459
vn -0.500009 0.000000 0.866020
vn -0.500009 0.000000 0.866020
vn -0.500009 0.000000 0.866020
vn 0.500001 0.000000 -0.866025
vn 0.500001 0.000000 -0.866025
vn 0.500001 0.000000 -0.866025
vn 0.000000 -1.000000 0.000000
vn 0.000000 -1.000000 0.000000
vn 0.000000 -1.000000 0.000000
vn 0.000000 -1.000000 0.000000
vn 0.849495 0.194448 0.490458
vn 0.849495 0.194448 0.490458
vn 0.849495 0.194448 0.490458
vn 0.849495 0.194448 0.490458
vn -0.500009 0.000000 0.866020
vn -0.500009 0.000000 0.866020
vn -0.500009 0.000000 0.866020
vn 0.499994 0.000000 -0.866029
vn 0.499994 0.000000 -0.866029
vn 0.499994 0.000000 -0.866029
vn 0.000000 -1.000000 0.000000
vn 0.000000 -1.000000 0.000000
vn 0.000000 -1.000000 0.000000
vn 0.000000 -1.000000 0.000000
vn 0.849497 0.194448 0.490455
vn 0.849497 0.194448 0.490455
vn 0.849497 0.194448 0.490455
vn 0.849496 0.194448 0.490455
vn -0.499998 0.000000 0.866026
vn -0.499998 0.000000 0.866026
vn -0.499998 0.000000 0.866026
vn 0.499994 0.000000 -0.866029
vn 0.499994 0.000000 -0.866029
vn 0.499994 0.000000 -0.866029
vn 0.000000 -1.000000 0.000000
vn 0.000000 -1.000000 0.000000
vn 0.000000 -1.000000 0.000000
vn 0.000000 -1.000000 0.000000
vn 0.849495 0.194448 0.490457
vn 0.849495 0.194448 0.490457
vn 0.849495 0.194448 0.490457
vn 0.849495 0.194448 0.490457
vn -0.500001 0.000000 0.866025
vn -0.500001 0.000000 0.866025
vn -0.500001 0.000000 0.866025
vn 0.499994 0.000000 -0.866029
vn 0.499994 0.000000 -0.866029
vn 0.499994 0.000000 -0.866029
vn 0.000000 -1.000000 0.000000
vn 0.000000 -1.000000 0.000000
vn 0.000000 -1.000000 0.000000
vn 0.000000 -1.000000 0.000000
vn 0.849497 0.194448 0.490455
vn 0.849496 0.194448 0.490455
vn 0.849496 0.194448 0.490455
vn 0.849496 0.194448 0.490455
vn -0.849953 0.191753 0.490726
vn -0.849952 0.191753 0.490726
vn -0.849952 0.191753 0.490726
vn -0.849952 0.191753 0.490726
vn 0.000000 -1.000000 0.000000
vn 0.000000 -1.000000 0.000000
vn 0.000000 -1.000000 0.000000
vn 0.000000 -1.000000 0.000000
vn 0.500006 0.000000 0.866022
vn 0.500006 0.000000 0.866022
vn 0.500006 0.000000 0.866022
vn -0.500006 0.000000 -0.866022
vn -0.500006 0.000000 -0.866022
vn -0.500006 0.000000 -0.866022
vn -0.849956 0.191751 0.490721
vn -0.849956 0.191751 0.490721
vn -0.849956 0.191751 0.490721
vn -0.849956 0.191751 0.490721
vn 0.000000 -1.000000 0.000000
vn 0.000000 -1.000000 0.000000
vn 0.000000 -1.000000 0.000000
vn 0.000000 -1.000000 0.000000
vn 0.499998 0.000000 0.866026
vn 0.499998 0.000000 0.866026
vn 0.499998 0.000000 0.866026
vn -0.500004 0.000000 -0.866023
vn -0.500004 0.000000 -0.866023
vn -0.500004 0.000000 -0.866023
vn 0.849953 0.191753 -0.490726
vn 0.849953 0.191753 -0.490726
vn 0.849953 0.191753 -0.490726
vn 0.849953 0.191753 -0.490726
vn 0.000000 -1.000000 0.000000
vn 0.000000 -1.000000 0.000000
vn 0.000000 -1.000000 0.000000
vn 0.000000 -1.000000 0.000000
vn -0.499991 0.000000 -0.866031
vn -0.499991 0.000000 -0.866031
vn -0.499991 0.000000 -0.866031
vn 0.499998 0.000000 0.866026
vn 0.499998 0.000000 0.866026
vn 0.499998 0.000000 0.866026
vn 0.849956 0.191752 -0.490721
vn 0.849956 0.191752 -0.490721
vn 0.849956 0.191752 -0.490721
vn 0.849956 0.191752 -0.490721
vn 0.000000 -1.000000 0.000000
vn 0.000000 -1.000000 0.000000
vn 0.000000 -1.000000 0.000000
vn 0.000000 -1.000000 0.000000
vn -0.499991 0.000000 -0.866031
vn -0.499991 0.000000 -0.866031
vn -0.499991 0.000000 -0.866031
vn 0.500004 0.000000 0.866023
vn 0.500004 0.000000 0.866023
vn 0.500004 0.000000 0.866023
vn 0.849956 0.191751 -0.490721
vn 0.849956 0.191751 -0.490721
vn 0.849956 0.191751 -0.490721
vn 0.849956 0.191751 -0.490721
vn 0.000000 -1.000000 0.000000
vn 0.000000 -1.000000 0.000000
vn 0.000000 -1.000000 0.000000
vn 0.000000 -1.000000 0.000000
vn -0.499997 0.000000 -0.866027
vn -0.499997 0.000000 -0.866027
vn -0.499997 0.000000 -0.866027
vn 0.499991 0.000000 0.866031
vn 0.499991 0.000000 0.866031
vn 0.499991 0.000000 0.866031
vn 0.849954 0.191753 -0.490723
vn 0.849954 0.191753 -0.490723
vn 0.849954 0.191753 -0.490723
vn 0.849954 0.191753 -0.490723
vn 0.000000 -1.000000 0.000000
vn 0.000000 -1.000000 0.000000
vn 0.000000 -1.000000 0.000000
vn 0.000000 -1.000000 0.000000
vn -0.499991 0.000000 -0.866031
vn -0.499991 0.000000 -0.866031
vn -0.499991 0.000000 -0.866031
vn 0.500012 0.000000 0.866019
vn 0.500012 0.000000 0.866019
vn 0.500012 0.000000 0.866019
vn 0.849956 0.191751 -0.490719
vn 0.849957 0.191751 -0.490720
vn 0.849957 0.191751 -0.490720
vn 0.849956 0.191751 -0.490719
vn 0.000000 -1.000000 0.000000
vn 0.000000 -1.000000 0.000000
vn 0.000000 -1.000000 0.000000
vn 0.000000 -1.000000 0.000000
vn -0.500001 0.000000 -0.866025
vn -0.500001 0.000000 -0.866025
vn -0.500001 0.000000 -0.866025
vn 0.499998 0.000000 0.866026
vn 0.499998 0.000000 0.866026
vn 0.499998 0.000000 0.866026
vn -0.849953 0.191753 0.490726
vn -0.849953 0.191753 0.490726
vn -0.849953 0.191753 0.490726
vn -0.849953 0.191753 0.490726
vn 0.000000 -1.000000 0.000000
vn 0.000000 -1.000000 0.000000
vn 0.000000 -1.000000 0.000000
vn 0.000000 -1.000000 0.000000
vn 0.500006 0.000000 0.866022
vn 0.500006 0.000000 0.866022
vn 0.500006 0.000000 0.866022
vn -0.500006 0.000000 -0.866022
vn -0.500006 0.000000 -0.866022
vn -0.500006 0.000000 -0.866022
vn -0.849955 0.191752 0.490723
vn -0.849955 0.191752 0.490723
vn -0.849955 0.191752 0.490723
vn -0.849955 0.191752 0.490723
vn 0.000000 -1.000000 0.000000
vn 0.000000 -1.000000 0.000000
vn 0.000000 -1.000000 0.000000
vn 0.000000 -1.000000 0.000000
vn 0.500002 0.000000 0.866024
vn 0.500002 0.000000 0.866024
vn 0.500002 0.000000 0.866024
vn -0.499995 0.000000 -0.866029
vn -0.499995 0.000000 -0.866028
vn -0.499995 0.000000 -0.866028
vn -0.849953 0.191753 0.490725
vn -0.849953 0.191753 0.490725
vn -0.849953 0.191753 0.490725
vn -0.849953 0.191753 0.490725
vn 0.000000 -1.000000 0.000000
vn 0.000000 -1.000000 0.000000
vn 0.000000 -1.000000 0.000000
vn 0.000000 -1.000000 0.000000
vn 0.499998 0.000000 0.866026
vn 0.499998 0.000000 0.866026
vn 0.499998 0.000000 0.866026
vn -0.499998 0.000000 -0.866026
vn -0.499998 0.000000 -0.866026
vn -0.499998 0.000000 -0.866026
vn -0.849956 0.191751 0.490721
vn -0.849956 0.191751 0.490721
vn -0.849956 0.191751 0.490721
vn -0.849956 0.191751 0.490721
vn 0.000000 -1.000000 0.000000
vn 0.000000 -1.000000 0.000000
vn 0.000000 -1.000000 0.000000
vn 0.000000 -1.000000 0.000000
vn 0.499998 0.000000 0.866026
vn 0.499998 0.000000 0.866026
vn 0.499998 0.000000 0.866026
vn -0.500004 0.000000 -0.866023
vn -0.500004 0.000000 -0.866023
vn -0.500004 0.000000 -0.866023
vn -0.849955 0.191752 0.490723
vn -0.849955 0.191752 0.490723
vn -0.849955 0.191751 0.490723
vn -0.849955 0.191751 0.490723
vn 0.000000 -1.000000 0.000000
vn 0.000000 -1.000000 0.000000
vn 0.000000 -1.000000 0.000000
vn 0.000000 -1.000000 0.000000
vn 0.499996 0.000000 0.866028
vn 0.499996 0.000000 0.866028
vn 0.499996 0.000000 0.866028
vn -0.500002 0.000000 -0.866024
vn -0.500002 0.000000 -0.866024
vn -0.500002 0.000000 -0.866024
vn -0.849955 0.191752 0.490722
vn -0.849955 0.191752 0.490722
vn -0.849955 0.191752 0.490722
vn -0.849955 0.191752 0.490722
vn 0.000000 -1.000000 0.000000
vn 0.000000 -1.000000 0.000000
vn 0.000000 -1.000000 0.000000
vn 0.000000 -1.000000 0.000000
vn 0.499998 0.000000 0.866027
vn 0.499998 0.000000 0.866027
vn 0.499998 0.000000 0.866027
vn -0.500002 0.000000 -0.866024
vn -0.500002 0.000000 -0.866024
vn -0.500002 0.000000 -0.866024
vn -0.849956 0.191751 0.490720
vn -0.849956 0.191751 0.490720
vn -0.849956 0.191751 0.490720
vn -0.849956 0.191751 0.490720
vn 0.000000 -1.000000 0.000000
vn 0.000000 -1.000000 0.000000
vn 0.000000 -1.000000 0.000000
vn 0.000000 -1.000000 0.000000
vn 0.500001 0.000000 0.866025
vn 0.500001 0.000000 0.866025
vn 0.500001 0.000000 0.866025
vn -0.499999 0.000000 -0.866026
vn -0.499999 0.000000 -0.866026
vn -0.499999 0.000000 -0.866026
vn -0.849956 0.191751 0.490720
vn -0.849956 0.191751 0.490720
vn -0.849956 0.191751 0.490720
vn -0.849956 0.191751 0.490720
vn 0.000000 -1.000000 0.000000
vn 0.000000 -1.000000 0.000000
vn 0.000000 -1.000000 0.000000
vn 0.000000 -1.000000 0.000000
vn 0.500004 0.000000 0.866023
vn 0.500004 0.000000 0.866023
vn 0.500004 0.000000 0.866023
vn -0.499999 0.000000 -0.866026
vn -0.499999 0.000000 -0.866026
vn -0.499999 0.000000 -0.866026
vn -0.849956 0.191752 0.490720
vn -0.849956 0.191752 0.490720
vn -0.849956 0.191752 0.490720
vn -0.849956 0.191752 0.490720
vn 0.000000 -1.000000 0.000000
vn 0.000000 -1.000000 0.000000
vn 0.000000 -1.000000 0.000000
vn 0.000000 -1.000000 0.000000
vn 0.500004 0.000000 0.866023
vn 0.500004 0.000000 0.866023
vn 0.500004 0.000000 0.866023
vn -0.499998 0.000000 -0.866026
vn -0.499998 0.000000 -0.866026
vn -0.499998 0.000000 -0.866026
vn 0.000000 0.194448 -0.980913
vn 0.000000 0.194448 -0.980913
vn 0.000000 0.194448 -0.980913
vn 0.000000 0.194448 -0.980913
vn 0.000000 -1.000000 0.000000
vn 0.000000 -1.000000 0.000000
vn 0.000000 -1.000000 0.000000
vn 0.000000 -1.000000 0.000000
vn 1.000000 0.000000 0.000000
vn 1.000000 0.000000 0.000000
vn 1.000000 0.000000 0.000000
vn -1.000000 0.000000 0.000000
vn -1.000000 0.000000 0.000000
vn -1.000000 0.000000 0.000000
vn 0.000000 0.194448 -0.980913
vn 0.000000 0.194448 -0.980913
vn 0.000000 0.194448 -0.980913
vn 0.000000 0.194448 -0.980913
vn 0.000000 -1.000000 0.000000
vn 0.000000 -1.000000 0.000000
vn 0.000000 -1.000000 0.000000
vn 0.000000 -1.000000 0.000000
vn 1.000000 0.000000 0.000000
vn 1.000000 0.000000 0.000000
vn 1.000000 0.000000 0.000000
vn -1.000000 0.000000 0.000000
vn -1.000000 0.000000 0.000000
vn -1.000000 0.000000 0.000000
vn 0.000000 0.216509 -0.976281
vn 0.000000 0.216509 -0.976281
vn 0.000000 0.216509 -0.976281
vn 0.000000 0.216509 -0.976281
vn 0.000000 -1.000000 0.000000
vn 0.000000 -1.000000 0.000000
vn 0.000000 -1.000000 0.000000
vn 0.000000 -1.000000 0.000000
vn 1.000000 0.000000 0.000000
vn 1.000000 0.000000 0.000000
vn 1.000000 0.000000 0.000000
vn -1.000000 0.000000 0.000000
vn -1.000000 0.000000 0.000000
vn -1.000000 0.000000 0.000000
vn 0.000000 0.216509 -0.976281
vn 0.000000 0.216509 -0.976281
vn 0.000000 0.216509 -0.976281
vn 0.000000 0.216509 -0.976281
vn 0.000000 -1.000000 0.000000
vn 0.000000 -1.000000 0.000000
vn 0.000000 -1.000000 0.000000
vn 0.000000 -1.000000 0.000000
vn 1.000000 0.000000 0.000000
vn 1.000000 0.000000 0.000000
vn 1.000000 0.000000 0.000000
vn -1.000000 0.000000 0.000000
vn -1.000000 0.000000 0.000000
vn -1.000000 0.000000 0.000000
vn 0.000000 0.199334 -0.979932
vn 0.000000 0.199334 -0.979932
vn 0.000000 0.199334 -0.979932
vn 0.000000 0.199334 -0.979932
vn 0.000000 -1.000000 0.000000
vn 0.000000 -1.000000 0.000000
vn 0.000000 -1.000000 0.000000
vn 0.000000 -1.000000 0.000000
vn 1.000000 0.000000 0.000000
vn 1.000000 0.000000 0.000000
vn 1.000000 0.000000 0.000000
vn -1.000000 0.000000 0.000000
vn -1.000000 0.000000 0.000000
vn -1.000000 0.000000 0.000000
vn 0.000000 0.194448 -0.980913
vn 0.000000 0.194448 -0.980913
vn 0.000000 0.194448 -0.980913
vn 0.000000 0.194448 -0.980913
vn 0.000000 -1.000000 0.000000
vn 0.000000 -1.000000 0.000000
vn 0.000000 -1.000000 0.000000
vn 0.000000 -1.000000 0.000000
vn 1.000000 0.000000 0.000000
vn 1.000000 0.000000 0.000000
vn 1.000000 0.000000 0.000000
vn -1.000000 0.000000 0.000000
vn -1.000000 0.000000 0.000000
vn -1.000000 0.000000 0.000000
s off
g Apoyo_Pared
usemtl initialShadingGroup
f 3/4/1 4/3/2 6/5/3 5/6/4
f 2/2/5 6/5/6 4/3/7
f 5/6/8 1/1/9 3/4/10
f 9/7/11 10/8/12 12/9/13 11/10/14
f 8/11/15 12/9/16 10/8/17
f 11/10/18 7/12/19 9/7/20
f 15/13/21 16/14/22 18/15/23 17/16/24
f 14/17/25 18/15/26 16/14/27
f 17/16/28 13/18/29 15/13/30
f 21/19/31 22/20/32 24/21/33 23/22/34
f 20/23/35 24/21/36 22/20/37
f 23/22/38 19/24/39 21/19/40
f 27/25/41 28/26/42 30/27/43 29/28/44
f 26/29/45 30/27/46 28/26/47
f 29/28/48 25/30/49 27/25/50
f 31/31/51 32/32/52 33/33/53
f 34/34/54 36/35/55 35/36/56
f 35/36/57 36/35/58 32/32/59 31/31/60
f 32/32/61 36/35/62 34/34/63 33/33/64
f 37/37/65 38/38/66 39/39/67
f 40/40/68 42/41/69 41/42/70
f 41/42/71 42/41/72 38/38/73 37/37/74
f 38/38/75 42/41/76 40/40/77 39/39/78
f 43/43/79 44/44/80 45/45/81
f 46/46/82 48/47/83 47/48/84
f 47/48/85 48/47/86 44/44/87 43/43/88
f 44/44/89 48/47/90 46/46/91 45/45/92
f 49/49/93 50/50/94 51/51/95
f 52/52/96 54/53/97 53/54/98
f 53/54/99 54/53/100 50/50/101 49/49/102
f 50/50/103 54/53/104 52/52/105 51/51/106
f 55/55/107 56/56/108 57/57/109
f 58/58/110 60/59/111 59/60/112
f 59/60/113 60/59/114 56/56/115 55/55/116
f 56/56/117 60/59/118 58/58/119 57/57/120
f 61/61/121 62/62/122 63/63/123
f 64/64/124 66/65/125 65/66/126
f 65/66/127 66/65/128 62/62/129 61/61/130
f 62/62/131 66/65/132 64/64/133 63/63/134
f 67/67/135 68/68/136 69/69/137
f 70/70/138 72/71/139 71/72/140
f 71/72/141 72/71/142 68/68/143 67/67/144
f 68/68/145 72/71/146 70/70/147 69/69/148
f 73/73/149 74/74/150 75/75/151
f 76/76/152 78/77/153 77/78/154
f 77/78/155 78/77/156 74/74/157 73/73/158
f 74/74/159 78/77/160 76/76/161 75/75/162
f 79/79/163 80/80/164 81/81/165
f 82/82/166 84/83/167 83/84/168
f 83/84/169 84/83/170 80/80/171 79/79/172
f 80/80/173 84/83/174 82/82/175 81/81/176
f 85/85/177 86/86/178 87/87/179
f 88/88/180 90/89/181 89/90/182
f 89/90/183 90/89/184 86/86/185 85/85/186
f 86/86/187 90/89/188 88/88/189 87/87/190
f 91/91/191 92/92/192 93/93/193
f 94/94/194 96/95/195 95/96/196
f 95/96/197 96/95/198 92/92/199 91/91/200
f 92/92/201 96/95/202 94/94/203 93/93/204
f 97/97/205 98/98/206 99/99/207
f 100/100/208 102/101/209 101/102/210
f 101/102/211 102/101/212 98/98/213 97/97/214
f 98/98/215 102/101/216 100/100/217 99/99/218
f 103/103/219 104/104/220 105/105/221
f 106/106/222 108/107/223 107/108/224
f 107/108/225 108/107/226 104/104/227 103/103/228
f 104/104/229 108/107/230 106/106/231 105/105/232
f 109/109/233 110/110/234 111/111/235
f 112/112/236 114/113/237 113/114/238
f 113/114/239 114/113/240 110/110/241 109/109/242
f 110/110/243 114/113/244 112/112/245 111/111/246
f 115/115/247 116/116/248 117/117/249
f 118/118/250 120/119/251 119/120/252
f 119/120/253 120/119/254 116/116/255 115/115/256
f 116/116/257 120/119/258 118/118/259 117/117/260
f 121/121/261 122/122/262 124/123/263 123/124/264
f 125/125/265 126/126/266 122/122/267 121/121/268
f 122/122/269 126/126/270 124/123/271
f 125/125/272 121/121/273 123/124/274
f 127/127/275 128/128/276 130/129/277 129/130/278
f 131/131/279 132/132/280 128/128/281 127/127/282
f 128/128/283 132/132/284 130/129/285
f 131/131/286 127/127/287 129/130/288
f 133/133/289 134/134/290 136/135/291 135/136/292
f 137/137/293 138/138/294 134/134/295 133/133/296
f 134/134/297 138/138/298 136/135/299
f 137/137/300 133/133/301 135/136/302
f 139/139/303 140/140/304 142/141/305 141/142/306
f 143/143/307 144/144/308 140/140/309 139/139/310
f 140/140/311 144/144/312 142/141/313
f 143/143/314 139/139/315 141/142/316
f 145/145/317 146/146/318 148/147/319 147/148/320
f 149/149/321 150/150/322 146/146/323 145/145/324
f 146/146/325 150/150/326 148/147/327
f 149/149/328 145/145/329 147/148/330
f 151/151/331 152/152/332 154/153/333 153/154/334
f 155/155/335 156/156/336 152/152/337 151/151/338
f 152/152/339 156/156/340 154/153/341
f 155/155/342 151/151/343 153/154/344
f 157/157/345 158/158/346 160/159/347 159/160/348
f 161/161/349 162/162/350 158/158/351 157/157/352
f 158/158/353 162/162/354 160/159/355
f 161/161/356 157/157/357 159/160/358
f 163/163/359 164/164/360 166/165/361 165/166/362
f 167/167/363 168/168/364 164/164/365 163/163/366
f 164/164/367 168/168/368 166/165/369
f 167/167/370 163/163/371 165/166/372
f 169/169/373 170/170/374 172/171/375 171/172/376
f 173/173/377 174/174/378 170/170/379 169/169/380
f 170/170/381 174/174/382 172/171/383
f 173/173/384 169/169/385 171/172/386
f 175/175/387 176/176/388 178/177/389 177/178/390
f 179/179/391 180/180/392 176/176/393 175/175/394
f 176/176/395 180/180/396 178/177/397
f 179/179/398 175/175/399 177/178/400
f 181/181/401 182/182/402 184/183/403 183/184/404
f 185/185/405 186/186/406 182/182/407 181/181/408
f 182/182/409 186/186/410 184/183/411
f 185/185/412 181/181/413 183/184/414
f 187/187/415 188/188/416 190/189/417 189/190/418
f 191/191/419 192/192/420 188/188/421 187/187/422
f 188/188/423 192/192/424 190/189/425
f 191/191/426 187/187/427 189/190/428
f 193/193/429 194/194/430 196/195/431 195/196/432
f 197/197/433 198/198/434 194/194/435 193/193/436
f 194/194/437 198/198/438 196/195/439
f 197/197/440 193/193/441 195/196/442
f 199/199/443 200/200/444 202/201/445 201/202/446
f 203/203/447 204/204/448 200/200/449 199/199/450
f 200/200/451 204/204/452 202/201/453
f 203/203/454 199/199/455 201/202/456
f 205/205/457 206/206/458 208/207/459 207/208/460
f 209/209/461 210/210/462 206/206/463 205/205/464
f 206/206/465 210/210/466 208/207/467
f 209/209/468 205/205/469 207/208/470
f 211/211/471 212/212/472 214/213/473 213/214/474
f 215/215/475 216/216/476 212/212/477 211/211/478
f 212/212/479 216/216/480 214/213/481
f 215/215/482 211/211/483 213/214/484
f 219/217/485 220/218/486 222/219/487 221/220/488
f 221/220/489 222/219/490 218/221/491 217/222/492
f 218/221/493 222/219/494 220/218/495
f 221/220/496 217/222/497 219/217/498
f 225/223/499 226/224/500 228/225/501 227/226/502
f 227/226/503 228/225/504 224/227/505 223/228/506
f 224/227/507 228/225/508 226/224/509
f 227/226/510 223/228/511 225/223/512
f 231/229/513 232/230/514 234/231/515 233/232/516
f 233/232/517 234/231/518 230/233/519 229/234/520
f 230/233/521 234/231/522 232/230/523
f 233/232/524 229/234/525 231/229/526
f 237/235/527 238/236/528 240/237/529 239/238/530
f 239/238/531 240/237/532 236/239/533 235/240/534
f 236/239/535 240/237/536 238/236/537
f 239/238/538 235/240/539 237/235/540
f 243/241/541 244/242/542 246/243/543 245/244/544
f 245/244/545 246/243/546 242/245/547 241/246/548
f 242/245/549 246/243/550 244/242/551
f 245/244/552 241/246/553 243/241/554
f 249/247/555 250/248/556 252/249/557 251/250/558
f 251/250/559 252/249/560 248/251/561 247/252/562
f 248/251/563 252/249/564 250/248/565
f 251/250/566 247/252/567 249/247/568
