# This file uses centimeters as units for non-parametric coordinates.

mtllib metalBars.mtl
g kk:default1
v 1.543930 11.638002 0.282104
v 1.202255 11.955414 0.274422
v -2.216553 7.589681 0.268555
v -2.558235 7.907094 0.260880
v -2.208374 7.584075 -0.327034
v -2.550049 7.901488 -0.334717
v 1.552116 11.632397 -0.313492
v 1.210434 11.949808 -0.321167
v 1.109474 3.708335 0.314888
v 1.464134 4.011269 0.316910
v -2.478432 7.909447 0.226067
v -2.123779 8.212381 0.228088
v -2.470253 7.903842 -0.369522
v -2.115593 8.206775 -0.367500
v 1.117661 3.702729 -0.280701
v 1.472313 4.005663 -0.278679
v 1.543930 3.853404 0.282104
v 1.202255 4.170815 0.274422
v -2.216553 -0.194919 0.268555
v -2.558235 0.122493 0.260880
v -2.208374 -0.200524 -0.327034
v -2.550049 0.116888 -0.334717
v 1.552116 3.847797 -0.313492
v 1.210434 4.165209 -0.321167
v 1.109474 11.492934 0.314888
v 1.464134 11.795868 0.316910
v -2.478432 15.694046 0.226067
v -2.123779 15.996981 0.228088
v -2.470253 15.688440 -0.369522
v -2.115593 15.991375 -0.367500
v 1.117661 11.487329 -0.280701
v 1.472313 11.790262 -0.278679
v 1.307541 -0.278641 0.612244
v 2.307541 -0.278641 0.612244
v 1.307541 16.003271 0.612244
v 2.307541 16.003271 0.612244
v 1.307541 16.003271 -0.664856
v 2.307541 16.003271 -0.664856
v 1.307541 -0.278641 -0.664856
v 2.307541 -0.278641 -0.664856
v -3.013855 -0.278641 0.612244
v -2.013855 -0.278641 0.612244
v -3.013855 16.003271 0.612244
v -2.013855 16.003271 0.612244
v -3.013855 16.003271 -0.664856
v -2.013855 16.003271 -0.664856
v -3.013855 -0.278641 -0.664856
v -2.013855 -0.278641 -0.664856
vt 0.163983 0.985463
vt 0.150479 0.998008
vt 0.001859 0.838012
vt 0.015363 0.825468
vt 0.548418 0.184167
vt 0.548115 0.196711
vt 0.524576 0.196490
vt 0.524879 0.183945
vt 0.184688 0.998008
vt 0.171184 0.985463
vt 0.319804 0.825468
vt 0.333308 0.838012
vt 0.518315 0.343941
vt 0.518618 0.356485
vt 0.495080 0.356707
vt 0.494776 0.344162
vt 0.548650 0.356707
vt 0.525111 0.356485
vt 0.495312 0.184167
vt 0.518850 0.183945
vt 0.689464 0.001992
vt 0.703481 0.013964
vt 0.561681 0.179999
vt 0.547665 0.168026
vt 0.432978 0.168248
vt 0.433058 0.180220
vt 0.409520 0.179999
vt 0.409440 0.168026
vt 0.709533 0.013964
vt 0.723550 0.001992
vt 0.865349 0.168026
vt 0.851333 0.179999
vt 0.467615 0.001992
vt 0.467534 0.013964
vt 0.443996 0.014186
vt 0.444076 0.002214
vt 0.471045 0.179999
vt 0.447506 0.180220
vt 0.412950 0.001992
vt 0.436489 0.002214
vt 0.489050 0.809198
vt 0.475547 0.821743
vt 0.326926 0.661747
vt 0.340430 0.649203
vt 0.608017 0.183945
vt 0.607714 0.196490
vt 0.584175 0.196268
vt 0.584479 0.183723
vt 0.172580 0.821743
vt 0.159077 0.809198
vt 0.307697 0.649203
vt 0.321201 0.661747
vt 0.577914 0.343719
vt 0.578218 0.356264
vt 0.554679 0.356485
vt 0.554375 0.343941
vt 0.608249 0.356485
vt 0.584711 0.356264
vt 0.554911 0.183945
vt 0.578450 0.183723
vt 0.917316 0.183723
vt 0.931332 0.195696
vt 0.789533 0.361730
vt 0.775516 0.349758
vt 0.502091 0.168248
vt 0.502171 0.180220
vt 0.478632 0.179999
vt 0.478552 0.168026
vt 0.613975 0.195696
vt 0.627991 0.183723
vt 0.769791 0.349758
vt 0.755774 0.361730
vt 0.536727 0.001992
vt 0.536647 0.013964
vt 0.513108 0.014186
vt 0.513188 0.002214
vt 0.540157 0.179999
vt 0.516619 0.180220
vt 0.482063 0.001992
vt 0.505601 0.002214
vt 0.205740 0.001992
vt 0.245262 0.001992
vt 0.245262 0.645478
vt 0.205740 0.645478
vt 0.431265 0.825468
vt 0.470787 0.825468
vt 0.470787 0.875941
vt 0.431265 0.875941
vt 0.251209 0.001992
vt 0.290731 0.001992
vt 0.290731 0.645478
vt 0.251209 0.645478
vt 0.476733 0.825468
vt 0.516255 0.825468
vt 0.516255 0.875941
vt 0.476733 0.875941
vt 0.296678 0.001992
vt 0.347151 0.001992
vt 0.347151 0.645478
vt 0.296678 0.645478
vt 0.353059 0.001992
vt 0.403532 0.001992
vt 0.403532 0.645478
vt 0.353059 0.645478
vt 0.001859 0.001992
vt 0.041381 0.001992
vt 0.041381 0.645478
vt 0.001859 0.645478
vt 0.340327 0.825468
vt 0.379849 0.825468
vt 0.379849 0.875941
vt 0.340327 0.875941
vt 0.047509 0.001992
vt 0.087031 0.001992
vt 0.087031 0.645478
vt 0.047509 0.645478
vt 0.385796 0.825468
vt 0.425318 0.825468
vt 0.425318 0.875941
vt 0.385796 0.875941
vt 0.092978 0.001992
vt 0.143451 0.001992
vt 0.143451 0.645478
vt 0.092978 0.645478
vt 0.149359 0.001992
vt 0.199832 0.001992
vt 0.199832 0.645478
vt 0.149359 0.645478
vn -0.013736 0.009409 0.999861
vn -0.013736 0.009409 0.999861
vn -0.013736 0.009409 0.999861
vn -0.013736 0.009409 0.999861
vn -0.680574 -0.732675 -0.002454
vn -0.680574 -0.732675 -0.002454
vn -0.680574 -0.732675 -0.002454
vn -0.680574 -0.732675 -0.002454
vn 0.013724 -0.009409 -0.999862
vn 0.013724 -0.009409 -0.999862
vn 0.013724 -0.009409 -0.999862
vn 0.013724 -0.009409 -0.999862
vn 0.680580 0.732669 0.002454
vn 0.680580 0.732669 0.002454
vn 0.680580 0.732670 0.002454
vn 0.680580 0.732670 0.002454
vn -0.732542 0.680523 -0.016469
vn -0.732542 0.680523 -0.016469
vn -0.732542 0.680523 -0.016469
vn -0.732542 0.680523 -0.016469
vn 0.732546 -0.680518 0.016469
vn 0.732546 -0.680518 0.016469
vn 0.732546 -0.680518 0.016469
vn 0.732546 -0.680518 0.016469
vn -0.013736 0.009408 0.999861
vn -0.013736 0.009408 0.999861
vn -0.013736 0.009408 0.999861
vn -0.013736 0.009408 0.999861
vn -0.649333 0.760335 -0.016077
vn -0.649333 0.760335 -0.016077
vn -0.649333 0.760335 -0.016077
vn -0.649333 0.760335 -0.016077
vn 0.013736 -0.009408 -0.999861
vn 0.013736 -0.009408 -0.999861
vn 0.013736 -0.009408 -0.999861
vn 0.013736 -0.009408 -0.999861
vn 0.649340 -0.760329 0.016077
vn 0.649340 -0.760329 0.016077
vn 0.649340 -0.760329 0.016077
vn 0.649340 -0.760329 0.016077
vn 0.760373 0.649472 0.004333
vn 0.760373 0.649472 0.004333
vn 0.760373 0.649472 0.004333
vn 0.760373 0.649472 0.004333
vn -0.760369 -0.649477 -0.004334
vn -0.760369 -0.649477 -0.004334
vn -0.760369 -0.649477 -0.004334
vn -0.760369 -0.649477 -0.004334
vn -0.013736 0.009409 0.999861
vn -0.013736 0.009409 0.999861
vn -0.013736 0.009409 0.999861
vn -0.013736 0.009409 0.999861
vn -0.680574 -0.732675 -0.002454
vn -0.680574 -0.732675 -0.002454
vn -0.680574 -0.732675 -0.002454
vn -0.680574 -0.732675 -0.002454
vn 0.013724 -0.009409 -0.999862
vn 0.013724 -0.009409 -0.999862
vn 0.013724 -0.009409 -0.999862
vn 0.013724 -0.009409 -0.999862
vn 0.680580 0.732670 0.002455
vn 0.680580 0.732669 0.002455
vn 0.680580 0.732670 0.002455
vn 0.680580 0.732670 0.002455
vn -0.732542 0.680523 -0.016470
vn -0.732542 0.680523 -0.016470
vn -0.732542 0.680523 -0.016470
vn -0.732542 0.680523 -0.016470
vn 0.732546 -0.680518 0.016469
vn 0.732546 -0.680518 0.016469
vn 0.732546 -0.680518 0.016469
vn 0.732546 -0.680518 0.016469
vn -0.013748 0.009408 0.999861
vn -0.013748 0.009408 0.999861
vn -0.013748 0.009408 0.999861
vn -0.013748 0.009408 0.999861
vn -0.649333 0.760335 -0.016077
vn -0.649333 0.760335 -0.016077
vn -0.649333 0.760335 -0.016077
vn -0.649333 0.760335 -0.016077
vn 0.013748 -0.009408 -0.999861
vn 0.013748 -0.009408 -0.999861
vn 0.013748 -0.009408 -0.999861
vn 0.013748 -0.009408 -0.999861
vn 0.649340 -0.760329 0.016077
vn 0.649340 -0.760329 0.016077
vn 0.649340 -0.760329 0.016077
vn 0.649340 -0.760329 0.016077
vn 0.760373 0.649472 0.004333
vn 0.760373 0.649472 0.004333
vn 0.760373 0.649472 0.004333
vn 0.760373 0.649472 0.004333
vn -0.760369 -0.649477 -0.004334
vn -0.760369 -0.649477 -0.004334
vn -0.760369 -0.649477 -0.004334
vn -0.760369 -0.649477 -0.004334
vn 0.000000 0.000000 1.000000
vn 0.000000 0.000000 1.000000
vn 0.000000 0.000000 1.000000
vn 0.000000 0.000000 1.000000
vn 0.000000 1.000000 0.000000
vn 0.000000 1.000000 0.000000
vn 0.000000 1.000000 0.000000
vn 0.000000 1.000000 0.000000
vn 0.000000 0.000000 -1.000000
vn 0.000000 0.000000 -1.000000
vn 0.000000 0.000000 -1.000000
vn 0.000000 0.000000 -1.000000
vn 0.000000 -1.000000 0.000000
vn 0.000000 -1.000000 0.000000
vn 0.000000 -1.000000 0.000000
vn 0.000000 -1.000000 0.000000
vn 1.000000 0.000000 0.000000
vn 1.000000 0.000000 0.000000
vn 1.000000 0.000000 0.000000
vn 1.000000 0.000000 0.000000
vn -1.000000 0.000000 0.000000
vn -1.000000 0.000000 0.000000
vn -1.000000 0.000000 0.000000
vn -1.000000 0.000000 0.000000
vn 0.000000 0.000000 1.000000
vn 0.000000 0.000000 1.000000
vn 0.000000 0.000000 1.000000
vn 0.000000 0.000000 1.000000
vn 0.000000 1.000000 0.000000
vn 0.000000 1.000000 0.000000
vn 0.000000 1.000000 0.000000
vn 0.000000 1.000000 0.000000
vn 0.000000 0.000000 -1.000000
vn 0.000000 0.000000 -1.000000
vn 0.000000 0.000000 -1.000000
vn 0.000000 0.000000 -1.000000
vn 0.000000 -1.000000 0.000000
vn 0.000000 -1.000000 0.000000
vn 0.000000 -1.000000 0.000000
vn 0.000000 -1.000000 0.000000
vn 1.000000 0.000000 0.000000
vn 1.000000 0.000000 0.000000
vn 1.000000 0.000000 0.000000
vn 1.000000 0.000000 0.000000
vn -1.000000 0.000000 0.000000
vn -1.000000 0.000000 0.000000
vn -1.000000 0.000000 0.000000
vn -1.000000 0.000000 0.000000
s off
g kk:pCube31 prop_metalBars
usemtl kk:initialShadingGroup
f 1/1/1 2/2/2 4/3/3 3/4/4
f 3/5/5 4/6/6 6/7/7 5/8/8
f 5/9/9 6/10/10 8/11/11 7/12/12
f 7/13/13 8/14/14 2/15/15 1/16/16
f 2/17/17 8/18/18 6/7/19 4/6/20
f 7/13/21 1/16/22 3/19/23 5/20/24
f 9/21/25 10/22/26 12/23/27 11/24/28
f 11/25/29 12/26/30 14/27/31 13/28/32
f 13/29/33 14/30/34 16/31/35 15/32/36
f 15/33/37 16/34/38 10/35/39 9/36/40
f 10/35/41 16/34/42 14/37/43 12/38/44
f 15/39/45 9/40/46 11/25/47 13/28/48
f 17/41/49 18/42/50 20/43/51 19/44/52
f 19/45/53 20/46/54 22/47/55 21/48/56
f 21/49/57 22/50/58 24/51/59 23/52/60
f 23/53/61 24/54/62 18/55/63 17/56/64
f 18/57/65 24/58/66 22/47/67 20/46/68
f 23/53/69 17/56/70 19/59/71 21/60/72
f 25/61/73 26/62/74 28/63/75 27/64/76
f 27/65/77 28/66/78 30/67/79 29/68/80
f 29/69/81 30/70/82 32/71/83 31/72/84
f 31/73/85 32/74/86 26/75/87 25/76/88
f 26/75/89 32/74/90 30/77/91 28/78/92
f 31/79/93 25/80/94 27/65/95 29/68/96
f 33/81/97 34/82/98 36/83/99 35/84/100
f 35/85/101 36/86/102 38/87/103 37/88/104
f 37/89/105 38/90/106 40/91/107 39/92/108
f 39/93/109 40/94/110 34/95/111 33/96/112
f 34/97/113 40/98/114 38/99/115 36/100/116
f 39/101/117 33/102/118 35/103/119 37/104/120
f 41/105/121 42/106/122 44/107/123 43/108/124
f 43/109/125 44/110/126 46/111/127 45/112/128
f 45/113/129 46/114/130 48/115/131 47/116/132
f 47/117/133 48/118/134 42/119/135 41/120/136
f 42/121/137 48/122/138 46/123/139 44/124/140
f 47/125/141 41/126/142 43/127/143 45/128/144
