# This file uses centimeters as units for non-parametric coordinates.

mtllib BolsaDinero.mtl
g default
v -0.660639 1.924116 0.000000
v 0.660640 1.924116 0.000000
v 2.317502 -0.072529 0.000000
v -2.317502 -0.072529 0.000000
v -1.175928 -4.406346 0.000000
v -0.772502 -0.072529 -1.974060
v -0.188044 1.794750 -0.509457
v -0.188044 1.794750 0.509456
v -0.772502 -0.072530 1.974060
v 1.175924 -4.406346 0.000000
v 0.772500 -0.072529 -1.974060
v 0.188044 1.794750 -0.509457
v 0.188044 1.794750 0.509456
v 0.772500 -0.072530 1.974060
v -2.993286 -2.908572 -1.663555
v -3.244325 -2.398686 0.000000
v -3.234128 -3.064161 0.000000
v -2.911220 -3.646132 0.000000
v -2.351970 -4.006963 0.000000
v 2.993288 -2.908572 -1.663555
v 2.351970 -4.006963 0.000000
v 2.911220 -3.646131 0.000000
v 3.234128 -3.064160 0.000000
v 3.244326 -2.398686 0.000000
v 2.993288 -2.908571 1.663556
v -2.993286 -2.908572 1.663556
v -0.660639 1.924116 -0.050045
v -0.387167 1.839314 -0.406446
v -2.340366 -0.170052 -0.926619
v -1.926381 -0.072529 -1.381566
v 0.387167 1.839314 -0.406446
v 0.660640 1.924116 -0.050045
v 2.317502 -0.072529 -0.940475
v 1.996895 -0.249555 -1.434407
v -0.387167 1.839314 0.406446
v -0.660639 1.924116 0.050045
v -1.996894 -0.249555 1.434407
v -2.317502 -0.072529 0.940475
v 0.387167 1.839314 0.406446
v 0.660640 1.924116 0.050045
v 2.340367 -0.170052 0.926619
v 1.926380 -0.072529 1.381566
v 3.244326 -2.398686 -1.076715
v 2.994193 -2.709631 -1.704377
v -3.244325 -2.398686 -1.076715
v -2.994193 -2.709632 -1.704377
v 2.994193 -2.709630 1.704377
v 3.244326 -2.398686 1.076715
v -3.244325 -2.398686 1.076715
v -2.994193 -2.709631 1.704377
v -1.096565 -3.124626 -2.669922
v -2.938023 -2.178448 -1.669343
v -3.108341 -1.818694 -1.026683
v -3.100720 -1.786186 0.000000
v -3.100720 -1.786186 1.031302
v -2.961528 -2.237456 1.686957
v -1.096565 -3.124626 2.669922
v 1.096561 -3.124626 2.669922
v 2.938024 -2.178447 1.669343
v 3.108343 -1.818693 1.026683
v 3.100721 -1.786186 0.000000
v 3.100721 -1.786186 -1.031302
v 2.961528 -2.237456 -1.686957
v 1.096561 -3.124626 -2.669922
v -1.017202 -1.842905 -2.520716
v -2.638947 -1.369816 -1.525455
v -2.972359 -1.238701 -0.976651
v -2.957115 -1.173685 0.000000
v -2.957115 -1.173685 0.985888
v -2.685956 -1.487833 1.560682
v -1.017202 -1.842905 2.520716
v 1.017199 -1.842905 2.520716
v 2.638947 -1.369816 1.525455
v 2.972359 -1.238700 0.976651
v 2.957116 -1.173685 0.000000
v 2.957116 -1.173685 -0.985888
v 2.685956 -1.487833 -1.560682
v 1.017199 -1.842905 -2.520716
v -2.815545 -3.273800 1.667648
v -2.786004 -3.424997 1.651051
v -2.730169 -3.521235 1.752193
v -1.153500 -3.947545 2.356860
v -1.142609 -3.675545 2.481968
v 1.153471 -3.947100 2.356934
v 1.136824 -3.676799 2.485390
v 2.730180 -3.521226 1.752202
v 2.786004 -3.424996 1.651051
v 2.815519 -3.273829 1.667654
v -2.730167 -3.521237 -1.752190
v -2.786004 -3.424997 -1.651049
v -2.815549 -3.273795 -1.667644
v -1.150584 -3.947597 -2.356835
v -1.136844 -3.677072 -2.485360
v 1.153490 -3.947418 -2.356940
v 1.136843 -3.677093 -2.485346
v 2.815545 -3.273800 -1.667645
v 2.786004 -3.424997 -1.651049
v 2.730170 -3.521235 -1.752191
v -1.175928 -4.406345 1.794839
v -1.164718 -4.177023 2.211614
v -2.512022 -3.709003 1.572998
v -2.351970 -4.006963 1.224290
v 1.175924 -4.406345 1.794479
v 1.164716 -4.177084 2.211278
v 2.512043 -3.708983 1.573015
v 2.351970 -4.006962 1.224319
v -1.175928 -4.406346 -1.794682
v -1.163257 -4.176994 -2.211614
v -2.512025 -3.709000 -1.572999
v -2.351970 -4.006963 -1.224293
v 1.175924 -4.406346 -1.794838
v 1.164714 -4.177023 -2.211614
v 2.512023 -3.709002 -1.572997
v 2.351970 -4.006963 -1.224290
v 0.187320 1.952586 -0.136096
v 0.071550 1.903885 -0.220207
v -0.071550 1.903885 -0.220207
v -0.187320 1.952586 -0.136096
v -0.231540 1.952586 0.000000
v -0.187320 1.952586 0.136096
v -0.071550 1.903885 0.220207
v 0.071550 1.903885 0.220207
v 0.187320 1.952586 0.136096
v 0.231540 1.952586 0.000000
v 0.223095 2.026569 -0.162088
v 0.085215 1.977868 -0.262263
v -0.085215 1.977868 -0.262263
v -0.223095 2.026569 -0.162088
v -0.275760 2.026569 0.000000
v -0.223095 2.026569 0.162088
v -0.085215 1.977868 0.262263
v 0.085215 1.977868 0.262263
v 0.223094 2.026569 0.162088
v 0.275760 2.026569 0.000000
v 0.316754 2.072292 -0.230136
v 0.120989 2.023592 -0.372367
v -0.120989 2.023592 -0.372367
v -0.316754 2.072292 -0.230135
v -0.391530 2.072292 0.000000
v -0.316754 2.072292 0.230136
v -0.120989 2.023592 0.372367
v 0.120989 2.023592 0.372367
v 0.316754 2.072292 0.230135
v 0.391530 2.072292 0.000000
v 0.432524 2.072292 -0.314247
v 0.165210 2.023592 -0.508463
v -0.165210 2.023592 -0.508463
v -0.432524 2.072292 -0.314247
v -0.534629 2.108818 0.000000
v -0.432524 2.072292 0.314247
v -0.165210 2.023592 0.508463
v 0.165210 2.023592 0.508463
v 0.432524 2.072292 0.314247
v 0.534629 2.108818 0.000000
v 0.526184 2.026569 -0.382295
v 0.200984 1.977868 -0.618567
v -0.200985 1.977868 -0.618566
v -0.526184 2.026569 -0.382295
v -0.650399 2.063094 0.000000
v -0.526184 2.026569 0.382295
v -0.200984 1.977868 0.618566
v 0.200984 1.977868 0.618566
v 0.526184 2.026569 0.382295
v 0.650399 2.063094 0.000000
v 0.561959 1.952586 -0.408287
v 0.214649 1.903885 -0.660622
v -0.214649 1.903885 -0.660622
v -0.561959 1.952586 -0.408287
v -0.694619 1.989112 0.000000
v -0.561959 1.952586 0.408287
v -0.214649 1.903885 0.660622
v 0.214649 1.903885 0.660622
v 0.561959 1.952586 0.408287
v 0.694619 1.989112 0.000000
v 0.526184 1.878603 -0.382295
v 0.200984 1.829902 -0.618567
v -0.200985 1.829902 -0.618566
v -0.526184 1.878603 -0.382295
v -0.650399 1.915129 0.000000
v -0.526184 1.878603 0.382295
v -0.200984 1.829902 0.618566
v 0.200984 1.829902 0.618566
v 0.526184 1.878603 0.382295
v 0.650399 1.915129 0.000000
v 0.432524 1.832879 -0.314247
v 0.165210 1.784178 -0.508463
v -0.165210 1.784178 -0.508463
v -0.432524 1.832879 -0.314247
v -0.534629 1.869405 0.000000
v -0.432524 1.832879 0.314247
v -0.165210 1.784178 0.508463
v 0.165210 1.784178 0.508463
v 0.432524 1.832879 0.314247
v 0.534629 1.869405 0.000000
v 0.316754 1.832879 -0.230136
v 0.120989 1.784178 -0.372367
v -0.120989 1.784178 -0.372367
v -0.316754 1.832879 -0.230135
v -0.391530 1.832879 0.000000
v -0.316754 1.832879 0.230136
v -0.120989 1.784178 0.372367
v 0.120989 1.784178 0.372367
v 0.316754 1.832879 0.230135
v 0.391530 1.832879 0.000000
v 0.223094 1.878603 -0.162088
v 0.085214 1.829902 -0.262263
v -0.085215 1.829902 -0.262263
v -0.223095 1.878603 -0.162088
v -0.275760 1.878603 0.000000
v -0.223094 1.878603 0.162088
v -0.085215 1.829902 0.262263
v 0.085215 1.829902 0.262263
v 0.223094 1.878603 0.162088
v 0.275760 1.878603 0.000000
v 0.187320 2.142268 -0.136096
v 0.071550 2.093567 -0.220207
v -0.071550 2.093567 -0.220207
v -0.187320 2.142268 -0.136096
v -0.231540 2.142268 0.000000
v -0.187320 2.142268 0.136096
v -0.071550 2.093567 0.220207
v 0.071550 2.093567 0.220207
v 0.187320 2.142268 0.136096
v 0.231540 2.142268 0.000000
v 0.223095 2.216251 -0.162088
v 0.085215 2.167550 -0.262263
v -0.085215 2.167550 -0.262263
v -0.223095 2.216251 -0.162088
v -0.275760 2.216251 0.000000
v -0.223095 2.216251 0.162088
v -0.085215 2.167550 0.262263
v 0.085215 2.167550 0.262263
v 0.223094 2.216251 0.162088
v 0.275760 2.216251 0.000000
v 0.316754 2.261975 -0.230136
v 0.120989 2.213274 -0.372367
v -0.120989 2.213274 -0.372367
v -0.316754 2.261975 -0.230135
v -0.391530 2.261975 0.000000
v -0.316754 2.261975 0.230136
v -0.120989 2.213274 0.372367
v 0.120989 2.213274 0.372367
v 0.316754 2.261975 0.230135
v 0.391530 2.261975 0.000000
v 0.432524 2.261975 -0.314247
v 0.165210 2.213274 -0.508463
v -0.165210 2.213274 -0.508463
v -0.432524 2.261975 -0.314247
v -0.534629 2.298501 0.000000
v -0.432524 2.261975 0.314247
v -0.165210 2.213274 0.508463
v 0.165210 2.213274 0.508463
v 0.432524 2.261975 0.314247
v 0.534629 2.298501 0.000000
v 0.526184 2.216251 -0.382295
v 0.200984 2.167550 -0.618567
v -0.200985 2.167550 -0.618566
v -0.526184 2.216251 -0.382295
v -0.650399 2.252777 0.000000
v -0.526184 2.216251 0.382295
v -0.200984 2.167550 0.618566
v 0.200984 2.167550 0.618566
v 0.526184 2.216251 0.382295
v 0.650399 2.252777 0.000000
v 0.561959 2.142268 -0.408287
v 0.214649 2.093567 -0.660622
v -0.214649 2.093567 -0.660622
v -0.561959 2.142268 -0.408287
v -0.694619 2.178794 0.000000
v -0.561959 2.142268 0.408287
v -0.214649 2.093567 0.660622
v 0.214649 2.093567 0.660622
v 0.561959 2.142268 0.408287
v 0.694619 2.178794 0.000000
v 0.526184 2.068285 -0.382295
v 0.200984 2.019585 -0.618567
v -0.200985 2.019585 -0.618566
v -0.526184 2.068285 -0.382295
v -0.650399 2.104811 0.000000
v -0.526184 2.068285 0.382295
v -0.200984 2.019585 0.618566
v 0.200984 2.019585 0.618566
v 0.526184 2.068285 0.382295
v 0.650399 2.104811 0.000000
v 0.432524 2.022562 -0.314247
v 0.165210 1.973861 -0.508463
v -0.165210 1.973861 -0.508463
v -0.432524 2.022562 -0.314247
v -0.534629 2.059087 0.000000
v -0.432524 2.022562 0.314247
v -0.165210 1.973861 0.508463
v 0.165210 1.973861 0.508463
v 0.432524 2.022562 0.314247
v 0.534629 2.059087 0.000000
v 0.316754 2.022562 -0.230136
v 0.120989 1.973861 -0.372367
v -0.120989 1.973861 -0.372367
v -0.316754 2.022562 -0.230135
v -0.391530 2.022562 0.000000
v -0.316754 2.022562 0.230136
v -0.120989 1.973861 0.372367
v 0.120989 1.973861 0.372367
v 0.316754 2.022562 0.230135
v 0.391530 2.022562 0.000000
v 0.223094 2.068285 -0.162088
v 0.085214 2.019585 -0.262263
v -0.085215 2.019585 -0.262263
v -0.223095 2.068285 -0.162088
v -0.275760 2.068285 0.000000
v -0.223094 2.068285 0.162088
v -0.085215 2.019585 0.262263
v 0.085215 2.019585 0.262263
v 0.223094 2.068285 0.162088
v 0.275760 2.068285 0.000000
v -0.330915 2.144066 -0.038639
v -0.331526 2.138398 -0.038639
v 0.313951 2.086319 0.067398
v 0.313340 2.091988 0.067398
v -0.095084 2.086319 -0.486938
v -0.094948 2.091988 -0.486342
v -1.090798 3.780434 0.000000
v -0.242682 3.728356 -1.063454
v -0.982765 3.728356 -0.473296
v -0.384588 2.091988 -0.185230
v -0.655043 3.039068 -0.038639
v -0.676615 2.986989 -0.325862
v -0.732104 3.039068 -0.167112
v -0.416129 2.144066 -0.094991
v -0.505119 2.685342 -0.038639
v -0.585951 2.685342 -0.133753
v -0.541539 2.633264 -0.260813
v -1.063359 3.780434 -0.242720
v -1.024455 3.556956 0.000000
v -0.998685 3.556956 -0.227959
v -1.083885 3.780434 -0.122119
v -1.017962 3.556956 -0.114692
v -1.104753 3.727841 0.000000
v -1.097751 3.727841 -0.123681
v -1.076963 3.727841 -0.245825
v -0.922993 3.504878 -0.444511
v -1.029544 3.728356 -0.360285
v -0.966927 3.504878 -0.338373
v -1.042716 3.675764 -0.364894
v -0.995338 3.675764 -0.479351
v -0.680071 3.728356 -0.852839
v -0.182311 2.091988 -0.300363
v -0.384398 2.986989 -0.553771
v -0.249885 2.091988 -0.232755
v -0.503277 2.986989 -0.434833
v -0.386072 2.633264 -0.341363
v -0.290923 2.633264 -0.436558
v -0.768923 3.728356 -0.646684
v -0.717058 3.504878 -0.605323
v -0.923538 3.728356 -0.580322
v -0.867368 3.504878 -0.545028
v -0.935353 3.675764 -0.587746
v -0.779832 3.675764 -0.655384
v -0.638708 3.504878 -0.800971
v -0.687459 3.728356 -0.737937
v -0.640549 3.504878 -0.691026
v -0.697327 3.675764 -0.747805
v -0.688772 3.675764 -0.863749
v -0.167071 2.986989 -0.802332
v -0.185166 2.091988 -0.384615
v -0.325786 2.986989 -0.676628
v -0.260743 2.633264 -0.541558
v -0.133711 2.633264 -0.656172
v -0.473206 3.728356 -0.982763
v -0.444424 3.504878 -0.922993
v -0.580270 3.728356 -0.923573
v -0.544977 3.504878 -0.867404
v -0.587694 3.675764 -0.935388
v -0.479260 3.675764 -0.995335
v -0.227919 3.504878 -0.998777
v -0.360222 3.728356 -1.029631
v -0.338312 3.504878 -0.967011
v -0.364831 3.675764 -1.042803
v -0.245787 3.675764 -1.077059
v -0.385138 2.086319 -0.185495
v -0.614490 3.079908 -0.038639
v -0.640079 3.027830 -0.308267
v -0.692571 3.079908 -0.158089
v -0.814496 3.528735 -0.038639
v -0.887546 3.528735 -0.202591
v -0.820277 3.476657 -0.395046
v -0.416725 2.138398 -0.095127
v -0.459974 2.684434 -0.038639
v -0.541941 2.684434 -0.123708
v -0.500865 2.632357 -0.241226
v -0.182692 2.086319 -0.300840
v -0.359114 3.027830 -0.522066
v -0.471574 3.027830 -0.409551
v -0.627932 3.476657 -0.534245
v -0.483813 3.476657 -0.678434
v -0.250363 2.086319 -0.233136
v -0.350779 2.632357 -0.313217
v -0.262776 2.632357 -0.401262
v -0.158047 3.027830 -0.762797
v -0.308192 3.027830 -0.640093
v -0.394963 3.476657 -0.820282
v -0.202551 3.476657 -0.957781
v -0.185431 2.086319 -0.385165
v -0.241157 2.632357 -0.500886
v -0.123665 2.632357 -0.612160
v 0.266584 2.086319 -0.334229
v 0.266203 2.091988 -0.333751
v 0.680127 3.728356 -0.852797
v 0.117050 2.131819 -0.348536
v 0.264779 3.768188 -0.995784
v 0.189171 3.026821 -0.664520
v 0.000055 2.091988 -0.497042
v 0.000061 2.986989 -0.821154
v 0.000058 2.633264 -0.671237
v 0.155812 2.673096 -0.518362
v 0.000068 3.728356 -1.160941
v 0.000067 3.504878 -1.094601
v -0.122071 3.728356 -1.154043
v -0.114644 3.504878 -1.088124
v -0.123633 3.675764 -1.167910
v 0.000068 3.675764 -1.174895
v 0.250018 3.544709 -0.931109
v 0.122190 3.728356 -1.083984
v 0.114762 3.504878 -1.018058
v 0.123753 3.675764 -1.097851
v 0.267884 3.715595 -1.009389
v 0.468279 2.986989 -0.587147
v 0.207291 2.131819 -0.316970
v 0.347926 3.026821 -0.608989
v 0.282876 2.673096 -0.473917
v 0.374810 2.633264 -0.469940
v 0.473350 3.728356 -0.982780
v 0.444565 3.504878 -0.923010
v 0.382324 3.768188 -0.961890
v 0.360414 3.544709 -0.899276
v 0.386933 3.715595 -0.975061
v 0.479405 3.675764 -0.995353
v 0.638766 3.504878 -0.800932
v 0.545110 3.504878 -0.867462
v 0.580406 3.728356 -0.923635
v 0.587831 3.675764 -0.935451
v 0.688828 3.675764 -0.863707
v 0.117186 2.126151 -0.349132
v 0.180147 3.067661 -0.624986
v 0.000060 3.027830 -0.780603
v 0.000064 3.476657 -0.980600
v 0.224650 3.516488 -0.819966
v 0.000055 2.086319 -0.497653
v 0.000057 2.632357 -0.626094
v 0.145766 2.672188 -0.474352
v 0.442997 3.027830 -0.555444
v 0.330331 3.067661 -0.572453
v 0.417111 3.516488 -0.752646
v 0.567689 3.476657 -0.711804
v 0.207556 2.126151 -0.317521
v 0.263288 2.672188 -0.433244
v 0.346664 2.632357 -0.434646
v 0.977215 3.728356 0.067398
v 0.384651 2.158709 -0.207362
v 0.982784 3.795076 -0.495408
v 0.676657 3.053710 -0.347985
v 0.333820 2.158709 -0.288315
v 0.587233 3.053710 -0.490400
v 0.470018 2.699985 -0.396926
v 0.541591 2.699985 -0.282940
v 0.852901 3.795076 -0.702257
v 0.801032 3.571599 -0.660894
v 0.771343 3.795076 -0.793422
v 0.724435 3.571599 -0.746515
v 0.781210 3.742484 -0.803289
v 0.863811 3.742484 -0.710958
v 0.923016 3.571599 -0.466625
v 0.923665 3.795076 -0.602500
v 0.867493 3.571599 -0.567205
v 0.935481 3.742484 -0.609925
v 0.995355 3.742484 -0.501462
v 0.637441 2.986989 0.067398
v 0.302672 2.158709 -0.049743
v 0.618673 3.053710 -0.121867
v 0.472508 2.699985 -0.088506
v 0.487529 2.633264 0.067398
v 1.063540 3.795076 -0.264876
v 0.998861 3.571599 -0.250114
v 1.029619 3.795076 -0.382394
v 0.967003 3.571599 -0.360485
v 1.042790 3.742484 -0.387003
v 1.077145 3.742484 -0.267981
v 0.910878 3.504878 0.067398
v 0.904478 3.571599 -0.069461
v 0.970400 3.795076 -0.076889
v 0.984267 3.742484 -0.078452
v 0.991169 3.675764 0.067398
v 0.385202 2.153040 -0.207627
v 0.640123 3.094551 -0.330391
v 0.555528 3.094551 -0.465116
v 0.711898 3.543377 -0.589814
v 0.820307 3.543377 -0.417163
v 0.334298 2.153040 -0.288696
v 0.434722 2.699077 -0.368779
v 0.500920 2.699077 -0.263354
v 0.596892 3.027830 0.067398
v 0.579137 3.094551 -0.112843
v 0.774129 3.543377 -0.157348
v 0.796881 3.476657 0.067398
v 0.303268 2.153040 -0.049879
v 0.428495 2.699077 -0.078461
v 0.442388 2.632357 0.067398
v 0.124962 2.086319 0.423480
v 0.124826 2.091988 0.422884
v 0.272555 3.728356 1.070132
v 0.384651 2.091988 0.185216
v 0.982784 3.728356 0.473262
v 0.676657 2.986989 0.325839
v 0.416256 2.091988 0.094995
v 0.732258 2.986989 0.167119
v 0.586092 2.633264 0.133758
v 0.541591 2.633264 0.260795
v 1.063540 3.728356 0.242731
v 0.998861 3.504878 0.227968
v 1.083984 3.728356 0.122141
v 1.018062 3.504878 0.114713
v 1.097851 3.675764 0.123704
v 1.077145 3.675764 0.245836
v 0.923016 3.504878 0.444480
v 1.029619 3.728356 0.360248
v 0.967003 3.504878 0.338339
v 1.042790 3.675764 0.364857
v 0.995355 3.675764 0.479317
v 0.297536 2.141752 0.333751
v 0.711460 3.778120 0.852797
v 0.499612 3.036754 0.587147
v 0.365153 2.141752 0.266169
v 0.618566 3.036754 0.468254
v 0.501351 2.683028 0.374780
v 0.406143 2.683028 0.469940
v 0.852901 3.728356 0.680112
v 0.801032 3.504878 0.638749
v 0.923665 3.728356 0.580355
v 0.867493 3.504878 0.545059
v 0.935481 3.675764 0.587779
v 0.863811 3.675764 0.688812
v 0.670099 3.554642 0.800932
v 0.802676 3.778120 0.771276
v 0.755768 3.554642 0.724369
v 0.812543 3.725528 0.781143
v 0.720160 3.725528 0.863707
v 0.196947 2.986989 0.738868
v 0.216612 2.141752 0.277576
v 0.357247 3.036754 0.569594
v 0.292197 2.683028 0.434522
v 0.163588 2.633264 0.592711
v 0.473350 3.728356 0.982780
v 0.444565 3.504878 0.923010
v 0.611739 3.778120 0.923635
v 0.576443 3.554642 0.867462
v 0.619164 3.725528 0.935451
v 0.479405 3.675764 0.995353
v 0.257794 3.504878 1.005457
v 0.338401 3.504878 0.859881
v 0.360312 3.728356 0.922496
v 0.364921 3.675764 0.935666
v 0.275660 3.675764 1.083737
v 0.385202 2.086319 0.185482
v 0.640123 3.027830 0.308245
v 0.692721 3.027830 0.158095
v 0.887713 3.476657 0.202600
v 0.820307 3.476657 0.395018
v 0.416852 2.086319 0.095131
v 0.542079 2.632357 0.123713
v 0.500920 2.632357 0.241208
v 0.297917 2.136084 0.334229
v 0.474330 3.077594 0.555444
v 0.586860 3.077594 0.442970
v 0.743231 3.526421 0.567669
v 0.599022 3.526421 0.711804
v 0.365631 2.136084 0.266550
v 0.466055 2.682121 0.346634
v 0.377997 2.682121 0.434646
v 0.187923 3.027830 0.699334
v 0.339651 3.077594 0.533059
v 0.426431 3.526421 0.713251
v 0.232426 3.476657 0.894315
v 0.216877 2.136084 0.278126
v 0.272609 2.682121 0.393849
v 0.153542 2.632357 0.548700
v -0.266506 2.059357 0.339513
v -0.266125 2.065025 0.339036
v -0.680071 3.728356 0.852839
v -0.094948 2.091988 0.333819
v -0.242682 3.728356 1.063454
v -0.167071 2.986989 0.649809
v 0.029843 2.091988 0.540636
v 0.029850 2.986989 0.864749
v 0.029847 2.633264 0.714832
v -0.133711 2.633264 0.503649
v 0.000068 3.728356 1.090793
v 0.000067 3.504878 1.024454
v 0.151979 3.728356 1.197726
v 0.144550 3.504878 1.131801
v 0.153541 3.675764 1.211594
v 0.000068 3.675764 1.104747
v -0.227919 3.504878 0.998777
v -0.122071 3.728356 1.083896
v -0.114644 3.504878 1.017976
v -0.123633 3.675764 1.097762
v -0.245787 3.675764 1.077059
v -0.468212 2.960027 0.592444
v -0.185166 2.065025 0.307508
v -0.325786 2.960027 0.599521
v -0.260743 2.606301 0.464451
v -0.374737 2.606301 0.475231
v -0.473206 3.701393 0.988031
v -0.444424 3.477915 0.928261
v -0.360222 3.728356 1.029631
v -0.338312 3.504878 0.967011
v -0.364831 3.675764 1.042803
v -0.479260 3.648801 1.000603
v -0.638708 3.504878 0.800971
v -0.544977 3.477915 0.872672
v -0.580270 3.701393 0.928841
v -0.587694 3.648801 0.940656
v -0.688772 3.675764 0.863749
v -0.095084 2.086319 0.334415
v -0.158047 3.027830 0.610274
v 0.029849 3.027830 0.824198
v 0.029853 3.476657 1.024195
v -0.202551 3.476657 0.887633
v 0.029843 2.086319 0.541247
v 0.029846 2.632357 0.669689
v -0.123665 2.632357 0.459637
v -0.442928 3.000867 0.560739
v -0.308192 3.000867 0.562986
v -0.394963 3.449694 0.825550
v -0.567627 3.449694 0.717107
v -0.185431 2.059357 0.308058
v -0.241157 2.605394 0.423779
v -0.346590 2.605394 0.439935
v -0.384588 2.091988 0.185230
v -0.982765 3.728356 0.473296
v -0.676615 2.986989 0.325862
v -0.333700 2.091988 0.266160
v -0.587091 2.986989 0.468239
v -0.469886 2.633264 0.374768
v -0.541539 2.633264 0.260813
v -0.852737 3.728356 0.680089
v -0.800873 3.504878 0.638728
v -0.771273 3.728356 0.771343
v -0.724364 3.504878 0.724431
v -0.781141 3.675764 0.781210
v -0.863646 3.675764 0.688789
v -0.922993 3.504878 0.444511
v -0.923538 3.728356 0.580322
v -0.867368 3.504878 0.545028
v -0.935353 3.675764 0.587746
v -0.995338 3.675764 0.479351
v -0.320177 2.091988 0.056352
v -0.636152 2.986989 0.128473
v -0.489998 2.633264 0.095114
v -0.967407 3.728356 0.204081
v -0.902733 3.504878 0.189320
v -1.029544 3.728356 0.360285
v -0.966927 3.504878 0.338373
v -1.042716 3.675764 0.364894
v -0.981011 3.675764 0.207187
v -0.922010 3.556956 0.076053
v -0.987932 3.780434 0.083480
v -1.001799 3.727841 0.085043
v -0.385138 2.086319 0.185495
v -0.640079 3.027830 0.308267
v -0.555389 3.027830 0.442956
v -0.711746 3.476657 0.567650
v -0.820277 3.476657 0.395046
v -0.334177 2.086319 0.266541
v -0.434593 2.632357 0.346622
v -0.500865 2.632357 0.241226
v -0.596619 3.027830 0.119450
v -0.791594 3.476657 0.163953
v -0.320772 2.086319 0.056488
v -0.445989 2.632357 0.085069
vt 0.686365 0.554789
vt 0.684687 0.465291
vt 0.760977 0.473848
vt 0.762949 0.543512
vt 0.865783 0.497734
vt 0.865833 0.515197
vt 0.129559 0.508393
vt 0.233053 0.481106
vt 0.233614 0.550820
vt 0.129380 0.525842
vt 0.308754 0.470096
vt 0.310797 0.559567
vt 0.570882 0.347044
vt 0.606686 0.385541
vt 0.571607 0.372390
vt 0.496166 0.378439
vt 0.495841 0.350421
vt 0.574628 0.676403
vt 0.637405 0.645623
vt 0.547062 0.701425
vt 0.499761 0.702871
vt 0.499459 0.674650
vt 0.496542 0.406594
vt 0.437814 0.407187
vt 0.411884 0.401964
vt 0.415738 0.379018
vt 0.420469 0.374070
vt 0.495538 0.322199
vt 0.420687 0.348667
vt 0.358081 0.379338
vt 0.448244 0.323646
vt 0.385190 0.388227
vt 0.452453 0.702425
vt 0.422485 0.686958
vt 0.424402 0.678024
vt 0.498761 0.618480
vt 0.499135 0.646633
vt 0.423669 0.652677
vt 0.418838 0.647837
vt 0.414674 0.625060
vt 0.440324 0.619251
vt 0.388480 0.639467
vt 0.542840 0.322644
vt 0.572800 0.338110
vt 0.495553 0.100195
vt 0.514701 0.094267
vt 0.768653 0.415120
vt 0.531057 0.201625
vt 0.567468 0.271213
vt 0.535042 0.260764
vt 0.870208 0.524626
vt 0.504177 0.924832
vt 0.540972 0.810755
vt 0.575297 0.799075
vt 0.542693 0.755516
vt 0.712397 0.621388
vt 0.125290 0.498933
vt 0.491116 0.100238
vt 0.454325 0.214315
vt 0.420000 0.182826
vt 0.452607 0.269555
vt 0.283229 0.374642
vt 0.499740 0.924875
vt 0.480592 0.930802
vt 0.225881 0.609505
vt 0.464239 0.799662
vt 0.427827 0.753855
vt 0.460253 0.748451
vt 0.501959 0.924853
vt 0.500846 0.811399
vt 0.494451 0.213671
vt 0.493335 0.100216
vt 0.500303 0.756438
vt 0.494995 0.268632
vt 0.539727 0.291550
vt 0.571928 0.312398
vt 0.495265 0.295581
vt 0.449632 0.296460
vt 0.328454 0.371470
vt 0.455568 0.725592
vt 0.423364 0.712670
vt 0.500033 0.729489
vt 0.545671 0.728610
vt 0.667078 0.639059
vt 0.632133 0.465587
vt 0.362155 0.468925
vt 0.363242 0.559408
vt 0.633079 0.556084
vt 0.595547 0.392426
vt 0.580544 0.399966
vt 0.554938 0.405817
vt 0.574856 0.650998
vt 0.575617 0.657924
vt 0.397789 0.466675
vt 0.384928 0.467510
vt 0.399138 0.560743
vt 0.387017 0.560432
vt 0.608250 0.464623
vt 0.596579 0.464299
vt 0.609514 0.557732
vt 0.597540 0.558373
vt 0.598838 0.630209
vt 0.557526 0.617879
vt 0.583500 0.623057
vt 0.427184 0.464278
vt 0.408487 0.466374
vt 0.428788 0.562429
vt 0.410005 0.560755
vt 0.566505 0.462651
vt 0.585510 0.464290
vt 0.586841 0.558665
vt 0.568141 0.560795
vt 0.497631 0.458977
vt 0.497672 0.566117
vt 0.843615 0.749454
vt 0.856079 0.746236
vt 0.858410 0.750821
vt 0.845945 0.754262
vt 0.832152 0.753987
vt 0.833677 0.759030
vt 0.820469 0.759118
vt 0.821851 0.764117
vt 0.809525 0.763004
vt 0.810967 0.767762
vt 0.799746 0.766810
vt 0.800742 0.770830
vt 0.736753 0.775171
vt 0.791348 0.770917
vt 0.884285 0.733593
vt 0.740543 0.769809
vt 0.876438 0.737541
vt 0.878636 0.741264
vt 0.866796 0.741632
vt 0.869095 0.746152
vt 0.861296 0.757128
vt 0.848531 0.760990
vt 0.835901 0.765495
vt 0.823682 0.771038
vt 0.811812 0.774497
vt 0.800018 0.777066
vt 0.788145 0.774724
vt 0.743089 0.765914
vt 0.883742 0.745476
vt 0.872856 0.752021
vt 0.864530 0.764094
vt 0.851000 0.768265
vt 0.838106 0.772814
vt 0.825497 0.777887
vt 0.812506 0.782535
vt 0.798474 0.784399
vt 0.783365 0.780017
vt 0.747125 0.763682
vt 0.889791 0.749781
vt 0.877838 0.758453
vt 0.846489 0.711354
vt 0.832714 0.716506
vt 0.818922 0.721431
vt 0.804659 0.726525
vt 0.789533 0.732744
vt 0.775190 0.743393
vt 0.761647 0.758414
vt 0.751366 0.764331
vt 0.878257 0.704117
vt 0.861206 0.706063
vt 0.847510 0.715859
vt 0.834107 0.720913
vt 0.820652 0.725597
vt 0.806828 0.730592
vt 0.792049 0.736483
vt 0.778195 0.746743
vt 0.764952 0.762880
vt 0.753109 0.766392
vt 0.878365 0.708605
vt 0.861830 0.710533
vt 0.848552 0.720399
vt 0.835492 0.725277
vt 0.822480 0.729835
vt 0.809055 0.734684
vt 0.794660 0.740341
vt 0.781259 0.750075
vt 0.768888 0.765357
vt 0.753686 0.769288
vt 0.878438 0.713093
vt 0.862493 0.715136
vt 0.850253 0.726842
vt 0.837409 0.731191
vt 0.824953 0.735805
vt 0.812100 0.740610
vt 0.798539 0.745915
vt 0.785994 0.754383
vt 0.775177 0.767440
vt 0.751964 0.773435
vt 0.878010 0.719434
vt 0.863408 0.721840
vt 0.852044 0.734104
vt 0.839572 0.738377
vt 0.827715 0.742686
vt 0.815629 0.747794
vt 0.803433 0.752666
vt 0.791699 0.758973
vt 0.782692 0.768721
vt 0.747831 0.776219
vt 0.876855 0.726814
vt 0.864415 0.730067
vt 0.853864 0.741291
vt 0.841644 0.744830
vt 0.830481 0.749156
vt 0.818735 0.754112
vt 0.807183 0.758549
vt 0.796858 0.763378
vt 0.788597 0.769108
vt 0.743289 0.776416
vt 0.876117 0.733165
vt 0.865345 0.736844
vt 0.858665 0.868339
vt 0.871160 0.871276
vt 0.871057 0.876399
vt 0.858472 0.873656
vt 0.846430 0.867039
vt 0.845439 0.872220
vt 0.833705 0.866244
vt 0.832614 0.871411
vt 0.822239 0.864712
vt 0.821263 0.869869
vt 0.811896 0.863673
vt 0.810776 0.868246
vt 0.788499 0.851351
vt 0.802575 0.864094
vt 0.901586 0.873431
vt 0.788348 0.854726
vt 0.893001 0.873178
vt 0.893229 0.877551
vt 0.882714 0.872233
vt 0.882615 0.877325
vt 0.870637 0.883296
vt 0.857629 0.880769
vt 0.844413 0.878956
vt 0.831065 0.878456
vt 0.818876 0.876449
vt 0.807094 0.873924
vt 0.797631 0.867274
vt 0.789448 0.858330
vt 0.895835 0.883651
vt 0.883189 0.884274
vt 0.870187 0.890941
vt 0.856421 0.888320
vt 0.843026 0.886440
vt 0.829555 0.885401
vt 0.815836 0.883996
vt 0.802295 0.880021
vt 0.790591 0.871457
vt 0.788016 0.862872
vt 0.899167 0.890307
vt 0.884493 0.892278
vt 0.878804 0.836031
vt 0.864256 0.834160
vt 0.849808 0.832058
vt 0.834905 0.829861
vt 0.818731 0.828039
vt 0.801278 0.830379
vt 0.783408 0.837521
vt 0.785250 0.865519
vt 0.910572 0.844498
vt 0.894380 0.838167
vt 0.877668 0.840494
vt 0.863467 0.838698
vt 0.849406 0.836548
vt 0.834910 0.834468
vt 0.819181 0.832516
vt 0.802348 0.834717
vt 0.784325 0.842069
vt 0.782283 0.865735
vt 0.908607 0.848524
vt 0.892912 0.842424
vt 0.876526 0.844996
vt 0.862681 0.843203
vt 0.849053 0.841144
vt 0.834954 0.839124
vt 0.819668 0.837142
vt 0.803490 0.839056
vt 0.786818 0.846064
vt 0.779905 0.863719
vt 0.906588 0.852535
vt 0.891402 0.846808
vt 0.875070 0.851476
vt 0.861637 0.849345
vt 0.848473 0.847581
vt 0.834878 0.845788
vt 0.820479 0.843884
vt 0.805601 0.845054
vt 0.790644 0.850500
vt 0.778221 0.860206
vt 0.903228 0.857943
vt 0.889118 0.853154
vt 0.873276 0.858718
vt 0.860241 0.856698
vt 0.847744 0.854960
vt 0.834683 0.853800
vt 0.821649 0.852209
vt 0.808363 0.851902
vt 0.795534 0.855083
vt 0.778707 0.855885
vt 0.898679 0.863883
vt 0.886145 0.860873
vt 0.871540 0.865886
vt 0.859086 0.863350
vt 0.847190 0.861976
vt 0.834495 0.860902
vt 0.822250 0.859392
vt 0.810939 0.858685
vt 0.800940 0.859461
vt 0.781923 0.853031
vt 0.894872 0.869116
vt 0.883732 0.867300
vt 0.220255 0.779180
vt 0.229124 0.761794
vt 0.232425 0.764719
vt 0.224380 0.782227
vt 0.295143 0.801621
vt 0.296839 0.782282
vt 0.301918 0.780955
vt 0.301015 0.800714
vt 0.249778 0.788689
vt 0.255535 0.770467
vt 0.261428 0.772617
vt 0.256106 0.791038
vt 0.241818 0.830063
vt 0.242292 0.828267
vt 0.245131 0.829070
vt 0.244630 0.830911
vt 0.218216 0.824178
vt 0.218579 0.822235
vt 0.221434 0.823026
vt 0.221012 0.824745
vt 0.208497 0.859723
vt 0.210161 0.846836
vt 0.215393 0.849678
vt 0.213263 0.862396
vt 0.203988 0.859927
vt 0.205232 0.847180
vt 0.202672 0.879468
vt 0.206839 0.879309
vt 0.210721 0.881885
vt 0.212647 0.822459
vt 0.212979 0.820853
vt 0.215703 0.821475
vt 0.215513 0.822901
vt 0.208286 0.826712
vt 0.211220 0.827780
vt 0.209807 0.821916
vt 0.210084 0.820548
vt 0.214174 0.828402
vt 0.216808 0.830281
vt 0.219712 0.830738
vt 0.230708 0.827211
vt 0.231409 0.825089
vt 0.233563 0.827127
vt 0.233300 0.828470
vt 0.219461 0.864860
vt 0.221707 0.852408
vt 0.227182 0.853775
vt 0.224407 0.866099
vt 0.216400 0.884075
vt 0.220323 0.885059
vt 0.223838 0.825412
vt 0.224278 0.823862
vt 0.228463 0.824256
vt 0.227868 0.826303
vt 0.226123 0.833225
vt 0.222600 0.831254
vt 0.228899 0.833960
vt 0.231650 0.833570
vt 0.228494 0.866335
vt 0.231684 0.853947
vt 0.238291 0.854964
vt 0.234848 0.867349
vt 0.223862 0.885212
vt 0.229626 0.886167
vt 0.236183 0.828692
vt 0.236450 0.826871
vt 0.239377 0.827589
vt 0.238979 0.829329
vt 0.237305 0.835387
vt 0.234501 0.834588
vt 0.240062 0.836276
vt 0.242815 0.837080
vt 0.228508 0.784405
vt 0.236525 0.766718
vt 0.241488 0.766385
vt 0.234110 0.784339
vt 0.218013 0.812655
vt 0.223121 0.797566
vt 0.229153 0.797660
vt 0.224324 0.813118
vt 0.213192 0.809968
vt 0.218756 0.795162
vt 0.240991 0.785466
vt 0.247897 0.767629
vt 0.252058 0.768891
vt 0.245966 0.786916
vt 0.231315 0.813934
vt 0.236223 0.798533
vt 0.241772 0.800124
vt 0.237170 0.815376
vt 0.241596 0.817662
vt 0.245899 0.802142
vt 0.252311 0.804662
vt 0.248035 0.820330
vt 0.248450 0.830329
vt 0.274684 0.796300
vt 0.278528 0.777566
vt 0.281661 0.777379
vt 0.278405 0.796459
vt 0.266112 0.837527
vt 0.266565 0.835631
vt 0.269507 0.836443
vt 0.268846 0.838435
vt 0.254011 0.833754
vt 0.254684 0.831926
vt 0.258878 0.832889
vt 0.258213 0.834531
vt 0.239704 0.868841
vt 0.243601 0.856554
vt 0.251237 0.859621
vt 0.247626 0.871552
vt 0.233580 0.887404
vt 0.241567 0.889845
vt 0.248047 0.831936
vt 0.251286 0.831253
vt 0.250777 0.832731
vt 0.246396 0.837452
vt 0.249227 0.838300
vt 0.256354 0.840795
vt 0.252223 0.840056
vt 0.252498 0.873045
vt 0.256611 0.861144
vt 0.260492 0.862997
vt 0.255758 0.874866
vt 0.245489 0.891089
vt 0.247953 0.892796
vt 0.261180 0.835550
vt 0.261757 0.833744
vt 0.263406 0.835721
vt 0.263123 0.837223
vt 0.259098 0.841685
vt 0.261377 0.842684
vt 0.266826 0.844829
vt 0.264147 0.843677
vt 0.261140 0.792404
vt 0.265710 0.773802
vt 0.274281 0.776335
vt 0.269734 0.794862
vt 0.253907 0.821846
vt 0.257761 0.806131
vt 0.266153 0.808051
vt 0.261853 0.823214
vt 0.267603 0.825030
vt 0.271616 0.809739
vt 0.275876 0.810312
vt 0.272236 0.825964
vt 0.290429 0.844522
vt 0.290601 0.842645
vt 0.294632 0.844107
vt 0.293983 0.846606
vt 0.277242 0.840625
vt 0.277805 0.838976
vt 0.280505 0.839923
vt 0.279943 0.841548
vt 0.260937 0.874315
vt 0.266131 0.862688
vt 0.271435 0.864575
vt 0.265622 0.876164
vt 0.252202 0.891840
vt 0.255981 0.893376
vt 0.271725 0.838511
vt 0.272375 0.837346
vt 0.275046 0.838212
vt 0.274487 0.839744
vt 0.269812 0.843787
vt 0.272524 0.845026
vt 0.275286 0.846180
vt 0.278109 0.847155
vt 0.271879 0.880282
vt 0.277895 0.868903
vt 0.283179 0.872988
vt 0.276173 0.884435
vt 0.262001 0.897341
vt 0.265168 0.901270
vt 0.282594 0.842502
vt 0.283278 0.840793
vt 0.285636 0.842758
vt 0.285155 0.843971
vt 0.280963 0.848164
vt 0.284018 0.848867
vt 0.291393 0.853965
vt 0.288609 0.851097
vt 0.282447 0.799837
vt 0.284873 0.780612
vt 0.289127 0.781606
vt 0.287377 0.801049
vt 0.277217 0.829086
vt 0.280450 0.813777
vt 0.285926 0.815239
vt 0.283218 0.830782
vt 0.291150 0.831625
vt 0.293791 0.815845
vt 0.300418 0.815623
vt 0.297910 0.832652
vt 0.322746 0.805616
vt 0.320169 0.784897
vt 0.326382 0.783590
vt 0.182983 0.762748
vt 0.328865 0.859269
vt 0.329539 0.856013
vt 0.334956 0.859203
vt 0.152040 0.810665
vt 0.302811 0.849415
vt 0.303345 0.847553
vt 0.306506 0.848579
vt 0.305922 0.850446
vt 0.280719 0.885087
vt 0.288097 0.873174
vt 0.293354 0.875614
vt 0.285155 0.887302
vt 0.269367 0.902078
vt 0.272594 0.903826
vt 0.296752 0.847637
vt 0.297058 0.846075
vt 0.300194 0.846753
vt 0.299745 0.848513
vt 0.294623 0.853215
vt 0.297529 0.854469
vt 0.300486 0.855686
vt 0.303472 0.856847
vt 0.315121 0.853338
vt 0.315774 0.851995
vt 0.318891 0.853142
vt 0.318274 0.854812
vt 0.290140 0.887848
vt 0.299127 0.876284
vt 0.304134 0.879210
vt 0.294117 0.890587
vt 0.276441 0.903832
vt 0.279321 0.905899
vt 0.309081 0.851569
vt 0.309731 0.849691
vt 0.313063 0.850745
vt 0.312208 0.852849
vt 0.306440 0.858010
vt 0.309387 0.859358
vt 0.312745 0.858941
vt 0.315845 0.860484
vt 0.296452 0.894014
vt 0.307144 0.883128
vt 0.154513 0.845016
vt 0.158527 0.860392
vt 0.281222 0.908839
vt 0.165011 0.881034
vt 0.321521 0.855960
vt 0.322222 0.854318
vt 0.325435 0.857041
vt 0.324858 0.858689
vt 0.319114 0.861915
vt 0.322624 0.864852
vt 0.150934 0.820157
vt 0.324624 0.867972
vt 0.305261 0.802717
vt 0.306054 0.782549
vt 0.309810 0.783134
vt 0.310039 0.803635
vt 0.302115 0.835970
vt 0.304700 0.818262
vt 0.310260 0.819616
vt 0.308566 0.837690
vt 0.314252 0.806237
vt 0.313010 0.785470
vt 0.316661 0.785674
vt 0.318880 0.806599
vt 0.314223 0.841262
vt 0.315263 0.822680
vt 0.320854 0.823479
vt 0.321040 0.842752
vt 0.326699 0.842681
vt 0.325391 0.822421
vt 0.333391 0.822140
vt 0.335677 0.844370
vt 0.201357 0.771472
vt 0.213205 0.754733
vt 0.215921 0.756687
vt 0.204619 0.773744
vt 0.180619 0.815611
vt 0.181144 0.813572
vt 0.184606 0.814277
vt 0.184087 0.815964
vt 0.166729 0.812904
vt 0.167180 0.810706
vt 0.170790 0.811476
vt 0.170360 0.813472
vt 0.164247 0.857654
vt 0.161211 0.842104
vt 0.171065 0.844732
vt 0.173906 0.858970
vt 0.169729 0.878592
vt 0.178708 0.879388
vt 0.157481 0.811724
vt 0.157874 0.810035
vt 0.163563 0.810192
vt 0.162995 0.812494
vt 0.156432 0.818318
vt 0.162171 0.820167
vt 0.165730 0.820468
vt 0.169315 0.820593
vt 0.178839 0.859505
vt 0.176862 0.845422
vt 0.181517 0.844507
vt 0.182774 0.858623
vt 0.182396 0.879937
vt 0.185457 0.879079
vt 0.173927 0.813956
vt 0.174243 0.812094
vt 0.177696 0.812884
vt 0.177263 0.815007
vt 0.172783 0.820893
vt 0.176091 0.822078
vt 0.179424 0.822531
vt 0.182817 0.822394
vt 0.187188 0.767126
vt 0.200774 0.750360
vt 0.209427 0.753726
vt 0.196670 0.770079
vt 0.165331 0.799342
vt 0.176153 0.781320
vt 0.186589 0.782918
vt 0.174766 0.800164
vt 0.181532 0.801570
vt 0.192176 0.784528
vt 0.195993 0.787127
vt 0.187924 0.803259
vt 0.187791 0.814915
vt 0.206851 0.820704
vt 0.207596 0.819061
vt 0.193510 0.818161
vt 0.193985 0.816356
vt 0.196995 0.817195
vt 0.196516 0.818914
vt 0.187755 0.858049
vt 0.187357 0.844272
vt 0.192996 0.845050
vt 0.192674 0.858610
vt 0.189230 0.878350
vt 0.192994 0.878740
vt 0.187306 0.816740
vt 0.190913 0.815693
vt 0.190442 0.817473
vt 0.185967 0.823105
vt 0.189113 0.823734
vt 0.192188 0.824398
vt 0.195264 0.824966
vt 0.198922 0.860731
vt 0.199448 0.847655
vt 0.198644 0.880553
vt 0.199478 0.819604
vt 0.199963 0.818051
vt 0.204312 0.818299
vt 0.203573 0.820564
vt 0.198298 0.825533
vt 0.201967 0.827861
vt 0.205145 0.827083
vt 0.208844 0.776349
vt 0.219184 0.759056
vt 0.222962 0.760475
vt 0.213524 0.778022
vt 0.194137 0.805617
vt 0.201159 0.789705
vt 0.206632 0.791399
vt 0.200356 0.807209
vt 0.207587 0.807443
vt 0.213783 0.792122
vt 0.572536 0.633061
vt 0.569653 0.390311
vt 0.425614 0.634736
vt 0.422799 0.391983
vt 0.396574 0.394816
vt 0.610244 0.636781
vt 0.579589 0.646050
vt 0.576436 0.377231
vt 0.572231 0.365461
vt 0.399642 0.632601
vt 0.423047 0.659605
vt 0.419705 0.367144
vt 0.627395 0.645467
vt 0.368079 0.379513
vt 0.578814 0.738014
vt 0.781716 0.580393
vt 0.292969 0.641172
vt 0.335288 0.650445
vt 0.416487 0.258277
vt 0.214349 0.401021
vt 0.702003 0.383642
vt 0.659778 0.374472
vt 0.579409 0.703892
vt 0.361731 0.649067
vt 0.415898 0.306789
vt 0.633380 0.375893
vt 0.435739 0.821933
vt 0.125346 0.535421
vt 0.418586 0.339762
vt 0.471856 0.094688
vt 0.576728 0.685308
vt 0.523438 0.930382
vt 0.559556 0.203135
vt 0.869711 0.488129
vt 0.371684 0.648626
vt 0.623440 0.376354
vt 0.171207 0.776501
vt 0.329732 0.804545
vt 0.197070 0.746514
vt 0.152766 0.807696
vt 0.158652 0.794578
vt 0.330296 0.869074
vt 0.334546 0.861529
vt 0.285328 0.913636
vt 0.301482 0.899348
vt 0.313412 0.888591
vt 0.904398 0.872508
vt 0.785724 0.852791
vt 0.779389 0.849851
vt 0.803411 0.861899
vt 0.910283 0.870617
vt 0.770808 0.855228
vt 0.916896 0.867331
vt 0.768411 0.864918
vt 0.922473 0.863532
vt 0.771888 0.872189
vt 0.925606 0.860011
vt 0.776812 0.875194
vt 0.918356 0.884820
vt 0.927319 0.855661
vt 0.783138 0.875252
vt 0.912738 0.881209
vt 0.906181 0.877636
vt 0.795412 0.861182
vt 0.901965 0.874799
vt 0.793109 0.854108
vt 0.885392 0.898628
vt 0.869809 0.897328
vt 0.902291 0.896205
vt 0.798101 0.885236
vt 0.813533 0.889941
vt 0.828193 0.891612
vt 0.841945 0.892664
vt 0.855478 0.894833
vt 0.886193 0.731408
vt 0.740654 0.773799
vt 0.742247 0.781184
vt 0.791400 0.769433
vt 0.890291 0.726943
vt 0.752573 0.782890
vt 0.894462 0.721014
vt 0.762036 0.777359
vt 0.897558 0.715091
vt 0.765644 0.769111
vt 0.898674 0.710534
vt 0.904273 0.736029
vt 0.898173 0.705903
vt 0.897602 0.735485
vt 0.752821 0.754312
vt 0.779059 0.785138
vt 0.890189 0.735330
vt 0.741320 0.757322
vt 0.885257 0.734701
vt 0.735453 0.766845
vt 0.881694 0.763556
vt 0.867285 0.769875
vt 0.895359 0.753476
vt 0.797094 0.790931
vt 0.813086 0.788856
vt 0.827056 0.784059
vt 0.840001 0.778854
vt 0.853252 0.774480
vn 0.191239 0.235542 -0.952863
vn -0.196333 0.237012 -0.951461
vn -0.181857 0.442479 -0.878146
vn 0.183642 0.450006 -0.873940
vn -0.152558 0.635580 -0.756812
vn 0.171107 0.636012 -0.752470
vn -0.171107 0.636012 0.752470
vn -0.183642 0.450006 0.873940
vn 0.181857 0.442479 0.878146
vn 0.152558 0.635579 0.756812
vn -0.191240 0.235542 0.952863
vn 0.196332 0.237012 0.951461
vn -0.744567 -0.214871 -0.632021
vn -0.711506 -0.276475 -0.646003
vn -0.780247 -0.613406 -0.122261
vn -0.794233 -0.607613 0.000000
vn -0.949072 -0.315059 0.000000
vn 0.749472 -0.229874 -0.620846
vn 0.678389 -0.138416 -0.721546
vn 0.990480 -0.008388 -0.137400
vn 1.000000 0.000080 0.000000
vn 0.949072 -0.315060 0.000001
vn -0.456342 -0.889805 0.000000
vn -0.476512 -0.873035 0.103663
vn -0.604284 -0.752579 0.261660
vn -0.642538 -0.621131 0.448710
vn -0.780247 -0.613406 0.122262
vn -1.000000 0.000081 0.000000
vn -0.749613 -0.230044 0.620612
vn -0.678532 -0.138547 0.721387
vn -0.990480 -0.008387 0.137400
vn -0.715087 -0.290919 0.635623
vn 0.989622 -0.006732 0.143537
vn 0.673329 -0.120956 0.729382
vn 0.744587 -0.214887 0.631992
vn 0.456344 -0.889803 0.000000
vn 0.794233 -0.607613 0.000001
vn 0.780248 -0.613405 0.122262
vn 0.642386 -0.621228 0.448794
vn 0.604243 -0.752570 0.261781
vn 0.476513 -0.873033 0.103678
vn 0.711535 -0.276337 0.646031
vn -0.989622 -0.006731 -0.143537
vn -0.673313 -0.120949 -0.729398
vn -0.692074 0.674209 -0.257828
vn -0.438212 0.660982 -0.609158
vn -0.481953 0.496896 -0.721676
vn -0.759350 0.586551 -0.281684
vn -0.512855 0.303202 -0.803149
vn -0.876996 0.420455 -0.232583
vn 0.424895 0.648045 -0.632061
vn 0.673412 0.683432 -0.281845
vn 0.729889 0.607734 -0.312924
vn 0.471347 0.468387 -0.747293
vn 0.871655 0.425143 -0.243867
vn 0.507331 0.292398 -0.810628
vn -0.424895 0.648046 0.632061
vn -0.673412 0.683432 0.281845
vn -0.729889 0.607734 0.312924
vn -0.471347 0.468387 0.747292
vn -0.871655 0.425143 0.243866
vn -0.507332 0.292398 0.810628
vn 0.692074 0.674209 0.257828
vn 0.438211 0.660982 0.609158
vn 0.481952 0.496896 0.721676
vn 0.759350 0.586551 0.281684
vn 0.512854 0.303202 0.803150
vn 0.876996 0.420456 0.232584
vn 0.769629 0.638088 0.022688
vn 0.816615 0.576894 0.018246
vn -0.816616 0.576894 -0.018247
vn -0.769629 0.638088 -0.022688
vn 0.908841 0.417050 0.008834
vn -0.908841 0.417050 -0.008834
vn -0.946436 0.258525 -0.193454
vn -0.538672 0.120853 -0.833803
vn -0.973599 0.228267 0.000000
vn -0.949335 0.254425 0.184476
vn -0.540701 0.106822 0.834405
vn 0.946435 0.258525 0.193455
vn 0.538673 0.120861 0.833801
vn 0.973599 0.228267 0.000000
vn 0.949335 0.254424 -0.184477
vn 0.540688 0.106785 -0.834418
vn -0.221036 -0.004423 -0.975256
vn -0.216142 -0.011003 0.976300
vn 0.220889 -0.005041 0.975286
vn 0.216765 -0.010236 -0.976170
vn -0.642096 -0.621650 -0.448625
vn -0.604236 -0.752455 -0.262124
vn -0.476523 -0.873013 -0.103798
vn 0.780247 -0.613406 -0.122261
vn 0.714964 -0.290800 -0.635815
vn -0.185279 -0.471122 0.862389
vn -0.248122 -0.251641 0.935475
vn 0.186601 -0.470529 0.862429
vn 0.248340 -0.242146 0.937919
vn -0.249243 -0.242092 -0.937694
vn -0.185841 -0.472600 -0.861459
vn 0.246103 -0.252739 -0.935712
vn 0.186976 -0.472141 -0.861466
vn 0.642427 -0.621199 -0.448776
vn 0.476511 -0.873036 -0.103663
vn 0.604280 -0.752571 -0.261694
vn -0.113380 -0.986029 0.122035
vn -0.180982 -0.782062 0.596342
vn 0.113374 -0.986034 0.122001
vn 0.181082 -0.782032 0.596352
vn -0.113480 -0.986017 -0.122035
vn -0.181082 -0.782088 -0.596279
vn 0.181117 -0.782114 -0.596233
vn 0.113381 -0.986031 -0.122018
vn -0.100040 -0.994983 0.000000
vn 0.100038 -0.994984 0.000000
vn -0.305566 0.522553 0.795970
vn -0.733369 0.500727 0.459828
vn -0.750393 0.501207 0.430931
vn -0.362054 0.522034 0.772268
vn 0.305566 0.522553 0.795970
vn 0.362055 0.522034 0.772267
vn 0.733369 0.500727 0.459828
vn 0.750393 0.501207 0.430931
vn 0.858359 0.513049 0.000000
vn 0.858359 0.513049 0.000000
vn 0.733369 0.500727 -0.459828
vn 0.750393 0.501207 -0.430931
vn 0.305566 0.522552 -0.795970
vn 0.362054 0.522034 -0.772268
vn -0.305566 0.522552 -0.795970
vn -0.362054 0.522034 -0.772268
vn -0.733369 0.500727 -0.459828
vn -0.750393 0.501207 -0.430931
vn -0.858360 0.513049 -0.000000
vn -0.858359 0.513049 -0.000000
vn -0.197258 0.936471 0.290018
vn -0.379441 0.913078 0.149375
vn -0.378697 0.913645 0.147792
vn -0.209830 0.935759 0.283421
vn 0.197258 0.936471 0.290019
vn 0.209830 0.935759 0.283421
vn 0.379441 0.913078 0.149375
vn 0.378696 0.913645 0.147792
vn 0.367341 0.930086 -0.000000
vn 0.367341 0.930087 -0.000000
vn 0.379441 0.913078 -0.149376
vn 0.378697 0.913645 -0.147792
vn 0.197258 0.936471 -0.290019
vn 0.209830 0.935758 -0.283421
vn -0.197258 0.936471 -0.290019
vn -0.209830 0.935758 -0.283421
vn -0.379441 0.913078 -0.149375
vn -0.378697 0.913645 -0.147792
vn -0.367341 0.930087 -0.000000
vn -0.367341 0.930087 -0.000000
vn -0.068470 0.996412 -0.049745
vn -0.140842 0.988281 -0.058854
vn -0.140831 0.988277 -0.058945
vn -0.068679 0.996390 -0.049898
vn 0.068470 0.996412 -0.049746
vn 0.068679 0.996390 -0.049898
vn 0.140842 0.988281 -0.058854
vn 0.140831 0.988277 -0.058946
vn 0.145769 0.989319 -0.000000
vn 0.145769 0.989319 -0.000000
vn 0.140842 0.988281 0.058854
vn 0.140831 0.988277 0.058945
vn 0.068470 0.996412 0.049745
vn 0.068679 0.996390 0.049897
vn -0.068470 0.996412 0.049746
vn -0.068679 0.996390 0.049898
vn -0.140842 0.988281 0.058854
vn -0.140831 0.988277 0.058946
vn -0.145769 0.989319 0.000000
vn -0.145769 0.989319 0.000000
vn 0.063802 0.921838 -0.382287
vn 0.234825 0.926833 -0.292979
vn 0.481986 0.756711 -0.441676
vn 0.167399 0.742265 -0.648861
vn -0.063802 0.921838 -0.382287
vn -0.167399 0.742265 -0.648861
vn -0.234825 0.926833 -0.292980
vn -0.481986 0.756711 -0.441676
vn -0.342153 0.939644 0.000000
vn -0.632185 0.774817 0.000000
vn -0.234825 0.926833 0.292980
vn -0.481986 0.756711 0.441676
vn -0.063802 0.921838 0.382288
vn -0.167399 0.742264 0.648862
vn 0.063802 0.921838 0.382287
vn 0.167399 0.742264 0.648862
vn 0.234825 0.926834 0.292979
vn 0.481986 0.756711 0.441676
vn 0.342153 0.939644 -0.000000
vn 0.632186 0.774817 -0.000000
vn 0.808404 0.005167 -0.588606
vn 0.311180 -0.020788 -0.950124
vn -0.311180 -0.020788 -0.950124
vn -0.808404 0.005167 -0.588606
vn -0.999512 0.031243 -0.000000
vn -0.808404 0.005167 0.588606
vn -0.311180 -0.020789 0.950124
vn 0.311180 -0.020788 0.950124
vn 0.808403 0.005167 0.588606
vn 0.999512 0.031243 0.000000
vn 0.574489 -0.750427 -0.326837
vn 0.238548 -0.767632 -0.594841
vn -0.238548 -0.767632 -0.594841
vn -0.574489 -0.750427 -0.326838
vn -0.676298 -0.736628 0.000000
vn -0.574488 -0.750427 0.326838
vn -0.238548 -0.767632 0.594841
vn 0.238548 -0.767632 0.594841
vn 0.574489 -0.750427 0.326837
vn 0.676298 -0.736628 -0.000000
vn 0.358123 -0.923542 -0.137183
vn 0.161771 -0.934928 -0.315816
vn -0.161771 -0.934928 -0.315816
vn -0.358123 -0.923541 -0.137183
vn -0.391746 -0.920074 0.000000
vn -0.358123 -0.923541 0.137183
vn -0.161771 -0.934928 0.315816
vn 0.161771 -0.934928 0.315816
vn 0.358123 -0.923541 0.137183
vn 0.391746 -0.920074 0.000000
vn 0.068679 -0.996390 0.049898
vn 0.140831 -0.988277 0.058945
vn 0.140842 -0.988281 0.058854
vn 0.068470 -0.996412 0.049746
vn -0.068679 -0.996390 0.049899
vn -0.068470 -0.996412 0.049747
vn -0.140831 -0.988277 0.058946
vn -0.140842 -0.988281 0.058855
vn -0.145769 -0.989319 -0.000000
vn -0.145769 -0.989319 -0.000000
vn -0.140831 -0.988277 -0.058945
vn -0.140842 -0.988281 -0.058854
vn -0.068679 -0.996390 -0.049897
vn -0.068470 -0.996412 -0.049745
vn 0.068679 -0.996390 -0.049897
vn 0.068470 -0.996412 -0.049745
vn 0.140831 -0.988277 -0.058945
vn 0.140842 -0.988281 -0.058854
vn 0.145769 -0.989319 0.000000
vn 0.145769 -0.989319 0.000000
vn -0.023535 -0.913645 0.405832
vn -0.204708 -0.935759 0.287142
vn -0.214868 -0.936471 0.277224
vn -0.024811 -0.913078 0.407029
vn 0.023535 -0.913644 0.405833
vn 0.024811 -0.913078 0.407030
vn 0.204708 -0.935759 0.287142
vn 0.214868 -0.936471 0.277224
vn 0.367341 -0.930086 0.000000
vn 0.367341 -0.930086 0.000000
vn 0.204708 -0.935758 -0.287143
vn 0.214868 -0.936471 -0.277225
vn 0.023535 -0.913644 -0.405833
vn 0.024811 -0.913078 -0.407030
vn -0.023535 -0.913644 -0.405833
vn -0.024811 -0.913078 -0.407030
vn -0.204708 -0.935758 -0.287143
vn -0.214868 -0.936471 -0.277225
vn -0.367341 -0.930086 0.000000
vn -0.367341 -0.930086 -0.000000
vn -0.177954 -0.501208 0.846831
vn -0.622589 -0.522035 0.582977
vn -0.662587 -0.522553 0.536578
vn -0.210698 -0.500728 0.839570
vn 0.177955 -0.501207 0.846832
vn 0.210698 -0.500727 0.839570
vn 0.622589 -0.522034 0.582978
vn 0.662587 -0.522553 0.536579
vn 0.858359 -0.513049 -0.000001
vn 0.858359 -0.513049 -0.000001
vn 0.622589 -0.522035 -0.582977
vn 0.662587 -0.522553 -0.536578
vn 0.177954 -0.501208 -0.846831
vn 0.210698 -0.500728 -0.839570
vn -0.177955 -0.501208 -0.846831
vn -0.210698 -0.500728 -0.839570
vn -0.622589 -0.522035 -0.582977
vn -0.662587 -0.522553 -0.536579
vn -0.858359 -0.513049 -0.000000
vn -0.858359 -0.513049 -0.000000
vn -0.305567 0.522554 0.795968
vn -0.733369 0.500728 0.459827
vn -0.750393 0.501208 0.430930
vn -0.362055 0.522036 0.772266
vn 0.305567 0.522554 0.795969
vn 0.362055 0.522035 0.772266
vn 0.733369 0.500728 0.459828
vn 0.750393 0.501208 0.430930
vn 0.858359 0.513049 -0.000001
vn 0.858359 0.513049 -0.000001
vn 0.733369 0.500728 -0.459829
vn 0.750393 0.501208 -0.430931
vn 0.305566 0.522553 -0.795969
vn 0.362054 0.522035 -0.772267
vn -0.305567 0.522554 -0.795969
vn -0.362055 0.522035 -0.772267
vn -0.733369 0.500728 -0.459828
vn -0.750393 0.501208 -0.430931
vn -0.858359 0.513049 -0.000000
vn -0.858359 0.513049 -0.000000
vn -0.197258 0.936471 0.290018
vn -0.379441 0.913078 0.149375
vn -0.378697 0.913644 0.147792
vn -0.209830 0.935759 0.283420
vn 0.197258 0.936471 0.290018
vn 0.209830 0.935759 0.283421
vn 0.379441 0.913078 0.149375
vn 0.378697 0.913644 0.147792
vn 0.367342 0.930086 -0.000001
vn 0.367342 0.930086 -0.000001
vn 0.379441 0.913078 -0.149376
vn 0.378697 0.913644 -0.147792
vn 0.197258 0.936471 -0.290018
vn 0.209830 0.935759 -0.283420
vn -0.197258 0.936472 -0.290018
vn -0.209830 0.935759 -0.283420
vn -0.379442 0.913078 -0.149375
vn -0.378697 0.913644 -0.147791
vn -0.367342 0.930086 0.000000
vn -0.367342 0.930086 0.000000
vn -0.068470 0.996412 -0.049746
vn -0.140843 0.988281 -0.058855
vn -0.140831 0.988277 -0.058946
vn -0.068679 0.996390 -0.049898
vn 0.068470 0.996412 -0.049746
vn 0.068679 0.996390 -0.049898
vn 0.140843 0.988281 -0.058854
vn 0.140831 0.988277 -0.058946
vn 0.145769 0.989319 0.000000
vn 0.145769 0.989319 0.000000
vn 0.140843 0.988281 0.058855
vn 0.140831 0.988277 0.058946
vn 0.068470 0.996412 0.049746
vn 0.068679 0.996390 0.049898
vn -0.068470 0.996412 0.049746
vn -0.068679 0.996390 0.049898
vn -0.140843 0.988281 0.058854
vn -0.140831 0.988277 0.058946
vn -0.145769 0.989319 0.000000
vn -0.145769 0.989319 0.000000
vn 0.063802 0.921839 -0.382286
vn 0.234826 0.926833 -0.292979
vn 0.481987 0.756711 -0.441676
vn 0.167399 0.742265 -0.648860
vn -0.063802 0.921838 -0.382287
vn -0.167399 0.742265 -0.648860
vn -0.234826 0.926833 -0.292981
vn -0.481986 0.756711 -0.441675
vn -0.342155 0.939644 0.000000
vn -0.632186 0.774817 0.000000
vn -0.234826 0.926833 0.292980
vn -0.481986 0.756711 0.441676
vn -0.063802 0.921838 0.382287
vn -0.167399 0.742265 0.648861
vn 0.063802 0.921839 0.382287
vn 0.167399 0.742265 0.648861
vn 0.234826 0.926833 0.292979
vn 0.481986 0.756711 0.441676
vn 0.342155 0.939644 -0.000000
vn 0.632186 0.774817 -0.000000
vn 0.808404 0.005167 -0.588606
vn 0.311180 -0.020788 -0.950124
vn -0.311180 -0.020789 -0.950124
vn -0.808404 0.005167 -0.588605
vn -0.999512 0.031243 0.000000
vn -0.808404 0.005167 0.588606
vn -0.311180 -0.020788 0.950124
vn 0.311180 -0.020789 0.950124
vn 0.808404 0.005167 0.588606
vn 0.999512 0.031243 0.000000
vn 0.574489 -0.750426 -0.326838
vn 0.238548 -0.767631 -0.594842
vn -0.238548 -0.767631 -0.594842
vn -0.574488 -0.750426 -0.326839
vn -0.676298 -0.736628 -0.000000
vn -0.574488 -0.750426 0.326839
vn -0.238548 -0.767632 0.594842
vn 0.238548 -0.767632 0.594841
vn 0.574488 -0.750426 0.326838
vn 0.676298 -0.736628 0.000000
vn 0.358124 -0.923541 -0.137184
vn 0.161771 -0.934928 -0.315817
vn -0.161771 -0.934927 -0.315817
vn -0.358124 -0.923541 -0.137185
vn -0.391747 -0.920073 -0.000000
vn -0.358124 -0.923541 0.137184
vn -0.161771 -0.934928 0.315816
vn 0.161772 -0.934928 0.315817
vn 0.358124 -0.923541 0.137185
vn 0.391747 -0.920073 0.000000
vn 0.068679 -0.996390 0.049898
vn 0.140831 -0.988277 0.058945
vn 0.140842 -0.988281 0.058854
vn 0.068470 -0.996412 0.049745
vn -0.068679 -0.996390 0.049898
vn -0.068470 -0.996412 0.049746
vn -0.140831 -0.988277 0.058946
vn -0.140842 -0.988281 0.058855
vn -0.145769 -0.989319 0.000000
vn -0.145769 -0.989319 0.000000
vn -0.140831 -0.988277 -0.058945
vn -0.140842 -0.988281 -0.058854
vn -0.068679 -0.996390 -0.049897
vn -0.068470 -0.996412 -0.049745
vn 0.068679 -0.996390 -0.049897
vn 0.068470 -0.996412 -0.049745
vn 0.140831 -0.988277 -0.058945
vn 0.140842 -0.988281 -0.058853
vn 0.145769 -0.989319 0.000000
vn 0.145769 -0.989319 -0.000000
vn -0.023535 -0.913644 0.405834
vn -0.204709 -0.935758 0.287142
vn -0.214869 -0.936471 0.277225
vn -0.024811 -0.913077 0.407031
vn 0.023535 -0.913644 0.405834
vn 0.024812 -0.913077 0.407031
vn 0.204709 -0.935758 0.287142
vn 0.214869 -0.936471 0.277225
vn 0.367342 -0.930086 0.000000
vn 0.367342 -0.930086 0.000000
vn 0.204709 -0.935758 -0.287143
vn 0.214869 -0.936471 -0.277225
vn 0.023535 -0.913644 -0.405834
vn 0.024811 -0.913077 -0.407031
vn -0.023535 -0.913644 -0.405834
vn -0.024812 -0.913077 -0.407031
vn -0.204709 -0.935758 -0.287142
vn -0.214869 -0.936471 -0.277225
vn -0.367342 -0.930086 0.000000
vn -0.367342 -0.930086 0.000000
vn -0.177955 -0.501208 0.846831
vn -0.622589 -0.522035 0.582978
vn -0.662587 -0.522553 0.536579
vn -0.210698 -0.500728 0.839570
vn 0.177955 -0.501208 0.846831
vn 0.210699 -0.500728 0.839570
vn 0.622589 -0.522034 0.582978
vn 0.662587 -0.522553 0.536579
vn 0.858359 -0.513049 -0.000000
vn 0.858359 -0.513049 -0.000000
vn 0.622589 -0.522035 -0.582977
vn 0.662587 -0.522553 -0.536578
vn 0.177955 -0.501208 -0.846831
vn 0.210699 -0.500728 -0.839570
vn -0.177955 -0.501208 -0.846831
vn -0.210699 -0.500728 -0.839570
vn -0.622589 -0.522035 -0.582977
vn -0.662587 -0.522553 -0.536578
vn -0.858359 -0.513049 0.000000
vn -0.858359 -0.513049 0.000000
vn 0.948298 0.252638 0.192108
vn 0.949465 0.194596 0.246270
vn 0.922761 0.205894 -0.325760
vn 0.896981 0.271719 -0.348704
vn -0.955787 0.270379 -0.115610
vn -0.973400 0.207662 -0.096793
vn -0.754664 0.164708 0.635101
vn -0.809256 0.227507 0.541614
vn 0.808763 0.259277 0.527900
vn 0.867395 0.188383 0.460584
vn 0.483603 0.226355 0.845512
vn 0.441113 0.298299 0.846426
vn -0.317139 -0.280245 -0.906027
vn 0.426684 0.596608 0.679706
vn 0.389283 0.547752 0.740558
vn -0.457737 -0.269820 -0.847157
vn -0.921517 -0.307159 -0.237612
vn 0.701179 0.706477 0.096117
vn 0.639047 0.704865 0.307872
vn -0.864802 -0.280244 -0.416631
vn -0.913836 -0.333212 0.232105
vn -0.886873 -0.453767 0.086901
vn -0.691436 -0.462272 -0.555177
vn -0.713232 -0.348237 -0.608302
vn -0.891877 -0.315784 0.323784
vn -0.887971 -0.431430 0.159299
vn -0.919836 -0.281062 0.273688
vn -0.922247 -0.282279 0.264159
vn -0.620862 -0.297599 -0.725235
vn -0.953855 -0.280238 -0.107827
vn 0.605932 0.786272 -0.120922
vn 0.695410 0.712377 -0.094462
vn -0.953666 -0.248684 -0.169342
vn -0.787771 -0.489776 0.373545
vn -0.866448 -0.495840 0.058400
vn -0.891781 -0.261478 0.369263
vn 0.324489 0.943238 -0.070781
vn -0.881699 -0.471498 0.017228
vn -0.858911 -0.467949 -0.208077
vn -0.801709 -0.456162 -0.386238
vn -0.901178 -0.254848 -0.350614
vn 0.526925 0.716669 0.456876
vn 0.456472 0.847849 0.269787
vn -0.815751 -0.266272 -0.513468
vn -0.534224 -0.320299 -0.782313
vn -0.535885 -0.426474 -0.728661
vn -0.708025 -0.435893 -0.555607
vn -0.814761 -0.315119 -0.486687
vn -0.528048 -0.282765 -0.800756
vn -0.830773 -0.276916 -0.482839
vn -0.620295 -0.268709 -0.736906
vn 0.463017 0.728208 0.505300
vn 0.445679 0.678101 0.584422
vn -0.520974 -0.265255 -0.811311
vn -0.509711 -0.455303 -0.729996
vn -0.575172 -0.460741 -0.675940
vn -0.716378 -0.490354 -0.496342
vn -0.763880 -0.502672 -0.404732
vn -0.781413 -0.307721 -0.542864
vn -0.630997 -0.425905 -0.648419
vn -0.343288 -0.428666 -0.835702
vn -0.422458 -0.347604 -0.837079
vn -0.846640 -0.256922 -0.466039
vn -0.466772 -0.303353 -0.830723
vn -0.510552 -0.280235 -0.812899
vn 0.533734 0.767284 0.355533
vn 0.472857 0.675715 0.565522
vn -0.416775 -0.280237 -0.864734
vn -0.526506 -0.456564 -0.717176
vn -0.645129 -0.501152 -0.576763
vn -0.433714 -0.413929 -0.800346
vn -0.436398 -0.375728 -0.817548
vn 0.922373 0.290381 -0.254768
vn 0.941535 0.211898 -0.261937
vn 0.616400 0.219949 0.756091
vn 0.707862 0.293961 0.642276
vn 0.858199 0.507128 -0.079474
vn 0.914919 0.379945 -0.136251
vn 0.724654 0.394293 0.565163
vn 0.710588 0.501470 0.493550
vn 0.866942 0.469555 -0.167120
vn 0.901497 0.367123 -0.229180
vn 0.534348 0.271192 0.800579
vn 0.526019 0.209187 0.824345
vn 0.859584 0.203215 0.468848
vn 0.834891 0.267125 0.481250
vn 0.549518 0.467757 0.692267
vn 0.565898 0.369961 0.736809
vn 0.755465 0.367638 0.542324
vn 0.687466 0.476995 0.547600
vn 0.606875 0.467834 0.642522
vn 0.710549 0.362423 0.603134
vn 0.378289 0.391548 0.838801
vn 0.331813 0.459572 0.823829
vn 0.119285 0.667089 0.735367
vn -0.142419 0.283381 0.948373
vn -0.075123 0.205632 0.975742
vn -0.246719 0.220521 0.943663
vn -0.351194 0.280723 0.893229
vn 0.510868 -0.280244 -0.812697
vn -0.045405 0.783702 0.619476
vn -0.494593 0.697730 0.518219
vn 0.622038 -0.314033 -0.717253
vn 0.544506 -0.266094 -0.795429
vn -0.504488 0.646692 0.572085
vn -0.414392 0.642628 0.644444
vn 0.445940 -0.253281 -0.858479
vn 0.455506 -0.325035 -0.828774
vn 0.362403 -0.428129 -0.827871
vn 0.504341 -0.403297 -0.763539
vn 0.581115 -0.302107 -0.755670
vn 0.496354 -0.281752 -0.821127
vn 0.613353 -0.261631 -0.745216
vn -0.346156 -0.272382 -0.897766
vn -0.000737 0.733458 0.679734
vn 0.250641 -0.271816 -0.929137
vn -0.258292 -0.432689 -0.863751
vn 0.150030 -0.453435 -0.878572
vn 0.470649 -0.433563 -0.768449
vn 0.576714 -0.400793 -0.711875
vn 0.145509 -0.328194 -0.933336
vn 0.222003 -0.444056 -0.868061
vn 0.468555 -0.449303 -0.760647
vn 0.374297 -0.340767 -0.862427
vn 0.080247 -0.277183 -0.957460
vn 0.255364 -0.298548 -0.919597
vn 0.010371 -0.242840 -0.970011
vn -0.162857 0.713512 0.681454
vn 0.072326 0.877917 0.473320
vn 0.114641 -0.289561 -0.950269
vn 0.135665 -0.480127 -0.866645
vn 0.049560 -0.510094 -0.858690
vn 0.554039 -0.475678 -0.683207
vn 0.248328 -0.500073 -0.829615
vn -0.476101 0.275508 0.835119
vn -0.504635 0.210008 0.837401
vn -0.631061 0.193073 0.751322
vn -0.594103 0.256844 0.762281
vn -0.317454 0.469631 0.823814
vn -0.380008 0.376030 0.845101
vn -0.522077 0.352870 0.776478
vn -0.474356 0.443104 0.760688
vn -0.213258 0.488809 0.845924
vn -0.194030 0.374022 0.906896
vn -0.424032 0.391706 0.816556
vn -0.472556 0.487437 0.734232
vn 0.939793 -0.235040 0.248081
vn -0.669500 0.733215 0.119020
vn -0.666152 0.621019 0.413009
vn 0.775489 -0.255766 -0.577236
vn 0.812950 -0.280242 -0.510467
vn -0.603932 0.687378 0.403457
vn -0.687153 0.710689 0.150802
vn 0.864934 -0.280235 -0.416362
vn 0.757192 -0.352478 -0.549927
vn 0.735164 -0.438794 -0.516715
vn 0.879436 -0.455316 -0.138854
vn 0.942632 -0.333833 -0.000018
vn 0.755820 -0.305322 -0.579237
vn 0.955844 -0.283200 0.078485
vn 0.681943 -0.238440 -0.691448
vn -0.625446 0.663787 0.410127
vn -0.554499 0.704855 0.442391
vn 0.750376 -0.280244 -0.598664
vn 0.693053 -0.450213 -0.563015
vn 0.695631 -0.456160 -0.554992
vn 0.740540 -0.459566 -0.490306
vn 0.843436 -0.482906 -0.235410
vn 0.943711 -0.315874 0.098153
vn 0.900314 -0.434644 -0.022763
vn 0.797754 -0.381808 -0.466703
vn 0.800733 -0.275431 -0.531944
vn 0.957634 -0.281948 0.058681
vn 0.761693 -0.230254 -0.605646
vn 0.905954 -0.280238 -0.317356
vn -0.663846 0.742209 -0.091839
vn -0.523955 0.846036 -0.098458
vn 0.951493 -0.261839 0.161560
vn 0.861966 -0.506606 0.019083
vn 0.841820 -0.507098 0.184906
vn 0.764718 -0.412142 -0.495325
vn 0.870253 -0.492506 0.009877
vn -0.763165 0.308506 0.567806
vn -0.753480 0.228975 0.616310
vn -0.973468 0.209981 -0.090924
vn -0.958329 0.284774 -0.022584
vn -0.719699 0.479395 0.502209
vn -0.743530 0.391266 0.542286
vn -0.921675 0.381849 0.068610
vn -0.851293 0.503394 0.147970
vn -0.878568 0.477523 0.009447
vn -0.930416 0.365428 -0.028081
vn -0.834022 0.337834 0.436206
vn -0.814034 0.427558 0.393119
vn -0.478631 0.270643 -0.835263
vn -0.560222 0.204383 -0.802732
vn -0.786779 0.177777 -0.591078
vn -0.757097 0.233593 -0.610113
vn 0.376861 -0.272219 0.885366
vn -0.548927 0.636540 -0.541753
vn -0.511177 0.639821 -0.573870
vn 0.771889 -0.219176 0.596783
vn 0.905954 -0.280238 0.317356
vn -0.692025 0.687321 -0.220661
vn -0.648840 0.689386 -0.322109
vn 0.864935 -0.280235 0.416361
vn 0.906013 -0.331217 -0.263506
vn 0.869155 -0.452656 -0.199179
vn 0.817194 -0.435495 0.377543
vn 0.865197 -0.340438 0.368153
vn 0.866225 -0.265009 -0.423586
vn 0.885497 -0.304469 0.350990
vn 0.900236 -0.252401 -0.354779
vn -0.647957 0.746048 0.153504
vn -0.691539 0.704871 -0.157894
vn 0.935845 -0.280244 0.213674
vn 0.828189 -0.442049 -0.344522
vn 0.867570 -0.456163 0.198086
vn 0.845052 -0.459546 0.273323
vn 0.800754 -0.461429 0.381938
vn 0.713392 -0.247205 0.655714
vn -0.490365 0.692109 -0.529649
vn -0.333491 0.717799 -0.611186
vn 0.598725 -0.280236 0.750330
vn 0.743937 -0.354087 0.566728
vn 0.702443 -0.444932 0.555527
vn 0.382309 -0.459373 0.801758
vn 0.249950 -0.340995 0.906227
vn 0.782561 -0.307551 0.541305
vn 0.136601 -0.284657 0.948847
vn 0.812951 -0.280242 0.510466
vn -0.558333 0.720173 -0.411844
vn -0.391648 0.796786 -0.460156
vn 0.760567 -0.306677 0.572265
vn 0.741072 -0.459338 0.489714
vn 0.693796 -0.457643 0.556066
vn 0.633106 -0.457958 0.624060
vn 0.456761 -0.478559 0.749901
vn 0.474030 -0.316637 0.821606
vn 0.499696 -0.409158 0.763475
vn 0.692617 -0.364645 0.622347
vn 0.739184 -0.280070 0.612510
vn 0.565866 -0.274485 0.777466
vn 0.773396 -0.241841 0.585979
vn 0.503245 -0.252930 0.826299
vn -0.116118 0.809024 -0.576192
vn -0.177647 0.927794 -0.328085
vn 0.130047 -0.298296 0.945572
vn 0.263201 -0.511890 0.817737
vn 0.054067 -0.547140 0.835293
vn 0.696207 -0.388946 0.603338
vn 0.551793 -0.459588 0.695919
vn -0.908440 0.281019 0.309460
vn -0.872129 0.194556 0.448931
vn -0.911552 0.226770 -0.343000
vn -0.888283 0.286678 -0.358845
vn -0.858697 0.504303 0.091201
vn -0.910995 0.382660 0.153815
vn -0.841691 0.387219 -0.376322
vn -0.796589 0.472651 -0.376891
vn -0.764006 0.308870 -0.566476
vn -0.815027 0.230111 -0.531771
vn -0.124639 0.210811 -0.969548
vn -0.223983 0.291743 -0.929902
vn -0.677389 0.486411 -0.551859
vn -0.726740 0.393326 -0.563155
vn -0.322242 0.388023 -0.863480
vn -0.382920 0.508267 -0.771387
vn -0.438935 0.461138 -0.771160
vn -0.471231 0.363367 -0.803683
vn -0.670777 0.336906 -0.660721
vn -0.629749 0.413818 -0.657397
vn 0.046738 0.262147 -0.963895
vn 0.000848 0.199897 -0.979817
vn 0.269303 0.224534 -0.936515
vn 0.384470 0.300567 -0.872836
vn -0.553834 -0.295188 0.778545
vn 0.442137 0.671796 -0.594311
vn 0.537935 0.644392 -0.543493
vn -0.635134 -0.263896 0.725922
vn -0.107431 -0.280234 0.953901
vn 0.306981 0.560836 -0.768912
vn 0.157601 0.704817 -0.691661
vn -0.213267 -0.280241 0.935939
vn -0.269294 -0.372018 0.888304
vn -0.075367 -0.467044 0.881017
vn -0.459716 -0.422023 0.781382
vn -0.622098 -0.288722 0.727759
vn -0.314744 -0.324183 0.892100
vn -0.610741 -0.259415 0.748130
vn 0.074343 -0.282666 0.956333
vn -0.354255 0.750675 -0.557665
vn 0.402226 0.484329 -0.776943
vn -0.393271 -0.255671 0.883159
vn 0.240364 -0.462978 0.853157
vn -0.502666 -0.354891 0.788276
vn -0.356272 -0.449309 0.819263
vn -0.188264 -0.530934 0.826236
vn -0.055875 -0.311993 0.948440
vn -0.152060 -0.468059 0.870516
vn -0.464420 -0.468068 0.751815
vn -0.401244 -0.352555 0.845404
vn -0.016726 -0.272043 0.962140
vn -0.282971 -0.302666 0.910121
vn -0.272678 -0.263463 0.925329
vn 0.140636 0.667995 -0.730756
vn 0.251684 0.672696 -0.695798
vn -0.362263 -0.295381 0.884034
vn -0.187274 -0.526718 0.829154
vn -0.214620 -0.520697 0.826325
vn -0.435592 -0.483023 0.759571
vn -0.610663 -0.437168 0.660283
vn 0.288359 0.322193 -0.901688
vn 0.332437 0.243130 -0.911248
vn 0.642603 0.189434 -0.742412
vn 0.640693 0.243192 -0.728265
vn 0.038379 0.503402 -0.863200
vn 0.157473 0.439191 -0.884485
vn 0.499087 0.404008 -0.766609
vn 0.390728 0.477504 -0.786970
vn 0.258276 0.531604 -0.806654
vn 0.175779 0.432158 -0.884501
vn 0.487454 0.419951 -0.765526
vn 0.535164 0.493191 -0.685830
vn 0.564645 0.655209 -0.501873
vn -0.822173 -0.219371 0.525270
vn 0.705586 0.705031 -0.071275
vn -0.812637 -0.280236 0.510969
vn 0.625584 0.687309 -0.369123
vn 0.639046 0.704865 -0.307873
vn -0.864802 -0.280244 0.416630
vn -0.761090 -0.347311 0.547829
vn -0.723033 -0.437579 0.534553
vn -0.886644 -0.452862 0.093696
vn -0.938437 -0.340200 0.059996
vn -0.771518 -0.304290 0.558720
vn -0.956746 -0.290505 -0.015588
vn -0.678936 -0.280243 0.678609
vn 0.598413 0.669448 -0.440161
vn -0.750636 -0.280235 0.598343
vn -0.648684 -0.448268 0.615033
vn -0.707770 -0.458108 0.537772
vn -0.763050 -0.459541 0.454507
vn -0.801709 -0.456162 0.386237
vn -0.934583 -0.303159 -0.186141
vn -0.900410 -0.407457 -0.152448
vn -0.935457 -0.264250 -0.234719
vn -0.964090 -0.263988 -0.028996
vn 0.679844 0.733218 -0.014244
vn 0.747329 0.650669 0.134643
vn -0.938145 -0.275530 -0.209684
vn -0.889328 -0.456503 -0.026461
vn -0.881983 -0.438828 -0.171861
vn -0.841802 -0.465086 0.273977
vn 0.772189 0.299983 -0.560120
vn 0.783653 0.227649 -0.577983
vn 0.976068 0.215814 0.026736
vn 0.955886 0.291067 -0.039529
vn 0.707838 0.477686 -0.520367
vn 0.744218 0.389208 -0.542822
vn 0.914024 0.386681 -0.122627
vn 0.854107 0.498087 -0.149702
vn 0.887790 0.448609 0.102852
vn 0.926012 0.357311 0.121779
s 1
g BolsaDinero
usemtl initialShadingGroup
f 78/1/1 65/2/2 6/3/3 11/4/4
f 6/3/3 7/5/5 12/6/6 11/4/4
f 8/7/7 9/8/8 14/9/9 13/10/10
f 9/8/8 71/11/11 72/12/12 14/9/9
f 15/13/13 91/687/14 90/15/15 18/16/16 17/17/17
f 20/18/18 44/709/19 43/20/20 24/21/21 23/22/22
f 18/16/16 19/23/23 102/24/24 101/682/25 81/26/26 80/27/27
f 16/28/28 17/17/17 26/29/29 50/707/30 49/31/31
f 17/17/17 18/16/16 80/27/27 79/690/32 26/29/29
f 23/22/22 24/21/21 48/33/33 47/34/34 25/35/35
f 21/36/36 22/37/37 87/38/38 86/39/39 105/681/40 106/41/41
f 22/37/37 23/22/22 25/35/35 88/689/42 87/38/38
f 45/43/43 46/44/44 15/13/13 17/17/17 16/28/28
f 27/45/45 28/46/46 30/711/47 29/48/48
f 29/48/48 30/711/47 66/49/49 67/50/50
f 31/710/51 32/52/52 33/53/53 34/54/54
f 34/54/54 33/53/53 76/55/55 77/693/56
f 35/708/57 36/58/58 38/59/59 37/60/60
f 37/60/60 38/59/59 69/61/61 70/697/62
f 40/63/63 39/64/64 42/705/65 41/66/66
f 41/66/66 42/705/65 73/67/67 74/68/68
f 13/10/10 14/9/9 42/65/65 39/706/64
f 11/4/4 12/6/6 31/51/51 34/694/54
f 2/69/69 3/70/70 33/53/53 32/52/52
f 29/48/48 4/71/71 1/72/72 27/45/45
f 41/66/66 3/70/70 2/69/69 40/63/63
f 1/72/72 4/71/71 38/59/59 36/58/58
f 30/47/47 28/712/46 7/5/5 6/3/3
f 37/698/60 9/8/8 8/7/7 35/57/57
f 41/66/66 74/68/68 75/73/73 3/70/70
f 33/53/53 3/70/70 75/73/73 76/55/55
f 29/48/48 67/50/50 68/74/74 4/71/71
f 38/59/59 4/71/71 68/74/74 69/61/61
f 65/2/2 66/699/49 30/47/47 6/3/3
f 77/56/56 78/1/1 11/4/4 34/694/54
f 42/65/65 14/9/9 72/12/12 73/695/67
f 70/62/62 71/11/11 9/8/8 37/698/60
f 53/75/75 52/76/76 46/44/44 45/43/43
f 54/77/77 53/75/75 45/43/43 16/28/28
f 55/78/78 54/77/77 16/28/28 49/31/31
f 56/703/79 55/78/78 49/31/31 50/707/30
f 60/80/80 59/81/81 47/34/34 48/33/33
f 61/82/82 60/80/80 48/33/33 24/21/21
f 62/83/83 61/82/82 24/21/21 43/20/20
f 63/701/84 62/83/83 43/20/20 44/709/19
f 51/85/85 52/700/76 66/699/49 65/2/2
f 67/50/50 66/49/49 52/76/76 53/75/75
f 68/74/74 67/50/50 53/75/75 54/77/77
f 69/61/61 68/74/74 54/77/77 55/78/78
f 70/697/62 69/61/61 55/78/78 56/703/79
f 56/79/79 57/86/86 71/11/11 70/62/62
f 72/12/12 71/11/11 57/86/86 58/87/87
f 73/695/67 72/12/12 58/87/87 59/696/81
f 74/68/68 73/67/67 59/81/81 60/80/80
f 75/73/73 74/68/68 60/80/80 61/82/82
f 76/55/55 75/73/73 61/82/82 62/83/83
f 77/693/56 76/55/55 62/83/83 63/701/84
f 63/84/84 64/88/88 78/1/1 77/56/56
f 64/88/88 51/85/85 65/2/2 78/1/1
f 90/15/15 89/686/89 109/680/90 110/91/91 19/23/23 18/16/16
f 97/92/92 96/93/93 20/18/18 23/22/22 22/37/37
f 79/32/32 81/683/26 82/94/94 83/95/95
f 83/95/95 82/94/94 84/96/96 85/97/97
f 85/97/97 84/96/96 86/688/39 88/42/42
f 89/89/89 91/14/14 93/98/98 92/99/99
f 92/99/99 93/98/98 95/100/100 94/101/101
f 94/101/101 95/100/100 96/684/93 98/102/102
f 46/704/44 52/700/76 51/85/85 93/98/98 91/14/14 15/714/13
f 26/692/29 79/32/32 83/95/95 57/86/86 56/79/79 50/30/30
f 58/87/87 57/86/86 83/95/95 85/97/97
f 59/696/81 58/87/87 85/97/97 88/42/42 25/713/35 47/702/34
f 96/684/93 95/100/100 64/88/88 63/84/84 44/19/19 20/691/18
f 93/98/98 51/85/85 64/88/88 95/100/100
f 79/690/32 80/27/27 81/26/26
f 86/39/39 87/38/38 88/689/42
f 89/686/89 90/15/15 91/687/14
f 96/93/93 97/92/92 98/685/102
f 114/103/103 113/679/104 98/685/102 97/92/92 22/37/37 21/36/36
f 99/105/105 100/106/106 101/25/25 102/24/24
f 100/106/106 99/105/105 103/107/107 104/108/108
f 104/108/108 103/107/107 106/41/41 105/40/40
f 107/109/109 108/110/110 112/111/111 111/112/112
f 108/110/110 107/109/109 110/91/91 109/90/90
f 111/112/112 112/111/111 113/104/104 114/103/103
f 99/105/105 5/113/113 10/114/114 103/107/107
f 5/113/113 107/109/109 111/112/112 10/114/114
f 10/114/114 111/112/112 114/103/103 21/36/36
f 103/107/107 10/114/114 21/36/36 106/41/41
f 19/23/23 5/113/113 99/105/105 102/24/24
f 19/23/23 110/91/91 107/109/109 5/113/113
f 100/106/106 82/94/94 81/683/26 101/25/25
f 82/94/94 100/106/106 104/108/108 84/96/96
f 84/96/96 104/108/108 105/40/40 86/688/39
f 92/99/99 108/110/110 109/90/90 89/89/89
f 108/110/110 92/99/99 94/101/101 112/111/111
f 112/111/111 94/101/101 98/102/102 113/104/104
s 8
f 116/115/115 115/116/116 125/117/117 126/118/118
f 117/119/119 116/115/115 126/118/118 127/120/120
f 118/121/121 117/119/119 127/120/120 128/122/122
f 119/123/123 118/121/121 128/122/122 129/124/124
f 120/125/125 119/123/123 129/124/124 130/126/126
f 121/756/127 120/125/125 130/126/126 131/128/128
f 122/754/129 121/127/127 131/772/128 132/130/130
f 123/131/131 122/129/129 132/771/130 133/132/132
f 124/133/133 123/131/131 133/132/132 134/134/134
f 115/116/116 124/133/133 134/134/134 125/117/117
s 9
f 126/118/135 125/117/136 135/135/137 136/136/138
f 127/120/139 126/118/135 136/136/138 137/137/140
f 128/122/141 127/120/139 137/137/140 138/138/142
f 129/124/143 128/122/141 138/138/142 139/139/144
f 130/126/145 129/124/143 139/139/144 140/140/146
f 131/128/147 130/126/145 140/140/146 141/141/148
f 132/130/149 131/772/147 141/770/148 142/142/150
f 133/132/151 132/771/149 142/769/150 143/143/152
f 134/134/153 133/132/151 143/143/152 144/144/154
f 125/117/136 134/134/153 144/144/154 135/135/137
s 10
f 136/136/155 135/135/156 145/145/157 146/146/158
f 137/137/159 136/136/155 146/146/158 147/147/160
f 138/138/161 137/137/159 147/147/160 148/148/162
f 139/139/163 138/138/161 148/148/162 149/149/164
f 140/140/165 139/139/163 149/149/164 150/150/166
f 141/141/167 140/140/165 150/150/166 151/151/168
f 142/142/169 141/770/167 151/767/168 152/152/170
f 143/143/171 142/769/169 152/766/170 153/153/172
f 144/144/173 143/143/171 153/153/172 154/154/174
f 135/135/156 144/144/173 154/154/174 145/145/157
s 11
f 146/146/175 145/145/176 155/774/177 156/780/178
f 147/147/179 146/146/175 156/780/178 157/779/180
f 148/148/181 147/147/179 157/779/180 158/778/182
f 149/149/183 148/148/181 158/778/182 159/777/184
f 150/150/185 149/149/183 159/777/184 160/776/186
f 151/151/187 150/150/185 160/776/186 161/768/188
f 152/152/189 151/767/187 161/161/188 162/162/190
f 153/153/191 152/766/189 162/764/190 163/775/192
f 154/154/193 153/153/191 163/775/192 164/773/194
f 145/145/176 154/154/193 164/773/194 155/774/177
f 156/156/178 155/155/177 165/165/195 166/166/196
f 157/157/180 156/156/178 166/166/196 167/167/197
f 158/158/182 157/157/180 167/167/197 168/168/198
f 159/159/184 158/158/182 168/168/198 169/169/199
f 160/160/186 159/159/184 169/169/199 170/170/200
f 161/161/188 160/160/186 170/170/200 171/171/201
f 162/162/190 161/161/188 171/171/201 172/172/202
f 163/163/192 162/765/190 172/763/202 173/173/203
f 164/164/194 163/163/192 173/173/203 174/174/204
f 155/155/177 164/164/194 174/174/204 165/165/195
f 166/166/196 165/165/195 175/175/205 176/176/206
f 167/167/197 166/166/196 176/176/206 177/177/207
f 168/168/198 167/167/197 177/177/207 178/178/208
f 169/169/199 168/168/198 178/178/208 179/179/209
f 170/170/200 169/169/199 179/179/209 180/180/210
f 171/171/201 170/170/200 180/180/210 181/181/211
f 172/172/202 171/171/201 181/762/211 182/182/212
f 173/173/203 172/763/202 182/761/212 183/183/213
f 174/174/204 173/173/203 183/183/213 184/184/214
f 165/165/195 174/174/204 184/184/214 175/175/205
f 176/176/206 175/175/205 185/185/215 186/186/216
f 177/177/207 176/176/206 186/186/216 187/187/217
f 178/178/208 177/177/207 187/187/217 188/188/218
f 179/179/209 178/178/208 188/188/218 189/189/219
f 180/180/210 179/179/209 189/189/219 190/190/220
f 181/181/211 180/180/210 190/190/220 191/191/221
f 182/182/212 181/762/211 191/760/221 192/192/222
f 183/183/213 182/761/212 192/759/222 193/193/223
f 184/184/214 183/183/213 193/193/223 194/194/224
f 175/175/205 184/184/214 194/194/224 185/185/215
s 12
f 186/186/225 185/185/226 195/195/227 196/196/228
f 187/187/229 186/186/225 196/196/228 197/197/230
f 188/188/231 187/187/229 197/197/230 198/198/232
f 189/189/233 188/188/231 198/198/232 199/199/234
f 190/190/235 189/189/233 199/199/234 200/200/236
f 191/191/237 190/190/235 200/200/236 201/201/238
f 192/192/239 191/760/237 201/758/238 202/202/240
f 193/193/241 192/759/239 202/757/240 203/203/242
f 194/194/243 193/193/241 203/203/242 204/204/244
f 185/185/226 194/194/243 204/204/244 195/195/227
s 13
f 196/196/245 195/195/246 205/205/247 206/206/248
f 197/197/249 196/196/245 206/206/248 207/207/250
f 198/198/251 197/197/249 207/207/250 208/208/252
f 199/199/253 198/198/251 208/208/252 209/209/254
f 200/200/255 199/199/253 209/209/254 210/210/256
f 201/201/257 200/200/255 210/210/256 211/211/258
f 202/202/259 201/758/257 211/755/258 212/212/260
f 203/203/261 202/757/259 212/753/260 213/213/262
f 204/204/263 203/203/261 213/213/262 214/214/264
f 195/195/246 204/204/263 214/214/264 205/205/247
s 14
f 206/206/265 205/205/266 115/116/267 116/115/268
f 207/207/269 206/206/265 116/115/268 117/119/270
f 208/208/271 207/207/269 117/119/270 118/121/272
f 209/209/273 208/208/271 118/121/272 119/123/274
f 210/210/275 209/209/273 119/123/274 120/125/276
f 211/211/277 210/210/275 120/125/276 121/756/278
f 212/212/279 211/755/277 121/127/278 122/754/280
f 213/213/281 212/753/279 122/129/280 123/131/282
f 214/214/283 213/213/281 123/131/282 124/133/284
f 205/205/266 214/214/283 124/133/284 115/116/267
s 15
f 216/215/285 215/216/286 225/217/287 226/218/288
f 217/219/289 216/215/285 226/218/288 227/220/290
f 218/221/291 217/219/289 227/220/290 228/222/292
f 219/223/293 218/221/291 228/222/292 229/224/294
f 220/225/295 219/223/293 229/224/294 230/226/296
f 221/728/297 220/225/295 230/226/296 231/228/298
f 222/726/299 221/227/297 231/744/298 232/230/300
f 223/231/301 222/229/299 232/743/300 233/232/302
f 224/233/303 223/231/301 233/232/302 234/234/304
f 215/216/286 224/233/303 234/234/304 225/217/287
s 16
f 226/218/305 225/217/306 235/235/307 236/236/308
f 227/220/309 226/218/305 236/236/308 237/237/310
f 228/222/311 227/220/309 237/237/310 238/238/312
f 229/224/313 228/222/311 238/238/312 239/239/314
f 230/226/315 229/224/313 239/239/314 240/240/316
f 231/228/317 230/226/315 240/240/316 241/241/318
f 232/230/319 231/744/317 241/742/318 242/242/320
f 233/232/321 232/743/319 242/741/320 243/243/322
f 234/234/323 233/232/321 243/243/322 244/244/324
f 225/217/306 234/234/323 244/244/324 235/235/307
s 17
f 236/236/325 235/235/326 245/245/327 246/246/328
f 237/237/329 236/236/325 246/246/328 247/247/330
f 238/238/331 237/237/329 247/247/330 248/248/332
f 239/239/333 238/238/331 248/248/332 249/249/334
f 240/240/335 239/239/333 249/249/334 250/250/336
f 241/241/337 240/240/335 250/250/336 251/251/338
f 242/242/339 241/742/337 251/251/338 252/252/340
f 243/243/341 242/741/339 252/740/340 253/253/342
f 244/244/343 243/243/341 253/253/342 254/254/344
f 235/235/326 244/244/343 254/254/344 245/245/327
s 18
f 246/246/345 245/245/346 255/746/347 256/752/348
f 247/247/349 246/246/345 256/752/348 257/751/350
f 248/248/351 247/247/349 257/751/350 258/750/352
f 249/249/353 248/248/351 258/750/352 259/749/354
f 250/250/355 249/249/353 259/749/354 260/748/356
f 251/251/357 250/250/355 260/748/356 261/739/358
f 252/252/359 251/251/357 261/739/358 262/262/360
f 253/253/361 252/740/359 262/737/360 263/747/362
f 254/254/363 253/253/361 263/747/362 264/745/364
f 245/245/346 254/254/363 264/745/364 255/746/347
f 256/256/348 255/255/347 265/265/365 266/266/366
f 257/257/350 256/256/348 266/266/366 267/267/367
f 258/258/352 257/257/350 267/267/367 268/268/368
f 259/259/354 258/258/352 268/268/368 269/269/369
f 260/260/356 259/259/354 269/269/369 270/270/370
f 261/261/358 260/260/356 270/270/370 271/271/371
f 262/262/360 261/739/358 271/736/371 272/272/372
f 263/263/362 262/738/360 272/735/372 273/273/373
f 264/264/364 263/263/362 273/273/373 274/274/374
f 255/255/347 264/264/364 274/274/374 265/265/365
f 266/266/366 265/265/365 275/275/375 276/276/376
f 267/267/367 266/266/366 276/276/376 277/277/377
f 268/268/368 267/267/367 277/277/377 278/278/378
f 269/269/369 268/268/368 278/278/378 279/279/379
f 270/270/370 269/269/369 279/279/379 280/280/380
f 271/271/371 270/270/370 280/280/380 281/281/381
f 272/272/372 271/736/371 281/734/381 282/282/382
f 273/273/373 272/735/372 282/733/382 283/283/383
f 274/274/374 273/273/373 283/283/383 284/284/384
f 265/265/365 274/274/374 284/284/384 275/275/375
f 276/276/376 275/275/375 285/285/385 286/286/386
f 277/277/377 276/276/376 286/286/386 287/287/387
f 278/278/378 277/277/377 287/287/387 288/288/388
f 279/279/379 278/278/378 288/288/388 289/289/389
f 280/280/380 279/279/379 289/289/389 290/290/390
f 281/281/381 280/280/380 290/290/390 291/291/391
f 282/282/382 281/734/381 291/732/391 292/292/392
f 283/283/383 282/733/382 292/731/392 293/293/393
f 284/284/384 283/283/383 293/293/393 294/294/394
f 275/275/375 284/284/384 294/294/394 285/285/385
s 19
f 286/286/395 285/285/396 295/295/397 296/296/398
f 287/287/399 286/286/395 296/296/398 297/297/400
f 288/288/401 287/287/399 297/297/400 298/298/402
f 289/289/403 288/288/401 298/298/402 299/299/404
f 290/290/405 289/289/403 299/299/404 300/300/406
f 291/291/407 290/290/405 300/300/406 301/301/408
f 292/292/409 291/732/407 301/730/408 302/302/410
f 293/293/411 292/731/409 302/729/410 303/303/412
f 294/294/413 293/293/411 303/303/412 304/304/414
f 285/285/396 294/294/413 304/304/414 295/295/397
s 20
f 296/296/415 295/295/416 305/305/417 306/306/418
f 297/297/419 296/296/415 306/306/418 307/307/420
f 298/298/421 297/297/419 307/307/420 308/308/422
f 299/299/423 298/298/421 308/308/422 309/309/424
f 300/300/425 299/299/423 309/309/424 310/310/426
f 301/301/427 300/300/425 310/310/426 311/311/428
f 302/302/429 301/730/427 311/727/428 312/312/430
f 303/303/431 302/729/429 312/725/430 313/313/432
f 304/304/433 303/303/431 313/313/432 314/314/434
f 295/295/416 304/304/433 314/314/434 305/305/417
s 21
f 306/306/435 305/305/436 215/216/437 216/215/438
f 307/307/439 306/306/435 216/215/438 217/219/440
f 308/308/441 307/307/439 217/219/440 218/221/442
f 309/309/443 308/308/441 218/221/442 219/223/444
f 310/310/445 309/309/443 219/223/444 220/225/446
f 311/311/447 310/310/445 220/225/446 221/728/448
f 312/312/449 311/727/447 221/227/448 222/726/450
f 313/313/451 312/725/449 222/229/450 223/231/452
f 314/314/453 313/313/451 223/231/452 224/233/454
f 305/305/436 314/314/453 224/233/454 215/216/437
s 22
f 678/315/455 677/316/456 316/317/457 387/318/458
f 505/319/459 504/320/460 317/321/461 506/322/462
f 403/323/463 402/324/464 319/325/465 404/326/466
f 377/327/467 375/328/468 322/329/469 378/330/470
f 343/331/471 341/332/472 323/333/473 344/334/474
f 330/335/475 327/336/476 326/337/477 331/338/478
f 329/339/479 325/340/480 327/336/476 330/335/475
f 315/341/481 329/339/479 330/335/475 328/342/482
f 328/342/482 330/335/475 331/338/478 324/343/483
f 338/344/484 335/345/485 332/346/486 339/347/487
f 325/340/480 333/348/488 336/349/489
f 337/350/490 321/351/491 335/345/485 338/344/484
f 333/348/488 337/350/490 338/344/484 336/349/489
f 336/349/489 338/344/484 339/347/487 334/352/492
f 326/337/477 327/336/476 334/352/492 342/353/493
f 339/347/487 332/346/486 341/332/472 343/331/471
f 334/352/492 339/347/487 343/331/471 342/353/493
f 342/353/493 343/331/471 344/334/474 340/354/494
f 361/355/495 359/356/496 345/357/497 362/358/498
f 350/359/499 349/360/500 347/361/501 351/362/502
f 331/338/478 326/337/477 349/360/500 350/359/499
f 324/343/483 331/338/478 350/359/499 348/363/503
f 348/363/503 350/359/499 351/362/502 346/364/504
f 356/365/505 354/366/506 352/367/507 357/368/508
f 353/369/509 349/360/500 326/337/477 355/370/510
f 344/334/474 323/333/473 354/366/506 356/365/505
f 340/354/494 344/334/474 356/365/505 355/370/510
f 355/370/510 356/365/505 357/368/508 353/369/509
f 347/361/501 349/360/500 353/369/509 360/371/511
f 357/368/508 352/367/507 359/356/496 361/355/495
f 353/369/509 357/368/508 361/355/495 360/371/511
f 360/371/511 361/355/495 362/358/498 358/372/512
f 366/373/513 365/374/514 363/375/515 367/376/516
f 351/362/502 347/361/501 365/374/514 366/373/513
f 346/364/504 351/362/502 366/373/513 364/377/517
f 364/377/517 366/373/513 367/376/516 320/378/518
f 372/379/519 370/380/520 368/381/521 373/382/522
f 369/383/523 365/374/514 347/361/501 371/384/524
f 362/358/498 345/357/497 370/380/520 372/379/519
f 358/372/512 362/358/498 372/379/519 371/384/524
f 371/384/524 372/379/519 373/382/522 369/383/523
f 363/375/515 365/374/514 369/383/523 376/385/525
f 373/382/522 368/381/521 375/328/468 377/327/467
f 369/383/523 373/382/522 377/327/467 376/385/525
f 376/385/525 377/327/467 378/330/470 374/386/526
f 388/387/527 386/388/528 379/389/529 389/390/530
f 384/391/531 382/392/532 381/393/533 385/394/534
f 383/395/535 380/396/536 382/392/532 384/391/531
f 383/395/535 384/391/531 332/346/486 335/345/485
f 323/333/473 341/332/472 385/394/534 354/366/506
f 387/318/458 316/317/457 386/388/528 388/387/527
f 380/396/536 387/318/458 388/387/527 382/392/532
f 382/392/532 388/387/527 389/390/530 381/393/533
f 396/397/537 395/398/538 390/399/539 397/400/540
f 393/401/541 392/402/542 391/403/543 394/404/544
f 385/394/534 381/393/533 392/402/542 393/401/541
f 345/357/497 359/356/496 394/404/544 370/380/520
f 389/390/530 379/389/529 395/398/538 396/397/537
f 381/393/533 389/390/530 396/397/537 392/402/542
f 392/402/542 396/397/537 397/400/540 391/403/543
f 400/405/545 399/406/546 398/407/547 401/408/548
f 394/404/544 391/403/543 399/406/546 400/405/545
f 322/329/469 375/328/468 401/408/548 417/409/549
f 397/400/540 390/399/539 402/324/464 403/323/463
f 391/403/543 397/400/540 403/323/463 399/406/546
f 399/406/546 403/323/463 404/326/466 398/407/547
f 455/410/550 454/411/551 405/412/552 456/413/553
f 440/414/554 439/415/555 407/416/556 441/417/557
f 424/418/558 422/419/559 409/420/560 425/421/561
f 413/422/562 412/423/563 410/424/564 414/425/565
f 367/376/516 363/375/515 412/423/563 413/422/562
f 320/378/518 367/376/516 413/422/562 411/426/566
f 411/426/566 413/422/562 414/425/565 408/427/567
f 419/428/568 417/409/549 415/429/569 420/430/570
f 374/386/526 418/431/571 363/375/515 376/385/525
f 378/330/470 322/329/469 417/409/549 419/428/568
f 374/386/526 378/330/470 419/428/568 418/431/571
f 418/431/571 419/428/568 420/430/570 416/432/572
f 421/433/573 410/424/564 412/423/563 423/434/574
f 420/430/570 415/429/569 422/419/559 424/418/558
f 416/432/572 420/430/570 424/418/558 423/434/574
f 423/434/574 424/418/558 425/421/561 421/433/573
f 429/435/575 428/436/576 426/437/577 430/438/578
f 414/425/565 410/424/564 428/436/576 429/435/575
f 408/427/567 414/425/565 429/435/575 427/439/579
f 427/439/579 429/435/575 430/438/578 406/440/580
f 435/441/581 433/442/582 431/443/583 436/444/584
f 428/436/576 410/424/564 421/433/573 434/445/585
f 425/421/561 409/420/560 433/442/582 435/441/581
f 421/433/573 425/421/561 435/441/581 434/445/585
f 434/445/585 435/441/581 436/444/584 432/446/586
f 437/447/587 426/437/577 428/436/576 438/448/588
f 436/444/584 431/443/583 439/415/555 440/414/554
f 432/446/586 436/444/584 440/414/554 438/448/588
f 438/448/588 440/414/554 441/417/557 437/447/587
f 448/449/589 447/450/590 442/451/591 449/452/592
f 445/453/593 444/454/594 443/455/595 446/456/596
f 401/408/548 398/407/547 444/454/594 445/453/593
f 422/419/559 415/429/569 445/453/593
f 404/326/466 319/325/465 447/450/590 448/449/589
f 398/407/547 404/326/466 448/449/589 444/454/594
f 444/454/594 448/449/589 449/452/592 443/455/595
f 452/457/597 451/458/598 450/459/599 453/460/600
f 446/456/596 443/455/595 451/458/598 452/457/597
f 409/420/560 446/456/596 452/457/597 433/442/582
f 452/457/597 439/415/555 431/443/583 433/442/582
f 449/452/592 442/451/591 454/411/551 455/410/550
f 443/455/595 449/452/592 455/410/550 451/458/598
f 451/458/598 455/410/550 456/413/553 450/459/599
f 490/461/601 489/462/602 457/463/603 491/464/604
f 474/465/605 472/466/606 459/467/607 475/468/608
f 463/469/609 462/470/610 460/471/611 464/472/612
f 430/438/578 426/437/577 462/470/610 463/469/609
f 406/440/580 430/438/578 463/469/609 461/473/613
f 461/473/613 463/469/609 464/472/612 458/474/614
f 469/475/615 467/476/616 465/477/617 470/478/618
f 462/470/610 468/479/619 466/480/620 473/481/621
f 441/417/557 407/416/556 467/476/616 469/475/615
f 437/447/587 441/417/557 469/475/615 468/479/619
f 468/479/619 469/475/615 470/478/618 466/480/620
f 471/482/622 460/471/611 462/470/610 473/481/621
f 470/478/618 465/477/617 472/466/606 474/465/605
f 466/480/620 470/478/618 474/465/605 473/481/621
f 473/481/621 474/465/605 475/468/608 471/482/622
f 479/483/623 478/484/624 476/485/625 480/486/626
f 464/472/612 460/471/611 478/484/624 479/483/623
f 458/474/614 464/472/612 479/483/623 477/487/627
f 477/487/627 479/483/623 480/486/626 318/488/628
f 485/489/629 483/490/630 481/491/631 486/492/632
f 478/484/624 460/471/611 471/482/622 484/493/633
f 475/468/608 459/467/607 483/490/630 485/489/629
f 471/482/622 475/468/608 485/489/629 484/493/633
f 484/493/633 485/489/629 486/492/632 482/494/634
f 487/495/635 476/485/625 478/484/624 488/496/636
f 486/492/632 481/491/631 489/462/602 490/461/601
f 482/494/634 486/492/632 490/461/601 488/496/636
f 488/496/636 490/461/601 491/464/604 487/495/635
f 498/497/637 497/498/638 492/499/639 499/500/640
f 495/501/641 494/502/642 493/503/643 496/504/644
f 453/460/600 450/459/599 494/502/642 495/501/641
f 407/416/556 453/460/600 495/501/641 467/476/616
f 495/501/641 472/466/606 465/477/617 467/476/616
f 456/413/553 405/412/552 497/498/638 498/497/637
f 450/459/599 456/413/553 498/497/637 494/502/642
f 494/502/642 498/497/637 499/500/640 493/503/643
f 502/505/645 501/506/646 500/507/647 503/508/648
f 496/504/644 493/503/643 501/506/646 502/505/645
f 459/467/607 496/504/644 502/505/645 483/490/630
f 502/505/645 489/462/602 481/491/631 483/490/630
f 499/500/640 492/499/639 504/320/460 505/319/459
f 493/503/643 499/500/640 505/319/459 501/506/646
f 501/506/646 505/319/459 506/322/462 500/507/647
f 583/509/649 582/510/650 507/511/651 584/716/652
f 560/513/653 559/514/654 509/515/655 561/721/656
f 526/517/657 524/518/658 511/519/659 527/520/660
f 515/521/661 514/522/662 512/523/663 516/524/664
f 480/486/626 476/485/625 514/522/662 515/521/661
f 318/488/628 480/486/626 515/521/661 513/525/665
f 513/525/665 515/521/661 516/524/664 510/526/666
f 521/527/667 519/528/668 517/529/669 522/530/670
f 514/522/662 520/531/671 518/532/672 525/533/673
f 491/464/604 457/463/603 519/528/668 521/527/667
f 487/495/635 491/464/604 521/527/667 520/531/671
f 520/531/671 521/527/667 522/530/670 518/532/672
f 523/534/674 512/523/663 514/522/662 525/533/673
f 522/530/670 517/529/669 524/518/658 526/517/657
f 518/532/672 522/530/670 526/517/657 525/533/673
f 525/533/673 526/517/657 527/520/660 523/534/674
f 544/535/675 542/536/676 529/537/677 545/538/678
f 533/539/679 532/540/680 530/541/681 534/542/682
f 516/524/664 512/523/663 532/540/680 533/539/679
f 510/526/666 516/524/664 533/539/679 531/543/683
f 531/543/683 533/539/679 534/542/682 528/544/684
f 539/545/685 537/546/686 535/547/687 540/548/688
f 532/540/680 538/549/689 536/550/690 543/551/691
f 527/520/660 511/519/659 537/546/686 539/545/685
f 523/534/674 527/520/660 539/545/685 538/549/689
f 538/549/689 539/545/685 540/548/688 536/550/690
f 541/552/692 530/541/681 532/540/680 543/551/691
f 540/548/688 535/547/687 542/536/676 544/535/675
f 536/550/690 540/548/688 544/535/675 543/551/691
f 543/551/691 544/535/675 545/538/678 541/552/692
f 549/553/693 548/554/694 546/724/695 550/723/696
f 534/542/682 530/541/681 548/554/694 549/553/693
f 528/544/684 534/542/682 549/553/693 547/557/697
f 547/557/697 549/553/693 550/723/696 508/722/698
f 555/559/699 553/560/700 551/561/701 556/562/702
f 548/554/694 530/541/681 541/552/692 554/563/703
f 545/538/678 529/537/677 553/560/700 555/559/699
f 541/552/692 545/538/678 555/559/699 554/563/703
f 554/563/703 555/559/699 556/562/702 552/564/704
f 557/720/705 546/724/695 548/554/694 558/566/706
f 556/562/702 551/561/701 559/514/654 560/513/653
f 552/564/704 556/562/702 560/513/653 558/566/706
f 558/566/706 560/513/653 561/721/656 557/720/705
f 568/567/707 567/568/708 562/569/709 569/570/710
f 565/571/711 564/572/712 563/573/713 566/574/714
f 503/508/648 500/507/647 564/572/712 565/571/711
f 457/463/603 503/508/648 565/571/711 519/528/668
f 565/571/711 524/518/658 517/529/669 519/528/668
f 506/322/462 317/321/461 567/568/708 568/567/707
f 500/507/647 506/322/462 568/567/707 564/572/712
f 564/572/712 568/567/707 569/570/710 563/573/713
f 576/575/715 575/576/716 570/577/717 577/578/718
f 573/579/719 572/580/720 571/581/721 574/582/722
f 566/574/714 563/573/713 572/580/720 573/579/719
f 511/519/659 566/574/714 573/579/719 537/546/686
f 573/579/719 542/536/676 535/547/687 537/546/686
f 569/570/710 562/569/709 575/576/716 576/575/715
f 563/573/713 569/570/710 576/575/715 572/580/720
f 572/580/720 576/575/715 577/578/718 571/581/721
f 580/583/723 579/584/724 578/585/725 581/586/726
f 574/582/722 571/581/721 579/584/724 580/583/723
f 529/537/677 574/582/722 580/583/723 553/560/700
f 580/583/723 559/514/654 551/561/701 553/560/700
f 577/578/718 570/577/717 582/510/650 583/509/649
f 571/581/721 577/578/718 583/509/649 579/584/724
f 579/584/724 583/509/649 584/716/652 578/585/725
f 635/587/727 634/588/728 585/589/729 636/590/730
f 620/591/731 619/592/732 587/593/733 621/594/734
f 604/595/735 602/596/736 589/597/737 605/598/738
f 593/599/739 592/600/740 590/601/741 594/602/742
f 550/556/696 546/555/695 592/600/740 593/599/739
f 508/558/698 550/556/696 593/599/739 591/603/743
f 591/603/743 593/599/739 594/602/742 588/604/744
f 599/605/745 597/606/746 595/607/747 600/608/748
f 598/609/749 596/610/750 592/600/740
f 561/516/656 509/718/655 597/606/746 599/605/745
f 557/565/705 561/516/656 599/605/745 598/609/749
f 598/609/749 599/605/745 600/608/748 596/610/750
f 590/601/741 592/600/740 596/610/750 603/611/751
f 600/608/748 595/607/747 602/596/736 604/595/735
f 596/610/750 600/608/748 604/595/735 603/611/751
f 603/611/751 604/595/735 605/598/738 601/612/752
f 609/613/753 608/614/754 606/615/755 610/616/756
f 594/602/742 590/601/741 608/614/754 609/613/753
f 588/604/744 594/602/742 609/613/753 607/617/757
f 607/617/757 609/613/753 610/616/756 586/618/758
f 615/619/759 613/620/760 611/621/761 616/622/762
f 601/612/752 614/623/763 590/601/741 603/611/751
f 605/598/738 589/597/737 613/620/760 615/619/759
f 601/612/752 605/598/738 615/619/759 614/623/763
f 614/623/763 615/619/759 616/622/762 612/624/764
f 606/615/755 608/614/754 612/624/764 618/625/765
f 616/622/762 611/621/761 619/592/732 620/591/731
f 612/624/764 616/622/762 620/591/731 618/625/765
f 618/625/765 620/591/731 621/594/734 617/626/766
f 628/627/767 627/628/768 622/629/769 629/630/770
f 625/631/771 624/632/772 623/633/773 626/634/774
f 581/719/726 578/715/725 624/632/772 625/631/771
f 509/718/655 581/719/726 625/631/771 597/606/746
f 589/597/737 602/596/736 626/634/774 613/620/760
f 584/512/652 507/717/651 627/628/768 628/627/767
f 578/715/725 584/512/652 628/627/767 624/632/772
f 624/632/772 628/627/767 629/630/770 623/633/773
f 632/635/775 631/636/776 630/637/777 633/638/778
f 626/634/774 623/633/773 631/636/776 632/635/775
f 587/593/733 619/592/732 633/638/778 646/639/779
f 629/630/770 622/629/769 634/588/728 635/587/727
f 623/633/773 629/630/770 635/587/727 631/636/776
f 631/636/776 635/587/727 636/590/730 630/637/777
f 666/640/780 665/641/781 321/351/491 337/350/490
f 653/642/782 651/643/783 638/644/784 654/645/785
f 642/646/786 641/647/787 639/648/788 643/649/789
f 610/616/756 606/615/755 641/647/787 642/646/786
f 586/618/758 610/616/756 642/646/786 640/650/790
f 640/650/790 642/646/786 643/649/789 637/651/791
f 648/652/792 646/639/779 644/653/793 649/654/794
f 617/626/766 647/655/795 606/615/755 618/625/765
f 621/594/734 587/593/733 646/639/779 648/652/792
f 617/626/766 621/594/734 648/652/792 647/655/795
f 647/655/795 648/652/792 649/654/794 645/656/796
f 639/648/788 641/647/787 645/656/796 652/657/797
f 649/654/794 644/653/793 651/643/783 653/642/782
f 645/656/796 649/654/794 653/642/782 652/657/797
f 652/657/797 653/642/782 654/645/785 650/658/798
f 657/659/799 656/660/800 325/340/480 329/339/479
f 643/649/789 639/648/788 656/660/800 657/659/799
f 637/651/791 643/649/789 657/659/799 655/661/801
f 655/661/801 657/659/799 329/339/479 315/341/481
f 662/662/802 660/663/803 658/664/804 663/665/805
f 650/658/798 661/666/806 639/648/788 652/657/797
f 654/645/785 638/644/784 660/663/803 662/662/802
f 650/658/798 654/645/785 662/662/802 661/666/806
f 661/666/806 662/662/802 663/665/805 659/667/807
f 325/340/480 656/660/800 659/667/807 664/668/808
f 663/665/805 658/664/804 665/641/781 666/640/780
f 659/667/807 663/665/805 666/640/780 664/668/808
f 664/668/808 666/640/780 337/350/490 333/348/488
f 673/669/809 672/670/810 667/671/811 674/672/812
f 670/673/813 669/674/814 668/675/815 671/676/816
f 633/638/778 630/637/777 669/674/814 670/673/813
f 638/644/784 651/643/783 671/676/816 660/663/803
f 636/590/730 585/589/729 672/670/810 673/669/809
f 630/637/777 636/590/730 673/669/809 669/674/814
f 669/674/814 673/669/809 674/672/812 668/675/815
f 676/677/817 675/678/818 380/396/536 383/395/535
f 671/676/816 668/675/815 675/678/818 676/677/817
f 383/395/535 321/351/491 665/641/781
f 674/672/812 667/671/811 677/316/456 678/315/455
f 668/675/815 674/672/812 678/315/455 675/678/818
f 675/678/818 678/315/455 387/318/458 380/396/536
f 334/352/492 327/336/476 325/340/480 336/349/489
f 326/337/477 342/353/493 340/354/494 355/370/510
f 347/361/501 360/371/511 358/372/512 371/384/524
f 335/345/485 321/351/491 383/395/535
f 332/346/486 384/391/531 385/394/534 341/332/472
f 385/394/534 393/401/541 352/367/507 354/366/506
f 352/367/507 393/401/541 394/404/544 359/356/496
f 394/404/544 400/405/545 368/381/521 370/380/520
f 368/381/521 400/405/545 401/408/548 375/328/468
f 416/432/572 412/423/563 363/375/515 418/431/571
f 412/423/563 416/432/572 423/434/574
f 428/436/576 434/445/585 432/446/586 438/448/588
f 401/408/548 445/453/593 415/429/569 417/409/549
f 445/453/593 446/456/596 409/420/560 422/419/559
f 452/457/597 453/460/600 407/416/556 439/415/555
f 462/470/610 426/437/577 437/447/587 468/479/619
f 478/484/624 484/493/633 482/494/634 488/496/636
f 495/501/641 496/504/644 459/467/607 472/466/606
f 502/505/645 503/508/648 457/463/603 489/462/602
f 514/522/662 476/485/625 487/495/635 520/531/671
f 532/540/680 512/523/663 523/534/674 538/549/689
f 548/554/694 554/563/703 552/564/704 558/566/706
f 565/571/711 566/574/714 511/519/659 524/518/658
f 573/579/719 574/582/722 529/537/677 542/536/676
f 580/583/723 581/586/726 509/515/655 559/514/654
f 592/600/740 546/555/695 557/565/705 598/609/749
f 612/624/764 608/614/754 590/601/741 614/623/763
f 625/631/771 595/607/747 597/606/746
f 595/607/747 625/631/771 626/634/774 602/596/736
f 626/634/774 632/635/775 611/621/761 613/620/760
f 611/621/761 632/635/775 633/638/778 619/592/732
f 645/656/796 641/647/787 606/615/755 647/655/795
f 659/667/807 656/660/800 639/648/788 661/666/806
f 664/668/808 333/348/488 325/340/480
f 633/638/778 670/673/813 644/653/793 646/639/779
f 644/653/793 670/673/813 671/676/816 651/643/783
f 671/676/816 676/677/817 658/664/804 660/663/803
f 658/664/804 676/677/817 383/395/535 665/641/781
