# This file uses centimeters as units for non-parametric coordinates.

mtllib Burbuja_0.mtl
g default
v 0.000000 2.262414 4.700846
v -2.350423 2.262414 4.071058
v -2.700857 1.283191 4.678028
v 0.000000 1.283191 5.401713
v -2.932749 8.535862 -0.514236
v -3.178316 8.510647 -0.514236
v -3.187553 8.544225 -0.000000
v -3.187553 8.640892 -0.000000
v -3.155887 8.207379 0.360144
v -3.131287 7.906506 0.309185
v -3.155887 8.216396 0.577175
v -2.096183 2.352948 3.630700
v 0.000000 0.972874 5.626893
v -2.813447 0.972874 4.873046
v 0.000000 2.352948 4.192365
v -3.178047 8.449515 0.254661
v -3.178047 8.521538 0.514236
v -2.932749 7.922050 0.309185
v -3.015595 8.655153 -0.000000
v 5.401713 1.283191 0.000000
v 5.626893 0.972874 0.000000
v 4.678028 1.283191 -2.700857
v -2.898433 8.242445 0.577175
v 0.000000 8.708447 -3.015595
v -1.507797 8.708447 -2.611582
v -1.320025 8.987595 -2.286351
v 0.000000 8.987595 -2.640050
v -2.611582 8.708447 -1.507797
v -3.015595 8.708447 0.000000
v -2.640050 8.987595 0.000000
v -2.286351 8.987595 -1.320025
v -2.932749 8.546770 0.514236
v 4.186087 2.352948 0.000000
v 4.798429 1.957066 -0.445814
v 5.101421 2.103182 -0.450372
v 5.037535 1.673747 -0.315893
v 5.295200 1.775263 -0.318461
v 4.894248 2.429202 -0.318461
v 4.574851 2.267483 -0.315801
v 5.103873 2.067879 -0.370949
v 5.294489 1.807669 -0.262301
v 4.906144 2.326582 -0.262301
v 5.370730 1.639360 0.000000
v 1.507797 7.736228 -2.611582
v 0.000000 7.736228 -3.015595
v 1.507797 8.708447 -2.611582
v 5.370730 1.699827 0.000000
v 4.823734 2.433096 0.000000
v 5.295200 1.775263 0.318461
v 5.037535 1.673747 0.315893
v 5.248539 2.632157 -0.360144
v 5.294489 1.807669 0.262301
v 5.500964 2.488019 -0.254661
v 4.574851 2.267483 0.315801
v 4.894248 2.429202 0.318461
v 4.806879 2.563432 0.000000
v 4.997878 2.776215 -0.254661
v 4.873046 0.972874 2.813447
v 2.700857 1.283191 4.678028
v 5.101421 2.103182 0.450372
v 4.798429 1.957066 0.445814
v 5.603368 2.428393 0.000000
v 3.630700 2.352948 2.096183
v 0.000000 0.965891 0.000000
v 2.813447 0.972874 4.873046
v 5.103873 2.067879 0.370949
v 4.906144 2.326582 0.262301
v 4.896373 2.835800 0.000000
v -1.593598 9.219115 -0.920064
v -0.920064 9.219115 -1.593598
v 4.997878 2.776215 0.254661
v 5.500964 2.488019 0.254661
v 4.601267 2.262414 -0.321333
v 5.248539 2.632157 0.360144
v 2.096183 2.352948 3.630700
v 5.187346 1.582697 0.000000
v 4.678028 1.283191 2.700857
v 5.318343 3.700918 -0.362350
v 5.078792 3.754468 -0.256220
v -1.552048 9.521040 -0.896076
v -0.896076 9.521040 -1.552048
v 5.547128 3.630690 -0.256220
v -1.840129 9.219115 0.000000
v 0.000000 9.219115 -1.840129
v 1.320025 8.987595 -2.286351
v -2.611582 8.708447 1.507797
v -2.286351 8.987595 1.320025
v 4.276729 2.336417 0.000000
v 5.078792 3.754468 0.256220
v 5.620975 3.594936 0.000000
v 3.630700 2.352948 -2.096183
v 4.071058 2.262414 -2.350423
v 4.979828 3.779126 0.000000
v 5.318343 3.700918 0.362350
v 5.547128 3.630690 0.256220
v 0.000000 9.521040 -1.792151
v -1.792151 9.521040 0.000000
v 4.601267 2.262414 0.321333
v -1.414813 9.904131 -0.816843
v -0.816843 9.904131 -1.414813
v -1.507797 7.736228 2.611582
v -2.611582 7.736228 1.507797
v 2.611582 7.736228 -1.507797
v 5.051364 4.702547 -0.254661
v 5.308484 4.683151 -0.360144
v 5.569457 4.658636 -0.254661
v 2.350423 2.262414 4.071058
v 5.051364 4.702547 0.254661
v 4.939233 4.709570 0.000000
v -0.551892 10.442657 -0.955905
v -0.955905 10.442657 -0.551892
v 0.000000 10.693686 0.000000
v -1.633685 9.904131 0.000000
v 0.000000 9.904131 -1.633685
v 0.000000 10.442657 -1.103784
v -1.103784 10.442657 0.000000
v 5.687742 4.646353 0.000000
v 5.308484 4.683151 0.360144
v -1.593598 9.219115 0.920064
v 0.920064 9.219115 -1.593598
v 4.881040 5.666054 -0.254661
v 5.569457 4.658636 0.254661
v 5.133677 5.718600 -0.360144
v -0.955905 10.442657 0.551892
v 0.551892 10.442657 -0.955905
v -1.230941 10.196814 -0.710684
v -0.710684 10.196814 -1.230941
v -1.507797 8.708447 2.611582
v 0.000000 8.708447 3.015595
v 0.011495 7.736228 3.012515
v 4.776122 5.644224 0.000000
v 4.881040 5.666054 0.254661
v 5.390515 5.770930 -0.254661
v 0.896076 9.521040 -1.552048
v -1.552048 9.521040 0.896076
v -0.551892 10.442657 0.955905
v 0.955905 10.442657 -0.551892
v 2.611582 8.708447 -1.507797
v 0.000000 10.196814 -1.421368
v -1.421368 10.196814 0.000000
v 2.932749 7.922427 -0.309185
v 3.133953 7.906506 -0.309185
v 4.516354 6.762065 -0.254661
v 5.133677 5.718600 0.360144
v 5.499406 5.792562 0.000000
v 2.898433 8.242918 -0.577175
v 3.158553 8.216396 -0.577175
v 4.755332 6.881368 -0.360144
v 4.071058 2.262414 2.350423
v 3.133953 7.961475 -0.254661
v 3.124101 7.855678 0.000000
v 3.158553 8.207379 -0.360144
v 3.124101 7.773179 0.000000
v 5.390515 5.770930 0.254661
v 4.418643 6.711006 0.000000
v 4.516377 6.760401 0.254661
v 3.836177 7.633729 -0.254661
v 0.000000 10.442657 1.103784
v 1.103784 10.442657 0.000000
v 3.134124 7.950101 0.254661
v 4.005211 7.819687 -0.360144
v 3.180713 8.449515 -0.254661
v 4.999589 6.982555 -0.254661
v -1.414813 9.904131 0.816843
v 0.816843 9.904131 -1.414813
v 3.764205 7.556219 0.000000
v 3.134124 7.892172 0.309185
v 2.932749 7.908000 0.309185
v 2.932749 8.547249 -0.514236
v 3.180713 8.521538 -0.514236
v 0.955905 10.442657 0.551892
v 0.551892 10.442657 0.955905
v 3.837377 7.624519 0.254661
v 4.755529 6.865294 0.360144
v 4.165437 8.012310 -0.254661
v 3.158917 8.193284 0.360144
v 3.190219 8.544225 0.000000
v 5.101755 7.017688 0.000000
v 3.158917 8.198633 0.577175
v 2.898433 8.225073 0.577175
v 3.190219 8.640892 0.000000
v 2.286351 8.987595 -1.320025
v -1.320025 8.987595 2.286351
v 4.999732 6.968478 0.254661
v 4.007764 7.807203 0.360144
v 3.180982 8.440873 0.254661
v 4.229205 8.090961 0.000000
v 3.180982 8.510647 0.514236
v 2.932749 8.536339 0.514236
v 1.496302 7.736228 2.614662
v 2.611582 7.736228 1.507797
v -1.230941 10.196814 0.710684
v 0.710684 10.196814 -1.230941
v 4.167328 8.004387 0.254661
v -0.920064 9.219115 1.593598
v 1.593598 9.219115 -0.920064
v 1.507797 8.708447 2.611582
v 2.611582 8.708447 1.507797
v -0.896076 9.521040 1.552048
v 1.552048 9.521040 -0.896076
v 3.015595 7.736228 0.000000
v -0.816843 9.904131 1.414813
v 1.414813 9.904131 -0.816843
v 1.230941 10.196814 -0.710684
v -0.710684 10.196814 1.230941
v 0.000000 9.219115 1.840129
v 1.840129 9.219115 0.000000
v 0.000000 8.987595 2.640050
v 2.640050 8.987595 0.000000
v 1.792151 9.521040 0.000000
v 0.000000 9.521040 1.792151
v -3.015595 7.736228 0.000000
v -3.015595 7.778255 -0.000000
v 3.015595 7.778492 0.000000
v 3.015595 8.708447 0.000000
v 1.633685 9.904131 0.000000
v 0.000000 9.904131 1.633685
v 0.000000 10.196814 1.421368
v 1.421368 10.196814 0.000000
v 1.593598 9.219115 0.920064
v 0.920064 9.219115 1.593598
v 1.552048 9.521040 0.896076
v 0.896076 9.521040 1.552048
v 3.015595 8.655544 0.000000
v 1.320025 8.987595 2.286351
v 2.286351 8.987595 1.320025
v 1.414813 9.904131 0.816843
v 0.816843 9.904131 1.414813
v 0.710684 10.196814 1.230941
v 1.230941 10.196814 0.710684
v -3.131287 7.961475 0.254661
v -3.178316 8.440873 -0.254661
v -4.162770 8.012310 0.254661
v -3.121435 7.855678 -0.000000
v -4.226539 8.090961 -0.000000
v -4.002545 7.819687 0.360144
v -3.156251 8.198633 -0.577175
v -3.121435 7.773179 -0.000000
v -2.898433 8.224602 -0.577175
v -3.156251 8.193284 -0.360144
v -3.131458 7.950101 -0.254661
v -3.833511 7.633729 0.254661
v -3.131458 7.892172 -0.309185
v -2.932749 7.907625 -0.309185
v -4.164662 8.004387 -0.254661
v -3.761539 7.556219 -0.000000
v 4.873046 0.972874 -2.813447
v -4.005098 7.807203 -0.360144
v -1.507797 7.736228 -2.611582
v -3.834711 7.624519 -0.254661
v -4.752666 6.881368 0.360144
v -4.513688 6.762065 0.254661
v -4.996923 6.982555 0.254661
v -4.415977 6.711006 -0.000000
v -2.611582 7.736228 -1.507797
v -5.099089 7.017688 -0.000000
v -4.513711 6.760401 -0.254661
v -4.752863 6.865294 -0.360144
v -4.997066 6.968478 -0.254661
v -4.878374 5.666054 0.254661
v -5.131011 5.718600 0.360144
v -4.773456 5.644224 -0.000000
v -5.387849 5.770930 0.254661
v -4.878374 5.666054 -0.254661
v -5.387849 5.770930 -0.254661
v -5.131011 5.718600 -0.360144
v -5.496740 5.792562 -0.000000
v 2.096183 2.352948 -3.630700
v -3.630700 2.352948 2.096183
v -5.048698 4.702547 0.254661
v -4.936567 4.709570 -0.000000
v -5.305818 4.683151 0.360144
v -4.186006 2.352948 0.000000
v -4.071058 2.262414 2.350423
v 2.350423 2.262414 -4.071058
v -5.566791 4.658636 0.254661
v -5.048698 4.702547 -0.254661
v -5.305818 4.683151 -0.360144
v -5.566791 4.658636 -0.254661
v -5.685076 4.646353 -0.000000
v -5.076126 3.754468 0.256220
v -4.977162 3.779126 -0.000000
v 0.000000 2.352948 -4.192365
v -4.678028 1.283191 2.700857
v 2.700857 1.283191 -4.678028
v -5.315677 3.700918 0.362350
v -5.076126 3.754468 -0.256220
v -5.544462 3.630690 0.256220
v -5.315677 3.700918 -0.362350
v -4.995212 2.776215 0.254661
v -4.893707 2.835800 -0.000000
v -5.544462 3.630690 -0.256220
v -5.618308 3.594936 -0.000000
v -5.245873 2.632157 0.360144
v 2.813447 0.972874 -4.873046
v 0.000000 1.283191 -5.401713
v -4.891582 2.429202 0.318461
v -4.571288 2.268117 0.315811
v -4.873046 0.972874 2.813447
v -5.626893 0.972874 0.000000
v -4.995212 2.776215 -0.254661
v -3.630700 2.352948 -2.096183
v -4.821069 2.433096 -0.000000
v -4.903478 2.326582 0.262301
v -4.804214 2.563432 -0.000000
v -5.498298 2.488019 0.254661
v -5.098755 2.103182 0.450372
v -4.797425 1.958452 0.445857
v -5.101207 2.067879 0.370949
v -4.891582 2.429202 -0.318461
v -4.571288 2.268117 -0.315811
v -5.245873 2.632157 -0.360144
v -4.903478 2.326582 -0.262301
v -5.498298 2.488019 -0.254661
v -2.096183 2.352948 -3.630700
v -5.600702 2.428393 -0.000000
v -5.292534 1.775263 0.318461
v -5.291824 1.807669 0.262301
v -5.098755 2.103182 -0.450372
v -5.101207 2.067879 -0.370949
v -5.036585 1.675069 0.315907
v -5.401713 1.283191 0.000000
v 0.000000 0.972874 -5.626893
v -4.797425 1.958452 -0.445857
v -5.368064 1.699827 -0.000000
v -5.368064 1.639360 -0.000000
v -5.291824 1.807669 -0.262301
v -5.292534 1.775263 -0.318461
v -5.036585 1.675069 -0.315907
v -2.700857 1.283191 -4.678028
v -4.873046 0.972874 -2.813447
v 0.000000 2.262414 -4.700846
v -4.678028 1.283191 -2.700857
v -2.813447 0.972874 -4.873046
v -4.601077 2.262414 0.322015
v -4.271618 2.337328 -0.000000
v -4.601077 2.262414 -0.322015
v -2.350423 2.262414 -4.071058
v -5.186582 1.583765 -0.000000
v -4.071058 2.262414 -2.350423
v 0.000000 1.767183 3.716310
v -1.858155 1.767183 3.218424
v 1.858155 1.767183 3.218424
v 3.218424 1.767183 1.858155
v 3.716310 1.767183 0.000000
v 3.218424 1.767183 -1.858155
v 1.858155 1.767183 -3.218424
v 0.000000 1.767183 -3.716310
v -1.858155 1.767183 -3.218424
v -3.218424 1.767183 -1.858155
v -3.716310 1.767183 0.000000
v -3.218424 1.767183 1.858155
v 1.336583 8.321994 -2.315029
v 0.000000 8.321994 -2.673165
v 2.315029 8.321994 -1.336583
v 2.673165 8.321994 0.000000
v 2.315029 8.321994 1.336583
v 1.326393 8.321994 2.317760
v 0.010190 8.321994 2.670435
v -1.336583 8.321994 2.315029
v -2.315029 8.321994 1.336583
v -2.673165 8.321994 0.000000
v -2.315029 8.321994 -1.336583
v -1.336583 8.321994 -2.315029
v -1.827196 9.035855 -1.054932
v -1.692574 9.173836 -0.977208
v -1.054932 9.035855 -1.827196
v -0.977208 9.173836 -1.692574
v 0.000000 9.035855 -2.109865
v 0.000000 9.173836 -1.954417
v -1.954417 9.173836 0.000000
v -2.109865 9.035855 -0.000000
v 1.054932 9.035855 -1.827196
v 0.977208 9.173836 -1.692574
v -1.692574 9.173836 0.977208
v -1.827196 9.035855 1.054932
v 1.827196 9.035855 -1.054932
v 1.692574 9.173836 -0.977208
v -0.977208 9.173836 1.692574
v -1.054932 9.035855 1.827196
v 0.000000 9.173836 1.954417
v -0.000000 9.035855 2.109865
v 2.109865 9.035855 0.000000
v 1.954417 9.173836 0.000000
v 1.692574 9.173836 0.977208
v 1.827196 9.035855 1.054932
v 0.977208 9.173836 1.692574
v 1.054932 9.035855 1.827196
vt 0.704933 0.783485
vt 0.708984 0.783485
vt 0.703526 0.805031
vt 0.700603 0.794155
vt 0.703983 0.761938
vt 0.700965 0.772814
vt 0.690453 0.807669
vt 0.690229 0.798575
vt 0.690820 0.768395
vt 0.691197 0.759301
vt 0.677612 0.796440
vt 0.680039 0.794155
vt 0.678213 0.770530
vt 0.680516 0.772814
vt 0.672626 0.783485
vt 0.676083 0.783485
vt 0.916872 0.788458
vt 0.921425 0.777618
vt 0.924752 0.779097
vt 0.919225 0.792758
vt 0.919225 0.765357
vt 0.916872 0.766715
vt 0.905882 0.792921
vt 0.905882 0.798382
vt 0.905882 0.759663
vt 0.905882 0.762197
vt 0.892538 0.792758
vt 0.894891 0.788458
vt 0.894891 0.766715
vt 0.892538 0.765357
vt 0.887011 0.779097
vt 0.890339 0.777618
vt 0.014228 0.496216
vt 0.013908 0.477377
vt 0.024898 0.481839
vt 0.024898 0.498713
vt 0.035889 0.477377
vt 0.035569 0.496216
vt 0.014163 0.537205
vt 0.024898 0.538239
vt 0.035634 0.537205
vt 0.014228 0.576930
vt 0.024898 0.577224
vt 0.035569 0.576930
vt 0.014228 0.617301
vt 0.024898 0.616387
vt 0.035569 0.617301
vt 0.014228 0.663224
vt 0.024898 0.661085
vt 0.035569 0.663155
vt 0.014228 0.699747
vt 0.024898 0.696500
vt 0.035569 0.699362
vt 0.510421 0.507904
vt 0.510421 0.477377
vt 0.521411 0.481895
vt 0.521091 0.510402
vt 0.499430 0.481895
vt 0.499751 0.510402
vt 0.510421 0.556782
vt 0.521157 0.558280
vt 0.499685 0.558280
vt 0.510421 0.600837
vt 0.521091 0.601351
vt 0.499751 0.601351
vt 0.510421 0.648863
vt 0.521091 0.647957
vt 0.499751 0.647957
vt 0.510421 0.700196
vt 0.521091 0.698724
vt 0.499751 0.698134
vt 0.521091 0.741871
vt 0.510421 0.745167
vt 0.499751 0.741539
vt 0.325713 0.839399
vt 0.325713 0.800848
vt 0.338364 0.800848
vt 0.338364 0.838394
vt 0.325713 0.762298
vt 0.338364 0.763303
vt 0.354415 0.800848
vt 0.354415 0.835074
vt 0.325713 0.867621
vt 0.338364 0.865880
vt 0.325713 0.734076
vt 0.338364 0.735817
vt 0.354415 0.766623
vt 0.366679 0.800848
vt 0.366679 0.830626
vt 0.354415 0.860130
vt 0.354415 0.741567
vt 0.366679 0.771071
vt 0.376980 0.800848
vt 0.376980 0.823973
vt 0.366679 0.852425
vt 0.366679 0.749272
vt 0.376980 0.777724
vt 0.678213 0.770530
vt 0.680516 0.772814
vt 0.676083 0.783485
vt 0.672626 0.783485
vt 0.690820 0.768395
vt 0.691197 0.759301
vt 0.680039 0.794155
vt 0.677612 0.796440
vt 0.700965 0.772814
vt 0.703983 0.761938
vt 0.690229 0.798575
vt 0.690453 0.807668
vt 0.704933 0.783485
vt 0.708984 0.783485
vt 0.700603 0.794155
vt 0.703526 0.805031
vt 0.338364 0.800848
vt 0.325713 0.800848
vt 0.325713 0.762298
vt 0.338364 0.763303
vt 0.325713 0.839399
vt 0.338364 0.838394
vt 0.325713 0.734076
vt 0.338364 0.735817
vt 0.354415 0.766623
vt 0.354415 0.800848
vt 0.354415 0.835074
vt 0.325713 0.867621
vt 0.338364 0.865880
vt 0.354415 0.741567
vt 0.366679 0.771071
vt 0.366679 0.800848
vt 0.366679 0.830626
vt 0.354415 0.860129
vt 0.366679 0.749272
vt 0.376980 0.777724
vt 0.376980 0.800848
vt 0.376980 0.823973
vt 0.366679 0.852425
vt 0.124783 0.814807
vt 0.123022 0.814807
vt 0.123022 0.751630
vt 0.130808 0.801852
vt 0.123022 0.877984
vt 0.130204 0.827761
vt 0.144233 0.790623
vt 0.143485 0.838990
vt 0.163758 0.751630
vt 0.156984 0.793260
vt 0.163758 0.877984
vt 0.156527 0.836353
vt 0.123022 0.705381
vt 0.163758 0.705381
vt 0.163758 0.814807
vt 0.161525 0.814807
vt 0.123022 0.924233
vt 0.163758 0.924233
vt 0.175454 0.759497
vt 0.175454 0.814807
vt 0.175454 0.870116
vt 0.124799 0.814742
vt 0.123028 0.814742
vt 0.123028 0.751580
vt 0.130828 0.801790
vt 0.123028 0.877904
vt 0.130224 0.827694
vt 0.144254 0.790564
vt 0.143506 0.838920
vt 0.163755 0.751580
vt 0.157002 0.793201
vt 0.163755 0.877904
vt 0.156545 0.836284
vt 0.123028 0.705343
vt 0.163755 0.705343
vt 0.163755 0.814742
vt 0.161539 0.814742
vt 0.163755 0.924142
vt 0.123028 0.924271
vt 0.175448 0.814742
vt 0.175448 0.759446
vt 0.175448 0.870038
vt 0.024898 0.616387
vt 0.024898 0.661085
vt 0.014228 0.663224
vt 0.014228 0.617301
vt 0.035569 0.663155
vt 0.035569 0.617301
vt 0.024898 0.696500
vt 0.014228 0.699747
vt 0.024898 0.577224
vt 0.014228 0.576930
vt 0.035569 0.699362
vt 0.035569 0.576930
vt 0.024898 0.538238
vt 0.014163 0.537205
vt 0.035634 0.537205
vt 0.024898 0.498713
vt 0.014228 0.496216
vt 0.035569 0.496216
vt 0.024898 0.481839
vt 0.013908 0.477376
vt 0.035889 0.477376
vt 0.557088 0.650490
vt 0.557088 0.701258
vt 0.546417 0.702730
vt 0.546417 0.651397
vt 0.557088 0.744405
vt 0.546417 0.747700
vt 0.535747 0.700668
vt 0.535747 0.650490
vt 0.557088 0.603885
vt 0.546417 0.603370
vt 0.535747 0.744073
vt 0.535747 0.603885
vt 0.557153 0.560814
vt 0.546417 0.559316
vt 0.535682 0.560814
vt 0.557088 0.512936
vt 0.546417 0.510437
vt 0.535747 0.512936
vt 0.557408 0.484429
vt 0.546417 0.479910
vt 0.535427 0.484429
vt 0.546417 0.477377
vt 0.559761 0.483071
vt 0.533074 0.483071
vt 0.565288 0.496811
vt 0.561960 0.495332
vt 0.530874 0.495332
vt 0.527547 0.496811
vt 0.559761 0.510471
vt 0.557408 0.506171
vt 0.535427 0.506171
vt 0.533074 0.510471
vt 0.808306 0.807586
vt 0.813930 0.820930
vt 0.808469 0.820930
vt 0.804006 0.809940
vt 0.808306 0.834274
vt 0.804006 0.831921
vt 0.091839 0.878113
vt 0.091839 0.814936
vt 0.116382 0.814936
vt 0.116382 0.870939
vt 0.091839 0.751759
vt 0.116382 0.758932
vt 0.091839 0.924362
vt 0.116382 0.911936
vt 0.091839 0.705381
vt 0.116382 0.717821
vt 0.091832 0.878082
vt 0.091832 0.814871
vt 0.116389 0.814871
vt 0.116389 0.870904
vt 0.091832 0.751660
vt 0.116389 0.758838
vt 0.091832 0.924356
vt 0.116389 0.911923
vt 0.091832 0.705387
vt 0.116389 0.717819
vt 0.862606 0.802756
vt 0.852317 0.802756
vt 0.851930 0.781210
vt 0.859135 0.781210
vt 0.852328 0.759663
vt 0.862606 0.759663
vt 0.237760 0.061956
vt 0.149930 0.085490
vt 0.139277 0.067038
vt 0.237760 0.040650
vt 0.237760 0.081902
vt 0.159903 0.102764
vt 0.085633 0.149786
vt 0.067182 0.139133
vt 0.124594 0.041606
vt 0.237760 0.011284
vt 0.325591 0.085490
vt 0.336244 0.067038
vt 0.315617 0.102764
vt 0.102908 0.159760
vt 0.044974 0.224124
vt 0.046222 0.224384
vt 0.041750 0.124450
vt 0.119876 0.033435
vt 0.237760 0.001849
vt 0.350927 0.041606
vt 0.389888 0.149786
vt 0.408339 0.139133
vt 0.372613 0.159760
vt 0.393475 0.237617
vt 0.062366 0.237617
vt 0.082046 0.237617
vt 0.036747 0.218935
vt 0.058778 0.237617
vt 0.026726 0.224380
vt 0.033578 0.119733
vt 0.355644 0.033435
vt 0.433771 0.124450
vt 0.430555 0.224153
vt 0.429448 0.224385
vt 0.413158 0.237617
vt 0.372613 0.315474
vt 0.315617 0.372470
vt 0.159903 0.372470
vt 0.102908 0.315474
vt 0.085633 0.325447
vt 0.046222 0.250849
vt 0.032802 0.224273
vt 0.036463 0.237617
vt 0.020441 0.237617
vt 0.011427 0.237617
vt 0.001992 0.237617
vt 0.441942 0.119733
vt 0.438816 0.218937
vt 0.448834 0.224381
vt 0.416956 0.237617
vt 0.389888 0.325447
vt 0.325591 0.389744
vt 0.237760 0.393331
vt 0.149930 0.389744
vt 0.067182 0.336100
vt 0.044974 0.251109
vt 0.032802 0.250960
vt 0.041750 0.350783
vt 0.026726 0.250853
vt 0.033578 0.355501
vt 0.473529 0.237617
vt 0.464093 0.237617
vt 0.455111 0.237617
vt 0.429448 0.250849
vt 0.442831 0.224273
vt 0.439170 0.237617
vt 0.408339 0.336100
vt 0.336244 0.408195
vt 0.237760 0.413278
vt 0.139277 0.408195
vt 0.036747 0.256298
vt 0.119876 0.441799
vt 0.124594 0.433627
vt 0.433771 0.350783
vt 0.441942 0.355501
vt 0.448834 0.250853
vt 0.442831 0.250960
vt 0.430555 0.251081
vt 0.350927 0.433627
vt 0.237760 0.434583
vt 0.237760 0.463950
vt 0.237760 0.473385
vt 0.355644 0.441799
vt 0.438816 0.256297
vt 0.820065 0.807694
vt 0.830862 0.807586
vt 0.834026 0.820930
vt 0.826342 0.820930
vt 0.830862 0.834274
vt 0.820065 0.834166
vt 0.715448 0.237617
vt 0.951217 0.237617
vt 0.919630 0.355501
vt 0.919630 0.119733
vt 0.833333 0.441799
vt 0.715448 0.473385
vt 0.833333 0.033435
vt 0.715448 0.001849
vt 0.597564 0.441799
vt 0.597564 0.033435
vt 0.511267 0.355501
vt 0.479680 0.237617
vt 0.511267 0.119733
vt 0.243075 0.842581
vt 0.226147 0.825653
vt 0.266199 0.802528
vt 0.236422 0.854105
vt 0.214623 0.832306
vt 0.219951 0.802528
vt 0.266199 0.848777
vt 0.266199 0.862084
vt 0.226147 0.779404
vt 0.289324 0.842581
vt 0.266199 0.870980
vt 0.231974 0.861809
vt 0.295977 0.854105
vt 0.243075 0.762475
vt 0.306252 0.825653
vt 0.300425 0.861809
vt 0.317776 0.832306
vt 0.214623 0.772750
vt 0.236422 0.750951
vt 0.266199 0.756279
vt 0.312448 0.802528
vt 0.266199 0.742972
vt 0.289324 0.762475
vt 0.306252 0.779404
vt 0.231974 0.743247
vt 0.266199 0.734076
vt 0.295977 0.750951
vt 0.300425 0.743247
vt 0.317776 0.772750
vt 0.734482 0.770530
vt 0.742912 0.770530
vt 0.742500 0.783485
vt 0.737953 0.783485
vt 0.733044 0.759301
vt 0.743943 0.759301
vt 0.742919 0.796440
vt 0.734482 0.796440
vt 0.743958 0.807669
vt 0.733044 0.807669
vt 0.878308 0.836634
vt 0.867638 0.836222
vt 0.867638 0.806798
vt 0.878308 0.809814
vt 0.888978 0.836214
vt 0.888978 0.806748
vt 0.852283 0.759708
vt 0.862651 0.759708
vt 0.859187 0.781210
vt 0.851885 0.781210
vt 0.862651 0.802712
vt 0.852272 0.802712
vt 0.492102 0.666908
vt 0.445853 0.713157
vt 0.437986 0.699529
vt 0.478475 0.659040
vt 0.382676 0.730085
vt 0.382676 0.714350
vt 0.426878 0.680291
vt 0.459236 0.647933
vt 0.319499 0.713157
vt 0.327367 0.699529
vt 0.382676 0.692135
vt 0.423622 0.674650
vt 0.453596 0.644676
vt 0.493295 0.603731
vt 0.471080 0.603731
vt 0.273250 0.666908
vt 0.286878 0.659040
vt 0.338474 0.680291
vt 0.382676 0.685621
vt 0.421227 0.670503
vt 0.449449 0.642282
vt 0.464567 0.603731
vt 0.478475 0.548421
vt 0.459236 0.559529
vt 0.306116 0.647933
vt 0.341731 0.674650
vt 0.382676 0.680833
vt 0.459778 0.603731
vt 0.453596 0.562786
vt 0.437986 0.507932
vt 0.426878 0.527171
vt 0.272058 0.603731
vt 0.294272 0.603731
vt 0.311757 0.644676
vt 0.344125 0.670503
vt 0.449449 0.565180
vt 0.423622 0.532811
vt 0.445853 0.494305
vt 0.492102 0.540554
vt 0.382676 0.493112
vt 0.382676 0.515327
vt 0.286878 0.548421
vt 0.306116 0.559529
vt 0.300786 0.603731
vt 0.315904 0.642282
vt 0.421227 0.536959
vt 0.382676 0.521840
vt 0.382676 0.477377
vt 0.327367 0.507932
vt 0.338474 0.527171
vt 0.311757 0.562786
vt 0.305575 0.603731
vt 0.382676 0.526629
vt 0.341731 0.532811
vt 0.319499 0.494305
vt 0.273250 0.540554
vt 0.315904 0.565180
vt 0.344125 0.536959
vt 0.814802 0.803595
vt 0.804132 0.803197
vt 0.804132 0.759663
vt 0.814802 0.762335
vt 0.793461 0.803584
vt 0.793461 0.762256
vt 0.738008 0.783485
vt 0.734530 0.770506
vt 0.742865 0.770506
vt 0.742451 0.783485
vt 0.743897 0.759256
vt 0.733090 0.759256
vt 0.742872 0.796464
vt 0.734530 0.796464
vt 0.743913 0.807714
vt 0.733090 0.807714
vt 0.814802 0.803595
vt 0.804132 0.803197
vt 0.804132 0.759663
vt 0.814802 0.762335
vt 0.793461 0.803584
vt 0.793461 0.762256
vt 0.878308 0.836634
vt 0.867638 0.836222
vt 0.867638 0.806798
vt 0.878308 0.809814
vt 0.888978 0.836214
vt 0.888978 0.806748
vt 0.820089 0.807671
vt 0.830832 0.807563
vt 0.834002 0.820930
vt 0.826385 0.820930
vt 0.830832 0.834297
vt 0.820089 0.834190
vt 0.833354 0.441712
vt 0.715450 0.473305
vt 0.597545 0.441713
vt 0.511233 0.355402
vt 0.479640 0.237498
vt 0.511232 0.119593
vt 0.598442 0.033040
vt 0.714548 0.001929
vt 0.833352 0.033280
vt 0.919664 0.119591
vt 0.951257 0.237495
vt 0.919665 0.355400
vt 0.722609 0.825503
vt 0.712331 0.824445
vt 0.713259 0.811660
vt 0.724047 0.812751
vt 0.941205 0.779446
vt 0.953900 0.773323
vt 0.962020 0.787063
vt 0.951224 0.791317
vt 0.945220 0.759663
vt 0.932944 0.766651
vt 0.931837 0.766439
vt 0.483386 0.734076
vt 0.483386 0.797253
vt 0.442650 0.797253
vt 0.442650 0.734076
vt 0.483386 0.860431
vt 0.442650 0.860431
vt 0.984561 0.721125
vt 0.978500 0.744769
vt 0.970215 0.733929
vt 0.974059 0.715089
vt 0.995138 0.727165
vt 0.986487 0.755672
vt 0.987486 0.676344
vt 0.977449 0.674100
vt 0.997072 0.679286
vt 0.987073 0.635188
vt 0.976300 0.634376
vt 0.998008 0.636215
vt 0.979749 0.591802
vt 0.969163 0.594004
vt 0.990510 0.589610
vt 0.963896 0.543082
vt 0.953883 0.548081
vt 0.974130 0.538842
vt 0.925383 0.511558
vt 0.932466 0.503766
vt 0.939179 0.495695
vt 0.895960 0.497826
vt 0.896990 0.487522
vt 0.897919 0.477377
vt 0.989889 0.777656
vt 0.977193 0.771534
vt 0.987212 0.759663
vt 0.998008 0.763917
vt 0.981208 0.791317
vt 0.968932 0.784328
vt 0.967825 0.784541
vt 0.762133 0.488279
vt 0.770120 0.477377
vt 0.778771 0.505883
vt 0.768194 0.511923
vt 0.780705 0.553762
vt 0.771119 0.556704
vt 0.753848 0.499119
vt 0.757692 0.517959
vt 0.781641 0.596833
vt 0.770706 0.597860
vt 0.761082 0.558948
vt 0.774143 0.643438
vt 0.763381 0.641246
vt 0.759933 0.598673
vt 0.757769 0.693616
vt 0.747537 0.689292
vt 0.752796 0.639044
vt 0.722891 0.737021
vt 0.716205 0.728759
vt 0.737516 0.684897
vt 0.681563 0.755310
vt 0.680639 0.744935
vt 0.709066 0.721104
vt 0.679600 0.734746
vt 0.631166 0.797852
vt 0.631166 0.836403
vt 0.618516 0.835398
vt 0.618516 0.797852
vt 0.602464 0.832078
vt 0.602464 0.797852
vt 0.631166 0.759301
vt 0.618516 0.760306
vt 0.602464 0.763626
vt 0.442621 0.797253
vt 0.442621 0.733986
vt 0.483416 0.733986
vt 0.483416 0.797736
vt 0.483416 0.860039
vt 0.442621 0.860521
vt 0.722643 0.825479
vt 0.712303 0.824407
vt 0.713227 0.811683
vt 0.724074 0.812789
vt 0.722592 0.825417
vt 0.712350 0.824605
vt 0.713283 0.811745
vt 0.724028 0.812619
vt 0.631166 0.759301
vt 0.631166 0.797852
vt 0.618516 0.797852
vt 0.618516 0.760306
vt 0.631166 0.836403
vt 0.618516 0.835398
vt 0.602464 0.797852
vt 0.602464 0.763626
vt 0.602464 0.832078
vt 0.748145 0.813079
vt 0.758434 0.812022
vt 0.759872 0.825064
vt 0.749070 0.826152
vt 0.896990 0.487522
vt 0.897919 0.477377
vt 0.939179 0.495696
vt 0.932465 0.503767
vt 0.963896 0.543082
vt 0.974130 0.538843
vt 0.895960 0.497826
vt 0.925383 0.511558
vt 0.953883 0.548081
vt 0.979749 0.591803
vt 0.990510 0.589610
vt 0.969163 0.594004
vt 0.987073 0.635188
vt 0.998008 0.636215
vt 0.976300 0.634376
vt 0.987486 0.676344
vt 0.997072 0.679287
vt 0.977449 0.674100
vt 0.984561 0.721125
vt 0.995138 0.727165
vt 0.974059 0.715089
vt 0.978500 0.744769
vt 0.986487 0.755672
vt 0.970215 0.733929
vt 0.722891 0.737021
vt 0.681563 0.755310
vt 0.680638 0.744936
vt 0.716205 0.728759
vt 0.679600 0.734746
vt 0.709066 0.721104
vt 0.747537 0.689292
vt 0.757769 0.693616
vt 0.737517 0.684897
vt 0.763381 0.641246
vt 0.774143 0.643438
vt 0.752796 0.639044
vt 0.770706 0.597860
vt 0.781641 0.596833
vt 0.759933 0.598673
vt 0.771119 0.556704
vt 0.780705 0.553762
vt 0.761082 0.558948
vt 0.768194 0.511923
vt 0.778771 0.505883
vt 0.757691 0.517959
vt 0.762133 0.488279
vt 0.770120 0.477376
vt 0.753848 0.499119
vt 0.952215 0.807182
vt 0.939589 0.813246
vt 0.931469 0.799506
vt 0.942194 0.795308
vt 0.948269 0.826907
vt 0.960442 0.819918
vt 0.961690 0.820157
vt 0.903233 0.816034
vt 0.915859 0.822098
vt 0.905838 0.833972
vt 0.895114 0.829773
vt 0.911914 0.802373
vt 0.924086 0.809362
vt 0.925334 0.809123
vt 0.540098 0.814869
vt 0.540098 0.751692
vt 0.564641 0.758866
vt 0.564641 0.814869
vt 0.540098 0.878046
vt 0.564641 0.870872
vt 0.540058 0.878007
vt 0.540058 0.815594
vt 0.564681 0.815539
vt 0.564681 0.870865
vt 0.540058 0.751731
vt 0.564681 0.758928
vn 0.000000 0.707855 0.706358
vn -0.353179 0.707855 0.611724
vn -0.406022 0.583594 0.703252
vn 0.000000 0.583594 0.812046
vn -0.906183 0.191301 -0.377141
vn -0.506893 0.633158 -0.584953
vn -0.423955 0.905631 -0.009738
vn -0.719837 0.694049 -0.011467
vn -0.999662 -0.026012 0.000226
vn -0.998732 -0.048279 -0.014246
vn -0.318337 -0.733239 0.600851
vn -0.449019 -0.297862 0.842413
vn -0.996973 -0.077702 0.002755
vn -0.998264 -0.055677 -0.019190
vn -0.404677 0.587316 0.700925
vn 0.000000 0.587314 0.809359
vn 0.000000 0.937273 -0.348597
vn 0.174298 0.937273 -0.301893
vn -0.998652 -0.049591 0.015356
vn -0.505548 0.645020 0.573036
vn -0.851721 -0.274680 0.446232
vn -0.917990 -0.061022 0.391882
vn 0.679158 0.583442 -0.445354
vn 0.810718 0.585437 0.000000
vn 0.809358 0.587315 0.000000
vn 0.700925 0.587317 -0.404677
vn 0.000000 0.246695 -0.969093
vn -0.484547 0.246695 -0.839260
vn -0.201119 0.915535 -0.348350
vn -0.000000 0.915535 -0.402239
vn -0.771702 0.317966 -0.550794
vn -0.692686 0.721237 -0.001584
vn -0.402239 0.915535 0.000000
vn -0.348349 0.915535 -0.201120
vn -0.905683 0.196734 0.375545
vn 0.774055 0.564080 -0.287494
vn 0.163225 0.080352 -0.983311
vn 0.375379 -0.515482 -0.770304
vn 0.804744 0.526710 -0.273794
vn 0.489864 -0.871799 0.000000
vn 0.865615 0.500710 0.000000
vn 0.096798 0.988356 -0.117401
vn -0.105843 0.687189 -0.718727
vn 0.398001 0.881214 -0.255064
vn 0.116709 0.993166 0.000000
vn -0.248844 0.968544 -0.000000
vn 0.358308 0.053133 -0.932090
vn 0.812939 -0.160688 -0.559741
vn -0.361224 0.278795 -0.889826
vn 0.968916 -0.247389 -0.000000
vn 0.500000 0.000000 -0.866025
vn 0.000000 0.000000 -1.000000
vn 0.484547 0.246695 -0.839259
vn -0.927698 0.373333 0.000000
vn 0.375378 -0.515482 0.770305
vn 0.804744 0.526710 0.273795
vn 0.078334 0.000146 -0.996927
vn -0.665960 0.081871 -0.741481
vn 0.812939 -0.160688 0.559741
vn 0.748199 -0.096879 -0.656363
vn 0.096798 0.988356 0.117401
vn -0.105843 0.687189 0.718727
vn -0.993458 0.114197 0.000000
vn 0.700925 0.587317 0.404677
vn 0.679158 0.583442 0.445353
vn 0.406022 0.583594 0.703252
vn 0.404677 0.587317 0.700925
vn 0.163225 0.080352 0.983311
vn 0.774055 0.564080 0.287494
vn 0.989099 -0.147251 -0.000000
vn 0.398001 0.881214 0.255064
vn 0.001241 -0.999999 0.000332
vn 0.001241 -0.999999 0.000332
vn 0.001241 -0.999999 0.000332
vn 0.000620 -0.999999 0.001075
vn 0.000620 -0.999999 0.001075
vn 0.000620 -0.999999 0.001075
vn 0.000620 -0.999999 0.001075
vn 0.358308 0.053133 0.932090
vn -0.361224 0.278795 0.889826
vn 0.748199 -0.096880 0.656363
vn -0.665960 0.081871 0.741481
vn 0.078334 0.000146 0.996927
vn 0.019532 0.000943 -0.999809
vn -0.701163 0.018975 -0.712748
vn -0.999752 0.022267 0.000000
vn -0.493804 0.156936 -0.855294
vn -0.855294 0.156936 -0.493804
vn -0.831325 0.280237 -0.479965
vn -0.479965 0.280237 -0.831325
vn 0.733561 -0.025806 -0.679133
vn 0.201120 0.915535 -0.348349
vn -0.771618 0.317996 0.550893
vn -0.348349 0.915535 0.201120
vn -0.701163 0.018975 0.712748
vn 0.999414 -0.034237 -0.000000
vn 0.580286 0.705057 -0.407631
vn -0.376919 0.902582 0.208033
vn -0.545906 0.837846 0.000000
vn 0.733561 -0.025806 0.679133
vn 0.019532 0.000943 0.999809
vn 0.000000 0.156936 -0.987609
vn 0.000000 0.280237 -0.959931
vn -0.987609 0.156936 0.000000
vn -0.959931 0.280237 0.000000
vn -0.765853 0.466861 -0.442165
vn -0.442165 0.466861 -0.765853
vn -0.690561 -0.071103 -0.719771
vn -0.994109 -0.108382 0.000000
vn 0.032168 0.004042 -0.999474
vn 0.725847 0.051179 -0.685949
vn -0.174298 0.937273 -0.301893
vn 0.353179 0.707855 0.611724
vn -0.690561 -0.071103 0.719771
vn -0.218084 0.899865 -0.377733
vn -0.377733 0.899865 -0.218084
vn 0.000000 1.000000 0.000000
vn -0.884331 0.466861 0.000000
vn 0.000000 0.466861 -0.884331
vn 0.000000 0.899865 -0.436169
vn -0.436168 0.899865 0.000000
vn 0.998218 0.059670 -0.000000
vn 0.032168 0.004043 0.999474
vn 0.725847 0.051179 0.685949
vn -0.662995 -0.171434 -0.728730
vn -0.967632 -0.252365 -0.000353
vn 0.029429 0.006683 -0.999545
vn -0.377733 0.899865 0.218084
vn 0.218084 0.899865 -0.377733
vn -0.635323 0.679573 -0.366804
vn -0.366804 0.679573 -0.635323
vn -0.001927 0.245964 0.969277
vn -0.483779 0.245264 0.840121
vn -0.498792 -0.001582 0.866720
vn 0.001430 -0.001575 0.999998
vn -0.664726 -0.172147 0.726983
vn 0.690072 0.170362 -0.703404
vn 0.493804 0.156936 -0.855294
vn 0.479966 0.280237 -0.831324
vn -0.855294 0.156936 0.493804
vn -0.831325 0.280237 0.479965
vn -0.218084 0.899865 0.377733
vn 0.377733 0.899865 -0.218084
vn -0.786618 -0.004844 0.617421
vn 0.786613 -0.004844 -0.617428
vn 0.771627 0.317984 -0.550889
vn 0.000000 0.679573 -0.733608
vn -0.733608 0.679573 -0.000000
vn 0.849949 -0.277198 -0.448049
vn 0.313327 -0.734706 -0.601692
vn 0.273659 -0.961572 -0.022149
vn 0.952061 -0.305286 -0.019511
vn -0.590503 -0.314300 -0.743318
vn -0.883028 -0.469308 -0.003517
vn 0.029413 0.006881 0.999544
vn 0.971128 0.238553 0.001564
vn 0.917503 -0.061342 -0.392971
vn 0.444657 -0.298595 -0.844465
vn 0.047854 0.030484 -0.998389
vn -0.376919 0.902582 -0.208033
vn 0.580286 0.705057 0.407631
vn 0.689333 0.170831 0.704015
vn 0.998264 -0.055678 0.019190
vn 0.999929 -0.011949 -0.000283
vn 0.996973 -0.077704 -0.002755
vn -0.594826 -0.318239 0.738177
vn -0.422510 -0.906147 -0.019569
vn -0.283240 -0.608858 -0.740990
vn -0.436265 -0.503836 -0.745535
vn -0.653776 -0.756583 -0.012640
vn -0.000000 0.899865 0.436169
vn 0.436168 0.899865 0.000000
vn 0.998214 -0.055993 -0.020831
vn 0.314198 -0.744059 0.589624
vn 0.048053 0.110425 -0.992722
vn 0.046043 0.065640 -0.996781
vn 0.998652 -0.049591 -0.015356
vn 0.501976 0.647033 -0.573907
vn 0.640309 0.352534 -0.682440
vn -0.765853 0.466861 0.442165
vn 0.442165 0.466861 -0.765853
vn 0.844509 -0.289229 0.450723
vn 0.904950 0.198319 -0.376476
vn -0.287198 -0.620693 0.729560
vn -0.442827 -0.511382 0.736473
vn 0.716116 0.697886 0.011491
vn 0.421021 0.906999 0.009755
vn 0.377733 0.899865 0.218084
vn 0.218084 0.899865 0.377733
vn 0.046887 0.030908 0.998422
vn 0.318517 0.720108 -0.616435
vn 0.474648 0.588318 -0.654669
vn 0.997048 -0.076762 0.001396
vn 0.447258 -0.296600 0.843794
vn 0.999662 -0.026011 -0.000226
vn 0.878713 0.477296 0.007257
vn 0.916811 -0.061693 0.394527
vn 0.348349 0.915535 -0.201120
vn -0.201119 0.915535 0.348349
vn 0.636816 0.348209 0.687907
vn 0.047193 0.065977 0.996705
vn 0.047388 0.109081 0.992903
vn 0.998732 -0.048278 0.014246
vn 0.503307 0.635159 0.585880
vn 0.402451 0.915356 0.012519
vn 0.626182 0.779575 0.012599
vn 0.905460 0.192845 0.378091
vn -0.635323 0.679573 0.366804
vn 0.366804 0.679573 -0.635323
vn 0.313494 0.710440 0.630077
vn 0.470534 0.579693 0.665247
vn 0.486307 0.245964 0.838455
vn 0.498761 -0.001576 0.866738
vn 0.786029 -0.007166 0.618148
vn 0.771490 0.316045 0.552195
vn -0.493804 0.156936 0.855294
vn -0.479966 0.280237 0.831324
vn 0.855294 0.156936 -0.493804
vn 0.831325 0.280237 -0.479965
vn -0.442165 0.466861 0.765853
vn 0.765853 0.466861 -0.442165
vn 0.635323 0.679573 -0.366804
vn -0.366804 0.679573 0.635323
vn 0.959931 0.280237 -0.000000
vn 0.987609 0.156936 0.000000
vn -0.000000 0.156936 0.987609
vn -0.000000 0.280237 0.959931
vn -0.953437 -0.300965 0.019441
vn -0.999947 -0.000002 0.010320
vn -0.000000 0.915535 0.402239
vn 0.402239 0.915535 -0.000000
vn 0.692341 0.721568 0.001585
vn 0.884331 0.466861 -0.000000
vn -0.000000 0.466861 0.884331
vn -0.000000 0.679573 0.733608
vn 0.733608 0.679573 0.000000
vn 0.855294 0.156936 0.493804
vn 0.831325 0.280237 0.479966
vn 0.493804 0.156936 0.855294
vn 0.479966 0.280237 0.831325
vn 0.765853 0.466861 0.442165
vn 0.442165 0.466861 0.765853
vn 0.366804 0.679573 0.635323
vn 0.635323 0.679573 0.366804
vn 0.201119 0.915535 0.348350
vn 0.348349 0.915535 0.201120
vn 0.999947 -0.000002 -0.010300
vn -0.279763 -0.959814 0.022115
vn -0.917305 -0.061374 -0.393428
vn -0.451617 -0.295864 -0.841728
vn -0.048053 0.110425 0.992722
vn -0.318517 0.720108 0.616435
vn -0.474648 0.588318 0.654669
vn -0.046043 0.065640 0.996781
vn -0.999929 -0.011948 0.000283
vn -0.402451 0.915356 -0.012519
vn -0.626182 0.779575 -0.012598
vn 0.283240 -0.608858 0.740990
vn 0.436265 -0.503835 0.745535
vn -0.997048 -0.076763 -0.001396
vn -0.846339 -0.286644 -0.448939
vn -0.319211 -0.742551 -0.588831
vn -0.313494 0.710440 -0.630077
vn -0.470535 0.579693 -0.665247
vn -0.998214 -0.055992 0.020831
vn 0.422510 -0.906147 0.019569
vn 0.653776 -0.756583 0.012640
vn -0.047388 0.109081 -0.992903
vn -0.047193 0.065977 -0.996705
vn 0.287198 -0.620693 -0.729560
vn 0.442827 -0.511382 -0.736473
vn -0.500000 0.000000 -0.866025
vn -0.047854 0.030484 0.998389
vn -0.640309 0.352534 0.682440
vn 0.590503 -0.314300 0.743318
vn -0.878713 0.477296 -0.007256
vn 0.883028 -0.469308 0.003517
vn -0.000332 -0.999999 0.001241
vn -0.000332 -0.999999 0.001241
vn -0.000332 -0.999999 0.001241
vn 0.001241 -0.999999 -0.000332
vn 0.001241 -0.999999 -0.000332
vn 0.001241 -0.999999 -0.000332
vn -0.787125 -0.004841 -0.616774
vn 0.594826 -0.318238 -0.738178
vn -0.636817 0.348209 -0.687907
vn -0.046887 0.030908 -0.998422
vn 0.662995 -0.171434 0.728731
vn -0.029429 0.006683 0.999545
vn -0.690072 0.170362 0.703404
vn 0.967632 -0.252365 0.000352
vn 0.664726 -0.172147 -0.726984
vn -0.971128 0.238553 -0.001564
vn -0.029413 0.006881 -0.999544
vn -0.689333 0.170831 -0.704015
vn 0.690561 -0.071103 0.719771
vn -0.032168 0.004042 0.999474
vn 0.994110 -0.108381 0.000000
vn -0.725848 0.051179 0.685949
vn 0.690561 -0.071102 -0.719771
vn 0.376609 0.902744 -0.207892
vn -0.580170 0.705229 0.407499
vn -0.174298 0.937273 0.301893
vn 0.353179 0.707855 -0.611724
vn -0.998218 0.059670 0.000000
vn -0.032168 0.004042 -0.999474
vn -0.725848 0.051179 -0.685949
vn 0.701163 0.018975 0.712748
vn -0.019532 0.000943 0.999809
vn 0.999752 0.022267 0.000000
vn 0.701163 0.018975 -0.712748
vn -0.679154 0.583442 0.445360
vn 0.406022 0.583594 -0.703252
vn -0.733562 -0.025806 0.679133
vn -0.019532 0.000943 -0.999809
vn -0.999414 -0.034236 0.000000
vn -0.733562 -0.025806 -0.679133
vn 0.665960 0.081870 0.741481
vn -0.078334 0.000146 0.996927
vn 0.993458 0.114196 0.000000
vn 0.665960 0.081870 -0.741481
vn -0.748199 -0.096880 0.656363
vn 0.000000 0.583594 -0.812046
vn 0.404677 0.587316 -0.700925
vn 0.000000 0.587314 -0.809359
vn 0.103993 0.689682 0.716606
vn -0.096723 0.988311 0.117841
vn -0.116604 0.993178 -0.000000
vn 0.246510 0.969140 0.000000
vn -0.700925 0.587317 0.404677
vn -0.809358 0.587315 0.000000
vn -0.810721 0.585433 -0.000000
vn -0.078334 0.000146 -0.996927
vn 0.927697 0.373333 0.000000
vn 0.361224 0.278796 0.889826
vn -0.358308 0.053133 0.932090
vn -0.001075 -0.999999 0.000620
vn -0.001075 -0.999999 0.000620
vn -0.001075 -0.999999 0.000620
vn -0.001075 -0.999999 0.000620
vn 0.000620 -0.999999 -0.001075
vn 0.000620 -0.999999 -0.001075
vn 0.000620 -0.999999 -0.001075
vn 0.000620 -0.999999 -0.001075
vn -0.989099 -0.147251 -0.000000
vn -0.164945 0.080537 0.983009
vn 0.361224 0.278796 -0.889826
vn -0.774189 0.564153 0.286991
vn -0.375503 -0.515369 0.770319
vn -0.804635 0.527122 0.273320
vn 0.103994 0.689682 -0.716606
vn -0.096723 0.988311 -0.117841
vn -0.748199 -0.096880 -0.656363
vn -0.812939 -0.160688 0.559740
vn -0.358308 0.053133 -0.932090
vn -0.164945 0.080537 -0.983009
vn -0.968917 -0.247388 -0.000000
vn -0.489415 -0.872051 0.000000
vn -0.864995 0.501781 -0.000000
vn -0.812939 -0.160688 -0.559740
vn -0.774189 0.564153 -0.286991
vn -0.804635 0.527122 -0.273320
vn -0.375503 -0.515369 -0.770319
vn -0.406022 0.583594 -0.703252
vn -0.404677 0.587317 -0.700925
vn -0.700925 0.587317 -0.404677
vn -0.679154 0.583442 -0.445360
vn 0.000000 0.937273 0.348597
vn 0.000000 0.707855 -0.706358
vn -0.396681 0.882029 0.254301
vn -0.396681 0.882029 -0.254301
vn 0.174298 0.937273 0.301893
vn -0.353179 0.707855 -0.611724
vn 0.376608 0.902744 0.207892
vn -0.580170 0.705229 -0.407498
vn -0.001241 -0.999999 -0.000332
vn -0.001241 -0.999999 -0.000332
vn -0.001241 -0.999999 -0.000332
vn -0.000332 -0.999999 -0.001241
vn -0.000332 -0.999999 -0.001241
vn -0.000332 -0.999999 -0.001241
vn -0.000908 -0.999999 -0.000908
vn -0.000908 -0.999999 -0.000908
vn -0.000908 -0.999999 -0.000908
vn 0.547712 0.836667 -0.000000
vn 0.137712 0.987286 -0.079380
vn 0.155212 0.950598 -0.268836
vn 0.000000 0.950598 -0.310424
vn -0.074226 0.988920 -0.128564
vn -0.113587 0.991368 -0.065475
vn -0.111513 0.993763 0.000000
vn -0.087843 0.994847 0.050635
vn -0.055760 0.993762 0.096579
vn 0.000000 0.991368 0.131110
vn 0.074226 0.988919 0.128564
vn 0.269075 0.950549 0.155100
vn 0.310792 0.950478 -0.000000
vn 0.107538 -0.976597 0.186261
vn -0.000000 -0.912734 0.408555
vn -0.204278 -0.912733 0.353820
vn -0.174085 -0.979588 0.100508
vn -0.177853 -0.984057 0.000000
vn -0.131931 -0.988288 -0.076687
vn -0.069000 -0.990471 -0.119188
vn 0.000177 -0.988540 -0.150959
vn 0.088505 -0.984046 -0.154338
vn 0.173489 -0.979729 -0.100164
vn 0.408556 -0.912733 0.000000
vn 0.353820 -0.912733 0.204278
vn -0.000000 -0.504677 0.863308
vn -0.431654 -0.504677 0.747647
vn -0.747647 -0.504677 0.431654
vn -0.863309 -0.504676 0.000000
vn -0.746520 -0.504675 -0.433603
vn -0.432403 -0.504291 -0.747474
vn 0.000735 -0.504291 -0.863533
vn 0.429703 -0.504675 -0.748771
vn 0.747647 -0.504677 -0.431654
vn 0.863309 -0.504676 0.000000
vn 0.747647 -0.504677 0.431655
vn 0.431654 -0.504677 0.747647
vn -0.183944 0.977183 -0.106200
vn -0.506167 0.811414 -0.292236
vn -0.292236 0.811415 -0.506167
vn -0.106200 0.977183 -0.183943
vn -0.212400 0.977183 -0.000000
vn -0.584472 0.811414 0.000000
vn 0.000000 0.811415 -0.584471
vn 0.000000 0.977183 -0.212400
vn 0.292236 0.811415 -0.506167
vn 0.106200 0.977183 -0.183944
vn -0.183944 0.977183 0.106200
vn -0.506167 0.811414 0.292235
vn 0.506167 0.811414 -0.292235
vn 0.183944 0.977183 -0.106200
vn -0.106200 0.977183 0.183943
vn -0.292236 0.811415 0.506166
vn 0.584472 0.811414 -0.000000
vn 0.212400 0.977183 0.000000
vn 0.000000 0.977183 0.212400
vn 0.000000 0.811415 0.584471
vn 0.106200 0.977183 0.183944
vn 0.292236 0.811415 0.506167
vn 0.506167 0.811414 0.292236
vn 0.183944 0.977183 0.106200
vn -0.318986 0.929694 -0.184168
vn -0.184166 0.929694 -0.318986
vn -0.368333 0.929694 0.000001
vn -0.000000 0.929694 -0.368332
vn -0.318986 0.929694 0.184167
vn 0.184167 0.929694 -0.318986
vn -0.184167 0.929694 0.318986
vn 0.318986 0.929694 -0.184167
vn 0.000000 0.929694 0.368332
vn 0.368333 0.929694 -0.000001
vn 0.318986 0.929694 0.184168
vn 0.184166 0.929694 0.318986
s 1
g Burbuja_0
usemtl lambert2SG
f 1/267/1 2/266/2 3/272/3 4/273/4
s 2
f 5/258/5 6/259/6 8/260/7 19/261/8
f 7/1/9 8/2/7 6/3/6 232/4/10
f 10/13/11 11/10/12 9/9/13 231/14/14
s 1
f 14/281/15 13/282/16 4/273/4 3/272/3
f 15/264/17 12/265/18 2/266/2 1/267/1
s 2
f 16/6/19 9/9/13 11/10/12 17/5/20
f 17/5/20 8/2/7 7/1/9 16/6/19
f 11/486/12 10/484/11 18/483/21 23/487/22
s 1
f 22/337/23 20/325/24 21/324/25 247/338/26
s 2
f 24/422/27 25/426/28 26/427/29 27/423/30
f 28/147/31 29/151/32 30/156/33 31/157/34
f 17/262/20 32/263/35 19/261/8 8/260/7
f 32/522/35 17/523/20 11/524/12 23/525/22
s 1
f 34/526/36 35/527/37 37/528/38 36/529/39
f 36/348/39 37/349/38 43/350/40 76/351/41
f 39/532/42 38/530/43 73/531/44
f 38/530/43 35/527/37 34/526/36 73/531/44
f 38/340/43 39/327/42 88/313/45 56/329/46
f 37/21/38 35/19/37 40/18/47 41/22/48
f 42/17/49 40/18/47 35/19/37 38/20/43
f 43/25/40 37/21/38 41/22/48 47/26/50
s 2
f 44/533/51 45/534/52 24/535/27 46/536/53
s 1
f 48/23/54 42/17/49 38/20/43 56/24/46
f 49/352/55 50/353/56 76/351/41 43/350/40
f 51/539/57 40/540/47 42/541/49 57/542/58
f 43/25/40 47/26/50 52/29/59 49/30/55
f 53/543/60 41/544/48 40/540/47 51/539/57
f 54/297/61 55/328/62 56/329/46 88/313/45
f 57/33/58 42/34/49 48/35/54 68/36/63
f 58/310/64 21/324/25 20/325/24 77/295/65
f 59/283/66 4/273/4 13/282/16 65/294/67
f 60/563/68 61/564/69 50/565/56 49/566/55
f 62/54/70 47/55/50 41/56/48 53/57/60
f 54/569/61 98/568/71 55/567/62
f 61/564/69 60/563/68 55/567/62 98/568/71
s off
f 64/354/72 21/355/73 58/356/74
f 65/358/75 13/359/76 64/354/77 58/356/78
s 1
f 49/30/55 52/29/59 66/32/79 60/31/68
f 48/23/54 56/24/46 55/27/62 67/28/80
f 52/58/59 47/55/50 62/54/70 72/59/81
f 60/31/68 66/32/79 67/28/80 55/27/62
f 48/35/54 67/37/80 71/38/82 68/36/63
f 66/570/79 52/571/59 72/572/81 74/573/83
f 67/576/80 66/570/79 74/573/83 71/577/82
f 78/545/84 51/539/57 57/542/58 79/546/85
f 79/39/85 57/33/58 68/36/63 93/40/86
s 8
f 70/83/87 69/75/88 80/78/89 81/84/90
s 1
f 82/547/91 53/543/60 51/539/57 78/545/84
s 2
f 85/420/92 46/419/53 24/422/27 27/423/30
f 29/151/32 86/145/93 87/155/94 30/156/33
s 1
f 68/36/63 71/38/82 89/41/95 93/40/86
f 90/60/96 62/54/70 53/57/60 82/61/91
f 73/341/44 92/330/97 91/314/98 39/327/42
f 91/314/98 33/298/99 88/313/45 39/327/42
f 72/59/81 62/54/70 90/60/96 95/62/100
f 71/577/82 74/573/83 94/575/101 89/580/95
f 74/573/83 72/572/81 95/574/100 94/575/101
s 8
f 84/594/102 70/595/87 81/596/90 96/597/103
f 69/75/88 83/76/104 97/77/105 80/78/89
f 81/84/90 80/78/89 99/82/106 100/90/107
s 1
f 104/42/108 79/39/85 93/40/86 109/43/109
f 105/548/110 78/545/84 79/546/85 104/549/108
f 106/550/111 82/547/91 78/545/84 105/548/110
f 75/274/112 15/264/17 1/267/1 107/275/113
f 93/40/86 89/41/95 108/44/114 109/43/109
s 8
f 110/367/115 111/368/116 112/369/117
f 80/78/89 97/77/105 113/81/118 99/82/106
f 96/597/103 81/596/90 100/598/107 114/599/119
f 115/373/120 110/367/115 112/369/117
f 111/368/116 116/372/121 112/369/117
s 1
f 117/63/122 90/60/96 82/61/91 106/64/111
f 107/275/113 1/267/1 4/273/4 59/283/66
f 89/580/95 94/575/101 118/579/123 108/583/114
f 95/62/100 90/60/96 117/63/122 122/65/124
f 121/45/125 104/42/108 109/43/109 131/46/126
f 94/575/101 95/574/100 122/578/124 118/579/123
f 123/551/127 105/548/110 104/549/108 121/552/125
s 8
f 116/372/121 124/375/128 112/369/117
f 125/376/129 115/373/120 112/369/117
f 100/90/107 99/82/106 126/89/130 127/95/131
s 2
f 129/603/132 128/604/133 101/605/134 130/606/135
s 1
f 109/43/109 108/44/114 132/47/136 131/46/126
f 133/553/137 106/550/111 105/548/110 123/551/127
s 8
f 120/600/138 84/594/102 96/597/103 134/601/139
f 83/76/104 119/79/140 135/80/141 97/77/105
f 124/375/128 136/380/142 112/369/117
f 137/381/143 125/376/129 112/369/117
s 2
f 102/139/144 101/149/134 128/150/133 86/145/93
f 103/160/145 44/170/51 46/171/53 138/166/146
s 8
f 114/377/119 100/378/107 127/370/131 139/374/147
f 99/82/106 113/81/118 140/88/148 126/89/130
s 2
f 141/396/149 142/397/150 153/398/151 214/399/152
s 1
f 143/48/153 121/45/125 131/46/126 155/49/154
f 108/583/114 118/579/123 144/582/155 132/586/136
f 145/66/156 117/63/122 106/64/111 133/67/137
s 2
f 146/400/157 147/401/158 142/397/150 141/396/149
s 1
f 148/554/159 123/551/127 121/552/125 143/555/153
f 63/284/160 75/274/112 107/275/113 149/285/161
f 122/65/124 117/63/122 145/66/156 154/68/162
s 2
f 142/98/150 150/99/163 151/100/164 153/101/151
f 152/102/165 150/99/163 142/98/150 147/103/158
s 1
f 118/579/123 122/578/124 154/581/162 144/582/155
f 131/46/126 132/47/136 156/50/166 155/49/154
f 151/406/167 150/407/168 157/408/169 166/409/170
s 8
f 136/380/142 158/386/171 112/369/117
f 159/387/172 137/381/143 112/369/117
s 2
f 153/101/151 151/100/164 160/104/173 167/105/174
s 1
f 150/560/168 152/561/175 161/558/176 157/557/169
s 2
f 162/106/177 152/102/165 147/103/158 170/107/178
s 1
f 163/556/179 133/553/137 123/551/127 148/554/159
s 8
f 97/77/105 135/80/141 164/87/180 113/81/118
f 134/601/139 96/597/103 114/599/119 165/602/181
s 1
f 157/51/169 143/48/153 155/49/154 166/52/170
s 2
f 167/402/174 168/403/182 214/399/152 153/398/151
f 169/609/183 170/610/178 147/611/158 146/612/157
s 1
f 160/410/184 151/406/167 166/409/170 173/411/185
s 8
f 127/370/131 126/371/130 111/368/116 110/367/115
s 1
f 143/555/153 157/557/169 161/558/176 148/554/159
s 2
f 170/412/178 169/413/183 224/414/186 181/415/187
s 1
f 65/294/67 58/310/64 77/295/65 59/283/66
f 149/285/161 107/275/113 59/283/66 77/295/65
s 8
f 171/390/188 159/387/172 112/369/117
f 158/386/171 172/389/189 112/369/117
s 1
f 173/53/185 166/52/170 155/49/154 156/50/166
f 132/586/136 144/582/155 174/585/190 156/589/166
f 152/561/175 162/562/191 175/559/192 161/558/176
s 2
f 167/105/174 160/104/173 176/108/193 179/109/194
f 177/110/195 162/106/177 170/107/178 181/111/187
s 1
f 178/69/196 145/66/156 133/67/137 163/70/179
s 8
f 172/389/189 171/390/188 112/369/117
s 1
f 148/554/159 161/558/176 175/559/192 163/556/179
s 2
f 179/404/194 180/405/197 168/403/182 167/402/174
s 8
f 139/374/147 127/370/131 110/367/115 115/373/120
f 126/89/130 140/88/148 116/93/121 111/94/116
s 2
f 138/418/146 46/419/53 85/420/92 182/421/198
f 86/473/93 128/472/133 183/466/199 87/459/94
s 1
f 154/68/162 145/66/156 178/69/196 184/71/200
f 144/582/155 154/581/162 184/584/200 174/585/190
f 185/588/201 176/591/202 160/593/184 173/592/185
s 2
f 179/109/194 176/108/193 186/112/203 188/113/204
s 1
f 162/476/191 177/477/205 187/478/206 175/479/192
f 185/588/201 173/592/185 156/589/166 174/585/190
s 2
f 188/613/204 189/614/207 180/615/197 179/616/194
f 189/416/207 188/417/204 181/415/187 224/414/186
f 177/110/195 181/111/187 188/113/204 186/112/203
s 8
f 113/81/118 164/87/180 192/92/208 140/88/148
f 165/382/181 114/377/119 139/374/147 193/379/209
s 1
f 187/478/206 177/477/205 186/480/210 194/481/211
f 163/70/179 175/72/192 187/73/206 178/69/196
f 194/587/211 186/590/210 176/591/202 185/588/201
s 2
f 197/174/212 190/175/213 191/162/214 198/168/215
s 1
f 194/587/211 185/588/201 174/585/190 184/584/200
f 194/74/211 184/71/200 178/69/196 187/73/206
s 8
f 119/79/140 195/85/216 199/86/217 135/80/141
f 196/116/218 120/120/138 134/121/139 200/117/219
f 140/88/148 192/92/208 124/97/128 116/93/121
f 193/379/209 139/374/147 115/373/120 125/376/129
f 135/80/141 199/86/217 202/91/220 164/87/180
f 200/117/219 134/121/139 165/127/181 203/122/221
f 203/122/221 165/127/181 193/132/209 204/128/222
f 164/87/180 202/91/220 205/96/223 192/92/208
f 192/384/208 205/385/223 136/380/142 124/375/128
f 137/381/143 204/383/222 193/379/209 125/376/129
f 210/114/224 207/115/225 196/116/218 200/117/219
f 195/617/216 206/618/226 211/619/227 199/620/217
s 2
f 213/137/228 212/138/229 102/139/144 18/140/21
f 18/140/21 102/139/144 23/143/22
f 23/143/22 102/139/144 86/145/93 32/146/35
f 86/145/93 29/151/32 19/152/8 32/146/35
f 128/472/133 129/465/132 208/457/230 183/466/199
f 209/176/231 215/172/232 138/166/146 182/177/198
s 8
f 210/114/224 200/117/219 203/122/221 216/123/233
f 199/620/217 211/619/227 217/623/234 202/624/220
s 1
f 73/341/44 34/347/36 92/330/97
f 22/337/23 92/330/97 34/347/36 36/339/39
f 76/326/41 20/325/24 22/337/23 36/339/39
s 8
f 202/391/220 217/392/234 218/388/235 205/385/223
f 216/123/233 203/122/221 204/128/222 219/129/236
f 205/385/223 218/388/235 158/386/171 136/380/142
f 219/129/236 204/128/222 137/133/143 159/134/172
f 220/118/237 207/115/225 210/114/224 222/119/238
f 206/618/226 221/621/239 223/622/240 211/619/227
s 1
f 63/284/160 149/285/161 98/296/71 54/297/61
f 88/313/45 33/298/99 63/284/160 54/297/61
s 8
f 222/119/238 210/114/224 216/123/233 227/124/241
f 211/619/227 223/622/240 228/625/242 217/623/234
s 2
f 130/606/135 190/607/213 197/608/212 129/603/132
s 8
f 218/388/235 229/393/243 172/389/189 158/386/171
f 230/130/244 219/129/236 159/134/172 171/135/188
f 221/125/239 220/118/237 222/119/238 223/126/240
f 217/392/234 228/394/242 229/393/243 218/388/235
f 227/124/241 216/123/233 219/129/236 230/130/244
f 229/393/243 230/395/244 171/390/188 172/389/189
f 223/126/240 222/119/238 227/124/241 228/131/242
f 228/131/242 227/124/241 230/130/244 229/136/243
s 2
f 129/465/132 197/455/212 225/447/245 208/457/230
f 198/168/215 215/172/232 209/176/231 226/178/246
f 197/455/212 198/456/215 226/440/246 225/447/245
s 1
f 98/296/71 149/285/161 61/311/69
f 61/311/69 149/285/161 77/295/65 50/312/56
f 77/295/65 20/325/24 76/326/41 50/312/56
s 2
f 214/158/152 201/159/247 103/160/145 141/161/149
f 141/161/149 103/160/145 146/164/157
f 146/164/157 103/160/145 138/166/146 169/167/183
f 138/166/146 215/172/232 224/173/186 169/167/183
f 191/162/214 201/159/247 214/158/152 168/163/182
f 168/163/182 180/165/197 191/162/214
f 198/168/215 191/162/214 180/165/197 189/169/207
f 224/173/186 215/172/232 198/168/215 189/169/207
f 213/482/228 18/483/21 10/484/11 238/485/248
f 6/626/6 5/627/5 239/628/249 237/629/250
s 1
f 9/630/251 16/631/252 233/632/253 236/633/254
s 2
f 10/13/11 231/14/14 234/16/255 238/15/248
s 1
f 16/492/252 7/493/256 235/494/257 233/495/253
f 231/636/258 9/630/251 236/633/254 242/637/259
s 2
f 232/4/10 6/3/6 237/7/250 240/8/260
f 25/426/28 28/433/31 31/434/34 26/427/29
f 237/490/250 239/491/249 244/489/261 243/488/262
s 1
f 235/494/257 7/493/256 232/496/263 245/497/264
s 2
f 238/15/248 234/16/255 241/12/265 243/11/262
s 1
f 234/498/266 231/499/258 242/500/259 246/501/267
s 2
f 243/488/262 244/489/261 213/482/228 238/485/248
f 240/8/260 237/7/250 243/11/262 241/12/265
s 1
f 245/654/264 232/655/263 240/656/268 248/657/269
f 241/502/270 234/498/266 246/501/267 250/503/271
f 248/657/269 240/656/268 241/658/270 250/659/271
s 2
f 24/535/27 45/534/52 249/537/272 25/538/28
s 1
f 251/634/273 236/633/254 233/632/253 253/635/274
f 252/638/275 242/637/259 236/633/254 251/634/273
f 253/201/274 233/204/253 235/205/257 256/202/276
f 254/180/277 246/185/267 242/186/259 252/181/275
s off
f 64/354/278 13/359/279 14/362/280
f 64/354/281 247/357/282 21/355/283
s 2
f 249/153/272 255/141/284 28/147/31 25/154/28
s 1
f 250/189/271 246/185/267 254/180/277 257/183/285
f 256/202/276 235/205/257 245/210/264 259/206/286
f 248/657/269 250/659/271 257/662/285 258/660/287
f 245/654/264 248/657/269 258/660/287 259/661/286
f 260/641/288 252/638/275 251/634/273 261/639/289
f 261/639/289 251/634/273 253/635/274 263/640/290
f 262/179/291 254/180/277 252/181/275 260/182/288
f 257/183/285 254/180/277 262/179/291 264/184/292
f 263/200/290 253/201/274 256/202/276 267/203/293
f 258/660/287 257/662/285 264/665/292 266/663/294
f 256/202/276 259/206/286 265/207/295 267/203/293
f 259/661/286 258/660/287 266/663/294 265/664/295
f 270/644/296 260/641/288 261/639/289 272/642/297
f 271/187/298 262/179/291 260/182/288 270/188/296
f 272/642/297 261/639/289 263/640/290 276/643/299
f 264/184/292 262/179/291 271/187/298 277/190/300
f 12/265/18 269/270/301 274/271/302 2/266/2
f 268/315/303 91/314/98 92/330/97 275/331/304
f 276/208/299 263/200/290 267/203/293 280/209/305
f 266/663/294 264/665/292 277/668/300 278/666/306
f 265/664/295 266/663/294 278/666/306 279/667/307
f 267/203/293 265/207/295 279/211/307 280/209/305
s 2
f 255/141/284 212/138/229 213/137/228 244/142/261
f 244/142/261 239/144/249 255/141/284
f 28/147/31 255/141/284 239/144/249 5/148/5
f 19/152/8 29/151/32 28/147/31 5/148/5
s 1
f 281/647/308 270/644/296 272/642/297 286/645/309
f 282/191/310 271/187/298 270/188/296 281/192/308
f 277/190/300 271/187/298 282/191/310 287/193/311
f 2/266/2 274/271/302 284/280/312 3/272/3
f 275/331/304 92/330/97 22/337/23 285/342/313
f 286/645/309 272/642/297 276/643/299 288/646/314
f 278/666/306 277/668/300 287/671/311 289/669/315
f 288/212/314 276/208/299 280/209/305 293/213/316
f 279/667/307 278/666/306 289/669/315 292/670/317
f 290/650/318 281/647/308 286/645/309 294/648/319
f 291/194/320 282/191/310 281/192/308 290/195/318
f 280/209/305 279/211/307 292/214/317 293/213/316
f 287/193/311 282/191/310 291/194/320 301/196/321
f 294/648/319 286/645/309 288/646/314 306/649/322
f 296/344/323 285/342/313 295/346/324 323/345/325
f 297/305/326 298/279/327 336/291/328 305/306/329
f 299/293/330 14/281/15 3/272/3 284/280/312
f 247/338/26 295/346/324 285/342/313 22/337/23
f 300/309/331 299/293/330 284/280/312 322/308/332
f 289/669/315 287/671/311 301/674/321 312/672/333
f 303/197/334 291/194/320 290/195/318 304/198/335
f 304/653/335 290/650/318 294/648/319 309/651/336
f 297/232/326 305/233/329 303/234/334 304/235/335
s off
f 64/354/337 14/362/338 299/364/339 300/365/340
f 295/360/341 247/357/342 64/354/343 323/361/344
s 1
f 306/215/322 288/212/314 293/213/316 316/216/345
f 307/224/346 297/228/326 304/229/335 309/225/336
f 301/196/321 291/194/320 303/197/334 313/199/347
f 308/678/348 307/679/346 317/680/349 321/681/350
f 303/234/334 305/233/329 310/236/351 313/237/347
f 311/304/352 310/320/351 305/306/329 336/291/328
f 292/670/317 289/669/315 312/672/333 314/673/353
f 309/651/336 294/648/319 306/649/322 318/652/354
f 293/213/316 292/214/317 314/217/353 316/216/345
f 317/222/349 307/224/346 309/225/336 318/218/354
f 312/672/333 301/674/321 313/677/347 320/675/355
f 313/230/347 310/231/351 319/227/356 320/226/355
f 318/218/354 306/215/322 316/216/345 325/219/357
f 321/504/350 317/505/349 326/506/358 339/507/359
f 314/673/353 312/672/333 320/675/355 327/676/360
f 319/685/356 324/686/361 329/687/362 328/688/363
f 326/221/358 317/222/349 318/218/354 325/219/357
f 316/216/345 314/217/353 327/220/360 325/219/357
f 320/226/355 319/227/356 328/223/363 327/220/360
f 326/221/358 325/219/357 327/220/360 328/223/363
f 328/508/363 329/509/362 339/507/359 326/506/358
f 330/336/364 296/344/323 323/345/325 334/335/365
f 331/323/366 300/309/331 322/308/332 333/321/367
f 283/332/368 268/315/303 275/331/304 332/343/369
f 332/343/369 275/331/304 285/342/313 296/344/323
f 298/684/327 297/682/326 335/683/370
f 297/682/326 307/679/346 308/678/348 335/683/370
f 311/691/352 337/690/371 310/689/351
f 324/686/361 319/685/356 310/689/351 337/690/371
f 315/317/372 283/332/368 332/343/369 338/333/373
f 302/303/374 315/317/372 338/333/373 340/318/375
f 338/333/373 332/343/369 296/344/323 330/336/364
s off
f 64/354/376 300/365/377 331/366/378
f 64/354/379 334/363/380 323/361/381
s 1
f 340/318/375 338/333/373 330/336/364 333/321/367
s off
f 64/354/382 331/366/383 334/363/384
s 1
f 334/335/365 331/323/366 333/321/367 330/336/364
f 335/278/370 274/271/302 269/270/301 298/279/327
f 269/270/301 273/288/385 336/291/328 298/279/327
f 302/303/374 340/318/375 337/319/371 311/304/352
f 336/291/328 273/288/385 302/303/374 311/304/352
f 335/278/370 308/290/348 274/271/302
f 284/280/312 274/271/302 308/290/348 321/292/350
f 339/307/359 322/308/332 284/280/312 321/292/350
f 337/319/371 340/318/375 324/334/361
f 324/334/361 340/318/375 333/321/367 329/322/362
f 333/321/367 322/308/332 339/307/359 329/322/362
f 352/277/386 342/269/387 341/268/388 343/276/389
f 352/277/386 343/276/389 344/286/390 345/287/391
f 352/277/386 345/287/391 346/299/392 347/300/393
f 352/277/386 347/300/393 348/316/394 349/301/395
f 352/277/386 349/301/395 350/302/396 351/289/397
s 16
f 364/510/398 354/511/399 353/512/400 355/513/401
f 364/510/398 355/513/401 356/514/402 357/515/403
f 364/510/398 357/515/403 358/516/404 359/517/405
f 364/510/398 359/517/405 360/518/406 361/519/407
f 364/510/398 361/519/407 362/520/408 363/521/409
s 1
f 12/265/18 15/264/17 341/268/388 342/269/387
f 15/264/17 75/274/112 343/276/389 341/268/388
f 75/274/112 63/284/160 344/286/390 343/276/389
f 63/284/160 33/298/99 345/287/391 344/286/390
f 33/298/99 91/314/98 346/299/392 345/287/391
f 91/314/98 268/315/303 347/300/393 346/299/392
f 268/315/303 283/332/368 348/316/394 347/300/393
f 283/332/368 315/317/372 349/301/395 348/316/394
f 315/317/372 302/303/374 350/302/396 349/301/395
f 302/303/374 273/288/385 351/289/397 350/302/396
f 273/288/385 269/270/301 352/277/386 351/289/397
f 269/270/301 12/265/18 342/269/387 352/277/386
s 16
f 45/692/410 44/693/411 353/694/400 354/695/399
f 44/244/411 103/238/412 355/241/401 353/245/400
f 103/238/412 201/239/413 356/240/402 355/241/401
f 201/239/413 191/242/414 357/243/403 356/240/402
f 191/242/414 190/246/415 358/247/404 357/243/403
f 190/698/415 130/699/416 359/700/405 358/701/404
f 130/699/416 101/702/417 360/703/406 359/700/405
f 101/254/417 102/248/418 361/251/407 360/255/406
f 102/248/418 212/249/419 362/250/408 361/251/407
f 212/249/419 255/252/420 363/253/409 362/250/408
f 255/252/420 249/256/421 364/257/398 363/253/409
f 249/696/421 45/692/410 354/695/399 364/697/398
s 2
f 365/442/422 366/451/423 368/443/424 367/435/425
f 366/451/423 365/442/422 372/450/426 371/461/427
f 367/435/425 368/443/424 370/436/428 369/428/429
f 369/428/429 370/436/428 374/429/430 373/424/431
f 371/461/427 372/450/426 376/460/432 375/468/433
f 373/424/431 374/429/430 378/430/434 377/425/435
f 375/468/433 376/460/432 380/467/436 379/471/437
f 377/425/435 378/430/434 384/439/438 383/432/439
f 379/471/437 380/467/436 382/458/440 381/464/441
f 381/464/441 382/458/440 388/448/442 387/454/443
f 383/432/439 384/439/438 385/446/444 386/441/445
f 386/441/445 385/446/444 387/454/443 388/448/442
f 26/427/29 31/434/34 365/442/422 367/435/425
f 27/423/30 26/427/29 367/435/425 369/428/429
f 31/434/34 30/449/33 372/450/426 365/442/422
f 368/443/424 366/451/423 69/462/446 70/452/447
f 366/451/423 371/461/427 83/469/448 69/462/446
f 370/436/428 368/443/424 70/452/447 84/444/449
f 85/420/92 27/423/30 369/428/429 373/424/431
f 30/449/33 87/459/94 376/460/432 372/450/426
f 371/461/427 375/468/433 119/474/450 83/469/448
f 374/429/430 370/436/428 84/444/449 120/437/451
f 182/421/198 85/420/92 373/424/431 377/425/435
f 87/459/94 183/466/199 380/467/436 376/460/432
f 375/468/433 379/471/437 195/475/452 119/474/450
f 378/430/434 374/429/430 120/437/451 196/438/453
f 379/471/437 381/464/441 206/470/454 195/475/452
f 384/439/438 378/430/434 196/438/453 207/445/455
f 183/466/199 208/457/230 382/458/440 380/467/436
f 209/431/231 182/421/198 377/425/435 383/432/439
f 385/446/444 384/439/438 207/445/455 220/453/456
f 381/464/441 387/454/443 221/463/457 206/470/454
f 387/454/443 385/446/444 220/453/456 221/463/457
f 208/457/230 225/447/245 388/448/442 382/458/440
f 226/440/246 209/431/231 383/432/439 386/441/445
f 225/447/245 226/440/246 386/441/445 388/448/442
