# This file uses centimeters as units for non-parametric coordinates.

mtllib lamp.mtl
g kk:default1
v -0.127167 -0.675009 -1.231861
v -0.127167 -0.686572 -1.054872
v -0.081360 -0.686572 -1.060903
v -0.038666 -0.686572 -1.078588
v -0.002014 -0.686572 -1.106715
v 0.026123 -0.686572 -1.143365
v 0.043793 -0.686572 -1.186052
v 0.049835 -0.686572 -1.231861
v 0.043793 -0.686572 -1.277670
v 0.026123 -0.686572 -1.320355
v -0.002014 -0.686572 -1.357007
v -0.038666 -0.686572 -1.385141
v -0.081360 -0.686572 -1.402819
v -0.127167 -0.686572 -1.408851
v -0.172974 -0.686572 -1.402819
v -0.215668 -0.686572 -1.385141
v -0.252319 -0.686572 -1.357007
v -0.280426 -0.686572 -1.320355
v -0.298126 -0.686572 -1.277670
v -0.304138 -0.686572 -1.231861
v -0.298126 -0.686572 -1.186052
v -0.280426 -0.686572 -1.143365
v -0.252319 -0.686572 -1.106715
v -0.215668 -0.686572 -1.078588
v -0.172974 -0.686572 -1.060903
v -0.127167 -0.714786 -0.889948
v -0.038666 -0.714786 -0.901598
v 0.043793 -0.714786 -0.935757
v 0.114624 -0.714786 -0.990091
v 0.168945 -0.714786 -1.060903
v 0.203094 -0.714786 -1.143365
v 0.214752 -0.714786 -1.231861
v 0.203094 -0.714786 -1.320355
v 0.168945 -0.714786 -1.402819
v 0.114624 -0.714786 -1.473634
v 0.043793 -0.714786 -1.527965
v -0.038666 -0.714786 -1.562127
v -0.127167 -0.714786 -1.573774
v -0.215668 -0.714786 -1.562127
v -0.298126 -0.714786 -1.527965
v -0.368927 -0.714786 -1.473634
v -0.423279 -0.714786 -1.402819
v -0.457428 -0.714786 -1.320355
v -0.469055 -0.714786 -1.231861
v -0.457428 -0.714786 -1.143365
v -0.423279 -0.714786 -1.060903
v -0.368927 -0.714786 -0.990091
v -0.298126 -0.714786 -0.935757
v -0.215668 -0.714786 -0.901598
v -0.127167 -0.816714 -0.748325
v -0.002014 -0.816714 -0.764799
v 0.114624 -0.816714 -0.813105
v 0.214752 -0.816714 -0.889948
v 0.291595 -0.816714 -0.990091
v 0.339874 -0.816714 -1.106715
v 0.356354 -0.816714 -1.231861
v 0.339874 -0.816714 -1.357007
v 0.291595 -0.816714 -1.473634
v 0.214752 -0.816714 -1.573774
v 0.114624 -0.816714 -1.650617
v -0.002014 -0.816714 -1.698923
v -0.127167 -0.816714 -1.715401
v -0.252319 -0.816714 -1.698923
v -0.368927 -0.816714 -1.650624
v -0.469055 -0.816714 -1.573774
v -0.545929 -0.816714 -1.473634
v -0.594208 -0.816714 -1.357007
v -0.610718 -0.816714 -1.231861
v -0.594208 -0.816714 -1.106715
v -0.545929 -0.816714 -0.990091
v -0.469055 -0.816714 -0.889948
v -0.368927 -0.816714 -0.813105
v -0.252319 -0.816714 -0.764799
v -0.127167 -0.958345 -0.639653
v 0.026123 -0.958345 -0.659832
v 0.168945 -0.958345 -0.718990
v 0.291595 -0.958345 -0.813105
v 0.385712 -0.958345 -0.935757
v 0.444855 -0.958345 -1.078588
v 0.465057 -0.958345 -1.231861
v 0.444855 -0.958345 -1.385141
v 0.385712 -0.958345 -1.527965
v 0.291595 -0.958345 -1.650617
v 0.168945 -0.958345 -1.744733
v 0.026123 -0.958345 -1.803897
v -0.127167 -0.958345 -1.824076
v -0.280426 -0.958345 -1.803897
v -0.423279 -0.958345 -1.744733
v -0.545929 -0.958345 -1.650624
v -0.640045 -0.958345 -1.527965
v -0.699188 -0.958345 -1.385141
v -0.719360 -0.958345 -1.231861
v -0.699188 -0.958345 -1.078588
v -0.640045 -0.958345 -0.935757
v -0.545929 -0.958345 -0.813105
v -0.423279 -0.958345 -0.718990
v -0.280426 -0.958345 -0.659832
v -0.127167 -1.024102 -0.383057
v 0.092529 -1.024102 -0.411986
v 0.297241 -1.024102 -0.496778
v 0.473022 -1.024102 -0.631672
v 0.607910 -1.024102 -0.807464
v 0.692719 -1.024102 -1.012175
v 0.721649 -1.024102 -1.231861
v 0.692719 -1.024102 -1.451548
v 0.607910 -1.024102 -1.656265
v 0.473022 -1.024102 -1.832057
v 0.297241 -1.024102 -1.966942
v 0.092529 -1.024102 -2.051744
v -0.127167 -1.024102 -2.080662
v -0.346832 -1.024102 -2.051744
v -0.551544 -1.024102 -1.966942
v -0.727356 -1.024102 -1.832057
v -0.862244 -1.024102 -1.656265
v -0.947021 -1.024102 -1.451548
v -0.975983 -1.024102 -1.231861
v -0.947021 -1.024102 -1.012181
v -0.862244 -1.024102 -0.807464
v -0.727356 -1.024102 -0.631672
v -0.551575 -1.024102 -0.496778
v -0.346832 -1.024102 -0.411986
v -0.127167 -1.201089 -0.353128
v 0.100281 -1.201089 -0.383074
v 0.312195 -1.201089 -0.470863
v 0.494202 -1.201089 -0.610508
v 0.633820 -1.201089 -0.792494
v 0.721619 -1.201089 -1.004433
v 0.751556 -1.201089 -1.231861
v 0.721619 -1.201089 -1.459295
v 0.633820 -1.201089 -1.671228
v 0.494202 -1.201089 -1.853222
v 0.312195 -1.201089 -1.992863
v 0.100281 -1.201089 -2.080649
v -0.127167 -1.201089 -2.110592
v -0.354584 -1.201089 -2.080649
v -0.566528 -1.201089 -1.992863
v -0.748535 -1.201089 -1.853222
v -0.888184 -1.201089 -1.671228
v -0.975952 -1.201089 -1.459295
v -1.005890 -1.201089 -1.231861
v -0.975952 -1.201089 -1.004433
v -0.888184 -1.201089 -0.792494
v -0.748535 -1.201089 -0.610508
v -0.566528 -1.201089 -0.470863
v -0.354584 -1.201089 -0.383074
v -0.127167 -0.747936 -1.072569
v -0.127167 -0.737531 -1.231861
v -0.085938 -0.747936 -1.077999
v -0.047516 -0.747936 -1.093913
v -0.014557 -0.747936 -1.119226
v 0.010773 -0.747936 -1.152217
v 0.026672 -0.747936 -1.190634
v 0.032135 -0.747936 -1.231861
v 0.026672 -0.747936 -1.273089
v 0.010773 -0.747936 -1.311506
v -0.014557 -0.747936 -1.344493
v -0.047516 -0.747936 -1.369810
v -0.085938 -0.747936 -1.385724
v -0.127167 -0.747936 -1.391150
v -0.168396 -0.747936 -1.385724
v -0.206818 -0.747936 -1.369810
v -0.239777 -0.747936 -1.344493
v -0.265106 -0.747936 -1.311506
v -0.281006 -0.747936 -1.273089
v -0.286438 -0.747936 -1.231861
v -0.281006 -0.747936 -1.190634
v -0.265106 -0.747936 -1.152217
v -0.239777 -0.747936 -1.119226
v -0.206818 -0.747936 -1.093913
v -0.168396 -0.747936 -1.077999
v -0.127167 -0.773327 -0.924139
v -0.047516 -0.773327 -0.934627
v 0.026672 -0.773327 -0.965367
v 0.090424 -0.773327 -1.014268
v 0.139343 -0.773327 -1.077999
v 0.170074 -0.773327 -1.152217
v 0.180573 -0.773327 -1.231861
v 0.170074 -0.773327 -1.311506
v 0.139343 -0.773327 -1.385724
v 0.090424 -0.773327 -1.449454
v 0.026672 -0.773327 -1.498356
v -0.047516 -0.773327 -1.529098
v -0.127167 -0.773327 -1.539583
v -0.206818 -0.773327 -1.529098
v -0.281006 -0.773327 -1.498356
v -0.344757 -0.773327 -1.449454
v -0.393646 -0.773327 -1.385724
v -0.424408 -0.773327 -1.311506
v -0.434906 -0.773327 -1.231861
v -0.424408 -0.773327 -1.152217
v -0.393646 -0.773327 -1.077999
v -0.344757 -0.773327 -1.014268
v -0.281006 -0.773327 -0.965367
v -0.206818 -0.773327 -0.934627
v -0.127167 -0.865072 -0.796678
v -0.014557 -0.865072 -0.811504
v 0.090424 -0.865072 -0.854983
v 0.180573 -0.865072 -0.924139
v 0.249725 -0.865072 -1.014268
v 0.293213 -0.865072 -1.119226
v 0.308044 -0.865072 -1.231861
v 0.293213 -0.865072 -1.344493
v 0.249725 -0.865072 -1.449454
v 0.180573 -0.865072 -1.539583
v 0.090424 -0.865072 -1.608746
v -0.014557 -0.865072 -1.652215
v -0.127167 -0.865072 -1.667050
v -0.239777 -0.865072 -1.652215
v -0.344757 -0.865072 -1.608746
v -0.434906 -0.865072 -1.539583
v -0.504028 -0.865072 -1.449454
v -0.547516 -0.865072 -1.344493
v -0.562347 -0.865072 -1.231861
v -0.547516 -0.865072 -1.119226
v -0.504028 -0.865072 -1.014268
v -0.434906 -0.865072 -0.924139
v -0.344757 -0.865072 -0.854983
v -0.239777 -0.865072 -0.811504
v -0.127167 -0.992534 -0.698873
v 0.010773 -0.992534 -0.717035
v 0.139343 -0.992534 -0.770276
v 0.249725 -0.992534 -0.854983
v 0.334442 -0.992534 -0.965367
v 0.387695 -0.992534 -1.093913
v 0.405823 -0.992534 -1.231861
v 0.387695 -0.992534 -1.369810
v 0.334442 -0.992534 -1.498356
v 0.249725 -0.992534 -1.608746
v 0.139343 -0.992534 -1.693446
v 0.010773 -0.992534 -1.746695
v -0.127167 -0.992534 -1.764856
v -0.265106 -0.992534 -1.746695
v -0.393646 -0.992534 -1.693446
v -0.504028 -0.992534 -1.608746
v -0.588745 -0.992534 -1.498356
v -0.641998 -0.992534 -1.369810
v -0.660156 -0.992534 -1.231861
v -0.641998 -0.992534 -1.093913
v -0.588745 -0.992534 -0.965367
v -0.504028 -0.992534 -0.854983
v -0.393646 -0.992534 -0.770276
v -0.265106 -0.992534 -0.717035
v -0.127167 -1.041800 -0.467942
v 0.070557 -1.041800 -0.493970
v 0.254791 -1.041800 -0.570292
v 0.412994 -1.041800 -0.691692
v 0.534424 -1.041800 -0.849902
v 0.610718 -1.041800 -1.034146
v 0.636749 -1.041800 -1.231861
v 0.610718 -1.041800 -1.429577
v 0.534424 -1.041800 -1.613817
v 0.412994 -1.041800 -1.772037
v 0.254791 -1.041800 -1.893437
v 0.070557 -1.041800 -1.969753
v -0.127167 -1.041800 -1.995776
v -0.324890 -1.041800 -1.969753
v -0.509125 -1.041800 -1.893437
v -0.667358 -1.041800 -1.772037
v -0.788727 -1.041800 -1.613817
v -0.865051 -1.041800 -1.429577
v -0.891083 -1.041800 -1.231861
v -0.865051 -1.041800 -1.034146
v -0.788727 -1.041800 -0.849902
v -0.667358 -1.041800 -0.691692
v -0.509125 -1.041800 -0.570292
v -0.324890 -1.041800 -0.493970
v -0.127167 -1.201089 -0.440664
v 0.077606 -1.201089 -0.467623
v 0.268433 -1.201089 -0.546665
v 0.432281 -1.201089 -0.672400
v 0.558044 -1.201089 -0.836267
v 0.637085 -1.201089 -1.027087
v 0.664032 -1.201089 -1.231861
v 0.637085 -1.201089 -1.436639
v 0.558044 -1.201089 -1.627462
v 0.432281 -1.201089 -1.791329
v 0.268433 -1.201089 -1.917063
v 0.077606 -1.201089 -1.996100
v -0.127167 -1.201089 -2.023062
v -0.331940 -1.201089 -1.996100
v -0.522766 -1.201089 -1.917063
v -0.686615 -1.201089 -1.791329
v -0.812347 -1.201089 -1.627462
v -0.891388 -1.201089 -1.436639
v -0.918365 -1.201089 -1.231861
v -0.891388 -1.201089 -1.027087
v -0.812347 -1.201089 -0.836261
v -0.686646 -1.201089 -0.672400
v -0.522766 -1.201089 -0.546665
v -0.331940 -1.201089 -0.467623
v -0.058777 -0.045506 -1.573774
v -0.058777 -0.045506 1.845365
v -0.195526 -0.045506 1.845365
v -0.195526 -0.045506 -1.573774
v -0.058777 0.022879 -1.573774
v -0.195526 0.022879 -1.573774
v -0.195526 0.022879 1.845365
v -0.058777 0.022879 1.845365
v -0.075989 -0.018274 0.786930
v -0.075989 -0.843307 1.845365
v -0.178375 -0.843307 1.845365
v -0.178375 -0.018274 0.786930
v -0.075989 0.000175 0.866123
v -0.178375 0.000175 0.866123
v -0.178375 -0.764572 1.845365
v -0.075989 -0.764572 1.845365
v -0.075989 -0.039481 -1.191597
v -0.075989 0.536377 1.845365
v -0.178375 0.536377 1.845365
v -0.178375 -0.039481 -1.191597
v -0.075989 0.013064 -1.281063
v -0.178375 0.013064 -1.281063
v -0.178375 0.606792 1.845365
v -0.075989 0.606792 1.845365
v -0.169739 -0.729332 -1.231861
v -0.148438 -0.729332 -1.194988
v -0.148438 -0.045506 -1.194988
v -0.169739 -0.045506 -1.231861
v -0.105865 -0.729332 -1.194988
v -0.105865 -0.045506 -1.194988
v -0.084595 -0.729332 -1.231861
v -0.084595 -0.045506 -1.231861
v -0.105865 -0.729332 -1.268732
v -0.105865 -0.045506 -1.268732
v -0.148438 -0.729332 -1.268732
v -0.148438 -0.045506 -1.268732
vt 0.808409 0.471125
vt 0.808409 0.439528
vt 0.816587 0.440604
vt 0.824207 0.443761
vt 0.830751 0.448783
vt 0.835773 0.455326
vt 0.838929 0.462947
vt 0.840006 0.471125
vt 0.838929 0.479303
vt 0.835773 0.486924
vt 0.830751 0.493468
vt 0.824207 0.498490
vt 0.816587 0.501646
vt 0.808409 0.502723
vt 0.800231 0.501646
vt 0.792611 0.498490
vt 0.786065 0.493468
vt 0.781045 0.486924
vt 0.777887 0.479303
vt 0.776811 0.471125
vt 0.777887 0.462947
vt 0.781045 0.455326
vt 0.786065 0.448783
vt 0.792611 0.443761
vt 0.800231 0.440604
vt 0.808409 0.410084
vt 0.824207 0.412164
vt 0.838929 0.418262
vt 0.851571 0.427963
vt 0.861273 0.440604
vt 0.867369 0.455326
vt 0.869451 0.471125
vt 0.867369 0.486924
vt 0.861273 0.501646
vt 0.851571 0.514289
vt 0.838929 0.523988
vt 0.824207 0.530088
vt 0.808409 0.532167
vt 0.792611 0.530088
vt 0.777887 0.523988
vt 0.765245 0.514289
vt 0.755545 0.501646
vt 0.749447 0.486924
vt 0.747368 0.471125
vt 0.749447 0.455326
vt 0.755545 0.440604
vt 0.765245 0.427963
vt 0.777887 0.418262
vt 0.792611 0.412164
vt 0.808409 0.384800
vt 0.830751 0.387741
vt 0.851571 0.396365
vt 0.869451 0.410084
vt 0.883168 0.427963
vt 0.891790 0.448783
vt 0.894733 0.471125
vt 0.891790 0.493468
vt 0.883168 0.514289
vt 0.869451 0.532167
vt 0.851571 0.545885
vt 0.830751 0.554509
vt 0.808409 0.557451
vt 0.786065 0.554509
vt 0.765245 0.545886
vt 0.747368 0.532167
vt 0.733646 0.514289
vt 0.725024 0.493468
vt 0.722083 0.471125
vt 0.725024 0.448783
vt 0.733646 0.427963
vt 0.747368 0.410084
vt 0.765245 0.396365
vt 0.786065 0.387741
vt 0.808409 0.365399
vt 0.835773 0.369001
vt 0.861273 0.379563
vt 0.883168 0.396365
vt 0.899970 0.418262
vt 0.910534 0.443761
vt 0.914136 0.471125
vt 0.910534 0.498490
vt 0.899970 0.523988
vt 0.883168 0.545885
vt 0.861273 0.562687
vt 0.835773 0.573250
vt 0.808409 0.576853
vt 0.781045 0.573250
vt 0.755545 0.562687
vt 0.733646 0.545886
vt 0.716846 0.523988
vt 0.706285 0.498490
vt 0.702682 0.471125
vt 0.706285 0.443761
vt 0.716846 0.418262
vt 0.733646 0.396365
vt 0.755545 0.379563
vt 0.781045 0.369001
vt 0.808409 0.319589
vt 0.847628 0.324754
vt 0.884176 0.339892
vt 0.915560 0.363974
vt 0.939643 0.395358
vt 0.954781 0.431905
vt 0.959944 0.471125
vt 0.954781 0.510345
vt 0.939643 0.546893
vt 0.915560 0.578277
vt 0.884176 0.602358
vt 0.847628 0.617498
vt 0.808409 0.622661
vt 0.769190 0.617498
vt 0.732642 0.602358
vt 0.701256 0.578277
vt 0.677176 0.546893
vt 0.662037 0.510345
vt 0.656873 0.471125
vt 0.662037 0.431906
vt 0.677176 0.395358
vt 0.701256 0.363974
vt 0.732640 0.339892
vt 0.769188 0.324754
vt 0.215539 0.887485
vt 0.183943 0.887485
vt 0.183943 0.846880
vt 0.215539 0.848266
vt 0.183943 0.809047
vt 0.215539 0.811718
vt 0.372309 0.831083
vt 0.340711 0.835710
vt 0.340711 0.810780
vt 0.372309 0.807001
vt 0.340711 0.778289
vt 0.372309 0.775617
vt 0.340711 0.740453
vt 0.372309 0.739070
vt 0.340711 0.699850
vt 0.372309 0.699850
vt 0.340711 0.659246
vt 0.372309 0.660630
vt 0.340711 0.621410
vt 0.372309 0.624082
vt 0.340711 0.588919
vt 0.372309 0.592698
vt 0.340711 0.563989
vt 0.372309 0.568617
vt 0.223308 0.815154
vt 0.254905 0.812483
vt 0.254905 0.850319
vt 0.223308 0.851702
vt 0.254905 0.890921
vt 0.223308 0.890921
vt 0.254905 0.931525
vt 0.223308 0.930140
vt 0.254905 0.969361
vt 0.223308 0.966688
vt 0.334810 0.831082
vt 0.303212 0.835710
vt 0.303212 0.810780
vt 0.334810 0.807001
vt 0.303212 0.778288
vt 0.334810 0.775617
vt 0.303212 0.740453
vt 0.334810 0.739069
vt 0.303212 0.699849
vt 0.334810 0.699849
vt 0.303212 0.659246
vt 0.334810 0.660629
vt 0.303212 0.621409
vt 0.334810 0.624082
vt 0.303212 0.588919
vt 0.334810 0.592698
vt 0.303212 0.563989
vt 0.334810 0.568615
vt 0.215539 0.963254
vt 0.183943 0.965925
vt 0.183943 0.928089
vt 0.215539 0.926706
vt 0.543029 0.684398
vt 0.514591 0.684398
vt 0.542059 0.677037
vt 0.539220 0.670181
vt 0.534700 0.664291
vt 0.528810 0.659771
vt 0.521951 0.656930
vt 0.514591 0.655962
vt 0.507232 0.656930
vt 0.500371 0.659771
vt 0.494483 0.664291
vt 0.489963 0.670181
vt 0.487122 0.677037
vt 0.486154 0.684398
vt 0.487122 0.691759
vt 0.489963 0.698617
vt 0.494483 0.704508
vt 0.500371 0.709025
vt 0.507232 0.711868
vt 0.514591 0.712837
vt 0.521951 0.711868
vt 0.528810 0.709025
vt 0.534700 0.704508
vt 0.539220 0.698617
vt 0.542059 0.691759
vt 0.569529 0.684398
vt 0.567656 0.670181
vt 0.562168 0.656930
vt 0.553437 0.645551
vt 0.542059 0.636822
vt 0.528810 0.631334
vt 0.514591 0.629462
vt 0.500371 0.631334
vt 0.487122 0.636822
vt 0.475744 0.645551
vt 0.467015 0.656930
vt 0.461525 0.670181
vt 0.459654 0.684398
vt 0.461525 0.698617
vt 0.467015 0.711868
vt 0.475744 0.723247
vt 0.487122 0.731976
vt 0.500371 0.737466
vt 0.514591 0.739336
vt 0.528810 0.737466
vt 0.542059 0.731976
vt 0.553437 0.723247
vt 0.562168 0.711868
vt 0.567656 0.698617
vt 0.592284 0.684398
vt 0.589636 0.664291
vt 0.581876 0.645551
vt 0.569529 0.629462
vt 0.553437 0.617115
vt 0.534700 0.609352
vt 0.514591 0.606705
vt 0.494483 0.609352
vt 0.475744 0.617115
vt 0.459654 0.629462
vt 0.447305 0.645551
vt 0.439545 0.664291
vt 0.436897 0.684398
vt 0.439545 0.704508
vt 0.447305 0.723247
vt 0.459654 0.739336
vt 0.475744 0.751683
vt 0.494483 0.759444
vt 0.514591 0.762093
vt 0.534700 0.759444
vt 0.553437 0.751683
vt 0.569529 0.739336
vt 0.581876 0.723247
vt 0.589636 0.704508
vt 0.609746 0.684398
vt 0.606503 0.659771
vt 0.596997 0.636822
vt 0.581876 0.617115
vt 0.562168 0.601991
vt 0.539220 0.592486
vt 0.514591 0.589245
vt 0.489963 0.592486
vt 0.467015 0.601991
vt 0.447305 0.617115
vt 0.432186 0.636822
vt 0.422678 0.659771
vt 0.419435 0.684398
vt 0.422678 0.709025
vt 0.432186 0.731976
vt 0.447305 0.751683
vt 0.467015 0.766805
vt 0.489963 0.776310
vt 0.514591 0.779553
vt 0.539220 0.776310
vt 0.562168 0.766805
vt 0.581876 0.751683
vt 0.596997 0.731976
vt 0.606503 0.709025
vt 0.650972 0.684398
vt 0.646326 0.649101
vt 0.632701 0.616208
vt 0.611027 0.587961
vt 0.582782 0.566288
vt 0.549890 0.552664
vt 0.514591 0.548017
vt 0.479293 0.552664
vt 0.446401 0.566288
vt 0.418154 0.587961
vt 0.396480 0.616208
vt 0.382857 0.649101
vt 0.378209 0.684398
vt 0.382857 0.719697
vt 0.396480 0.752590
vt 0.418154 0.780837
vt 0.446401 0.802508
vt 0.479293 0.816132
vt 0.514591 0.820781
vt 0.549890 0.816132
vt 0.582782 0.802508
vt 0.611027 0.780837
vt 0.632701 0.752590
vt 0.646326 0.719697
vt 0.291115 0.883107
vt 0.262676 0.883107
vt 0.262676 0.847810
vt 0.291115 0.846548
vt 0.262676 0.814918
vt 0.291115 0.812483
vt 0.268873 0.563989
vt 0.297311 0.568206
vt 0.297311 0.589880
vt 0.268873 0.586436
vt 0.297311 0.618125
vt 0.268873 0.615691
vt 0.297311 0.651018
vt 0.268873 0.649758
vt 0.297311 0.686316
vt 0.268873 0.686316
vt 0.297311 0.721613
vt 0.268873 0.722875
vt 0.297311 0.754506
vt 0.268873 0.756942
vt 0.297311 0.782753
vt 0.268873 0.786197
vt 0.297311 0.804426
vt 0.268873 0.808644
vt 0.298293 0.839549
vt 0.326731 0.841983
vt 0.326731 0.874876
vt 0.298293 0.873614
vt 0.326731 0.910173
vt 0.298293 0.910173
vt 0.326731 0.945472
vt 0.298293 0.946734
vt 0.326731 0.978365
vt 0.298293 0.980799
vt 0.234534 0.563989
vt 0.262972 0.568206
vt 0.262972 0.589880
vt 0.234534 0.586436
vt 0.262972 0.618126
vt 0.234534 0.615691
vt 0.262972 0.651019
vt 0.234534 0.649758
vt 0.262972 0.686317
vt 0.234534 0.686317
vt 0.262972 0.721615
vt 0.234534 0.722875
vt 0.262972 0.754508
vt 0.234534 0.756943
vt 0.262972 0.782753
vt 0.234534 0.786197
vt 0.262972 0.804426
vt 0.234534 0.808644
vt 0.291115 0.953733
vt 0.262676 0.951299
vt 0.262676 0.918406
vt 0.291115 0.919668
vt 0.552654 0.300123
vt 0.552654 0.315750
vt 0.512050 0.310404
vt 0.516093 0.295310
vt 0.474214 0.294731
vt 0.482028 0.281199
vt 0.441722 0.269801
vt 0.452772 0.258751
vt 0.416794 0.237311
vt 0.430326 0.229497
vt 0.401119 0.199474
vt 0.416215 0.195429
vt 0.395774 0.158871
vt 0.411402 0.158871
vt 0.401119 0.118268
vt 0.416215 0.122312
vt 0.416794 0.080432
vt 0.430326 0.088245
vt 0.441722 0.047940
vt 0.452772 0.058990
vt 0.474214 0.023010
vt 0.482028 0.036543
vt 0.512050 0.007338
vt 0.516093 0.022432
vt 0.552654 0.001992
vt 0.552654 0.017619
vt 0.593256 0.007338
vt 0.589213 0.022432
vt 0.631092 0.023010
vt 0.623278 0.036543
vt 0.663582 0.047940
vt 0.652531 0.058990
vt 0.688514 0.080432
vt 0.674982 0.088245
vt 0.704186 0.118268
vt 0.689092 0.122312
vt 0.709532 0.158871
vt 0.693906 0.158871
vt 0.704186 0.199474
vt 0.689092 0.195429
vt 0.688514 0.237311
vt 0.674982 0.229496
vt 0.663582 0.269801
vt 0.652531 0.258751
vt 0.631092 0.294731
vt 0.623278 0.281199
vt 0.593258 0.310404
vt 0.589213 0.295310
vt 0.026333 0.001992
vt 0.026333 0.612408
vt 0.001916 0.612408
vt 0.001916 0.001992
vt 0.058389 0.612408
vt 0.033972 0.612408
vt 0.033972 0.001992
vt 0.058389 0.001992
vt 0.404233 0.824620
vt 0.404233 0.849037
vt 0.392024 0.849037
vt 0.392024 0.824620
vt 0.065841 0.612407
vt 0.065841 0.001992
vt 0.078049 0.001992
vt 0.078049 0.612407
vt 0.084587 0.612407
vt 0.084587 0.001992
vt 0.096795 0.001992
vt 0.096795 0.612407
vt 0.228633 0.563989
vt 0.228633 0.752950
vt 0.210355 0.752950
vt 0.210355 0.563989
vt 0.177848 0.983870
vt 0.159571 0.983870
vt 0.159571 0.809047
vt 0.177848 0.809047
vt 0.201160 0.805208
vt 0.053868 0.616247
vt 0.067925 0.616247
vt 0.204454 0.791070
vt 0.001916 0.998008
vt 0.149208 0.809047
vt 0.152502 0.823185
vt 0.015973 0.998008
vt 0.389681 0.001992
vt 0.389681 0.544178
vt 0.371404 0.544178
vt 0.371404 0.001992
vt 0.121609 0.560150
vt 0.103332 0.560150
vt 0.103332 0.001992
vt 0.121609 0.001992
vt 0.127703 0.544177
vt 0.230510 0.001992
vt 0.243081 0.001992
vt 0.137084 0.560150
vt 0.352361 0.560150
vt 0.249554 0.017964
vt 0.258934 0.001992
vt 0.364932 0.560150
vt 0.333911 0.839549
vt 0.337712 0.839549
vt 0.337712 0.961632
vt 0.333911 0.961632
vt 0.345313 0.839549
vt 0.345313 0.961632
vt 0.352658 0.839549
vt 0.359241 0.839549
vt 0.359241 0.961632
vt 0.352658 0.961632
vt 0.365823 0.839549
vt 0.365823 0.961632
vt 0.384681 0.961632
vt 0.377079 0.961632
vt 0.377079 0.839549
vt 0.384681 0.839549
vt 0.373279 0.961632
vt 0.373279 0.839549
vn 0.000000 1.000000 0.000000
vn 0.000000 0.992616 0.121302
vn 0.031400 0.992612 0.117201
vn 0.060700 0.992607 0.105101
vn 0.085801 0.992611 0.085801
vn 0.105101 0.992607 0.060700
vn 0.117201 0.992612 0.031400
vn 0.121302 0.992616 0.000000
vn 0.117201 0.992612 -0.031400
vn 0.105101 0.992607 -0.060700
vn 0.085801 0.992611 -0.085801
vn 0.060700 0.992607 -0.105101
vn 0.031400 0.992612 -0.117201
vn 0.000000 0.992616 -0.121302
vn -0.031400 0.992612 -0.117201
vn -0.060700 0.992607 -0.105101
vn -0.085801 0.992611 -0.085801
vn -0.105101 0.992607 -0.060700
vn -0.117201 0.992612 -0.031400
vn -0.121302 0.992616 0.000000
vn -0.117201 0.992612 0.031400
vn -0.105101 0.992607 0.060700
vn -0.085801 0.992611 0.085801
vn -0.060700 0.992607 0.105101
vn -0.031400 0.992612 0.117201
vn 0.000000 0.992616 0.121302
vn 0.000000 0.915597 0.402098
vn 0.104099 0.915593 0.388397
vn 0.031400 0.992612 0.117201
vn 0.201003 0.915615 0.348206
vn 0.060700 0.992607 0.105101
vn 0.284303 0.915611 0.284303
vn 0.085801 0.992611 0.085801
vn 0.348206 0.915615 0.201003
vn 0.105101 0.992607 0.060700
vn 0.388397 0.915593 0.104099
vn 0.117201 0.992612 0.031400
vn 0.402098 0.915597 0.000000
vn 0.121302 0.992616 0.000000
vn 0.388397 0.915593 -0.104099
vn 0.117201 0.992612 -0.031400
vn 0.348206 0.915615 -0.201003
vn 0.105101 0.992607 -0.060700
vn 0.284303 0.915611 -0.284303
vn 0.085801 0.992611 -0.085801
vn 0.201003 0.915615 -0.348206
vn 0.060700 0.992607 -0.105101
vn 0.104099 0.915593 -0.388397
vn 0.031400 0.992612 -0.117201
vn 0.000000 0.915597 -0.402098
vn 0.000000 0.992616 -0.121302
vn -0.104099 0.915593 -0.388397
vn -0.031400 0.992612 -0.117201
vn -0.201003 0.915615 -0.348206
vn -0.060700 0.992607 -0.105101
vn -0.284303 0.915611 -0.284303
vn -0.085801 0.992611 -0.085801
vn -0.348206 0.915615 -0.201003
vn -0.105101 0.992607 -0.060700
vn -0.388397 0.915593 -0.104099
vn -0.117201 0.992612 -0.031400
vn -0.402098 0.915597 0.000000
vn -0.121302 0.992616 0.000000
vn -0.388397 0.915593 0.104099
vn -0.117201 0.992612 0.031400
vn -0.348206 0.915615 0.201003
vn -0.105101 0.992607 0.060700
vn -0.284303 0.915611 0.284303
vn -0.085801 0.992611 0.085801
vn -0.201003 0.915615 0.348206
vn -0.060700 0.992607 0.105101
vn -0.104099 0.915593 0.388397
vn -0.031400 0.992612 0.117201
vn 0.000000 0.915597 0.402098
vn 0.000000 0.711841 0.702341
vn 0.181806 0.711822 0.678421
vn 0.104099 0.915593 0.388397
vn 0.351216 0.711833 0.608228
vn 0.201003 0.915615 0.348206
vn 0.496629 0.711842 0.496629
vn 0.284303 0.915611 0.284303
vn 0.608228 0.711833 0.351216
vn 0.348206 0.915615 0.201003
vn 0.678421 0.711822 0.181806
vn 0.388397 0.915593 0.104099
vn 0.702341 0.711841 0.000000
vn 0.402098 0.915597 0.000000
vn 0.678421 0.711822 -0.181806
vn 0.388397 0.915593 -0.104099
vn 0.608228 0.711833 -0.351216
vn 0.348206 0.915615 -0.201003
vn 0.496629 0.711842 -0.496629
vn 0.284303 0.915611 -0.284303
vn 0.351216 0.711833 -0.608228
vn 0.201003 0.915615 -0.348206
vn 0.181806 0.711822 -0.678421
vn 0.104099 0.915593 -0.388397
vn 0.000000 0.711841 -0.702341
vn 0.000000 0.915597 -0.402098
vn -0.181806 0.711822 -0.678421
vn -0.104099 0.915593 -0.388397
vn -0.351216 0.711833 -0.608228
vn -0.201003 0.915615 -0.348206
vn -0.496629 0.711842 -0.496629
vn -0.284303 0.915611 -0.284303
vn -0.608228 0.711833 -0.351216
vn -0.348206 0.915615 -0.201003
vn -0.678421 0.711822 -0.181806
vn -0.388397 0.915593 -0.104099
vn -0.702341 0.711841 0.000000
vn -0.402098 0.915597 0.000000
vn -0.678421 0.711822 0.181806
vn -0.388397 0.915593 0.104099
vn -0.608228 0.711833 0.351216
vn -0.348206 0.915615 0.201003
vn -0.496629 0.711842 0.496629
vn -0.284303 0.915611 0.284303
vn -0.351216 0.711833 0.608228
vn -0.201003 0.915615 0.348206
vn -0.181806 0.711822 0.678421
vn -0.104099 0.915593 0.388397
vn 0.000000 0.711841 0.702341
vn 0.000000 0.608763 0.793352
vn 0.205300 0.608800 0.766300
vn 0.181806 0.711822 0.678421
vn 0.396677 0.608765 0.687061
vn 0.351216 0.711833 0.608228
vn 0.560978 0.608776 0.560978
vn 0.496629 0.711842 0.496629
vn 0.687061 0.608765 0.396677
vn 0.608228 0.711833 0.351216
vn 0.766300 0.608800 0.205300
vn 0.678421 0.711822 0.181806
vn 0.793352 0.608763 0.000000
vn 0.702341 0.711841 0.000000
vn 0.766300 0.608800 -0.205300
vn 0.678421 0.711822 -0.181806
vn 0.687061 0.608765 -0.396677
vn 0.608228 0.711833 -0.351216
vn 0.560978 0.608776 -0.560978
vn 0.496629 0.711842 -0.496629
vn 0.396677 0.608765 -0.687061
vn 0.351216 0.711833 -0.608228
vn 0.205300 0.608800 -0.766300
vn 0.181806 0.711822 -0.678421
vn 0.000000 0.608763 -0.793352
vn 0.000000 0.711841 -0.702341
vn -0.205300 0.608800 -0.766300
vn -0.181806 0.711822 -0.678421
vn -0.396677 0.608765 -0.687061
vn -0.351216 0.711833 -0.608228
vn -0.560978 0.608776 -0.560978
vn -0.496629 0.711842 -0.496629
vn -0.687061 0.608765 -0.396677
vn -0.608228 0.711833 -0.351216
vn -0.766300 0.608800 -0.205300
vn -0.678421 0.711822 -0.181806
vn -0.793352 0.608763 0.000000
vn -0.702341 0.711841 0.000000
vn -0.766300 0.608800 0.205300
vn -0.678421 0.711822 0.181806
vn -0.687061 0.608765 0.396677
vn -0.608228 0.711833 0.351216
vn -0.560978 0.608776 0.560978
vn -0.496629 0.711842 0.496629
vn -0.396677 0.608765 0.687061
vn -0.351216 0.711833 0.608228
vn -0.205300 0.608800 0.766300
vn -0.181806 0.711822 0.678421
vn 0.000000 0.968684 0.248296
vn 0.000000 0.968684 0.248296
vn 0.064299 0.968691 0.239798
vn 0.064299 0.968691 0.239798
vn 0.124100 0.968697 0.214999
vn 0.124100 0.968697 0.214999
vn 0.175502 0.968710 0.175502
vn 0.175502 0.968710 0.175502
vn 0.214999 0.968697 0.124100
vn 0.214999 0.968697 0.124100
vn 0.239798 0.968691 0.064299
vn 0.239798 0.968691 0.064299
vn 0.248296 0.968684 0.000000
vn 0.248296 0.968684 0.000000
vn 0.239798 0.968691 -0.064299
vn 0.239798 0.968691 -0.064299
vn 0.214999 0.968697 -0.124100
vn 0.214999 0.968697 -0.124100
vn 0.175502 0.968710 -0.175502
vn 0.175502 0.968710 -0.175502
vn 0.124100 0.968697 -0.214999
vn 0.124100 0.968697 -0.214999
vn 0.064299 0.968691 -0.239798
vn 0.064299 0.968691 -0.239798
vn 0.000000 0.968684 -0.248296
vn 0.000000 0.968684 -0.248296
vn -0.064299 0.968691 -0.239798
vn -0.064299 0.968691 -0.239798
vn -0.124100 0.968697 -0.214999
vn -0.124100 0.968697 -0.214999
vn -0.175502 0.968710 -0.175502
vn -0.175502 0.968710 -0.175502
vn -0.214999 0.968697 -0.124100
vn -0.214999 0.968697 -0.124100
vn -0.239798 0.968691 -0.064299
vn -0.239798 0.968691 -0.064299
vn -0.248296 0.968684 0.000000
vn -0.248296 0.968684 0.000000
vn -0.239798 0.968691 0.064299
vn -0.239798 0.968691 0.064299
vn -0.214999 0.968697 0.124100
vn -0.214999 0.968697 0.124100
vn -0.175502 0.968710 0.175502
vn -0.175502 0.968710 0.175502
vn -0.124100 0.968697 0.214999
vn -0.124100 0.968697 0.214999
vn -0.064299 0.968691 0.239798
vn -0.064299 0.968691 0.239798
vn 0.000000 0.166701 0.986008
vn 0.000000 0.166701 0.986008
vn 0.255202 0.166702 0.952409
vn 0.255202 0.166702 0.952409
vn 0.493004 0.166701 0.853907
vn 0.493004 0.166701 0.853907
vn 0.697212 0.166703 0.697212
vn 0.697212 0.166703 0.697212
vn 0.853907 0.166701 0.493004
vn 0.853907 0.166701 0.493004
vn 0.952409 0.166702 0.255202
vn 0.952409 0.166702 0.255202
vn 0.986008 0.166701 0.000000
vn 0.986008 0.166701 0.000000
vn 0.952409 0.166702 -0.255202
vn 0.952409 0.166702 -0.255202
vn 0.853907 0.166701 -0.493004
vn 0.853907 0.166701 -0.493004
vn 0.697212 0.166703 -0.697212
vn 0.697212 0.166703 -0.697212
vn 0.493004 0.166701 -0.853907
vn 0.493004 0.166701 -0.853907
vn 0.255202 0.166702 -0.952409
vn 0.255202 0.166702 -0.952409
vn 0.000000 0.166701 -0.986008
vn 0.000000 0.166701 -0.986008
vn -0.255202 0.166702 -0.952409
vn -0.255202 0.166702 -0.952409
vn -0.493004 0.166701 -0.853907
vn -0.493004 0.166701 -0.853907
vn -0.697212 0.166703 -0.697212
vn -0.697212 0.166703 -0.697212
vn -0.853907 0.166701 -0.493004
vn -0.853907 0.166701 -0.493004
vn -0.952409 0.166702 -0.255202
vn -0.952409 0.166702 -0.255202
vn -0.986008 0.166701 0.000000
vn -0.986008 0.166701 0.000000
vn -0.952409 0.166702 0.255202
vn -0.952409 0.166702 0.255202
vn -0.853907 0.166701 0.493004
vn -0.853907 0.166701 0.493004
vn -0.697212 0.166703 0.697212
vn -0.697212 0.166703 0.697212
vn -0.493004 0.166701 0.853907
vn -0.493004 0.166701 0.853907
vn -0.255202 0.166702 0.952409
vn -0.255202 0.166702 0.952409
vn 0.000000 -0.992616 -0.121302
vn 0.000000 -1.000000 0.000000
vn -0.031400 -0.992612 -0.117201
vn -0.060700 -0.992607 -0.105101
vn -0.085801 -0.992611 -0.085801
vn -0.105101 -0.992607 -0.060700
vn -0.117201 -0.992612 -0.031400
vn -0.121302 -0.992616 0.000000
vn -0.117201 -0.992612 0.031400
vn -0.105101 -0.992607 0.060700
vn -0.085801 -0.992611 0.085801
vn -0.060700 -0.992607 0.105101
vn -0.031400 -0.992612 0.117201
vn 0.000000 -0.992616 0.121302
vn 0.031400 -0.992612 0.117201
vn 0.060700 -0.992607 0.105101
vn 0.085801 -0.992611 0.085801
vn 0.105101 -0.992607 0.060700
vn 0.117201 -0.992612 0.031400
vn 0.121302 -0.992616 0.000000
vn 0.117201 -0.992612 -0.031400
vn 0.105101 -0.992607 -0.060700
vn 0.085801 -0.992611 -0.085801
vn 0.060700 -0.992607 -0.105101
vn 0.031400 -0.992612 -0.117201
vn 0.000000 -0.915597 -0.402098
vn 0.000000 -0.992616 -0.121302
vn -0.031400 -0.992612 -0.117201
vn -0.104099 -0.915593 -0.388397
vn -0.060700 -0.992607 -0.105101
vn -0.201003 -0.915615 -0.348206
vn -0.085801 -0.992611 -0.085801
vn -0.284303 -0.915611 -0.284303
vn -0.105101 -0.992607 -0.060700
vn -0.348206 -0.915615 -0.201003
vn -0.117201 -0.992612 -0.031400
vn -0.388397 -0.915593 -0.104099
vn -0.121302 -0.992616 0.000000
vn -0.402098 -0.915597 0.000000
vn -0.117201 -0.992612 0.031400
vn -0.388397 -0.915593 0.104099
vn -0.105101 -0.992607 0.060700
vn -0.348206 -0.915615 0.201003
vn -0.085801 -0.992611 0.085801
vn -0.284303 -0.915611 0.284303
vn -0.060700 -0.992607 0.105101
vn -0.201003 -0.915615 0.348206
vn -0.031400 -0.992612 0.117201
vn -0.104099 -0.915593 0.388397
vn 0.000000 -0.992616 0.121302
vn 0.000000 -0.915597 0.402098
vn 0.031400 -0.992612 0.117201
vn 0.104099 -0.915593 0.388397
vn 0.060700 -0.992607 0.105101
vn 0.201003 -0.915615 0.348206
vn 0.085801 -0.992611 0.085801
vn 0.284303 -0.915611 0.284303
vn 0.105101 -0.992607 0.060700
vn 0.348206 -0.915615 0.201003
vn 0.117201 -0.992612 0.031400
vn 0.388397 -0.915593 0.104099
vn 0.121302 -0.992616 0.000000
vn 0.402098 -0.915597 0.000000
vn 0.117201 -0.992612 -0.031400
vn 0.388397 -0.915593 -0.104099
vn 0.105101 -0.992607 -0.060700
vn 0.348206 -0.915615 -0.201003
vn 0.085801 -0.992611 -0.085801
vn 0.284303 -0.915611 -0.284303
vn 0.060700 -0.992607 -0.105101
vn 0.201003 -0.915615 -0.348206
vn 0.031400 -0.992612 -0.117201
vn 0.104099 -0.915593 -0.388397
vn 0.000000 -0.711841 -0.702341
vn 0.000000 -0.915597 -0.402098
vn -0.104099 -0.915593 -0.388397
vn -0.181806 -0.711822 -0.678421
vn -0.201003 -0.915615 -0.348206
vn -0.351216 -0.711833 -0.608228
vn -0.284303 -0.915611 -0.284303
vn -0.496629 -0.711842 -0.496629
vn -0.348206 -0.915615 -0.201003
vn -0.608228 -0.711833 -0.351216
vn -0.388397 -0.915593 -0.104099
vn -0.678421 -0.711822 -0.181806
vn -0.402098 -0.915597 0.000000
vn -0.702341 -0.711841 0.000000
vn -0.388397 -0.915593 0.104099
vn -0.678421 -0.711822 0.181806
vn -0.348206 -0.915615 0.201003
vn -0.608228 -0.711833 0.351216
vn -0.284303 -0.915611 0.284303
vn -0.496629 -0.711842 0.496629
vn -0.201003 -0.915615 0.348206
vn -0.351216 -0.711833 0.608228
vn -0.104099 -0.915593 0.388397
vn -0.181806 -0.711822 0.678421
vn 0.000000 -0.915597 0.402098
vn 0.000000 -0.711841 0.702341
vn 0.104099 -0.915593 0.388397
vn 0.181806 -0.711822 0.678421
vn 0.201003 -0.915615 0.348206
vn 0.351216 -0.711833 0.608228
vn 0.284303 -0.915611 0.284303
vn 0.496629 -0.711842 0.496629
vn 0.348206 -0.915615 0.201003
vn 0.608228 -0.711833 0.351216
vn 0.388397 -0.915593 0.104099
vn 0.678421 -0.711822 0.181806
vn 0.402098 -0.915597 0.000000
vn 0.702341 -0.711841 0.000000
vn 0.388397 -0.915593 -0.104099
vn 0.678421 -0.711822 -0.181806
vn 0.348206 -0.915615 -0.201003
vn 0.608228 -0.711833 -0.351216
vn 0.284303 -0.915611 -0.284303
vn 0.496629 -0.711842 -0.496629
vn 0.201003 -0.915615 -0.348206
vn 0.351216 -0.711833 -0.608228
vn 0.104099 -0.915593 -0.388397
vn 0.181806 -0.711822 -0.678421
vn 0.000000 -0.608763 -0.793352
vn 0.000000 -0.711841 -0.702341
vn -0.181806 -0.711822 -0.678421
vn -0.205300 -0.608800 -0.766300
vn -0.351216 -0.711833 -0.608228
vn -0.396677 -0.608765 -0.687061
vn -0.496629 -0.711842 -0.496629
vn -0.560978 -0.608776 -0.560978
vn -0.608228 -0.711833 -0.351216
vn -0.687061 -0.608765 -0.396677
vn -0.678421 -0.711822 -0.181806
vn -0.766300 -0.608800 -0.205300
vn -0.702341 -0.711841 0.000000
vn -0.793352 -0.608763 0.000000
vn -0.678421 -0.711822 0.181806
vn -0.766300 -0.608800 0.205300
vn -0.608228 -0.711833 0.351216
vn -0.687061 -0.608765 0.396677
vn -0.496629 -0.711842 0.496629
vn -0.560978 -0.608776 0.560978
vn -0.351216 -0.711833 0.608228
vn -0.396677 -0.608765 0.687061
vn -0.181806 -0.711822 0.678421
vn -0.205300 -0.608800 0.766300
vn 0.000000 -0.711841 0.702341
vn 0.000000 -0.608763 0.793352
vn 0.181806 -0.711822 0.678421
vn 0.205300 -0.608800 0.766300
vn 0.351216 -0.711833 0.608228
vn 0.396677 -0.608765 0.687061
vn 0.496629 -0.711842 0.496629
vn 0.560978 -0.608776 0.560978
vn 0.608228 -0.711833 0.351216
vn 0.687061 -0.608765 0.396677
vn 0.678421 -0.711822 0.181806
vn 0.766300 -0.608800 0.205300
vn 0.702341 -0.711841 0.000000
vn 0.793352 -0.608763 0.000000
vn 0.678421 -0.711822 -0.181806
vn 0.766300 -0.608800 -0.205300
vn 0.608228 -0.711833 -0.351216
vn 0.687061 -0.608765 -0.396677
vn 0.496629 -0.711842 -0.496629
vn 0.560978 -0.608776 -0.560978
vn 0.351216 -0.711833 -0.608228
vn 0.396677 -0.608765 -0.687061
vn 0.181806 -0.711822 -0.678421
vn 0.205300 -0.608800 -0.766300
vn 0.000000 -0.978001 -0.208600
vn 0.000000 -0.978001 -0.208600
vn -0.054000 -0.977999 -0.201500
vn -0.054000 -0.977999 -0.201500
vn -0.104299 -0.977993 -0.180699
vn -0.104299 -0.977993 -0.180699
vn -0.147500 -0.978002 -0.147500
vn -0.147500 -0.978002 -0.147500
vn -0.180699 -0.977993 -0.104299
vn -0.180699 -0.977993 -0.104299
vn -0.201500 -0.977999 -0.054000
vn -0.201500 -0.977999 -0.054000
vn -0.208600 -0.978001 0.000000
vn -0.208600 -0.978001 0.000000
vn -0.201500 -0.977999 0.054000
vn -0.201500 -0.977999 0.054000
vn -0.180699 -0.977993 0.104299
vn -0.180699 -0.977993 0.104299
vn -0.147500 -0.978002 0.147500
vn -0.147500 -0.978002 0.147500
vn -0.104299 -0.977993 0.180699
vn -0.104299 -0.977993 0.180699
vn -0.054000 -0.977999 0.201500
vn -0.054000 -0.977999 0.201500
vn 0.000000 -0.978001 0.208600
vn 0.000000 -0.978001 0.208600
vn 0.054000 -0.977999 0.201500
vn 0.054000 -0.977999 0.201500
vn 0.104299 -0.977993 0.180699
vn 0.104299 -0.977993 0.180699
vn 0.147500 -0.978002 0.147500
vn 0.147500 -0.978002 0.147500
vn 0.180699 -0.977993 0.104299
vn 0.180699 -0.977993 0.104299
vn 0.201500 -0.977999 0.054000
vn 0.201500 -0.977999 0.054000
vn 0.208600 -0.978001 0.000000
vn 0.208600 -0.978001 0.000000
vn 0.201500 -0.977999 -0.054000
vn 0.201500 -0.977999 -0.054000
vn 0.180699 -0.977993 -0.104299
vn 0.180699 -0.977993 -0.104299
vn 0.147500 -0.978002 -0.147500
vn 0.147500 -0.978002 -0.147500
vn 0.104299 -0.977993 -0.180699
vn 0.104299 -0.977993 -0.180699
vn 0.054000 -0.977999 -0.201500
vn 0.054000 -0.977999 -0.201500
vn 0.000000 -0.168792 -0.985652
vn 0.000000 -0.168792 -0.985652
vn -0.255092 -0.168795 -0.952070
vn -0.255092 -0.168795 -0.952070
vn -0.492805 -0.168802 -0.853609
vn -0.492805 -0.168802 -0.853609
vn -0.696961 -0.168791 -0.696961
vn -0.696961 -0.168791 -0.696961
vn -0.853609 -0.168802 -0.492805
vn -0.853609 -0.168802 -0.492805
vn -0.952070 -0.168795 -0.255092
vn -0.952070 -0.168795 -0.255092
vn -0.985652 -0.168792 0.000000
vn -0.985652 -0.168792 0.000000
vn -0.952070 -0.168795 0.255092
vn -0.952070 -0.168795 0.255092
vn -0.853609 -0.168802 0.492805
vn -0.853609 -0.168802 0.492805
vn -0.696961 -0.168791 0.696961
vn -0.696961 -0.168791 0.696961
vn -0.492805 -0.168802 0.853609
vn -0.492805 -0.168802 0.853609
vn -0.255092 -0.168795 0.952070
vn -0.255092 -0.168795 0.952070
vn 0.000000 -0.168792 0.985652
vn 0.000000 -0.168792 0.985652
vn 0.255092 -0.168795 0.952070
vn 0.255092 -0.168795 0.952070
vn 0.492805 -0.168802 0.853609
vn 0.492805 -0.168802 0.853609
vn 0.696961 -0.168791 0.696961
vn 0.696961 -0.168791 0.696961
vn 0.853609 -0.168802 0.492805
vn 0.853609 -0.168802 0.492805
vn 0.952070 -0.168795 0.255092
vn 0.952070 -0.168795 0.255092
vn 0.985652 -0.168792 0.000000
vn 0.985652 -0.168792 0.000000
vn 0.952070 -0.168795 -0.255092
vn 0.952070 -0.168795 -0.255092
vn 0.853609 -0.168802 -0.492805
vn 0.853609 -0.168802 -0.492805
vn 0.696961 -0.168791 -0.696961
vn 0.696961 -0.168791 -0.696961
vn 0.492805 -0.168802 -0.853609
vn 0.492805 -0.168802 -0.853609
vn 0.255092 -0.168795 -0.952070
vn 0.255092 -0.168795 -0.952070
vn 0.000000 -1.000000 0.000000
vn 0.000000 -1.000000 0.000000
vn 0.000000 -1.000000 0.000000
vn 0.000000 -1.000000 0.000000
vn 0.000000 -1.000000 0.000000
vn 0.000000 -1.000000 0.000000
vn 0.000000 -1.000000 0.000000
vn 0.000000 -1.000000 0.000000
vn 0.000000 -1.000000 0.000000
vn 0.000000 -1.000000 0.000000
vn 0.000000 -1.000000 0.000000
vn 0.000000 -1.000000 0.000000
vn 0.000000 -1.000000 0.000000
vn 0.000000 -1.000000 0.000000
vn 0.000000 -1.000000 0.000000
vn 0.000000 -1.000000 0.000000
vn 0.000000 -1.000000 0.000000
vn 0.000000 -1.000000 0.000000
vn 0.000000 -1.000000 0.000000
vn 0.000000 -1.000000 0.000000
vn 0.000000 -1.000000 0.000000
vn 0.000000 -1.000000 0.000000
vn 0.000000 -1.000000 0.000000
vn 0.000000 -1.000000 0.000000
vn 0.000000 -1.000000 0.000000
vn 0.000000 -1.000000 0.000000
vn 0.000000 -1.000000 0.000000
vn 0.000000 -1.000000 0.000000
vn 0.000000 -1.000000 0.000000
vn 0.000000 -1.000000 0.000000
vn 0.000000 -1.000000 0.000000
vn 0.000000 -1.000000 0.000000
vn 0.000000 -1.000000 0.000000
vn 0.000000 -1.000000 0.000000
vn 0.000000 -1.000000 0.000000
vn 0.000000 -1.000000 0.000000
vn 0.000000 -1.000000 0.000000
vn 0.000000 -1.000000 0.000000
vn 0.000000 -1.000000 0.000000
vn 0.000000 -1.000000 0.000000
vn 0.000000 -1.000000 0.000000
vn 0.000000 -1.000000 0.000000
vn 0.000000 -1.000000 0.000000
vn 0.000000 -1.000000 0.000000
vn 0.000000 -1.000000 0.000000
vn 0.000000 -1.000000 0.000000
vn 0.000000 -1.000000 0.000000
vn 0.000000 -1.000000 0.000000
vn 0.000000 -1.000000 0.000000
vn 0.000000 -1.000000 0.000000
vn 0.000000 -1.000000 0.000000
vn 0.000000 -1.000000 0.000000
vn 0.000000 1.000000 0.000000
vn 0.000000 1.000000 0.000000
vn 0.000000 1.000000 0.000000
vn 0.000000 1.000000 0.000000
vn 0.000000 0.000000 -1.000000
vn 0.000000 0.000000 -1.000000
vn 0.000000 0.000000 -1.000000
vn 0.000000 0.000000 -1.000000
vn -1.000000 0.000000 0.000000
vn -1.000000 0.000000 0.000000
vn -1.000000 0.000000 0.000000
vn -1.000000 0.000000 0.000000
vn 1.000000 0.000000 0.000000
vn 1.000000 0.000000 0.000000
vn 1.000000 0.000000 0.000000
vn 1.000000 0.000000 0.000000
vn 0.000000 -0.788690 -0.614792
vn 0.000000 -0.788690 -0.614792
vn 0.000000 -0.788690 -0.614792
vn 0.000000 -0.788690 -0.614792
vn 0.000000 0.788123 0.615518
vn 0.000000 0.788123 0.615518
vn 0.000000 0.788123 0.615518
vn 0.000000 0.788123 0.615518
vn -1.000000 0.000000 0.000000
vn -1.000000 0.000000 0.000000
vn -1.000000 0.000000 0.000000
vn -1.000000 0.000000 0.000000
vn 1.000000 0.000000 0.000000
vn 1.000000 0.000000 0.000000
vn 1.000000 0.000000 0.000000
vn 1.000000 0.000000 0.000000
vn 0.000000 -0.982493 0.186299
vn 0.000000 -0.982493 0.186299
vn 0.000000 -0.982493 0.186299
vn 0.000000 -0.982493 0.186299
vn 0.000000 0.982435 -0.186607
vn 0.000000 0.982435 -0.186607
vn 0.000000 0.982435 -0.186607
vn 0.000000 0.982435 -0.186607
vn -1.000000 0.000000 0.000000
vn -1.000000 0.000000 0.000000
vn -1.000000 0.000000 0.000000
vn -1.000000 0.000000 0.000000
vn 1.000000 0.000000 0.000000
vn 1.000000 0.000000 0.000000
vn 1.000000 0.000000 0.000000
vn 1.000000 0.000000 0.000000
vn -1.000000 0.000000 0.000000
vn -0.500011 0.000000 0.866019
vn -0.500011 0.000000 0.866019
vn -1.000000 0.000000 0.000000
vn -0.500011 0.000000 0.866019
vn 0.500011 0.000000 0.866019
vn 0.500011 0.000000 0.866019
vn -0.500011 0.000000 0.866019
vn 0.500011 0.000000 0.866019
vn 1.000000 0.000000 0.000000
vn 1.000000 0.000000 0.000000
vn 0.500011 0.000000 0.866019
vn 1.000000 0.000000 0.000000
vn 0.500011 0.000000 -0.866019
vn 0.500011 0.000000 -0.866019
vn 1.000000 0.000000 0.000000
vn 0.500011 0.000000 -0.866019
vn -0.500011 0.000000 -0.866019
vn -0.500011 0.000000 -0.866019
vn 0.500011 0.000000 -0.866019
vn -0.500011 0.000000 -0.866019
vn -1.000000 0.000000 0.000000
vn -1.000000 0.000000 0.000000
vn -0.500011 0.000000 -0.866019
s 1
g kk:polySurface1951 prop_lamp
usemtl kk:initialShadingGroup
f 1/1/1 2/2/2 3/3/3
f 1/1/1 3/3/3 4/4/4
f 1/1/1 4/4/4 5/5/5
f 1/1/1 5/5/5 6/6/6
f 1/1/1 6/6/6 7/7/7
f 1/1/1 7/7/7 8/8/8
f 1/1/1 8/8/8 9/9/9
f 1/1/1 9/9/9 10/10/10
f 1/1/1 10/10/10 11/11/11
f 1/1/1 11/11/11 12/12/12
f 1/1/1 12/12/12 13/13/13
f 1/1/1 13/13/13 14/14/14
f 1/1/1 14/14/14 15/15/15
f 1/1/1 15/15/15 16/16/16
f 1/1/1 16/16/16 17/17/17
f 1/1/1 17/17/17 18/18/18
f 1/1/1 18/18/18 19/19/19
f 1/1/1 19/19/19 20/20/20
f 1/1/1 20/20/20 21/21/21
f 1/1/1 21/21/21 22/22/22
f 1/1/1 22/22/22 23/23/23
f 1/1/1 23/23/23 24/24/24
f 1/1/1 24/24/24 25/25/25
f 1/1/1 25/25/25 2/2/2
s 2
f 2/2/26 26/26/27 27/27/28 3/3/29
f 3/3/29 27/27/28 28/28/30 4/4/31
f 4/4/31 28/28/30 29/29/32 5/5/33
f 5/5/33 29/29/32 30/30/34 6/6/35
f 6/6/35 30/30/34 31/31/36 7/7/37
f 7/7/37 31/31/36 32/32/38 8/8/39
f 8/8/39 32/32/38 33/33/40 9/9/41
f 9/9/41 33/33/40 34/34/42 10/10/43
f 10/10/43 34/34/42 35/35/44 11/11/45
f 11/11/45 35/35/44 36/36/46 12/12/47
f 12/12/47 36/36/46 37/37/48 13/13/49
f 13/13/49 37/37/48 38/38/50 14/14/51
f 14/14/51 38/38/50 39/39/52 15/15/53
f 15/15/53 39/39/52 40/40/54 16/16/55
f 16/16/55 40/40/54 41/41/56 17/17/57
f 17/17/57 41/41/56 42/42/58 18/18/59
f 18/18/59 42/42/58 43/43/60 19/19/61
f 19/19/61 43/43/60 44/44/62 20/20/63
f 20/20/63 44/44/62 45/45/64 21/21/65
f 21/21/65 45/45/64 46/46/66 22/22/67
f 22/22/67 46/46/66 47/47/68 23/23/69
f 23/23/69 47/47/68 48/48/70 24/24/71
f 24/24/71 48/48/70 49/49/72 25/25/73
f 25/25/73 49/49/72 26/26/27 2/2/26
s 3
f 26/26/74 50/50/75 51/51/76 27/27/77
f 27/27/77 51/51/76 52/52/78 28/28/79
f 28/28/79 52/52/78 53/53/80 29/29/81
f 29/29/81 53/53/80 54/54/82 30/30/83
f 30/30/83 54/54/82 55/55/84 31/31/85
f 31/31/85 55/55/84 56/56/86 32/32/87
f 32/32/87 56/56/86 57/57/88 33/33/89
f 33/33/89 57/57/88 58/58/90 34/34/91
f 34/34/91 58/58/90 59/59/92 35/35/93
f 35/35/93 59/59/92 60/60/94 36/36/95
f 36/36/95 60/60/94 61/61/96 37/37/97
f 37/37/97 61/61/96 62/62/98 38/38/99
f 38/38/99 62/62/98 63/63/100 39/39/101
f 39/39/101 63/63/100 64/64/102 40/40/103
f 40/40/103 64/64/102 65/65/104 41/41/105
f 41/41/105 65/65/104 66/66/106 42/42/107
f 42/42/107 66/66/106 67/67/108 43/43/109
f 43/43/109 67/67/108 68/68/110 44/44/111
f 44/44/111 68/68/110 69/69/112 45/45/113
f 45/45/113 69/69/112 70/70/114 46/46/115
f 46/46/115 70/70/114 71/71/116 47/47/117
f 47/47/117 71/71/116 72/72/118 48/48/119
f 48/48/119 72/72/118 73/73/120 49/49/121
f 49/49/121 73/73/120 50/50/75 26/26/74
s 4
f 50/50/122 74/74/123 75/75/124 51/51/125
f 51/51/125 75/75/124 76/76/126 52/52/127
f 52/52/127 76/76/126 77/77/128 53/53/129
f 53/53/129 77/77/128 78/78/130 54/54/131
f 54/54/131 78/78/130 79/79/132 55/55/133
f 55/55/133 79/79/132 80/80/134 56/56/135
f 56/56/135 80/80/134 81/81/136 57/57/137
f 57/57/137 81/81/136 82/82/138 58/58/139
f 58/58/139 82/82/138 83/83/140 59/59/141
f 59/59/141 83/83/140 84/84/142 60/60/143
f 60/60/143 84/84/142 85/85/144 61/61/145
f 61/61/145 85/85/144 86/86/146 62/62/147
f 62/62/147 86/86/146 87/87/148 63/63/149
f 63/63/149 87/87/148 88/88/150 64/64/151
f 64/64/151 88/88/150 89/89/152 65/65/153
f 65/65/153 89/89/152 90/90/154 66/66/155
f 66/66/155 90/90/154 91/91/156 67/67/157
f 67/67/157 91/91/156 92/92/158 68/68/159
f 68/68/159 92/92/158 93/93/160 69/69/161
f 69/69/161 93/93/160 94/94/162 70/70/163
f 70/70/163 94/94/162 95/95/164 71/71/165
f 71/71/165 95/95/164 96/96/166 72/72/167
f 72/72/167 96/96/166 97/97/168 73/73/169
f 73/73/169 97/97/168 74/74/123 50/50/122
s 5
f 74/74/170 98/98/171 99/99/172 75/75/173
f 75/75/173 99/99/172 100/100/174 76/76/175
f 76/76/175 100/100/174 101/101/176 77/77/177
f 77/77/177 101/101/176 102/102/178 78/78/179
f 78/78/179 102/102/178 103/103/180 79/79/181
f 79/79/181 103/103/180 104/104/182 80/80/183
f 80/80/183 104/104/182 105/105/184 81/81/185
f 81/81/185 105/105/184 106/106/186 82/82/187
f 82/82/187 106/106/186 107/107/188 83/83/189
f 83/83/189 107/107/188 108/108/190 84/84/191
f 84/84/191 108/108/190 109/109/192 85/85/193
f 85/85/193 109/109/192 110/110/194 86/86/195
f 86/86/195 110/110/194 111/111/196 87/87/197
f 87/87/197 111/111/196 112/112/198 88/88/199
f 88/88/199 112/112/198 113/113/200 89/89/201
f 89/89/201 113/113/200 114/114/202 90/90/203
f 90/90/203 114/114/202 115/115/204 91/91/205
f 91/91/205 115/115/204 116/116/206 92/92/207
f 92/92/207 116/116/206 117/117/208 93/93/209
f 93/93/209 117/117/208 118/118/210 94/94/211
f 94/94/211 118/118/210 119/119/212 95/95/213
f 95/95/213 119/119/212 120/120/214 96/96/215
f 96/96/215 120/120/214 121/121/216 97/97/217
f 97/97/217 121/121/216 98/98/171 74/74/170
s 6
f 98/122/218 122/123/219 123/124/220 99/125/221
f 99/125/221 123/124/220 124/126/222 100/127/223
f 100/128/223 124/129/222 125/130/224 101/131/225
f 101/131/225 125/130/224 126/132/226 102/133/227
f 102/133/227 126/132/226 127/134/228 103/135/229
f 103/135/229 127/134/228 128/136/230 104/137/231
f 104/137/231 128/136/230 129/138/232 105/139/233
f 105/139/233 129/138/232 130/140/234 106/141/235
f 106/141/235 130/140/234 131/142/236 107/143/237
f 107/143/237 131/142/236 132/144/238 108/145/239
f 108/146/239 132/147/238 133/148/240 109/149/241
f 109/149/241 133/148/240 134/150/242 110/151/243
f 110/151/243 134/150/242 135/152/244 111/153/245
f 111/153/245 135/152/244 136/154/246 112/155/247
f 112/156/247 136/157/246 137/158/248 113/159/249
f 113/159/249 137/158/248 138/160/250 114/161/251
f 114/161/251 138/160/250 139/162/252 115/163/253
f 115/163/253 139/162/252 140/164/254 116/165/255
f 116/165/255 140/164/254 141/166/256 117/167/257
f 117/167/257 141/166/256 142/168/258 118/169/259
f 118/169/259 142/168/258 143/170/260 119/171/261
f 119/171/261 143/170/260 144/172/262 120/173/263
f 120/174/263 144/175/262 145/176/264 121/177/265
f 121/177/265 145/176/264 122/123/219 98/122/218
s 7
f 146/178/266 147/179/267 148/180/268
f 148/180/268 147/179/267 149/181/269
f 149/181/269 147/179/267 150/182/270
f 150/182/270 147/179/267 151/183/271
f 151/183/271 147/179/267 152/184/272
f 152/184/272 147/179/267 153/185/273
f 153/185/273 147/179/267 154/186/274
f 154/186/274 147/179/267 155/187/275
f 155/187/275 147/179/267 156/188/276
f 156/188/276 147/179/267 157/189/277
f 157/189/277 147/179/267 158/190/278
f 158/190/278 147/179/267 159/191/279
f 159/191/279 147/179/267 160/192/280
f 160/192/280 147/179/267 161/193/281
f 161/193/281 147/179/267 162/194/282
f 162/194/282 147/179/267 163/195/283
f 163/195/283 147/179/267 164/196/284
f 164/196/284 147/179/267 165/197/285
f 165/197/285 147/179/267 166/198/286
f 166/198/286 147/179/267 167/199/287
f 167/199/287 147/179/267 168/200/288
f 168/200/288 147/179/267 169/201/289
f 169/201/289 147/179/267 170/202/290
f 170/202/290 147/179/267 146/178/266
s 8
f 171/203/291 146/178/292 148/180/293 172/204/294
f 172/204/294 148/180/293 149/181/295 173/205/296
f 173/205/296 149/181/295 150/182/297 174/206/298
f 174/206/298 150/182/297 151/183/299 175/207/300
f 175/207/300 151/183/299 152/184/301 176/208/302
f 176/208/302 152/184/301 153/185/303 177/209/304
f 177/209/304 153/185/303 154/186/305 178/210/306
f 178/210/306 154/186/305 155/187/307 179/211/308
f 179/211/308 155/187/307 156/188/309 180/212/310
f 180/212/310 156/188/309 157/189/311 181/213/312
f 181/213/312 157/189/311 158/190/313 182/214/314
f 182/214/314 158/190/313 159/191/315 183/215/316
f 183/215/316 159/191/315 160/192/317 184/216/318
f 184/216/318 160/192/317 161/193/319 185/217/320
f 185/217/320 161/193/319 162/194/321 186/218/322
f 186/218/322 162/194/321 163/195/323 187/219/324
f 187/219/324 163/195/323 164/196/325 188/220/326
f 188/220/326 164/196/325 165/197/327 189/221/328
f 189/221/328 165/197/327 166/198/329 190/222/330
f 190/222/330 166/198/329 167/199/331 191/223/332
f 191/223/332 167/199/331 168/200/333 192/224/334
f 192/224/334 168/200/333 169/201/335 193/225/336
f 193/225/336 169/201/335 170/202/337 194/226/338
f 194/226/338 170/202/337 146/178/292 171/203/291
s 9
f 195/227/339 171/203/340 172/204/341 196/228/342
f 196/228/342 172/204/341 173/205/343 197/229/344
f 197/229/344 173/205/343 174/206/345 198/230/346
f 198/230/346 174/206/345 175/207/347 199/231/348
f 199/231/348 175/207/347 176/208/349 200/232/350
f 200/232/350 176/208/349 177/209/351 201/233/352
f 201/233/352 177/209/351 178/210/353 202/234/354
f 202/234/354 178/210/353 179/211/355 203/235/356
f 203/235/356 179/211/355 180/212/357 204/236/358
f 204/236/358 180/212/357 181/213/359 205/237/360
f 205/237/360 181/213/359 182/214/361 206/238/362
f 206/238/362 182/214/361 183/215/363 207/239/364
f 207/239/364 183/215/363 184/216/365 208/240/366
f 208/240/366 184/216/365 185/217/367 209/241/368
f 209/241/368 185/217/367 186/218/369 210/242/370
f 210/242/370 186/218/369 187/219/371 211/243/372
f 211/243/372 187/219/371 188/220/373 212/244/374
f 212/244/374 188/220/373 189/221/375 213/245/376
f 213/245/376 189/221/375 190/222/377 214/246/378
f 214/246/378 190/222/377 191/223/379 215/247/380
f 215/247/380 191/223/379 192/224/381 216/248/382
f 216/248/382 192/224/381 193/225/383 217/249/384
f 217/249/384 193/225/383 194/226/385 218/250/386
f 218/250/386 194/226/385 171/203/340 195/227/339
s 10
f 219/251/387 195/227/388 196/228/389 220/252/390
f 220/252/390 196/228/389 197/229/391 221/253/392
f 221/253/392 197/229/391 198/230/393 222/254/394
f 222/254/394 198/230/393 199/231/395 223/255/396
f 223/255/396 199/231/395 200/232/397 224/256/398
f 224/256/398 200/232/397 201/233/399 225/257/400
f 225/257/400 201/233/399 202/234/401 226/258/402
f 226/258/402 202/234/401 203/235/403 227/259/404
f 227/259/404 203/235/403 204/236/405 228/260/406
f 228/260/406 204/236/405 205/237/407 229/261/408
f 229/261/408 205/237/407 206/238/409 230/262/410
f 230/262/410 206/238/409 207/239/411 231/263/412
f 231/263/412 207/239/411 208/240/413 232/264/414
f 232/264/414 208/240/413 209/241/415 233/265/416
f 233/265/416 209/241/415 210/242/417 234/266/418
f 234/266/418 210/242/417 211/243/419 235/267/420
f 235/267/420 211/243/419 212/244/421 236/268/422
f 236/268/422 212/244/421 213/245/423 237/269/424
f 237/269/424 213/245/423 214/246/425 238/270/426
f 238/270/426 214/246/425 215/247/427 239/271/428
f 239/271/428 215/247/427 216/248/429 240/272/430
f 240/272/430 216/248/429 217/249/431 241/273/432
f 241/273/432 217/249/431 218/250/433 242/274/434
f 242/274/434 218/250/433 195/227/388 219/251/387
s 11
f 243/275/435 219/251/436 220/252/437 244/276/438
f 244/276/438 220/252/437 221/253/439 245/277/440
f 245/277/440 221/253/439 222/254/441 246/278/442
f 246/278/442 222/254/441 223/255/443 247/279/444
f 247/279/444 223/255/443 224/256/445 248/280/446
f 248/280/446 224/256/445 225/257/447 249/281/448
f 249/281/448 225/257/447 226/258/449 250/282/450
f 250/282/450 226/258/449 227/259/451 251/283/452
f 251/283/452 227/259/451 228/260/453 252/284/454
f 252/284/454 228/260/453 229/261/455 253/285/456
f 253/285/456 229/261/455 230/262/457 254/286/458
f 254/286/458 230/262/457 231/263/459 255/287/460
f 255/287/460 231/263/459 232/264/461 256/288/462
f 256/288/462 232/264/461 233/265/463 257/289/464
f 257/289/464 233/265/463 234/266/465 258/290/466
f 258/290/466 234/266/465 235/267/467 259/291/468
f 259/291/468 235/267/467 236/268/469 260/292/470
f 260/292/470 236/268/469 237/269/471 261/293/472
f 261/293/472 237/269/471 238/270/473 262/294/474
f 262/294/474 238/270/473 239/271/475 263/295/476
f 263/295/476 239/271/475 240/272/477 264/296/478
f 264/296/478 240/272/477 241/273/479 265/297/480
f 265/297/480 241/273/479 242/274/481 266/298/482
f 266/298/482 242/274/481 219/251/436 243/275/435
s 12
f 267/299/483 243/300/484 244/301/485 268/302/486
f 268/302/486 244/301/485 245/303/487 269/304/488
f 269/305/488 245/306/487 246/307/489 270/308/490
f 270/308/490 246/307/489 247/309/491 271/310/492
f 271/310/492 247/309/491 248/311/493 272/312/494
f 272/312/494 248/311/493 249/313/495 273/314/496
f 273/314/496 249/313/495 250/315/497 274/316/498
f 274/316/498 250/315/497 251/317/499 275/318/500
f 275/318/500 251/317/499 252/319/501 276/320/502
f 276/320/502 252/319/501 253/321/503 277/322/504
f 277/323/504 253/324/503 254/325/505 278/326/506
f 278/326/506 254/325/505 255/327/507 279/328/508
f 279/328/508 255/327/507 256/329/509 280/330/510
f 280/330/510 256/329/509 257/331/511 281/332/512
f 281/333/512 257/334/511 258/335/513 282/336/514
f 282/336/514 258/335/513 259/337/515 283/338/516
f 283/338/516 259/337/515 260/339/517 284/340/518
f 284/340/518 260/339/517 261/341/519 285/342/520
f 285/342/520 261/341/519 262/343/521 286/344/522
f 286/344/522 262/343/521 263/345/523 287/346/524
f 287/346/524 263/345/523 264/347/525 288/348/526
f 288/348/526 264/347/525 265/349/527 289/350/528
f 289/351/528 265/352/527 266/353/529 290/354/530
f 290/354/530 266/353/529 243/300/484 267/299/483
s 13
f 267/355/531 122/356/532 145/357/533 290/358/534
f 290/358/534 145/357/533 144/359/535 289/360/536
f 289/360/536 144/359/535 143/361/537 288/362/538
f 288/362/538 143/361/537 142/363/539 287/364/540
f 287/364/540 142/363/539 141/365/541 286/366/542
f 286/366/542 141/365/541 140/367/543 285/368/544
f 285/368/544 140/367/543 139/369/545 284/370/546
f 284/370/546 139/369/545 138/371/547 283/372/548
f 283/372/548 138/371/547 137/373/549 282/374/550
f 282/374/550 137/373/549 136/375/551 281/376/552
f 281/376/552 136/375/551 135/377/553 280/378/554
f 280/378/554 135/377/553 134/379/555 279/380/556
f 279/380/556 134/379/555 133/381/557 278/382/558
f 278/382/558 133/381/557 132/383/559 277/384/560
f 277/384/560 132/383/559 131/385/561 276/386/562
f 276/386/562 131/385/561 130/387/563 275/388/564
f 275/388/564 130/387/563 129/389/565 274/390/566
f 274/390/566 129/389/565 128/391/567 273/392/568
f 273/392/568 128/391/567 127/393/569 272/394/570
f 272/394/570 127/393/569 126/395/571 271/396/572
f 271/396/572 126/395/571 125/397/573 270/398/574
f 270/398/574 125/397/573 124/399/575 269/400/576
f 269/400/576 124/399/575 123/401/577 268/402/578
f 268/402/578 123/401/577 122/356/532 267/355/531
s off
f 291/403/579 292/404/580 293/405/581 294/406/582
f 295/407/583 296/408/584 297/409/585 298/410/586
f 291/411/587 294/412/588 296/413/589 295/414/590
f 294/415/591 293/416/592 297/417/593 296/418/594
f 292/419/595 291/420/596 295/421/597 298/422/598
f 299/423/599 300/424/600 301/425/601 302/426/602
f 303/427/603 304/428/604 305/429/605 306/430/606
f 302/431/607 301/432/608 305/433/609 304/434/610
f 300/435/611 299/436/612 303/437/613 306/438/614
f 307/439/615 308/440/616 309/441/617 310/442/618
f 311/443/619 312/444/620 313/445/621 314/446/622
f 310/447/623 309/448/624 313/449/625 312/450/626
f 308/451/627 307/452/628 311/453/629 314/454/630
f 315/455/631 316/456/632 317/457/633 318/458/634
f 316/456/635 319/459/636 320/460/637 317/457/638
f 319/461/639 321/462/640 322/463/641 320/464/642
f 321/462/643 323/465/644 324/466/645 322/463/646
f 323/467/647 325/468/648 326/469/649 324/470/650
f 325/468/651 315/471/652 318/472/653 326/469/654
