%YAML 1.1
%TAG !u! tag:unity3d.com,2011:
--- !u!208 &656707535367140013
NavMeshObstacle:
  m_ObjectHideFlags: 0
  m_CorrespondingSourceObject: {fileID: 0}
  m_PrefabInstance: {fileID: 0}
  m_PrefabAsset: {fileID: 0}
  m_GameObject: {fileID: 9223296167398468323}
  m_Enabled: 1
  serializedVersion: 3
  m_Shape: 1
  m_Extents: {x: 0.5, y: 1.725, z: 0.5}
  m_MoveThreshold: 0.1
  m_Carve: 1
  m_CarveOnlyStationary: 0
  m_Center: {x: 0, y: 0, z: 0}
  m_TimeToStationary: 0.5
--- !u!1001 &9223296167398370369
PrefabInstance:
  m_ObjectHideFlags: 0
  serializedVersion: 2
  m_Modification:
    m_TransformParent: {fileID: 0}
    m_Modifications:
    - target: {fileID: 100002, guid: d5c5b772f5d91e7429331b5ee2068a08, type: 3}
      propertyPath: m_Name
      value: lamppost Variant
      objectReference: {fileID: 0}
    - target: {fileID: 100002, guid: d5c5b772f5d91e7429331b5ee2068a08, type: 3}
      propertyPath: m_Layer
      value: 2
      objectReference: {fileID: 0}
    - target: {fileID: 100000, guid: d5c5b772f5d91e7429331b5ee2068a08, type: 3}
      propertyPath: m_Layer
      value: 2
      objectReference: {fileID: 0}
    - target: {fileID: 400002, guid: d5c5b772f5d91e7429331b5ee2068a08, type: 3}
      propertyPath: m_LocalPosition.x
      value: -0.5
      objectReference: {fileID: 0}
    - target: {fileID: 400002, guid: d5c5b772f5d91e7429331b5ee2068a08, type: 3}
      propertyPath: m_LocalPosition.y
      value: 1.6188066
      objectReference: {fileID: 0}
    - target: {fileID: 400002, guid: d5c5b772f5d91e7429331b5ee2068a08, type: 3}
      propertyPath: m_LocalPosition.z
      value: -5.77
      objectReference: {fileID: 0}
    - target: {fileID: 400002, guid: d5c5b772f5d91e7429331b5ee2068a08, type: 3}
      propertyPath: m_LocalRotation.x
      value: 0
      objectReference: {fileID: 0}
    - target: {fileID: 400002, guid: d5c5b772f5d91e7429331b5ee2068a08, type: 3}
      propertyPath: m_LocalRotation.y
      value: -0
      objectReference: {fileID: 0}
    - target: {fileID: 400002, guid: d5c5b772f5d91e7429331b5ee2068a08, type: 3}
      propertyPath: m_LocalRotation.z
      value: -0
      objectReference: {fileID: 0}
    - target: {fileID: 400002, guid: d5c5b772f5d91e7429331b5ee2068a08, type: 3}
      propertyPath: m_LocalRotation.w
      value: 1
      objectReference: {fileID: 0}
    - target: {fileID: 400002, guid: d5c5b772f5d91e7429331b5ee2068a08, type: 3}
      propertyPath: m_RootOrder
      value: 0
      objectReference: {fileID: 0}
    - target: {fileID: 400002, guid: d5c5b772f5d91e7429331b5ee2068a08, type: 3}
      propertyPath: m_LocalEulerAnglesHint.x
      value: 0
      objectReference: {fileID: 0}
    - target: {fileID: 400002, guid: d5c5b772f5d91e7429331b5ee2068a08, type: 3}
      propertyPath: m_LocalEulerAnglesHint.y
      value: 0
      objectReference: {fileID: 0}
    - target: {fileID: 400002, guid: d5c5b772f5d91e7429331b5ee2068a08, type: 3}
      propertyPath: m_LocalEulerAnglesHint.z
      value: 0
      objectReference: {fileID: 0}
    - target: {fileID: 2300000, guid: d5c5b772f5d91e7429331b5ee2068a08, type: 3}
      propertyPath: m_Materials.Array.data[0]
      value: 
      objectReference: {fileID: 2100000, guid: 838c0e4e7a53de146803b78bb72d5013, type: 2}
    m_RemovedComponents: []
  m_SourcePrefab: {fileID: 100100000, guid: d5c5b772f5d91e7429331b5ee2068a08, type: 3}
--- !u!1 &9223296167398468323 stripped
GameObject:
  m_CorrespondingSourceObject: {fileID: 100002, guid: d5c5b772f5d91e7429331b5ee2068a08,
    type: 3}
  m_PrefabInstance: {fileID: 9223296167398370369}
  m_PrefabAsset: {fileID: 0}
