# This file uses centimeters as units for non-parametric coordinates.

mtllib bars0.mtl
g default
v 0.153705 8.450409 -4.363552
v -0.066863 8.450409 -4.363552
v 0.153705 8.670975 -4.363552
v -0.066863 8.670975 -4.363552
v 0.153700 8.670975 3.824848
v -0.066867 8.670975 3.824848
v 0.153700 8.450409 3.824848
v -0.066867 8.450409 3.824848
v 0.200575 -0.377083 3.382424
v -0.108421 -0.377083 3.382428
v 0.200575 -0.214927 3.382424
v -0.108421 -0.214927 3.382428
v 0.200582 -0.214927 3.659730
v -0.108413 -0.214927 3.659730
v 0.365663 -0.214927 3.937695
v -0.273502 -0.214927 3.937702
v 0.280916 -0.214927 4.235226
v -0.188766 -0.214927 4.235229
v 0.280916 -0.377083 4.235226
v -0.188766 -0.377083 4.235229
v 0.365663 -0.377083 3.937695
v -0.273502 -0.377083 3.937702
v 0.200582 -0.377083 3.659730
v -0.108413 -0.377083 3.659730
v 0.200575 7.099635 3.382424
v -0.108421 7.099635 3.382428
v 0.200575 7.261792 3.382424
v -0.108421 7.261792 3.382428
v 0.200582 7.261792 3.659730
v -0.108413 7.261792 3.659730
v 0.365663 7.261792 3.937695
v -0.273502 7.261792 3.937702
v 0.280916 7.261792 4.235226
v -0.188766 7.261792 4.235229
v 0.280916 7.099635 4.235226
v -0.188766 7.099635 4.235229
v 0.365663 7.099635 3.937695
v -0.273502 7.099635 3.937702
v 0.200582 7.099635 3.659730
v -0.108413 7.099635 3.659730
v -0.070593 -2.798375 4.133442
v 0.156919 -2.798375 4.133442
v 0.270672 -2.798375 3.936411
v 0.156919 -2.798375 3.739381
v -0.070593 -2.798375 3.739381
v -0.184346 -2.798375 3.936411
v -0.070593 9.073943 4.133442
v 0.156919 9.073943 4.133442
v 0.270672 9.073943 3.936411
v 0.156919 9.073943 3.739381
v -0.070593 9.073943 3.739381
v -0.184346 9.073943 3.936411
v 0.043161 -2.798375 3.936411
v 0.043161 9.073943 3.936411
v 0.153705 -1.956417 -4.363552
v -0.066863 -1.956417 -4.363552
v 0.153705 -1.735851 -4.363552
v -0.066863 -1.735851 -4.363552
v 0.153700 -1.735851 3.824848
v -0.066867 -1.735851 3.824848
v 0.153700 -1.956417 3.824848
v -0.066867 -1.956417 3.824848
v -0.070593 -2.798375 -4.123798
v 0.156922 -2.798375 -4.123798
v 0.270676 -2.798375 -4.320827
v 0.156922 -2.798375 -4.517857
v -0.070593 -2.798375 -4.517857
v -0.184346 -2.798375 -4.320829
v -0.070593 9.073943 -4.123798
v 0.156922 9.073943 -4.123798
v 0.270676 9.073943 -4.320827
v 0.156922 9.073943 -4.517857
v -0.070593 9.073943 -4.517857
v -0.184346 9.073943 -4.320829
v 0.043168 -2.798375 -4.320829
v 0.043168 9.073943 -4.320829
v 0.161441 -1.439810 -3.981260
v -0.068239 -1.439810 -3.981264
v 0.161441 -1.324396 -3.981260
v -0.068239 -1.324396 -3.981264
v 0.161441 8.032956 -3.981260
v -0.068239 8.032956 -3.981264
v 0.161441 8.148367 -3.981260
v -0.068239 8.148367 -3.981264
v 0.161441 8.148367 -3.855124
v -0.068238 8.148367 -3.855124
v 0.161448 8.148367 3.470579
v -0.068235 8.148367 3.470579
v 0.161441 8.148367 3.596715
v -0.068243 8.148367 3.596712
v 0.161441 8.032954 3.596715
v -0.068243 8.032954 3.596712
v 0.161441 -1.324400 3.596715
v -0.068243 -1.324400 3.596712
v 0.161441 -1.439810 3.596715
v -0.068243 -1.439810 3.596712
v 0.161441 -1.439810 3.470575
v -0.068242 -1.439810 3.470579
v 0.161441 -1.439810 -3.855127
v -0.068238 -1.439810 -3.855124
v -0.068242 -1.324396 3.470579
v -0.068238 -1.324396 -3.855124
v -0.068242 8.032956 3.470579
v -0.068238 8.032956 -3.855124
v 0.161441 -1.324396 3.470575
v 0.161441 -1.324396 -3.855127
v 0.161441 8.032956 3.470575
v 0.161441 8.032956 -3.855127
v 0.161441 3.309449 -3.981260
v -0.068239 3.309449 -3.981264
v -0.068238 3.309449 -3.855124
v 0.161441 3.309449 -3.855127
v 0.161441 3.158756 -3.981260
v -0.068239 3.158756 -3.981264
v -0.068238 3.158756 -3.855124
v 0.161441 3.158756 -3.855127
v 0.161441 3.317569 3.596715
v -0.068243 3.317569 3.596712
v -0.068242 3.317571 3.470579
v 0.161441 3.317571 3.470575
v -0.068242 3.175091 3.470579
v -0.068243 3.175086 3.596712
v 0.161441 3.175086 3.596715
v 0.161441 3.175091 3.470575
v -0.108417 -0.377083 -3.763168
v 0.200575 -0.377083 -3.763168
v -0.108417 -0.214927 -3.763168
v 0.200575 -0.214927 -3.763168
v -0.108417 -0.214927 -4.040470
v 0.200575 -0.214927 -4.040470
v -0.273502 -0.214927 -4.318438
v 0.365660 -0.214927 -4.318438
v -0.188762 -0.214927 -4.615965
v 0.280920 -0.214927 -4.615969
v -0.188762 -0.377083 -4.615965
v 0.280920 -0.377083 -4.615969
v -0.273502 -0.377083 -4.318438
v 0.365660 -0.377083 -4.318438
v -0.108417 -0.377083 -4.040470
v 0.200575 -0.377083 -4.040470
v -0.108417 7.099635 -3.763168
v 0.200575 7.099635 -3.763168
v -0.108417 7.261792 -3.763168
v 0.200575 7.261792 -3.763168
v -0.108417 7.261792 -4.040470
v 0.200575 7.261792 -4.040470
v -0.273502 7.261792 -4.318438
v 0.365660 7.261792 -4.318438
v -0.188762 7.261792 -4.615965
v 0.280920 7.261792 -4.615969
v -0.188762 7.099635 -4.615965
v 0.280920 7.099635 -4.615969
v -0.273502 7.099635 -4.318438
v 0.365660 7.099635 -4.318438
v -0.108417 7.099635 -4.040470
v 0.200575 7.099635 -4.040470
vt 0.375000 0.000000
vt 0.625000 0.000000
vt 0.625000 0.250000
vt 0.375000 0.250000
vt 0.625000 0.500000
vt 0.375000 0.500000
vt 0.625000 0.750000
vt 0.375000 0.750000
vt 0.625000 1.000000
vt 0.375000 1.000000
vt 0.875000 0.000000
vt 0.875000 0.250000
vt 0.125000 0.000000
vt 0.125000 0.250000
vt 0.375000 0.000000
vt 0.625000 0.000000
vt 0.625000 0.250000
vt 0.375000 0.250000
vt 0.625000 0.333333
vt 0.375000 0.333333
vt 0.625000 0.416667
vt 0.375000 0.416667
vt 0.625000 0.500000
vt 0.375000 0.500000
vt 0.625000 0.750000
vt 0.375000 0.750000
vt 0.625000 0.833333
vt 0.375000 0.833333
vt 0.625000 0.916667
vt 0.375000 0.916667
vt 0.625000 1.000000
vt 0.375000 1.000000
vt 0.791667 0.000000
vt 0.875000 0.000000
vt 0.875000 0.250000
vt 0.791667 0.250000
vt 0.708333 0.000000
vt 0.708333 0.250000
vt 0.125000 0.000000
vt 0.208333 0.000000
vt 0.208333 0.250000
vt 0.125000 0.250000
vt 0.291667 0.000000
vt 0.291667 0.250000
vt 0.375000 0.000000
vt 0.625000 0.000000
vt 0.625000 0.250000
vt 0.375000 0.250000
vt 0.625000 0.333333
vt 0.375000 0.333333
vt 0.625000 0.416667
vt 0.375000 0.416667
vt 0.625000 0.500000
vt 0.375000 0.500000
vt 0.625000 0.750000
vt 0.375000 0.750000
vt 0.625000 0.833333
vt 0.375000 0.833333
vt 0.625000 0.916667
vt 0.375000 0.916667
vt 0.625000 1.000000
vt 0.375000 1.000000
vt 0.791667 0.000000
vt 0.875000 0.000000
vt 0.875000 0.250000
vt 0.791667 0.250000
vt 0.708333 0.000000
vt 0.708333 0.250000
vt 0.125000 0.000000
vt 0.208333 0.000000
vt 0.208333 0.250000
vt 0.125000 0.250000
vt 0.291667 0.000000
vt 0.291667 0.250000
vt 0.375000 0.312500
vt 0.416667 0.312500
vt 0.416667 0.688440
vt 0.375000 0.688440
vt 0.458333 0.312500
vt 0.458333 0.688440
vt 0.500000 0.312500
vt 0.500000 0.688440
vt 0.541667 0.312500
vt 0.541667 0.688440
vt 0.583333 0.312500
vt 0.583333 0.688440
vt 0.625000 0.312500
vt 0.625000 0.688440
vt 0.421875 0.020934
vt 0.578125 0.020934
vt 0.500000 0.150000
vt 0.343750 0.156250
vt 0.421875 0.291566
vt 0.578125 0.291566
vt 0.656250 0.156250
vt 0.578125 0.979066
vt 0.421875 0.979066
vt 0.500000 0.837500
vt 0.343750 0.843750
vt 0.421875 0.708434
vt 0.578125 0.708434
vt 0.656250 0.843750
vt 0.375000 0.000000
vt 0.625000 0.000000
vt 0.625000 0.250000
vt 0.375000 0.250000
vt 0.625000 0.500000
vt 0.375000 0.500000
vt 0.625000 0.750000
vt 0.375000 0.750000
vt 0.625000 1.000000
vt 0.375000 1.000000
vt 0.875000 0.000000
vt 0.875000 0.250000
vt 0.125000 0.000000
vt 0.125000 0.250000
vt 0.375000 0.312500
vt 0.416667 0.312500
vt 0.416667 0.688440
vt 0.375000 0.688440
vt 0.458333 0.312500
vt 0.458333 0.688440
vt 0.500000 0.312500
vt 0.500000 0.688440
vt 0.541667 0.312500
vt 0.541667 0.688440
vt 0.583333 0.312500
vt 0.583333 0.688440
vt 0.625000 0.312500
vt 0.625000 0.688440
vt 0.421875 0.020934
vt 0.578125 0.020934
vt 0.500000 0.150000
vt 0.343750 0.156250
vt 0.421875 0.291566
vt 0.578125 0.291566
vt 0.656250 0.156250
vt 0.578125 0.979066
vt 0.421875 0.979066
vt 0.500000 0.837500
vt 0.343750 0.843750
vt 0.421875 0.708434
vt 0.578125 0.708434
vt 0.656250 0.843750
vt 0.375000 0.000000
vt 0.625000 0.000000
vt 0.625000 0.083333
vt 0.375000 0.083333
vt 0.375000 0.124601
vt 0.625000 0.124601
vt 0.625000 0.166667
vt 0.375000 0.166667
vt 0.625000 0.250000
vt 0.375000 0.250000
vt 0.625000 0.333333
vt 0.375000 0.333333
vt 0.625000 0.416667
vt 0.375000 0.416667
vt 0.625000 0.500000
vt 0.375000 0.500000
vt 0.625000 0.583333
vt 0.375000 0.583333
vt 0.375000 0.625327
vt 0.625000 0.625327
vt 0.625000 0.626596
vt 0.375000 0.626596
vt 0.375000 0.666667
vt 0.625000 0.666667
vt 0.625000 0.750000
vt 0.375000 0.750000
vt 0.625000 0.833333
vt 0.375000 0.833333
vt 0.625000 0.916667
vt 0.375000 0.916667
vt 0.625000 1.000000
vt 0.375000 1.000000
vt 0.791667 0.000000
vt 0.875000 0.000000
vt 0.875000 0.083333
vt 0.791667 0.083333
vt 0.708333 0.000000
vt 0.708333 0.083333
vt 0.791667 0.123404
vt 0.875000 0.123404
vt 0.875000 0.124673
vt 0.791667 0.124673
vt 0.708333 0.124601
vt 0.708333 0.166667
vt 0.791667 0.166667
vt 0.875000 0.166667
vt 0.875000 0.250000
vt 0.791667 0.250000
vt 0.708333 0.250000
vt 0.125000 0.000000
vt 0.208333 0.000000
vt 0.208333 0.083333
vt 0.125000 0.083333
vt 0.291667 0.000000
vt 0.291667 0.083333
vt 0.125000 0.123404
vt 0.208333 0.123404
vt 0.208333 0.124673
vt 0.125000 0.124673
vt 0.291667 0.124601
vt 0.291667 0.166667
vt 0.125000 0.166667
vt 0.208333 0.166667
vt 0.208333 0.250000
vt 0.125000 0.250000
vt 0.291667 0.250000
vt 0.375000 0.123259
vt 0.625000 0.123259
vt 0.708333 0.123259
vt 0.291667 0.123259
vt 0.375000 0.000000
vt 0.625000 0.000000
vt 0.625000 0.250000
vt 0.375000 0.250000
vt 0.625000 0.333333
vt 0.375000 0.333333
vt 0.625000 0.416667
vt 0.375000 0.416667
vt 0.625000 0.500000
vt 0.375000 0.500000
vt 0.625000 0.750000
vt 0.375000 0.750000
vt 0.625000 0.833333
vt 0.375000 0.833333
vt 0.625000 0.916667
vt 0.375000 0.916667
vt 0.625000 1.000000
vt 0.375000 1.000000
vt 0.791667 0.000000
vt 0.875000 0.000000
vt 0.875000 0.250000
vt 0.791667 0.250000
vt 0.708333 0.000000
vt 0.708333 0.250000
vt 0.125000 0.000000
vt 0.208333 0.000000
vt 0.208333 0.250000
vt 0.125000 0.250000
vt 0.291667 0.000000
vt 0.291667 0.250000
vt 0.375000 0.000000
vt 0.625000 0.000000
vt 0.625000 0.250000
vt 0.375000 0.250000
vt 0.625000 0.333333
vt 0.375000 0.333333
vt 0.625000 0.416667
vt 0.375000 0.416667
vt 0.625000 0.500000
vt 0.375000 0.500000
vt 0.625000 0.750000
vt 0.375000 0.750000
vt 0.625000 0.833333
vt 0.375000 0.833333
vt 0.625000 0.916667
vt 0.375000 0.916667
vt 0.625000 1.000000
vt 0.375000 1.000000
vt 0.791667 0.000000
vt 0.875000 0.000000
vt 0.875000 0.250000
vt 0.791667 0.250000
vt 0.708333 0.000000
vt 0.708333 0.250000
vt 0.125000 0.000000
vt 0.208333 0.000000
vt 0.208333 0.250000
vt 0.125000 0.250000
vt 0.291667 0.000000
vt 0.291667 0.250000
vn 0.000000 0.000000 -1.000000
vn 0.000000 0.000000 -1.000000
vn 0.000000 0.000000 -1.000000
vn 0.000000 0.000000 -1.000000
vn 0.000000 1.000000 0.000000
vn 0.000000 1.000000 0.000000
vn 0.000000 1.000000 0.000000
vn 0.000000 1.000000 0.000000
vn 0.000000 0.000000 1.000000
vn 0.000000 0.000000 1.000000
vn 0.000000 0.000000 1.000000
vn 0.000000 0.000000 1.000000
vn 0.000000 -1.000000 0.000000
vn 0.000000 -1.000000 0.000000
vn 0.000000 -1.000000 0.000000
vn 0.000000 -1.000000 0.000000
vn -1.000000 0.000000 -0.000001
vn -1.000000 0.000000 -0.000001
vn -1.000000 0.000000 -0.000001
vn -1.000000 0.000000 -0.000001
vn 1.000000 0.000000 0.000001
vn 1.000000 0.000000 0.000001
vn 1.000000 0.000000 0.000001
vn 1.000000 0.000000 0.000001
vn -0.000012 0.000000 -1.000000
vn -0.000012 0.000000 -1.000000
vn -0.000012 0.000000 -1.000000
vn -0.000012 0.000000 -1.000000
vn 0.000000 1.000000 -0.000000
vn 0.000000 1.000000 -0.000000
vn 0.000000 1.000000 -0.000000
vn 0.000000 1.000000 -0.000000
vn 0.000000 1.000000 -0.000000
vn 0.000000 1.000000 -0.000000
vn 0.000000 1.000000 0.000000
vn 0.000000 1.000000 0.000000
vn 0.000008 0.000000 1.000000
vn 0.000008 0.000000 1.000000
vn 0.000008 0.000000 1.000000
vn 0.000008 0.000000 1.000000
vn 0.000000 -1.000000 -0.000000
vn 0.000000 -1.000000 -0.000000
vn 0.000000 -1.000000 -0.000000
vn 0.000000 -1.000000 -0.000000
vn 0.000000 -1.000000 0.000000
vn 0.000000 -1.000000 0.000000
vn 0.000000 -1.000000 0.000000
vn 0.000000 -1.000000 0.000000
vn -0.990393 0.000000 -0.138281
vn -0.961756 0.000000 0.273908
vn -0.961756 0.000000 0.273908
vn -0.990393 0.000000 -0.138281
vn -0.958537 0.000000 -0.284969
vn -0.958537 0.000000 -0.284969
vn -1.000000 0.000000 0.000028
vn -1.000000 0.000000 0.000028
vn 0.961747 0.000000 0.273938
vn 0.990397 0.000000 -0.138250
vn 0.990397 0.000000 -0.138250
vn 0.961747 0.000000 0.273938
vn 0.958533 0.000000 -0.284983
vn 0.958533 0.000000 -0.284983
vn 1.000000 0.000000 -0.000028
vn 1.000000 0.000000 -0.000028
vn -0.000013 0.000000 -1.000000
vn -0.000013 0.000000 -1.000000
vn -0.000013 0.000000 -1.000000
vn -0.000013 0.000000 -1.000000
vn 0.000000 1.000000 0.000001
vn 0.000000 1.000000 0.000001
vn 0.000000 1.000000 0.000002
vn 0.000000 1.000000 0.000002
vn 0.000000 1.000000 0.000001
vn 0.000000 1.000000 0.000001
vn 0.000000 1.000000 -0.000000
vn 0.000000 1.000000 -0.000000
vn 0.000007 0.000000 1.000000
vn 0.000007 0.000000 1.000000
vn 0.000007 0.000000 1.000000
vn 0.000007 0.000000 1.000000
vn 0.000000 -1.000000 -0.000002
vn 0.000000 -1.000000 -0.000002
vn 0.000000 -1.000000 -0.000001
vn 0.000000 -1.000000 -0.000001
vn 0.000000 -1.000000 0.000000
vn 0.000000 -1.000000 0.000000
vn 0.000000 -1.000000 -0.000001
vn 0.000000 -1.000000 -0.000001
vn -0.990393 0.000000 -0.138280
vn -0.961756 0.000000 0.273909
vn -0.961756 0.000000 0.273909
vn -0.990393 0.000000 -0.138280
vn -0.958537 0.000000 -0.284969
vn -0.958537 0.000000 -0.284969
vn -1.000000 0.000000 0.000028
vn -1.000000 0.000000 0.000028
vn 0.961747 0.000000 0.273939
vn 0.990397 0.000000 -0.138250
vn 0.990397 0.000000 -0.138250
vn 0.961747 0.000000 0.273939
vn 0.958533 0.000000 -0.284983
vn 0.958533 0.000000 -0.284983
vn 1.000000 0.000000 -0.000028
vn 1.000000 0.000000 -0.000028
vn -0.500003 0.000000 0.866024
vn 0.500003 0.000000 0.866024
vn 0.500003 0.000000 0.866024
vn -0.500003 0.000000 0.866024
vn 1.000000 0.000000 0.000000
vn 1.000000 0.000000 0.000000
vn 0.500003 0.000000 -0.866024
vn 0.500003 0.000000 -0.866024
vn -0.500003 0.000000 -0.866024
vn -0.500003 0.000000 -0.866024
vn -1.000000 0.000000 0.000000
vn -1.000000 0.000000 0.000000
vn 0.000000 -1.000000 -0.000001
vn 0.000000 -1.000000 0.000001
vn 0.000000 -1.000000 -0.000000
vn 0.000000 -1.000000 -0.000001
vn 0.000000 -1.000000 0.000000
vn 0.000000 -1.000000 -0.000001
vn 0.000000 -1.000000 0.000000
vn 0.000000 1.000000 -0.000003
vn 0.000000 1.000000 0.000003
vn 0.000000 1.000000 -0.000001
vn 0.000000 1.000000 0.000000
vn 0.000000 1.000000 -0.000003
vn 0.000000 1.000000 -0.000000
vn 0.000000 1.000000 -0.000003
vn 0.000000 0.000000 -1.000000
vn 0.000000 0.000000 -1.000000
vn 0.000000 0.000000 -1.000000
vn 0.000000 0.000000 -1.000000
vn 0.000000 1.000000 -0.000000
vn 0.000000 1.000000 -0.000000
vn 0.000000 1.000000 -0.000000
vn 0.000000 1.000000 -0.000000
vn 0.000000 0.000000 1.000000
vn 0.000000 0.000000 1.000000
vn 0.000000 0.000000 1.000000
vn 0.000000 0.000000 1.000000
vn 0.000000 -1.000000 -0.000000
vn 0.000000 -1.000000 -0.000000
vn 0.000000 -1.000000 -0.000000
vn 0.000000 -1.000000 -0.000000
vn -1.000000 0.000000 -0.000001
vn -1.000000 0.000000 -0.000001
vn -1.000000 0.000000 -0.000001
vn -1.000000 0.000000 -0.000001
vn 1.000000 0.000000 0.000001
vn 1.000000 0.000000 0.000001
vn 1.000000 0.000000 0.000001
vn 1.000000 0.000000 0.000001
vn -0.500000 0.000000 0.866026
vn 0.499996 0.000000 0.866028
vn 0.499996 0.000000 0.866028
vn -0.500000 0.000000 0.866026
vn 1.000000 0.000000 0.000000
vn 1.000000 0.000000 0.000000
vn 0.499995 0.000000 -0.866028
vn 0.499995 0.000000 -0.866028
vn -0.499992 0.000000 -0.866030
vn -0.499992 0.000000 -0.866030
vn -1.000000 0.000000 0.000000
vn -1.000000 0.000000 0.000000
vn 0.000000 -1.000000 0.000001
vn 0.000000 -1.000000 0.000001
vn 0.000000 -1.000000 -0.000000
vn 0.000000 -1.000000 0.000000
vn 0.000000 -1.000000 -0.000001
vn 0.000000 -1.000000 -0.000002
vn 0.000000 -1.000000 -0.000001
vn 0.000000 1.000000 -0.000005
vn 0.000000 1.000000 -0.000003
vn 0.000000 1.000000 0.000000
vn 0.000000 1.000000 0.000003
vn 0.000000 1.000000 0.000005
vn 0.000000 1.000000 0.000003
vn 0.000000 1.000000 -0.000003
vn 0.000017 0.000000 -1.000000
vn 0.000017 0.000000 -1.000000
vn 0.000017 0.000000 -1.000000
vn 0.000017 0.000000 -1.000000
vn 0.000016 0.000000 -1.000000
vn 0.000016 0.000000 -1.000000
vn 0.000016 0.000000 -1.000000
vn 0.000016 0.000000 -1.000000
vn 0.000016 0.000000 -1.000000
vn 0.000016 0.000000 -1.000000
vn 0.000000 1.000000 0.000000
vn 0.000000 1.000000 0.000000
vn 0.000000 1.000000 -0.000000
vn 0.000000 1.000000 -0.000000
vn 0.000000 1.000000 -0.000000
vn 0.000000 1.000000 -0.000000
vn 0.000000 1.000000 -0.000002
vn 0.000000 1.000000 -0.000002
vn -0.000015 0.000000 1.000000
vn -0.000015 0.000000 1.000000
vn -0.000016 0.000000 1.000000
vn -0.000016 0.000000 1.000000
vn -0.000016 0.000000 1.000000
vn -0.000016 0.000000 1.000000
vn -0.000015 0.000000 1.000000
vn -0.000015 0.000000 1.000000
vn -0.000015 0.000000 1.000000
vn -0.000015 0.000000 1.000000
vn -0.000015 0.000000 1.000000
vn -0.000015 0.000000 1.000000
vn 0.000000 -1.000000 -0.000001
vn 0.000000 -1.000000 -0.000001
vn 0.000000 -1.000000 -0.000000
vn 0.000000 -1.000000 -0.000000
vn 0.000000 -1.000000 0.000000
vn 0.000000 -1.000000 0.000000
vn 0.000000 -1.000000 0.000000
vn 0.000000 -1.000000 0.000000
vn -1.000000 0.000000 -0.000001
vn -1.000000 0.000000 -0.000008
vn -1.000000 0.000000 -0.000008
vn -1.000000 0.000000 -0.000003
vn -1.000000 0.000000 -0.000000
vn -1.000000 0.000000 0.000003
vn -1.000000 0.000000 0.000008
vn -1.000000 0.000000 0.000008
vn -1.000000 0.000000 -0.000008
vn -1.000000 0.000000 -0.000008
vn -1.000000 0.000000 -0.000008
vn -1.000000 0.000000 -0.000008
vn -1.000000 0.000000 0.000008
vn -1.000000 0.000000 0.000008
vn -1.000000 0.000017 0.000003
vn -1.000000 0.000000 0.000008
vn -1.000000 0.000017 -0.000003
vn -1.000000 0.000001 -0.000008
vn -1.000000 0.000029 -0.000034
vn -1.000000 0.000029 -0.000001
vn -1.000000 0.000028 0.000000
vn -1.000000 0.000000 0.000008
vn 1.000000 0.000000 0.000000
vn 1.000000 0.000000 0.000000
vn 1.000000 0.000000 0.000000
vn 1.000000 0.000000 0.000000
vn 1.000000 0.000000 0.000000
vn 1.000000 0.000000 0.000000
vn 1.000000 0.000000 0.000000
vn 1.000000 0.000000 0.000000
vn 1.000000 0.000000 0.000000
vn 1.000000 0.000000 0.000000
vn 1.000000 0.000000 0.000000
vn 1.000000 0.000000 0.000000
vn 1.000000 0.000000 0.000000
vn 1.000000 0.000000 0.000000
vn 1.000000 -0.000000 0.000000
vn 1.000000 -0.000019 -0.000000
vn 1.000000 -0.000001 0.000001
vn 1.000000 -0.000019 -0.000000
vn 1.000000 -0.000033 0.000000
vn 1.000000 -0.000033 0.000030
vn 1.000000 -0.000032 -0.000001
vn 1.000000 -0.000000 0.000000
vn 0.000000 -1.000000 0.000000
vn 0.000000 -1.000000 0.000000
vn 0.000000 -1.000000 0.000000
vn 0.000000 -1.000000 0.000000
vn 0.000016 0.000000 1.000000
vn 0.000016 0.000000 1.000000
vn 0.000016 0.000000 1.000000
vn 0.000016 0.000000 1.000000
vn 0.000000 1.000000 -0.000000
vn 0.000000 1.000000 -0.000000
vn 0.000000 1.000000 -0.000000
vn 0.000000 1.000000 -0.000000
vn 0.000017 0.000000 -1.000000
vn 0.000017 0.000000 -1.000000
vn -1.000000 0.000000 0.000008
vn -1.000000 0.000000 0.000008
vn 1.000000 0.000000 0.000000
vn 1.000000 0.000000 0.000000
vn 0.000017 0.000000 1.000000
vn 0.000017 0.000000 1.000000
vn 0.000017 0.000000 1.000000
vn 0.000017 0.000000 1.000000
vn -0.000016 0.000000 -1.000000
vn -0.000016 0.000000 -1.000000
vn -0.000016 0.000000 -1.000000
vn -0.000016 0.000000 -1.000000
vn -0.000017 0.000000 -1.000000
vn -0.000017 0.000000 -1.000000
vn -0.000017 0.000000 -1.000000
vn -0.000017 0.000000 -1.000000
vn -0.000000 0.999999 -0.001109
vn -0.000000 0.999999 -0.001109
vn -0.000000 0.999999 -0.001109
vn -0.000000 0.999999 -0.001109
vn -1.000000 0.000000 -0.000001
vn -1.000000 0.000000 -0.000001
vn -1.000000 0.000000 -0.000001
vn -1.000000 0.000000 -0.000001
vn 0.000000 -0.999998 0.002230
vn 0.000000 -0.999998 0.002230
vn 0.000000 -0.999998 0.002230
vn 0.000000 -0.999998 0.002230
vn 1.000000 0.000000 0.000000
vn 1.000000 0.000000 0.000000
vn 1.000000 0.000000 0.000000
vn 1.000000 0.000000 0.000000
vn 0.000000 0.000000 1.000000
vn 0.000000 0.000000 1.000000
vn 0.000000 0.000000 1.000000
vn 0.000000 0.000000 1.000000
vn 0.000000 1.000000 0.000000
vn 0.000000 1.000000 0.000000
vn 0.000000 1.000000 0.000000
vn 0.000000 1.000000 0.000000
vn 0.000000 1.000000 0.000000
vn 0.000000 1.000000 0.000000
vn 0.000000 1.000000 0.000000
vn 0.000000 1.000000 0.000000
vn -0.000008 0.000000 -1.000000
vn -0.000008 0.000000 -1.000000
vn -0.000008 0.000000 -1.000000
vn -0.000008 0.000000 -1.000000
vn 0.000000 -1.000000 0.000000
vn 0.000000 -1.000000 0.000000
vn 0.000000 -1.000000 0.000000
vn 0.000000 -1.000000 0.000000
vn 0.000000 -1.000000 0.000000
vn 0.000000 -1.000000 0.000000
vn 0.000000 -1.000000 0.000000
vn 0.000000 -1.000000 0.000000
vn 0.990395 0.000000 0.138269
vn 0.961753 0.000000 -0.273919
vn 0.961753 0.000000 -0.273919
vn 0.990395 0.000000 0.138269
vn 0.958534 0.000000 0.284979
vn 0.958534 0.000000 0.284979
vn 1.000000 0.000000 0.000000
vn 1.000000 0.000000 0.000000
vn -0.961753 0.000000 -0.273920
vn -0.990395 0.000000 0.138269
vn -0.990395 0.000000 0.138269
vn -0.961753 0.000000 -0.273920
vn -0.958534 0.000000 0.284978
vn -0.958534 0.000000 0.284978
vn -1.000000 0.000000 0.000000
vn -1.000000 0.000000 0.000000
vn 0.000000 0.000000 1.000000
vn 0.000000 0.000000 1.000000
vn 0.000000 0.000000 1.000000
vn 0.000000 0.000000 1.000000
vn 0.000000 1.000000 0.000000
vn 0.000000 1.000000 0.000000
vn 0.000000 1.000000 0.000001
vn 0.000000 1.000000 0.000001
vn 0.000000 1.000000 -0.000001
vn 0.000000 1.000000 -0.000001
vn 0.000000 1.000000 -0.000001
vn 0.000000 1.000000 -0.000001
vn -0.000008 0.000000 -1.000000
vn -0.000008 0.000000 -1.000000
vn -0.000008 0.000000 -1.000000
vn -0.000008 0.000000 -1.000000
vn 0.000000 -1.000000 0.000000
vn 0.000000 -1.000000 0.000000
vn 0.000000 -1.000000 0.000000
vn 0.000000 -1.000000 0.000000
vn 0.000000 -1.000000 0.000000
vn 0.000000 -1.000000 0.000000
vn 0.000000 -1.000000 0.000000
vn 0.000000 -1.000000 0.000000
vn 0.990395 0.000000 0.138268
vn 0.961753 0.000000 -0.273918
vn 0.961753 0.000000 -0.273918
vn 0.990395 0.000000 0.138268
vn 0.958534 0.000000 0.284978
vn 0.958534 0.000000 0.284978
vn 1.000000 0.000000 0.000000
vn 1.000000 0.000000 0.000000
vn -0.961753 0.000000 -0.273919
vn -0.990395 0.000000 0.138269
vn -0.990395 0.000000 0.138269
vn -0.961753 0.000000 -0.273919
vn -0.958534 0.000000 0.284977
vn -0.958534 0.000000 0.284977
vn -1.000000 0.000000 0.000000
vn -1.000000 0.000000 0.000000
s off
g prop_bars0
usemtl initialShadingGroup
f 1/1/1 2/2/2 4/3/3 3/4/4
f 3/4/5 4/3/6 6/5/7 5/6/8
f 5/6/9 6/5/10 8/7/11 7/8/12
f 7/8/13 8/7/14 2/9/15 1/10/16
f 2/2/17 8/11/18 6/12/19 4/3/20
f 7/13/21 1/1/22 3/4/23 5/14/24
f 9/15/25 10/16/26 12/17/27 11/18/28
s 1
f 11/18/29 12/17/30 14/19/31 13/20/32
f 13/20/32 14/19/31 16/21/33 15/22/34
f 15/22/34 16/21/33 18/23/35 17/24/36
s off
f 17/24/37 18/23/38 20/25/39 19/26/40
s 2
f 19/26/41 20/25/42 22/27/43 21/28/44
f 21/28/44 22/27/43 24/29/45 23/30/46
f 23/30/46 24/29/45 10/31/47 9/32/48
s 3
f 22/33/49 20/34/50 18/35/51 16/36/52
f 24/37/53 22/33/49 16/36/52 14/38/54
f 10/16/55 24/37/53 14/38/54 12/17/56
s 4
f 19/39/57 21/40/58 15/41/59 17/42/60
f 21/40/58 23/43/61 13/44/62 15/41/59
f 23/43/61 9/15/63 11/18/64 13/44/62
s off
f 25/45/65 26/46/66 28/47/67 27/48/68
s 5
f 27/48/69 28/47/70 30/49/71 29/50/72
f 29/50/72 30/49/71 32/51/73 31/52/74
f 31/52/74 32/51/73 34/53/75 33/54/76
s off
f 33/54/77 34/53/78 36/55/79 35/56/80
s 6
f 35/56/81 36/55/82 38/57/83 37/58/84
f 37/58/84 38/57/83 40/59/85 39/60/86
f 39/60/86 40/59/85 26/61/87 25/62/88
s 7
f 38/63/89 36/64/90 34/65/91 32/66/92
f 40/67/93 38/63/89 32/66/92 30/68/94
f 26/46/95 40/67/93 30/68/94 28/47/96
s 8
f 35/69/97 37/70/98 31/71/99 33/72/100
f 37/70/98 39/73/101 29/74/102 31/71/99
f 39/73/101 25/45/103 27/48/104 29/74/102
s 9
f 41/75/105 42/76/106 48/77/107 47/78/108
f 42/76/106 43/79/109 49/80/110 48/77/107
f 43/79/109 44/81/111 50/82/112 49/80/110
f 44/81/111 45/83/113 51/84/114 50/82/112
f 45/83/113 46/85/115 52/86/116 51/84/114
f 46/85/115 41/87/105 47/88/108 52/86/116
s 10
f 42/89/117 41/90/118 53/91/119
f 43/92/120 42/89/117 53/91/119
f 44/93/121 43/92/120 53/91/119
f 45/94/122 44/93/121 53/91/119
f 46/95/123 45/94/122 53/91/119
f 41/90/118 46/95/123 53/91/119
s 11
f 47/96/124 48/97/125 54/98/126
f 48/97/125 49/99/127 54/98/126
f 49/99/127 50/100/128 54/98/126
f 50/100/128 51/101/129 54/98/126
f 51/101/129 52/102/130 54/98/126
f 52/102/130 47/96/124 54/98/126
s off
f 55/103/131 56/104/132 58/105/133 57/106/134
f 57/106/135 58/105/136 60/107/137 59/108/138
f 59/108/139 60/107/140 62/109/141 61/110/142
f 61/110/143 62/109/144 56/111/145 55/112/146
f 56/104/147 62/113/148 60/114/149 58/105/150
f 61/115/151 55/103/152 57/106/153 59/116/154
s 12
f 63/117/155 64/118/156 70/119/157 69/120/158
f 64/118/156 65/121/159 71/122/160 70/119/157
f 65/121/159 66/123/161 72/124/162 71/122/160
f 66/123/161 67/125/163 73/126/164 72/124/162
f 67/125/163 68/127/165 74/128/166 73/126/164
f 68/127/165 63/129/155 69/130/158 74/128/166
s 13
f 64/131/167 63/132/168 75/133/169
f 65/134/170 64/131/167 75/133/169
f 66/135/171 65/134/170 75/133/169
f 67/136/172 66/135/171 75/133/169
f 68/137/173 67/136/172 75/133/169
f 63/132/168 68/137/173 75/133/169
s 14
f 69/138/174 70/139/175 76/140/176
f 70/139/175 71/141/177 76/140/176
f 71/141/177 72/142/178 76/140/176
f 72/142/178 73/143/179 76/140/176
f 73/143/179 74/144/180 76/140/176
f 74/144/180 69/138/174 76/140/176
s 15
f 77/145/181 78/146/182 80/147/183 79/148/184
f 109/149/185 110/150/186 82/151/187 81/152/188
f 81/152/188 82/151/187 84/153/189 83/154/190
s 17
f 83/154/191 84/153/192 86/155/193 85/156/194
f 85/156/194 86/155/193 88/157/195 87/158/196
f 87/158/196 88/157/195 90/159/197 89/160/198
s 18
f 89/160/199 90/159/200 92/161/201 91/162/202
f 117/163/203 118/164/204 122/165/205 123/166/206
f 93/167/207 94/168/208 96/169/209 95/170/210
s 19
f 95/170/211 96/169/212 98/171/213 97/172/214
f 97/172/214 98/171/213 100/173/215 99/174/216
f 99/174/216 100/173/215 78/175/217 77/176/218
s 20
f 98/177/219 96/178/220 94/179/221 101/180/222
f 100/181/223 98/177/219 101/180/222 102/182/224
f 78/146/225 100/181/223 102/182/224 80/147/226
f 121/183/227 122/184/228 118/185/229 119/186/230
f 110/150/231 111/187/232 104/188/233 82/151/234
f 103/189/235 92/190/236 90/191/237 88/192/238
f 104/188/233 103/189/235 88/192/238 86/193/239
f 82/151/234 104/188/233 86/193/239 84/153/240
s 22
f 95/194/241 97/195/242 105/196/243 93/197/244
f 97/195/242 99/198/245 106/199/246 105/196/243
f 99/198/245 77/145/247 79/148/248 106/199/246
f 123/200/249 124/201/250 120/202/251 117/203/252
f 112/204/253 109/149/254 81/152/255 108/205/256
f 91/206/257 107/207/258 87/208/259 89/209/260
f 107/207/258 108/205/256 85/210/261 87/208/259
f 108/205/256 81/152/255 83/154/262 85/210/261
s off
f 103/189/263 104/188/264 108/205/265 107/207/266
f 104/188/267 111/187/268 112/204/269 108/205/270
f 102/182/271 101/180/272 105/196/273 106/199/274
s 15
f 113/211/275 114/212/276 110/150/186 109/149/185
s 20
f 114/212/277 115/213/278 111/187/232 110/150/231
s 22
f 116/214/279 113/211/280 109/149/254 112/204/253
s 15
f 79/148/184 80/147/183 114/212/276 113/211/275
s 20
f 80/147/226 102/182/224 115/213/278 114/212/277
s off
f 116/214/281 115/213/282 102/182/283 106/199/284
s 22
f 106/199/246 79/148/248 113/211/280 116/214/279
s 18
f 91/162/202 92/161/201 118/164/204 117/163/203
s 20
f 119/186/230 118/185/229 92/190/236 103/189/235
s off
f 120/202/285 119/186/286 103/189/287 107/207/288
s 22
f 117/203/252 120/202/251 107/207/258 91/206/257
s 20
f 101/180/222 94/179/221 122/184/228 121/183/227
s 18
f 123/166/206 122/165/205 94/168/208 93/167/207
s 22
f 93/197/244 105/196/243 124/201/250 123/200/249
s off
f 101/180/289 121/183/290 124/201/291 105/196/292
f 112/204/293 111/187/294 119/186/295 120/202/296
f 111/187/297 115/213/298 121/183/299 119/186/300
f 115/213/301 116/214/302 124/201/303 121/183/304
f 116/214/305 112/204/306 120/202/307 124/201/308
f 125/215/309 126/216/310 128/217/311 127/218/312
s 24
f 127/218/313 128/217/314 130/219/315 129/220/316
f 129/220/316 130/219/315 132/221/317 131/222/318
f 131/222/318 132/221/317 134/223/319 133/224/320
s off
f 133/224/321 134/223/322 136/225/323 135/226/324
s 25
f 135/226/325 136/225/326 138/227/327 137/228/328
f 137/228/328 138/227/327 140/229/329 139/230/330
f 139/230/330 140/229/329 126/231/331 125/232/332
s 26
f 138/233/333 136/234/334 134/235/335 132/236/336
f 140/237/337 138/233/333 132/236/336 130/238/338
f 126/216/339 140/237/337 130/238/338 128/217/340
s 27
f 135/239/341 137/240/342 131/241/343 133/242/344
f 137/240/342 139/243/345 129/244/346 131/241/343
f 139/243/345 125/215/347 127/218/348 129/244/346
s off
f 141/245/349 142/246/350 144/247/351 143/248/352
s 28
f 143/248/353 144/247/354 146/249/355 145/250/356
f 145/250/356 146/249/355 148/251/357 147/252/358
f 147/252/358 148/251/357 150/253/359 149/254/360
s off
f 149/254/361 150/253/362 152/255/363 151/256/364
s 29
f 151/256/365 152/255/366 154/257/367 153/258/368
f 153/258/368 154/257/367 156/259/369 155/260/370
f 155/260/370 156/259/369 142/261/371 141/262/372
s 30
f 154/263/373 152/264/374 150/265/375 148/266/376
f 156/267/377 154/263/373 148/266/376 146/268/378
f 142/246/379 156/267/377 146/268/378 144/247/380
s 31
f 151/269/381 153/270/382 147/271/383 149/272/384
f 153/270/382 155/273/385 145/274/386 147/271/383
f 155/273/385 141/245/387 143/248/388 145/274/386
