<?xml version="1.0" encoding="UTF-8" standalone="no"?>
<!DOCTYPE svg PUBLIC "-//W3C//DTD SVG 1.1//EN"
 "http://www.w3.org/Graphics/SVG/1.1/DTD/svg11.dtd">
<!-- Generated by graphviz version 3.0.0 (20220226.1711)
 -->
<!-- Pages: 1 -->
<svg width="531pt" height="476pt"
 viewBox="0.00 0.00 531.25 476.00" xmlns="http://www.w3.org/2000/svg" xmlns:xlink="http://www.w3.org/1999/xlink">
<g id="graph0" class="graph" transform="scale(1 1) rotate(0) translate(4 472)">
<polygon fill="white" stroke="transparent" points="-4,4 -4,-472 527.25,-472 527.25,4 -4,4"/>
<!-- [root] aws_instance.experience (expand) -->
<g id="node1" class="node">
<title>[root] aws_instance.experience (expand)</title>
<polygon fill="none" stroke="black" points="197.98,-324 46.98,-324 46.98,-288 197.98,-288 197.98,-324"/>
<text text-anchor="middle" x="122.48" y="-302.3" font-family="Times,serif" font-size="14.00">aws_instance.experience</text>
</g>
<!-- [root] aws_network_interface.experience (expand) -->
<g id="node3" class="node">
<title>[root] aws_network_interface.experience (expand)</title>
<polygon fill="none" stroke="black" points="224.98,-252 19.98,-252 19.98,-216 224.98,-216 224.98,-252"/>
<text text-anchor="middle" x="122.48" y="-230.3" font-family="Times,serif" font-size="14.00">aws_network_interface.experience</text>
</g>
<!-- [root] aws_instance.experience (expand)&#45;&gt;[root] aws_network_interface.experience (expand) -->
<g id="edge1" class="edge">
<title>[root] aws_instance.experience (expand)&#45;&gt;[root] aws_network_interface.experience (expand)</title>
<path fill="none" stroke="black" d="M122.48,-287.7C122.48,-279.98 122.48,-270.71 122.48,-262.11"/>
<polygon fill="black" stroke="black" points="125.98,-262.1 122.48,-252.1 118.98,-262.1 125.98,-262.1"/>
</g>
<!-- [root] aws_internet_gateway.experience (expand) -->
<g id="node2" class="node">
<title>[root] aws_internet_gateway.experience (expand)</title>
<polygon fill="none" stroke="black" points="464.98,-180 265.98,-180 265.98,-144 464.98,-144 464.98,-180"/>
<text text-anchor="middle" x="365.48" y="-158.3" font-family="Times,serif" font-size="14.00">aws_internet_gateway.experience</text>
</g>
<!-- [root] aws_vpc.experience (expand) -->
<g id="node7" class="node">
<title>[root] aws_vpc.experience (expand)</title>
<polygon fill="none" stroke="black" points="333.48,-108 207.48,-108 207.48,-72 333.48,-72 333.48,-108"/>
<text text-anchor="middle" x="270.48" y="-86.3" font-family="Times,serif" font-size="14.00">aws_vpc.experience</text>
</g>
<!-- [root] aws_internet_gateway.experience (expand)&#45;&gt;[root] aws_vpc.experience (expand) -->
<g id="edge2" class="edge">
<title>[root] aws_internet_gateway.experience (expand)&#45;&gt;[root] aws_vpc.experience (expand)</title>
<path fill="none" stroke="black" d="M342,-143.7C329.92,-134.8 315.03,-123.82 301.96,-114.2"/>
<polygon fill="black" stroke="black" points="303.82,-111.22 293.69,-108.1 299.67,-116.85 303.82,-111.22"/>
</g>
<!-- [root] aws_subnet.experience (expand) -->
<g id="node6" class="node">
<title>[root] aws_subnet.experience (expand)</title>
<polygon fill="none" stroke="black" points="247.48,-180 105.48,-180 105.48,-144 247.48,-144 247.48,-180"/>
<text text-anchor="middle" x="176.48" y="-158.3" font-family="Times,serif" font-size="14.00">aws_subnet.experience</text>
</g>
<!-- [root] aws_network_interface.experience (expand)&#45;&gt;[root] aws_subnet.experience (expand) -->
<g id="edge3" class="edge">
<title>[root] aws_network_interface.experience (expand)&#45;&gt;[root] aws_subnet.experience (expand)</title>
<path fill="none" stroke="black" d="M135.83,-215.7C142.24,-207.39 150.04,-197.28 157.09,-188.14"/>
<polygon fill="black" stroke="black" points="159.95,-190.16 163.29,-180.1 154.41,-185.88 159.95,-190.16"/>
</g>
<!-- [root] aws_route_table.experience (expand) -->
<g id="node4" class="node">
<title>[root] aws_route_table.experience (expand)</title>
<polygon fill="none" stroke="black" points="448.98,-252 281.98,-252 281.98,-216 448.98,-216 448.98,-252"/>
<text text-anchor="middle" x="365.48" y="-230.3" font-family="Times,serif" font-size="14.00">aws_route_table.experience</text>
</g>
<!-- [root] aws_route_table.experience (expand)&#45;&gt;[root] aws_internet_gateway.experience (expand) -->
<g id="edge4" class="edge">
<title>[root] aws_route_table.experience (expand)&#45;&gt;[root] aws_internet_gateway.experience (expand)</title>
<path fill="none" stroke="black" d="M365.48,-215.7C365.48,-207.98 365.48,-198.71 365.48,-190.11"/>
<polygon fill="black" stroke="black" points="368.98,-190.1 365.48,-180.1 361.98,-190.1 368.98,-190.1"/>
</g>
<!-- [root] aws_route_table_association.experience (expand) -->
<g id="node5" class="node">
<title>[root] aws_route_table_association.experience (expand)</title>
<polygon fill="none" stroke="black" points="450.48,-324 216.48,-324 216.48,-288 450.48,-288 450.48,-324"/>
<text text-anchor="middle" x="333.48" y="-302.3" font-family="Times,serif" font-size="14.00">aws_route_table_association.experience</text>
</g>
<!-- [root] aws_route_table_association.experience (expand)&#45;&gt;[root] aws_route_table.experience (expand) -->
<g id="edge5" class="edge">
<title>[root] aws_route_table_association.experience (expand)&#45;&gt;[root] aws_route_table.experience (expand)</title>
<path fill="none" stroke="black" d="M341.39,-287.7C345.03,-279.73 349.43,-270.1 353.47,-261.26"/>
<polygon fill="black" stroke="black" points="356.69,-262.65 357.66,-252.1 350.32,-259.74 356.69,-262.65"/>
</g>
<!-- [root] aws_route_table_association.experience (expand)&#45;&gt;[root] aws_subnet.experience (expand) -->
<g id="edge6" class="edge">
<title>[root] aws_route_table_association.experience (expand)&#45;&gt;[root] aws_subnet.experience (expand)</title>
<path fill="none" stroke="black" d="M313.56,-287.97C301.57,-277.66 286.05,-264.18 272.48,-252 265.55,-245.78 228.18,-211.07 202.16,-186.89"/>
<polygon fill="black" stroke="black" points="204.53,-184.31 194.83,-180.07 199.77,-189.44 204.53,-184.31"/>
</g>
<!-- [root] aws_subnet.experience (expand)&#45;&gt;[root] aws_vpc.experience (expand) -->
<g id="edge7" class="edge">
<title>[root] aws_subnet.experience (expand)&#45;&gt;[root] aws_vpc.experience (expand)</title>
<path fill="none" stroke="black" d="M199.72,-143.7C211.67,-134.8 226.4,-123.82 239.33,-114.2"/>
<polygon fill="black" stroke="black" points="241.58,-116.88 247.51,-108.1 237.4,-111.27 241.58,-116.88"/>
</g>
<!-- [root] provider[&quot;registry.terraform.io/hashicorp/aws&quot;] -->
<g id="node8" class="node">
<title>[root] provider[&quot;registry.terraform.io/hashicorp/aws&quot;]</title>
<polygon fill="none" stroke="black" points="270.48,-36 17.94,-18 270.48,0 523.02,-18 270.48,-36"/>
<text text-anchor="middle" x="270.48" y="-14.3" font-family="Times,serif" font-size="14.00">provider[&quot;registry.terraform.io/hashicorp/aws&quot;]</text>
</g>
<!-- [root] aws_vpc.experience (expand)&#45;&gt;[root] provider[&quot;registry.terraform.io/hashicorp/aws&quot;] -->
<g id="edge8" class="edge">
<title>[root] aws_vpc.experience (expand)&#45;&gt;[root] provider[&quot;registry.terraform.io/hashicorp/aws&quot;]</title>
<path fill="none" stroke="black" d="M270.48,-71.7C270.48,-63.98 270.48,-54.71 270.48,-46.11"/>
<polygon fill="black" stroke="black" points="273.98,-46.1 270.48,-36.1 266.98,-46.1 273.98,-46.1"/>
</g>
<!-- [root] provider[&quot;registry.terraform.io/hashicorp/aws&quot;] (close) -->
<g id="node9" class="node">
<title>[root] provider[&quot;registry.terraform.io/hashicorp/aws&quot;] (close)</title>
<ellipse fill="none" stroke="black" cx="227.48" cy="-378" rx="227.46" ry="18"/>
<text text-anchor="middle" x="227.48" y="-374.3" font-family="Times,serif" font-size="14.00">[root] provider[&quot;registry.terraform.io/hashicorp/aws&quot;] (close)</text>
</g>
<!-- [root] provider[&quot;registry.terraform.io/hashicorp/aws&quot;] (close)&#45;&gt;[root] aws_instance.experience (expand) -->
<g id="edge9" class="edge">
<title>[root] provider[&quot;registry.terraform.io/hashicorp/aws&quot;] (close)&#45;&gt;[root] aws_instance.experience (expand)</title>
<path fill="none" stroke="black" d="M202.06,-360.05C188.36,-350.92 171.28,-339.53 156.45,-329.65"/>
<polygon fill="black" stroke="black" points="158.29,-326.67 148.03,-324.03 154.41,-332.49 158.29,-326.67"/>
</g>
<!-- [root] provider[&quot;registry.terraform.io/hashicorp/aws&quot;] (close)&#45;&gt;[root] aws_route_table_association.experience (expand) -->
<g id="edge10" class="edge">
<title>[root] provider[&quot;registry.terraform.io/hashicorp/aws&quot;] (close)&#45;&gt;[root] aws_route_table_association.experience (expand)</title>
<path fill="none" stroke="black" d="M253.14,-360.05C266.97,-350.92 284.22,-339.53 299.18,-329.65"/>
<polygon fill="black" stroke="black" points="301.27,-332.46 307.69,-324.03 297.42,-326.62 301.27,-332.46"/>
</g>
<!-- [root] root -->
<g id="node10" class="node">
<title>[root] root</title>
<ellipse fill="none" stroke="black" cx="227.48" cy="-450" rx="47.39" ry="18"/>
<text text-anchor="middle" x="227.48" y="-446.3" font-family="Times,serif" font-size="14.00">[root] root</text>
</g>
<!-- [root] root&#45;&gt;[root] provider[&quot;registry.terraform.io/hashicorp/aws&quot;] (close) -->
<g id="edge11" class="edge">
<title>[root] root&#45;&gt;[root] provider[&quot;registry.terraform.io/hashicorp/aws&quot;] (close)</title>
<path fill="none" stroke="black" d="M227.48,-431.7C227.48,-423.98 227.48,-414.71 227.48,-406.11"/>
<polygon fill="black" stroke="black" points="230.98,-406.1 227.48,-396.1 223.98,-406.1 230.98,-406.1"/>
</g>
</g>
</svg>
