counter,AS,Type,GranularityValue,SeverityScore,PageRank,NumBadDep,TotalDep,NumberOfVerteces,NumOfCycle,NumSetOfElement,TotNumOfSetOfElement,ADI
1,283359461,ud,2,71,457.8519704966076,5,0,0,0,6,277,11.0
2,283359470,ud,2,31,10.011984063735603,1,0,0,0,2,277,11.0
3,283359479,ud,2,74,9.565008940445331,2,0,0,0,3,277,11.0
4,283359428,ud,2,70,191.96870265493624,1,0,0,0,2,277,11.0
5,283359446,ud,2,69,72.37133995485243,3,0,0,0,4,277,11.0
6,283359398,ud,2,30,19.221452330442915,2,0,0,0,3,277,11.0
7,283359410,ud,2,29,18.111402145350937,1,0,0,0,2,277,11.0
8,283359419,ud,2,28,17.162901268658786,4,0,0,0,5,277,11.0
9,283359365,ud,2,73,577.7265313780205,3,0,0,0,4,277,11.0
10,283359374,ud,2,27,9.432105555363037,1,0,0,0,2,277,11.0
11,283359383,ud,2,26,14.319085706366819,1,0,0,0,2,277,11.0
12,283359335,ud,2,57,57.42172439087875,5,0,0,0,6,277,11.0
13,283359347,ud,2,25,10.164421090801408,1,0,0,0,2,277,11.0
14,283359356,ud,2,24,10.52233751847037,1,0,0,0,2,277,11.0
15,283359725,ud,2,56,4.988936202426123,1,0,0,0,2,277,11.0
16,283359734,ud,2,23,5.040184138759161,1,0,0,0,2,277,11.0
17,283359680,ud,2,68,289.07262240904305,4,0,0,0,5,277,11.0
18,283359698,ud,2,55,12.486541197683106,4,0,0,0,5,277,11.0
19,283359710,ud,2,67,7.675600081902087,1,0,0,0,2,277,11.0
20,283359656,ud,2,80,13.549501068879264,2,0,0,0,3,277,11.0
21,283359668,ud,2,54,9.961402691787576,2,0,0,0,3,277,11.0
22,283359623,ud,2,22,16.445025056019553,2,0,0,0,3,277,11.0
23,283359635,ud,2,53,89.31728861411031,2,0,0,0,3,277,11.0
24,283359647,ud,2,52,178.3735232841006,1,0,0,0,2,277,11.0
25,283359590,ud,2,75,265.24375009952223,3,0,0,0,4,277,11.0
26,283359605,ud,2,79,3.6010087107781175,1,0,0,0,2,277,11.0
27,283359614,ud,2,51,3.085845205467221,1,0,0,0,2,277,11.0
28,283359563,ud,2,21,2.9693369953583697,1,0,0,0,2,277,11.0
29,283359572,ud,2,50,64.34470126931686,1,0,0,0,2,277,11.0
30,283359581,ud,2,49,7.623880326849796,1,0,0,0,2,277,11.0
31,283359521,ud,2,20,7.965228353588773,1,0,0,0,2,277,11.0
32,283359530,ud,2,48,10.02284271945784,1,0,0,0,2,277,11.0
33,283359539,ud,2,19,4.108318785048919,1,0,0,0,2,277,11.0
34,283359548,ud,2,66,81.81116586310891,3,0,0,0,4,277,11.0
35,283359494,ud,2,81,3.0151713792553068,1,0,0,0,2,277,11.0
36,283359503,ud,2,18,6.10274780565019,1,0,0,0,2,277,11.0
37,283359512,ud,2,47,7.135316087253582,1,0,0,0,2,277,11.0
38,283359980,ud,2,46,8.073886964937989,1,0,0,0,2,277,11.0
39,283359989,ud,2,17,56.11455369921677,4,0,0,0,5,277,11.0
40,283359944,ud,2,45,111.71001567057047,1,0,0,0,2,277,11.0
41,283359953,ud,2,78,3.881945185500354,1,0,0,0,2,277,11.0
42,283359962,ud,2,65,12.913983709117499,4,0,0,0,5,277,11.0
43,283359914,ud,2,16,6.980510017625138,1,0,0,0,2,277,11.0
44,283359923,ud,2,64,9.400553634999936,1,0,0,0,2,277,11.0
45,283359932,ud,2,63,10.398923486655407,2,0,0,0,3,277,11.0
46,283359878,ud,2,15,4.584038461574205,1,0,0,0,2,277,11.0
47,283359893,ud,2,62,184.29595458452178,1,0,0,0,2,277,11.0
48,283359902,ud,2,82,249.26458680736414,2,0,0,0,3,277,11.0
49,283359848,ud,2,44,14.346036823023365,1,0,0,0,2,277,11.0
50,283359857,ud,2,14,7.725102383253639,2,0,0,0,3,277,11.0
51,283359866,ud,2,13,14.94107846055374,1,0,0,0,2,277,11.0
52,283359809,ud,2,43,27.828508747897104,4,0,0,0,5,277,11.0
53,283359827,ud,2,12,37.82579143633768,2,0,0,0,3,277,11.0
54,283359839,ud,2,61,27.484417242180267,1,0,0,0,2,277,11.0
55,283359779,ud,2,60,4.5227713646446706,1,0,0,0,2,277,11.0
56,283359788,ud,2,11,6.737886976578301,1,0,0,0,2,277,11.0
57,283359797,ud,2,42,11.966360412523382,2,0,0,0,3,277,11.0
58,283359752,ud,2,10,5.927201925737924,1,0,0,0,2,277,11.0
59,283359761,ud,2,41,3.946123966271551,1,0,0,0,2,277,11.0
60,283359770,ud,2,77,5.201571532572155,1,0,0,0,2,277,11.0
61,283360229,ud,2,9,5.946005170382849,1,0,0,0,2,277,11.0
62,283360199,ud,2,59,9.391292198299434,1,0,0,0,2,277,11.0
63,283360208,ud,2,8,7.987629674636109,1,0,0,0,2,277,11.0
64,283360217,ud,2,7,17.0623123484704,2,0,0,0,3,277,11.0
65,283360160,ud,2,40,5.468098761423992,1,0,0,0,2,277,11.0
66,283360169,ud,2,6,9.593339709960246,1,0,0,0,2,277,11.0
67,283360178,ud,2,39,5.685650836799616,2,0,0,0,3,277,11.0
68,283360190,ud,2,38,7.637738073702343,1,0,0,0,2,277,11.0
69,283360133,ud,2,72,6.703950108093291,1,0,0,0,2,277,11.0
70,283360142,ud,2,5,6.004275859058062,1,0,0,0,2,277,11.0
71,283360151,ud,2,37,8.196874581390626,1,0,0,0,2,277,11.0
72,283360103,ud,2,36,52.05055472410445,3,0,0,0,4,277,11.0
73,283360112,ud,2,35,23.368994024516706,3,0,0,0,4,277,11.0
74,283360067,ud,2,34,10.507092292850775,2,0,0,0,3,277,11.0
75,283360076,ud,2,4,21.057048910870485,2,0,0,0,3,277,11.0
76,283360088,ud,2,3,2.122170003224284,1,0,0,0,2,277,11.0
77,283360040,ud,2,76,2.41721611592867,1,0,0,0,2,277,11.0
78,283360049,ud,2,33,6.723725491232118,1,0,0,0,2,277,11.0
79,283360058,ud,2,2,3.0754186516981075,1,0,0,0,2,277,11.0
80,283360007,ud,2,1,8.30061153184873,1,0,0,0,2,277,11.0
81,283360016,ud,2,32,67.89514387622341,3,0,0,0,4,277,11.0
82,283360031,ud,2,58,61.01920733123412,1,0,0,0,2,277,11.0
83,283359283,hl,2,1,1466.0624534048452,0,44,0,0,44,277,11.0
84,283357412,cd,1,62,0.9212663109171377,0,0,2,1,2,277,11.0
85,283357419,cd,1,61,1.137319731714256,0,0,2,1,2,277,11.0
86,283357426,cd,1,145,0.965684967972427,0,0,2,8,2,277,11.0
87,283357433,cd,1,141,0.9292391820031827,0,0,2,6,2,277,11.0
88,283357377,cd,1,60,3.4609136495593935,0,0,2,1,2,277,11.0
89,283357384,cd,1,117,0.8932556716533622,0,0,2,2,2,277,11.0
90,283357391,cd,1,59,1.248963940291065,0,0,2,1,2,277,11.0
91,283357398,cd,1,58,0.9212663109171377,0,0,2,1,2,277,11.0
92,283357405,cd,1,57,0.9212663109171377,0,0,2,1,2,277,11.0
93,283357347,cd,1,116,1.054031138881642,0,0,2,2,2,277,11.0
94,283357354,cd,1,129,4.050356731133109,0,0,3,2,3,277,11.0
95,283357362,cd,1,115,4.087584371844354,0,0,2,2,2,277,11.0
96,283357369,cd,1,128,3.825878330817305,0,0,3,2,3,277,11.0
97,283357312,cd,1,127,4.315217822006484,0,0,3,2,3,277,11.0
98,283357320,cd,1,133,4.289370107762077,0,0,4,2,4,277,11.0
99,283357329,cd,1,134,4.391946009929873,0,0,5,2,5,277,11.0
100,283357339,cd,1,126,3.911283092722067,0,0,3,2,3,277,11.0
101,283357285,cd,1,95,4.919561890760592,0,0,5,1,5,277,11.0
102,283357295,cd,1,88,2.469015144470829,0,0,4,1,4,277,11.0
103,283357304,cd,1,125,3.7881409616532897,0,0,3,2,3,277,11.0
104,283357254,cd,1,132,4.741821872415129,0,0,4,2,4,277,11.0
105,283357263,cd,1,97,4.976661081997555,0,0,6,1,6,277,11.0
106,283357274,cd,1,96,5.06275199084426,0,0,6,1,6,277,11.0
107,283357220,cd,1,131,4.1632588851833034,0,0,4,2,4,277,11.0
108,283357229,cd,1,124,3.8901409616532896,0,0,3,2,3,277,11.0
109,283357237,cd,1,130,4.1632588851833034,0,0,4,2,4,277,11.0
110,283357246,cd,1,123,4.03514023557921,0,0,3,2,3,277,11.0
111,283357184,cd,1,80,2.0106737788996245,0,0,3,1,3,277,11.0
112,283357192,cd,1,56,1.3880277858899883,0,0,2,1,2,277,11.0
113,283357199,cd,1,55,1.1886197941626806,0,0,2,1,2,277,11.0
114,283357206,cd,1,54,2.994988547615315,0,0,2,1,2,277,11.0
115,283357213,cd,1,53,2.994988547615315,0,0,2,1,2,277,11.0
116,283357665,cd,2,52,10.62825211370324,0,0,2,1,2,277,11.0
117,283357672,cd,2,51,35.66741733199382,0,0,2,1,2,277,11.0
118,283357679,cd,2,114,42.16041504167945,0,0,2,2,2,277,11.0
119,283357686,cd,2,50,27.778010240889113,0,0,2,1,2,277,11.0
120,283357693,cd,2,113,35.00288197922257,0,0,2,2,2,277,11.0
121,283357635,cd,2,49,204.47723760522,0,0,2,1,2,277,11.0
122,283357642,cd,2,48,545.2236065758992,0,0,2,1,2,277,11.0
123,283357649,cd,2,47,105.11217443648812,0,0,2,1,2,277,11.0
124,283357656,cd,2,87,311.9376613611207,0,0,4,1,4,277,11.0
125,283357605,cd,2,46,270.48233601612105,0,0,2,1,2,277,11.0
126,283357612,cd,2,86,540.2656815985187,0,0,4,1,4,277,11.0
127,283357621,cd,2,45,172.86567923392198,0,0,2,1,2,277,11.0
128,283357628,cd,2,44,209.19453823085772,0,0,2,1,2,277,11.0
129,283357569,cd,1,43,0.9407492550217555,0,0,2,1,2,277,11.0
130,283357576,cd,1,42,0.9477775659691995,0,0,2,1,2,277,11.0
131,283357583,cd,1,41,0.9497119632913453,0,0,2,1,2,277,11.0
132,283357590,cd,2,144,536.7736341662799,0,0,2,7,2,277,11.0
133,283357597,cd,2,79,685.9444996163522,0,0,3,1,3,277,11.0
134,283357541,cd,1,40,0.9551576731397148,0,0,2,1,2,277,11.0
135,283357548,cd,1,39,0.9092398732830309,0,0,2,1,2,277,11.0
136,283357555,cd,1,38,0.9092398732830309,0,0,2,1,2,277,11.0
137,283357562,cd,1,37,0.9407492550217555,0,0,2,1,2,277,11.0
138,283357506,cd,1,112,1.1426234086585443,0,0,2,2,2,277,11.0
139,283357513,cd,1,146,1.0040626726989215,0,0,2,11,2,277,11.0
140,283357520,cd,1,36,0.9061260414943357,0,0,2,1,2,277,11.0
141,283357527,cd,1,35,0.9061260414943357,0,0,2,1,2,277,11.0
142,283357534,cd,1,34,0.9551576731397148,0,0,2,1,2,277,11.0
143,283357476,cd,1,33,1.267733351873885,0,0,2,1,2,277,11.0
144,283357483,cd,1,78,1.8588363476419645,0,0,3,1,3,277,11.0
145,283357491,cd,1,32,1.7622074675209287,0,0,2,1,2,277,11.0
146,283357498,cd,1,77,1.3967456461484204,0,0,3,1,3,277,11.0
147,283357440,cd,1,143,0.8898738726596667,0,0,2,7,2,277,11.0
148,283357447,cd,1,31,1.1861175423000014,0,0,2,1,2,277,11.0
149,283357454,cd,1,30,0.9434659219393065,0,0,2,1,2,277,11.0
150,283357461,cd,1,76,1.2801044001696344,0,0,3,1,3,277,11.0
151,283357469,cd,1,29,0.9093983509694235,0,0,2,1,2,277,11.0
152,283357922,cd,2,28,15.490731604714693,0,0,2,1,2,277,11.0
153,283357929,cd,2,27,12.924158255065798,0,0,2,1,2,277,11.0
154,283357936,cd,2,26,9.695226389466129,0,0,2,1,2,277,11.0
155,283357943,cd,2,25,15.687490601087369,0,0,2,1,2,277,11.0
156,283357950,cd,2,137,13.2264908894957,0,0,2,3,2,277,11.0
157,283357892,cd,2,75,24.018588438510918,0,0,3,1,3,277,11.0
158,283357900,cd,2,122,12.341258008224827,0,0,3,2,3,277,11.0
159,283357908,cd,2,111,12.446375008482232,0,0,2,2,2,277,11.0
160,283357915,cd,2,24,26.645068845065424,0,0,2,1,2,277,11.0
161,283357863,cd,2,147,48.509818992132274,0,0,2,15,2,277,11.0
162,283357870,cd,2,110,61.09558307827187,0,0,2,2,2,277,11.0
163,283357877,cd,2,74,10.085386360968368,0,0,3,1,3,277,11.0
164,283357885,cd,2,140,12.4409340889448,0,0,2,5,2,277,11.0
165,283357831,cd,2,109,30.8811869816469,0,0,2,2,2,277,11.0
166,283357838,cd,2,85,75.3619801071948,0,0,4,1,4,277,11.0
167,283357847,cd,2,73,76.37582216495619,0,0,3,1,3,277,11.0
168,283357855,cd,2,121,61.38518584375244,0,0,3,2,3,277,11.0
169,283357792,cd,2,23,6.226482182600677,0,0,2,1,2,277,11.0
170,283357799,cd,2,22,21.475784397165558,0,0,2,1,2,277,11.0
171,283357806,cd,2,120,55.34861917550131,0,0,3,2,3,277,11.0
172,283357814,cd,2,84,71.9634091282253,0,0,4,1,4,277,11.0
173,283357823,cd,2,72,47.49597693437087,0,0,3,1,3,277,11.0
174,283357764,cd,2,108,10.644713270431836,0,0,2,2,2,277,11.0
175,283357771,cd,2,107,40.21888155352697,0,0,2,2,2,277,11.0
176,283357778,cd,2,21,14.976914482526318,0,0,2,1,2,277,11.0
177,283357785,cd,2,20,8.579576707225051,0,0,2,1,2,277,11.0
178,283357728,cd,2,139,13.250201333328647,0,0,2,5,2,277,11.0
179,283357735,cd,2,19,7.888447391608363,0,0,2,1,2,277,11.0
180,283357742,cd,2,18,10.781184216257106,0,0,2,1,2,277,11.0
181,283357749,cd,2,17,14.722381012123492,0,0,2,1,2,277,11.0
182,283357756,cd,2,71,16.50747094177145,0,0,3,1,3,277,11.0
183,283357700,cd,2,16,14.709081999315753,0,0,2,1,2,277,11.0
184,283357707,cd,2,106,16.10083133874197,0,0,2,2,2,277,11.0
185,283357714,cd,2,15,24.065192674876137,0,0,2,1,2,277,11.0
186,283357721,cd,2,14,10.559381857167125,0,0,2,1,2,277,11.0
187,283358180,cd,2,142,16.515757683262258,0,0,2,7,2,277,11.0
188,283358187,cd,2,13,8.353058174102673,0,0,2,1,2,277,11.0
189,283358194,cd,2,12,8.42878219050216,0,0,2,1,2,277,11.0
190,283358150,cd,2,105,8.842356690298327,0,0,2,2,2,277,11.0
191,283358157,cd,2,104,5.351075350332287,0,0,2,2,2,277,11.0
192,283358164,cd,2,70,7.4449161828819435,0,0,3,1,3,277,11.0
193,283358172,cd,2,119,10.165340887494633,0,0,3,2,3,277,11.0
194,283358115,cd,2,136,8.62496985095342,0,0,2,3,2,277,11.0
195,283358122,cd,2,103,7.563036954416491,0,0,2,2,2,277,11.0
196,283358129,cd,2,102,4.697244269136361,0,0,2,2,2,277,11.0
197,283358136,cd,2,11,42.2412109798051,0,0,2,1,2,277,11.0
198,283358143,cd,2,10,3.3122578024268177,0,0,2,1,2,277,11.0
199,283358086,cd,2,9,5.004356504574277,0,0,2,1,2,277,11.0
200,283358093,cd,2,138,10.718742115755816,0,0,2,4,2,277,11.0
201,283358100,cd,2,101,8.221193289511866,0,0,2,2,2,277,11.0
202,283358107,cd,2,118,11.384471267414344,0,0,3,2,3,277,11.0
203,283358054,cd,2,8,7.941879347482942,0,0,2,1,2,277,11.0
204,283358061,cd,2,7,9.829585330598071,0,0,2,1,2,277,11.0
205,283358068,cd,2,94,29.492503965313347,0,0,5,1,5,277,11.0
206,283358078,cd,2,69,22.775693226340188,0,0,3,1,3,277,11.0
207,283358017,cd,2,68,12.279962086143897,0,0,3,1,3,277,11.0
208,283358025,cd,2,93,18.14338440280811,0,0,5,1,5,277,11.0
209,283358035,cd,2,83,16.24612510007776,0,0,4,1,4,277,11.0
210,283358044,cd,2,92,28.82031327109278,0,0,5,1,5,277,11.0
211,283357987,cd,2,91,31.163736387026844,0,0,5,1,5,277,11.0
212,283357997,cd,2,67,16.806988086371334,0,0,3,1,3,277,11.0
213,283358005,cd,2,98,37.124559023687596,0,0,7,1,7,277,11.0
214,283357957,cd,2,6,17.354934511892946,0,0,2,1,2,277,11.0
215,283357964,cd,2,5,24.71850721730889,0,0,2,1,2,277,11.0
216,283357971,cd,2,82,28.810759951477557,0,0,4,1,4,277,11.0
217,283357980,cd,2,4,10.285302463417004,0,0,2,1,2,277,11.0
218,283357152,cd,1,3,1.5805558042294456,0,0,2,1,2,277,11.0
219,283357159,cd,1,90,2.6170213066029406,0,0,5,1,5,277,11.0
220,283357169,cd,1,100,1.1156166135612524,0,0,2,2,2,277,11.0
221,283357176,cd,1,66,1.8288482602418348,0,0,3,1,3,277,11.0
222,283357125,cd,1,89,2.719021306602941,0,0,5,1,5,277,11.0
223,283357135,cd,1,81,2.0963753135933048,0,0,4,1,4,277,11.0
224,283357144,cd,1,65,2.1699754144753935,0,0,3,1,3,277,11.0
225,283357088,cd,1,2,2.269958123929089,0,0,2,1,2,277,11.0
226,283357095,cd,1,99,0.9286318931350004,0,0,2,2,2,277,11.0
227,283357102,cd,1,135,1.2995977925979214,0,0,2,3,2,277,11.0
228,283357109,cd,1,64,1.754803708306393,0,0,3,1,3,277,11.0
229,283357117,cd,1,63,2.105243782827793,0,0,3,1,3,277,11.0
230,283357081,cd,1,1,1.0093121726219123,0,0,2,1,2,277,11.0
