counter,AS,Type,GranularityValue,SeverityScore,PageRank,NumBadDep,TotalDep,NumberOfVerteces,NumOfCycle,NumSetOfElement,TotNumOfSetOfElement,ADI
1,565257,ud,2,4,7.112412019956581,1,0,0,0,2,93,21.0
2,565248,ud,2,5,11.948434419271448,1,0,0,0,2,93,21.0
3,565278,ud,2,2,12.019323247312217,1,0,0,0,2,93,21.0
4,565266,ud,2,9,19.549444662325623,2,0,0,0,3,93,21.0
5,565287,ud,2,7,27.432394682105688,1,0,0,0,2,93,21.0
6,565299,ud,2,1,17.27721865919232,1,0,0,0,2,93,21.0
7,565215,ud,2,8,53.15753402792667,6,0,0,0,7,93,21.0
8,565206,ud,2,3,17.466932560680156,1,0,0,0,2,93,21.0
9,565236,ud,2,6,58.16164048496804,4,0,0,0,5,93,21.0
10,565073,hl,1,3,27.635586013710046,0,62,0,0,61,93,21.0
11,565144,hl,2,2,176.89920907388966,0,26,0,0,21,93,21.0
12,565178,hl,2,1,101.65300650878315,0,20,0,0,19,93,21.0
13,564360,cd,1,41,2.7605360859611086,0,0,4,1,4,93,21.0
14,564353,cd,1,16,1.278472771018984,0,0,2,1,2,93,21.0
15,564378,cd,1,31,3.403310390566424,0,0,3,1,3,93,21.0
16,564369,cd,1,40,4.361905966992216,0,0,4,1,4,93,21.0
17,564393,cd,1,45,4.3704364661704,0,0,6,1,6,93,21.0
18,564386,cd,1,15,2.879842652050092,0,0,2,1,2,93,21.0
19,564412,cd,1,14,2.544921928068139,0,0,2,1,2,93,21.0
20,564404,cd,1,30,3.1525856194083914,0,0,3,1,3,93,21.0
21,564429,cd,1,48,2.6973906976226285,0,0,3,2,3,93,21.0
22,564419,cd,1,44,4.6346489343505155,0,0,5,1,5,93,21.0
23,564446,cd,1,43,4.625770606869208,0,0,5,1,5,93,21.0
24,564437,cd,1,49,3.7664493396647805,0,0,4,2,4,93,21.0
25,564456,cd,1,13,1.429062184262928,0,0,2,1,2,93,21.0
26,564463,cd,1,46,2.791272440866627,0,0,2,2,2,93,21.0
27,564478,cd,1,51,3.412580051283057,0,0,2,3,2,93,21.0
28,564470,cd,1,29,3.084599254477916,0,0,3,1,3,93,21.0
29,564495,cd,1,39,3.062460231733624,0,0,4,1,4,93,21.0
30,564485,cd,1,42,3.921781498938052,0,0,5,1,5,93,21.0
31,564504,cd,1,12,1.8371711623272402,0,0,2,1,2,93,21.0
32,564511,cd,1,38,3.5963273913627676,0,0,4,1,4,93,21.0
33,564520,cd,1,28,2.7370061241583397,0,0,3,1,3,93,21.0
34,564528,cd,1,11,1.8584211623272402,0,0,2,1,2,93,21.0
35,564535,cd,1,37,3.683718016362768,0,0,4,1,4,93,21.0
36,564552,cd,1,27,1.6640695709039814,0,0,3,1,3,93,21.0
37,564544,cd,1,47,4.271901318487485,0,0,3,2,3,93,21.0
38,564575,cd,1,10,1.2784475633436954,0,0,2,1,2,93,21.0
39,564560,cd,1,9,1.2299820310012506,0,0,2,1,2,93,21.0
40,564567,cd,1,26,1.7125351032464262,0,0,3,1,3,93,21.0
41,564589,cd,2,52,55.440093411211365,0,0,2,10,2,93,21.0
42,564582,cd,1,8,1.5380787642041724,0,0,2,1,2,93,21.0
43,564603,cd,2,25,62.8557663742914,0,0,3,1,3,93,21.0
44,564596,cd,2,7,34.86079048081612,0,0,2,1,2,93,21.0
45,564618,cd,2,36,53.36899428383969,0,0,4,1,4,93,21.0
46,564611,cd,2,6,30.5212256763388,0,0,2,1,2,93,21.0
47,564635,cd,2,5,40.1065180785955,0,0,2,1,2,93,21.0
48,564627,cd,2,24,45.953321320759656,0,0,3,1,3,93,21.0
49,564650,cd,2,4,20.398354484566234,0,0,2,1,2,93,21.0
50,564642,cd,2,23,55.538613723016354,0,0,3,1,3,93,21.0
51,564665,cd,2,35,39.66045604053313,0,0,4,1,4,93,21.0
52,564657,cd,2,22,32.244783077453086,0,0,3,1,3,93,21.0
53,564683,cd,2,21,15.406225295625369,0,0,3,1,3,93,21.0
54,564674,cd,2,34,30.838320940046223,0,0,4,1,4,93,21.0
55,564698,cd,2,20,16.65741891578535,0,0,3,1,3,93,21.0
56,564691,cd,2,3,16.81268743303223,0,0,2,1,2,93,21.0
57,564713,cd,2,19,16.563775253578818,0,0,3,1,3,93,21.0
58,564706,cd,2,2,9.431459854193147,0,0,2,1,2,93,21.0
59,564730,cd,2,33,31.24576853507573,0,0,4,1,4,93,21.0
60,564721,cd,2,32,28.942692895560906,0,0,4,1,4,93,21.0
61,564747,cd,2,50,38.279864251921744,0,0,2,3,2,93,21.0
62,564739,cd,2,18,15.813672890654871,0,0,3,1,3,93,21.0
63,564761,cd,2,17,33.42937649687887,0,0,3,1,3,93,21.0
64,564754,cd,2,1,26.01370353379883,0,0,2,1,2,93,21.0
