counter,AS,Type,GranularityValue,SeverityScore,PageRank,NumBadDep,TotalDep,NumberOfVerteces,NumOfCycle,NumSetOfElement,TotNumOfSetOfElement,ADI
1,352241656,ud,2,44,8.954300234565887,1,0,0,0,2,274,22.0
2,352241647,ud,2,43,20.167707750657385,1,0,0,0,2,274,22.0
3,352241638,ud,2,42,25.641883310072018,1,0,0,0,2,274,22.0
4,352241629,ud,2,41,25.8596785042634,1,0,0,0,2,274,22.0
5,352241620,ud,2,40,3.064866083223344,1,0,0,0,2,274,22.0
6,352241611,ud,2,39,8.47422691118031,1,0,0,0,2,274,22.0
7,352241602,ud,2,80,82.63273845713663,5,0,0,0,6,274,22.0
8,352241584,ud,2,67,47.65584850771045,4,0,0,0,5,274,22.0
9,352241575,ud,2,77,3.1183096557584817,1,0,0,0,2,274,22.0
10,352241566,ud,2,66,63.161068249309466,1,0,0,0,2,274,22.0
11,352241911,ud,2,38,76.36185357137498,1,0,0,0,2,274,22.0
12,352241893,ud,2,37,16.749492911104877,4,0,0,0,5,274,22.0
13,352241884,ud,2,65,195.337452754587,1,0,0,0,2,274,22.0
14,352241875,ud,2,36,10.035552236122609,1,0,0,0,2,274,22.0
15,352241866,ud,2,70,559.5776817752359,3,0,0,0,4,274,22.0
16,352241854,ud,2,64,71.78912842700376,2,0,0,0,3,274,22.0
17,352241842,ud,2,35,16.97783837081615,2,0,0,0,3,274,22.0
18,352241833,ud,2,34,13.580276687438479,1,0,0,0,2,274,22.0
19,352241824,ud,2,63,69.50898856738046,6,0,0,0,7,274,22.0
20,352241815,ud,2,33,10.284157575269829,1,0,0,0,2,274,22.0
21,352241806,ud,2,32,14.425750047733036,1,0,0,0,2,274,22.0
22,352241797,ud,2,31,6.0151589192830155,1,0,0,0,2,274,22.0
23,352241788,ud,2,30,8.202326919064081,1,0,0,0,2,274,22.0
24,352241779,ud,2,62,9.060318104148905,1,0,0,0,2,274,22.0
25,352241767,ud,2,29,17.01389301283304,2,0,0,0,3,274,22.0
26,352241758,ud,2,61,7.8274194341820404,1,0,0,0,2,274,22.0
27,352241749,ud,2,28,9.759502741567443,1,0,0,0,2,274,22.0
28,352241737,ud,2,69,6.755875071549113,1,0,0,0,2,274,22.0
29,352241725,ud,2,27,7.120625023775627,2,0,0,0,3,274,22.0
30,352241716,ud,2,26,7.9224711225511015,1,0,0,0,2,274,22.0
31,352241701,ud,2,60,23.94597077864221,3,0,0,0,4,274,22.0
32,352241692,ud,2,59,30.160200576584366,5,0,0,0,6,274,22.0
33,352241683,ud,2,25,2.141590391274043,1,0,0,0,2,274,22.0
34,352241674,ud,2,76,55.58395027582854,1,0,0,0,2,274,22.0
35,352241665,ud,2,58,478.6778117898612,6,0,0,0,7,274,22.0
36,352242175,ud,2,24,12.529667454995105,4,0,0,0,5,274,22.0
37,352242154,ud,2,23,182.3169336166835,1,0,0,0,2,274,22.0
38,352242142,ud,2,75,13.183295892720075,2,0,0,0,3,274,22.0
39,352242133,ud,2,22,70.96667671378876,1,0,0,0,2,274,22.0
40,352242121,ud,2,21,59.59843024623334,2,0,0,0,3,274,22.0
41,352242112,ud,2,20,4.0929733242069535,1,0,0,0,2,274,22.0
42,352242103,ud,2,19,5.783583038500392,1,0,0,0,2,274,22.0
43,352242094,ud,2,57,5.172667096487471,1,0,0,0,2,274,22.0
44,352242085,ud,2,56,3.074860498595562,1,0,0,0,2,274,22.0
45,352242070,ud,2,74,3.5553652988978826,1,0,0,0,2,274,22.0
46,352242061,ud,2,68,278.20685950026075,3,0,0,0,4,274,22.0
47,352242052,ud,2,18,7.54447701243179,1,0,0,0,2,274,22.0
48,352242043,ud,2,55,35.54647980312391,1,0,0,0,2,274,22.0
49,352242028,ud,2,17,4.646129246166903,1,0,0,0,2,274,22.0
50,352242016,ud,2,16,5.171404124865035,1,0,0,0,2,274,22.0
51,352242007,ud,2,15,5.353406777740661,1,0,0,0,2,274,22.0
52,352241989,ud,2,79,81.73411180246892,6,0,0,0,7,274,22.0
53,352241980,ud,2,14,9.942994586507874,1,0,0,0,2,274,22.0
54,352241971,ud,2,13,17.949266987554907,1,0,0,0,2,274,22.0
55,352241962,ud,2,73,2.937278583284127,1,0,0,0,2,274,22.0
56,352241950,ud,2,12,13.51370983168779,2,0,0,0,3,274,22.0
57,352241941,ud,2,11,18.739552512984964,2,0,0,0,3,274,22.0
58,352241920,ud,2,54,57.94831934574499,2,0,0,0,3,274,22.0
59,352242424,ud,2,72,3.8796675568391055,1,0,0,0,2,274,22.0
60,352242415,ud,2,53,190.37605423904867,1,0,0,0,2,274,22.0
61,352242403,ud,2,10,4.524479828073385,1,0,0,0,2,274,22.0
62,352242394,ud,2,9,15.302136235119008,1,0,0,0,2,274,22.0
63,352242382,ud,2,8,7.666459591039203,2,0,0,0,3,274,22.0
64,352242367,ud,2,52,7.860044687427883,1,0,0,0,2,274,22.0
65,352242358,ud,2,7,5.037893693078766,1,0,0,0,2,274,22.0
66,352242349,ud,2,6,5.0139393293210635,1,0,0,0,2,274,22.0
67,352242340,ud,2,5,6.948842151869017,1,0,0,0,2,274,22.0
68,352242328,ud,2,78,259.00308456816657,2,0,0,0,3,274,22.0
69,352242319,ud,2,4,14.190481931998125,1,0,0,0,2,274,22.0
70,352242298,ud,2,71,49.25036796654169,5,0,0,0,6,274,22.0
71,352242286,ud,2,51,12.952848582476278,4,0,0,0,5,274,22.0
72,352242277,ud,2,50,11.550380802328702,1,0,0,0,2,274,22.0
73,352242268,ud,2,3,4.709217815322941,1,0,0,0,2,274,22.0
74,352242259,ud,2,49,4.4101048338254625,1,0,0,0,2,274,22.0
75,352242247,ud,2,48,11.919743570449915,2,0,0,0,3,274,22.0
76,352242238,ud,2,2,6.720001181566559,1,0,0,0,2,274,22.0
77,352242190,ud,2,47,287.21408340456094,4,0,0,0,5,274,22.0
78,352242460,ud,2,1,103.14536269130568,1,0,0,0,2,274,22.0
79,352242448,ud,2,46,10.454895935272694,2,0,0,0,3,274,22.0
80,352242439,ud,2,45,8.975443218038087,1,0,0,0,2,274,22.0
81,352241510,hl,2,1,1388.9092243743687,0,48,0,0,46,274,22.0
82,352241442,hl,2,2,1632.6818586050358,0,60,0,0,55,274,22.0
83,352239354,cd,1,120,2.786913929349651,0,0,6,1,6,274,22.0
84,352239345,cd,1,104,1.8373471507204875,0,0,4,1,4,274,22.0
85,352239334,cd,1,119,2.888913929349651,0,0,6,1,6,274,22.0
86,352239327,cd,1,133,1.137484030785739,0,0,2,2,2,274,22.0
87,352239318,cd,1,103,2.237775442071112,0,0,4,1,4,274,22.0
88,352239309,cd,1,102,1.982725099258002,0,0,4,1,4,274,22.0
89,352239302,cd,1,60,1.444728964453728,0,0,2,1,2,274,22.0
90,352239295,cd,1,140,1.097351813478618,0,0,2,3,2,274,22.0
91,352239288,cd,1,132,0.9286318931350004,0,0,2,2,2,274,22.0
92,352239281,cd,1,59,1.022325570959396,0,0,2,1,2,274,22.0
93,352239274,cd,1,58,1.929979160981722,0,0,2,1,2,274,22.0
94,352239611,cd,1,57,0.9470031342785065,0,0,2,1,2,274,22.0
95,352239604,cd,1,56,0.9445474843144908,0,0,2,1,2,274,22.0
96,352239597,cd,1,55,0.9309886372325082,0,0,2,1,2,274,22.0
97,352239590,cd,1,54,0.9309886372325082,0,0,2,1,2,274,22.0
98,352239583,cd,1,53,0.9056591484669418,0,0,2,1,2,274,22.0
99,352239576,cd,1,52,0.9056591484669418,0,0,2,1,2,274,22.0
100,352239569,cd,1,51,0.9380706776038359,0,0,2,1,2,274,22.0
101,352239562,cd,1,50,0.9380706776038359,0,0,2,1,2,274,22.0
102,352239555,cd,1,49,0.9044661926818347,0,0,2,1,2,274,22.0
103,352239548,cd,1,48,0.9044661926818347,0,0,2,1,2,274,22.0
104,352239541,cd,1,131,1.1863535397259986,0,0,2,2,2,274,22.0
105,352239532,cd,1,101,1.6790569843005423,0,0,4,1,4,274,22.0
106,352239524,cd,1,85,1.3745811106435064,0,0,3,1,3,274,22.0
107,352239517,cd,1,47,0.989160583941606,0,0,2,1,2,274,22.0
108,352239509,cd,1,84,1.3060469614993302,0,0,3,1,3,274,22.0
109,352239501,cd,1,83,1.58311312554964,0,0,3,1,3,274,22.0
110,352239494,cd,1,46,0.9093983509694235,0,0,2,1,2,274,22.0
111,352239487,cd,1,45,0.9199727504242585,0,0,2,1,2,274,22.0
112,352239480,cd,1,44,0.9199727504242585,0,0,2,1,2,274,22.0
113,352239473,cd,1,43,0.9199727504242585,0,0,2,1,2,274,22.0
114,352239466,cd,1,139,0.8869717617192113,0,0,2,3,2,274,22.0
115,352239459,cd,1,42,0.9434659219393065,0,0,2,1,2,274,22.0
116,352239452,cd,1,41,1.1438370244481528,0,0,2,1,2,274,22.0
117,352239445,cd,1,40,1.1861175423000014,0,0,2,1,2,274,22.0
118,352239438,cd,1,39,1.2478551949017695,0,0,2,1,2,274,22.0
119,352239431,cd,1,146,0.8898738726596667,0,0,2,7,2,274,22.0
120,352239424,cd,1,144,0.9292391820031827,0,0,2,6,2,274,22.0
121,352239417,cd,1,148,0.965684967972427,0,0,2,8,2,274,22.0
122,352239410,cd,1,130,0.8521345536489646,0,0,2,2,2,274,22.0
123,352239403,cd,1,38,1.1885891201676042,0,0,2,1,2,274,22.0
124,352239396,cd,1,37,1.218871821596585,0,0,2,1,2,274,22.0
125,352239389,cd,1,36,1.361305858548081,0,0,2,1,2,274,22.0
126,352239380,cd,1,100,2.3143565733825318,0,0,4,1,4,274,22.0
127,352239373,cd,1,35,1.2627897947533682,0,0,2,1,2,274,22.0
128,352239365,cd,1,82,1.8761005768426968,0,0,3,1,3,274,22.0
129,352239871,cd,2,81,92.72535491326626,0,0,3,1,3,274,22.0
130,352239862,cd,2,99,125.08561012087664,0,0,4,1,4,274,22.0
131,352239855,cd,2,34,48.32552217563493,0,0,2,1,2,274,22.0
132,352239846,cd,2,98,122.0660752656769,0,0,4,1,4,274,22.0
133,352239836,cd,2,113,271.4558782269568,0,0,5,1,5,274,22.0
134,352239826,cd,2,112,274.6274095182841,0,0,5,1,5,274,22.0
135,352239819,cd,2,129,51.497053466962186,0,0,2,2,2,274,22.0
136,352239811,cd,2,80,95.89688620459351,0,0,3,1,3,274,22.0
137,352239801,cd,2,111,272.6386516955103,0,0,5,1,5,274,22.0
138,352239794,cd,2,33,108.32387440511863,0,0,2,1,2,274,22.0
139,352239786,cd,2,79,153.3010015874599,0,0,3,1,3,274,22.0
140,352239775,cd,2,118,322.93442529370327,0,0,6,1,6,274,22.0
141,352239768,cd,2,141,44.09716028885406,0,0,2,4,2,274,22.0
142,352239758,cd,2,110,222.2083059090517,0,0,5,1,5,274,22.0
143,352239747,cd,2,117,267.9827303615578,0,0,6,1,6,274,22.0
144,352239738,cd,2,97,89.25220704786723,0,0,4,1,4,274,22.0
145,352239728,cd,2,109,267.22751634017595,0,0,5,1,5,274,22.0
146,352239720,cd,2,78,88.4969930264854,0,0,3,1,3,274,22.0
147,352239709,cd,2,116,266.5619389997299,0,0,6,1,6,274,22.0
148,352239700,cd,2,96,287.0543977188092,0,0,4,1,4,274,22.0
149,352239692,cd,2,77,267.5301887889532,0,0,3,1,3,274,22.0
150,352239683,cd,2,95,593.7554303323031,0,0,4,1,4,274,22.0
151,352239676,cd,2,32,208.5341114027092,0,0,2,1,2,274,22.0
152,352239669,cd,2,31,158.10672356067002,0,0,2,1,2,274,22.0
153,352239660,cd,2,94,353.8229141118181,0,0,4,1,4,274,22.0
154,352239650,cd,2,108,539.1354512523087,0,0,5,1,5,274,22.0
155,352239642,cd,2,76,292.08419419503076,0,0,3,1,3,274,22.0
156,352239635,cd,2,30,218.49886544299545,0,0,2,1,2,274,22.0
157,352239628,cd,2,147,531.1795684590919,0,0,2,8,2,274,22.0
158,352239618,cd,2,107,754.3099245104138,0,0,5,1,5,274,22.0
159,352240124,cd,2,29,11.1917313904326,0,0,2,1,2,274,22.0
160,352240116,cd,2,75,16.70162408741755,0,0,3,1,3,274,22.0
161,352240109,cd,2,28,14.801447874202395,0,0,2,1,2,274,22.0
162,352240102,cd,2,27,8.285705132209507,0,0,2,1,2,274,22.0
163,352240095,cd,2,26,25.29900750866559,0,0,2,1,2,274,22.0
164,352240086,cd,2,93,30.462199747970928,0,0,4,1,4,274,22.0
165,352240079,cd,2,25,27.203726018348586,0,0,2,1,2,274,22.0
166,352240071,cd,2,74,36.753447140766475,0,0,3,1,3,274,22.0
167,352240062,cd,2,92,73.9762458419881,0,0,4,1,4,274,22.0
168,352240054,cd,2,73,64.42652471957021,0,0,3,1,3,274,22.0
169,352240047,cd,2,128,56.551881526446365,0,0,2,2,2,274,22.0
170,352240038,cd,2,91,73.16717903796149,0,0,4,1,4,274,22.0
171,352240031,cd,2,149,55.627994432225265,0,0,2,11,2,274,22.0
172,352240023,cd,2,136,65.29253584483763,0,0,3,2,3,274,22.0
173,352240012,cd,2,115,90.42798967387725,0,0,6,1,6,274,22.0
174,352240000,cd,2,121,99.97771079629514,0,0,7,1,7,274,22.0
175,352239992,cd,2,72,49.44513501122404,0,0,3,1,3,274,22.0
176,352239983,cd,2,90,72.88880506814104,0,0,4,1,4,274,22.0
177,352239975,cd,2,71,47.68692337057763,0,0,3,1,3,274,22.0
178,352239968,cd,2,143,24.243253313660635,0,0,2,5,2,274,22.0
179,352239958,cd,2,106,65.22610797631386,0,0,5,1,5,274,22.0
180,352239947,cd,2,114,74.77582909873175,0,0,6,1,6,274,22.0
181,352239937,cd,2,105,82.71690016037937,0,0,5,1,5,274,22.0
182,352239930,cd,2,24,17.81767182872564,0,0,2,1,2,274,22.0
183,352239923,cd,2,23,22.658571705994348,0,0,2,1,2,274,22.0
184,352239916,cd,2,22,13.564384325148964,0,0,2,1,2,274,22.0
185,352239908,cd,2,70,24.472374583945445,0,0,3,1,3,274,22.0
186,352239901,cd,2,21,17.1056598353281,0,0,2,1,2,274,22.0
187,352239894,cd,2,20,11.540143330290835,0,0,2,1,2,274,22.0
188,352239887,cd,2,19,37.753446252747246,0,0,2,1,2,274,22.0
189,352239879,cd,2,69,82.15327899037857,0,0,3,1,3,274,22.0
190,352240378,cd,2,127,8.346222085565149,0,0,2,2,2,274,22.0
191,352240371,cd,2,18,4.797595443506067,0,0,2,1,2,274,22.0
192,352240364,cd,2,126,23.556643484436012,0,0,2,2,2,274,22.0
193,352240357,cd,2,17,17.255694424622316,0,0,2,1,2,274,22.0
194,352240349,cd,2,68,22.282427516281807,0,0,3,1,3,274,22.0
195,352240342,cd,2,16,10.108292260704465,0,0,2,1,2,274,22.0
196,352240334,cd,2,67,14.976948978558998,0,0,3,1,3,274,22.0
197,352240325,cd,2,89,28.230348908957307,0,0,4,1,4,274,22.0
198,352240316,cd,2,88,26.7611764099181,0,0,4,1,4,274,22.0
199,352240308,cd,2,66,26.10981953722544,0,0,3,1,3,274,22.0
200,352240300,cd,2,65,12.939092619140943,0,0,3,1,3,274,22.0
201,352240291,cd,2,87,26.192492549539253,0,0,4,1,4,274,22.0
202,352240284,cd,2,15,8.070435901286409,0,0,2,1,2,274,22.0
203,352240275,cd,2,86,25.81862702016319,0,0,4,1,4,274,22.0
204,352240268,cd,2,14,7.696570371910349,0,0,2,1,2,274,22.0
205,352240260,cd,2,64,12.565227089764884,0,0,3,1,3,274,22.0
206,352240253,cd,2,138,13.400453503500838,0,0,2,3,2,274,22.0
207,352240246,cd,2,13,12.570865359030506,0,0,2,1,2,274,22.0
208,352240239,cd,2,12,26.073871158891567,0,0,2,1,2,274,22.0
209,352240232,cd,2,11,9.383712315024873,0,0,2,1,2,274,22.0
210,352240225,cd,2,10,15.016008422907007,0,0,2,1,2,274,22.0
211,352240218,cd,2,9,15.051329411777054,0,0,2,1,2,274,22.0
212,352240211,cd,2,125,12.587462400980325,0,0,2,2,2,274,22.0
213,352240203,cd,2,135,12.47177982000304,0,0,3,2,3,274,22.0
214,352240195,cd,2,63,23.80957815881044,0,0,3,1,3,274,22.0
215,352240188,cd,2,142,12.29077675537324,0,0,2,5,2,274,22.0
216,352240180,cd,2,62,9.992618398488027,0,0,3,1,3,274,22.0
217,352240173,cd,2,124,7.6173033618477755,0,0,2,2,2,274,22.0
218,352240166,cd,2,8,21.286460500711478,0,0,2,1,2,274,22.0
219,352240159,cd,2,7,6.203123491636459,0,0,2,1,2,274,22.0
220,352240152,cd,2,6,7.571745389116412,0,0,2,1,2,274,22.0
221,352240145,cd,2,5,7.651036293446749,0,0,2,1,2,274,22.0
222,352240138,cd,2,123,8.432097910635875,0,0,2,2,2,274,22.0
223,352240131,cd,2,122,24.397190019291774,0,0,2,2,2,274,22.0
224,352240436,cd,2,145,16.862460655471963,0,0,2,7,2,274,22.0
225,352240429,cd,2,4,8.617131460951246,0,0,2,1,2,274,22.0
226,352240422,cd,2,3,8.55188095445956,0,0,2,1,2,274,22.0
227,352240415,cd,2,2,3.340279743594907,0,0,2,1,2,274,22.0
228,352240408,cd,2,1,4.691865510314144,0,0,2,1,2,274,22.0
229,352240400,cd,2,134,11.222343476834139,0,0,3,2,3,274,22.0
230,352240393,cd,2,137,8.385695039593724,0,0,2,3,2,274,22.0
231,352240385,cd,2,61,12.428596171035185,0,0,3,1,3,274,22.0
