counter,AS,Type,GranularityValue,SeverityScore,PageRank,NumBadDep,TotalDep,NumberOfVerteces,NumOfCycle,NumSetOfElement,TotNumOfSetOfElement,ADI
1,2205753,ud,2,8,16.41429158965956,1,0,0,0,2,99,30.0
2,2205792,ud,2,7,27.05214374065099,1,0,0,0,2,99,30.0
3,2205801,ud,2,6,22.253511220866084,1,0,0,0,2,99,30.0
4,2205810,ud,2,5,19.28364033858723,1,0,0,0,2,99,30.0
5,2205819,ud,2,12,62.86357115737286,4,0,0,0,5,99,30.0
6,2205762,ud,2,10,25.788597693714518,2,0,0,0,3,99,30.0
7,2205774,ud,2,4,23.81645011882818,1,0,0,0,2,99,30.0
8,2205783,ud,2,3,25.79517511465324,1,0,0,0,2,99,30.0
9,2205858,ud,2,11,28.66783552679628,1,0,0,0,2,99,30.0
10,2205867,ud,2,9,23.80987269788946,2,0,0,0,3,99,30.0
11,2205828,ud,2,2,23.624955904127862,1,0,0,0,2,99,30.0
12,2205837,ud,2,1,8.564679659225368,1,0,0,0,2,99,30.0
13,2205846,ud,2,13,20.149561082433316,2,0,0,0,3,99,30.0
14,2205700,hl,2,1,118.21677143499659,0,18,0,0,16,99,30.0
15,2205726,hl,2,2,163.42406463156973,0,19,0,0,16,99,30.0
16,2205594,hl,1,4,29.108784477691014,0,63,0,0,62,99,30.0
17,2205666,hl,2,3,192.84179779642113,0,26,0,0,21,99,30.0
18,2204706,cd,1,13,1.2104117951656632,0,0,2,1,2,99,30.0
19,2204713,cd,1,46,4.672551632926653,0,0,5,1,5,99,30.0
20,2204723,cd,1,53,5.698275968242052,0,0,6,1,6,99,30.0
21,2204734,cd,1,35,4.412169547642703,0,0,4,1,4,99,30.0
22,2204770,cd,1,25,3.5548170031188144,0,0,3,1,3,99,30.0
23,2204778,cd,1,34,4.696290810581957,0,0,4,1,4,99,30.0
24,2204787,cd,1,45,5.735403583302942,0,0,5,1,5,99,30.0
25,2204797,cd,1,12,1.4507080813993962,0,0,2,1,2,99,30.0
26,2204743,cd,1,24,4.209396046289326,0,0,3,1,3,99,30.0
27,2204751,cd,1,44,5.4955024668886745,0,0,5,1,5,99,30.0
28,2204761,cd,1,33,4.544983653764041,0,0,4,1,4,99,30.0
29,2204838,cd,1,63,4.0966231609633965,0,0,2,3,2,99,30.0
30,2204845,cd,1,11,2.1129922910168673,0,0,2,1,2,99,30.0
31,2204852,cd,1,32,4.293578871200995,0,0,4,1,4,99,30.0
32,2204861,cd,1,23,3.1686772188813483,0,0,3,1,3,99,30.0
33,2204804,cd,1,22,3.436816853910268,0,0,3,1,3,99,30.0
34,2204812,cd,1,31,3.492772338145995,0,0,4,1,4,99,30.0
35,2204821,cd,1,43,4.53188511086698,0,0,5,1,5,99,30.0
36,2204831,cd,1,10,2.0934053344951282,0,0,2,1,2,99,30.0
37,2204896,cd,1,30,3.576664306705611,0,0,4,1,4,99,30.0
38,2204905,cd,1,52,5.757250886889739,0,0,6,1,6,99,30.0
39,2204916,cd,1,42,4.916368742107659,0,0,5,1,5,99,30.0
40,2204926,cd,1,29,3.7748949346445153,0,0,4,1,4,99,30.0
41,2204869,cd,1,28,4.207789991602333,0,0,4,1,4,99,30.0
42,2204878,cd,1,62,5.135735933684382,0,0,3,2,3,99,30.0
43,2204886,cd,1,41,4.718138114168755,0,0,5,1,5,99,30.0
44,2204964,cd,1,40,4.003363629678815,0,0,5,1,5,99,30.0
45,2204974,cd,1,59,6.183950209862943,0,0,7,1,7,99,30.0
46,2204986,cd,1,9,1.3495335005479685,0,0,2,1,2,99,30.0
47,2204935,cd,1,51,5.9554815148286435,0,0,6,1,6,99,30.0
48,2204946,cd,1,50,5.144837437141958,0,0,6,1,6,99,30.0
49,2204957,cd,1,8,1.482933641204307,0,0,2,1,2,99,30.0
50,2205030,cd,2,7,19.495008261381553,0,0,2,1,2,99,30.0
51,2205037,cd,2,64,54.157408368846276,0,0,2,11,2,99,30.0
52,2205044,cd,2,39,77.96728106673574,0,0,5,1,5,99,30.0
53,2205054,cd,2,21,52.97426315047908,0,0,3,1,3,99,30.0
54,2204993,cd,1,58,6.050550069206605,0,0,7,1,7,99,30.0
55,2205005,cd,1,49,5.01143729648562,0,0,6,1,6,99,30.0
56,2205016,cd,1,61,3.3220603876472707,0,0,2,2,2,99,30.0
57,2205023,cd,2,6,23.63207488657681,0,0,2,1,2,99,30.0
58,2205089,cd,2,5,27.908355619821236,0,0,2,1,2,99,30.0
59,2205096,cd,2,57,81.87481133547742,0,0,7,1,7,99,30.0
60,2205108,cd,2,4,21.968613855263524,0,0,2,1,2,99,30.0
61,2205115,cd,2,20,42.92868858028794,0,0,3,1,3,99,30.0
62,2205062,cd,2,48,87.16378935947805,0,0,6,1,6,99,30.0
63,2205073,cd,2,19,64.61088528758634,0,0,3,1,3,99,30.0
64,2205081,cd,2,18,48.86843034484565,0,0,3,1,3,99,30.0
65,2205161,cd,2,27,62.064796630109264,0,0,4,1,4,99,30.0
66,2205170,cd,2,56,73.35150506059375,0,0,7,1,7,99,30.0
67,2205182,cd,2,38,59.99510928144436,0,0,5,1,5,99,30.0
68,2205123,cd,2,17,51.611319711369205,0,0,3,1,3,99,30.0
69,2205131,cd,2,3,30.651244986344793,0,0,2,1,2,99,30.0
70,2205138,cd,2,55,84.61770070200097,0,0,7,1,7,99,30.0
71,2205150,cd,2,47,75.42119240925867,0,0,6,1,6,99,30.0
72,2205222,cd,2,54,72.7433304051638,0,0,7,1,7,99,30.0
73,2205234,cd,2,37,59.38693462601441,0,0,5,1,5,99,30.0
74,2205244,cd,2,36,74.9265304406806,0,0,5,1,5,99,30.0
75,2205192,cd,2,16,27.973382982249934,0,0,3,1,3,99,30.0
76,2205200,cd,2,26,48.93345770727434,0,0,4,1,4,99,30.0
77,2205209,cd,2,60,81.93983869790611,0,0,8,1,8,99,30.0
78,2205254,cd,2,2,52.373626368788884,0,0,2,1,2,99,30.0
79,2205261,cd,2,15,28.691516554123865,0,0,3,1,3,99,30.0
80,2205269,cd,2,14,18.20853013313583,0,0,3,1,3,99,30.0
81,2205277,cd,2,1,10.990746836218582,0,0,2,1,2,99,30.0
