counter,AS,Type,GranularityValue,SeverityScore,PageRank,NumBadDep,TotalDep,NumberOfVerteces,NumOfCycle,NumSetOfElement,TotNumOfSetOfElement,ADI
1,403433477,ud,2,76,335.5870765547304,2,0,0,0,3,284,23.0
2,403433501,ud,2,61,73.9624806808336,1,0,0,0,2,284,23.0
3,403433489,ud,2,85,12.977409475458938,2,0,0,0,3,284,23.0
4,403433510,ud,2,75,296.86480325955733,4,0,0,0,5,284,23.0
5,403433534,ud,2,60,11.887419479743777,2,0,0,0,3,284,23.0
6,403433546,ud,2,59,30.109008567586272,5,0,0,0,6,284,23.0
7,403433582,ud,2,58,6.641483426832032,1,0,0,0,2,284,23.0
8,403433573,ud,2,57,4.694233533264922,1,0,0,0,2,284,23.0
9,403433591,ud,2,74,4.552270448591928,1,0,0,0,2,284,23.0
10,403433615,ud,2,56,11.765489685358618,1,0,0,0,2,284,23.0
11,403433600,ud,2,55,24.524620201702874,3,0,0,0,4,284,23.0
12,403433624,ud,2,54,14.170703396161173,1,0,0,0,2,284,23.0
13,403433642,ud,2,73,12.753295450226315,4,0,0,0,5,284,23.0
14,403433633,ud,2,84,3.8641990357128586,1,0,0,0,2,284,23.0
15,403433660,ud,2,53,26.532919281811036,1,0,0,0,2,284,23.0
16,403433678,ud,2,52,19.030521889020836,1,0,0,0,2,284,23.0
17,403433669,ud,2,51,19.92252209099676,1,0,0,0,2,284,23.0
18,403433687,ud,2,50,14.45585527470734,1,0,0,0,2,284,23.0
19,403433705,ud,2,49,7.064058291006331,1,0,0,0,2,284,23.0
20,403433696,ud,2,48,11.822055841385012,1,0,0,0,2,284,23.0
21,403433723,ud,2,72,10.284036263594327,2,0,0,0,3,284,23.0
22,403433714,ud,2,71,8.948650761025517,1,0,0,0,2,284,23.0
23,403433735,ud,2,70,9.022288275541996,1,0,0,0,2,284,23.0
24,403433753,ud,2,69,50.040281881912364,5,0,0,0,6,284,23.0
25,403433744,ud,2,47,8.16759166375073,1,0,0,0,2,284,23.0
26,403433774,ud,2,83,3.0276608221771135,1,0,0,0,2,284,23.0
27,403433786,ud,2,46,3.0535294195198537,1,0,0,0,2,284,23.0
28,403433804,ud,2,45,26.56611473844154,1,0,0,0,2,284,23.0
29,403433795,ud,2,44,26.366085082513543,1,0,0,0,2,284,23.0
30,403433822,ud,2,43,20.89941826622412,1,0,0,0,2,284,23.0
31,403433813,ud,2,42,9.18459175746261,1,0,0,0,2,284,23.0
32,403433834,ud,2,41,2.132292492807929,1,0,0,0,2,284,23.0
33,403433855,ud,2,40,8.433856802742191,1,0,0,0,2,284,23.0
34,403433843,ud,2,82,56.2999813562564,1,0,0,0,2,284,23.0
35,403433864,ud,2,68,63.5276875813064,1,0,0,0,2,284,23.0
36,403433873,ud,2,39,7.07654520939596,2,0,0,0,3,284,23.0
37,403433900,ud,2,38,7.92732239583558,1,0,0,0,2,284,23.0
38,403433891,ud,2,81,6.903941490036222,1,0,0,0,2,284,23.0
39,403433918,ud,2,37,7.9111135250576465,1,0,0,0,2,284,23.0
40,403433909,ud,2,36,9.85626130840065,1,0,0,0,2,284,23.0
41,403433927,ud,2,35,16.892580407789794,2,0,0,0,3,284,23.0
42,403433948,ud,2,34,12.736309066031755,1,0,0,0,2,284,23.0
43,403433939,ud,2,33,6.170246742076138,1,0,0,0,2,284,23.0
44,403433018,ud,2,32,81.38094180328399,5,0,0,0,6,284,23.0
45,403433009,ud,2,31,10.185249954297165,1,0,0,0,2,284,23.0
46,403433039,ud,2,30,4.625902377957834,1,0,0,0,2,284,23.0
47,403433030,ud,2,29,5.155089952197045,1,0,0,0,2,284,23.0
48,403433048,ud,2,28,14.12432437111439,2,0,0,0,3,284,23.0
49,403433069,ud,2,27,19.06371734565134,1,0,0,0,2,284,23.0
50,403433060,ud,2,26,9.873218472304252,1,0,0,0,2,284,23.0
51,403433087,ud,2,25,59.892473706884786,2,0,0,0,3,284,23.0
52,403433078,ud,2,80,2.9307372737000676,1,0,0,0,2,284,23.0
53,403433099,ud,2,67,526.406243388399,7,0,0,0,8,284,23.0
54,403433108,ud,2,79,82.09393655009211,6,0,0,0,7,284,23.0
55,403433135,ud,2,24,15.7550757717326,1,0,0,0,2,284,23.0
56,403433120,ud,2,78,72.92414997993576,4,0,0,0,5,284,23.0
57,403433144,ud,2,23,106.1129863240248,1,0,0,0,2,284,23.0
58,403433162,ud,2,66,568.0043939420256,3,0,0,0,4,284,23.0
59,403433153,ud,2,22,13.736389563561058,1,0,0,0,2,284,23.0
60,403433174,ud,2,21,18.72672593707872,2,0,0,0,3,284,23.0
61,403433198,ud,2,20,16.990476483013545,4,0,0,0,5,284,23.0
62,403433189,ud,2,19,12.895427995262216,1,0,0,0,2,284,23.0
63,403433225,ud,2,18,86.27773787982832,1,0,0,0,2,284,23.0
64,403433216,ud,2,65,201.35395223448978,1,0,0,0,2,284,23.0
65,403433246,ud,2,77,3.560609930114082,1,0,0,0,2,284,23.0
66,403433234,ud,2,64,288.99852798553917,3,0,0,0,4,284,23.0
67,403433258,ud,2,17,7.550740473785613,1,0,0,0,2,284,23.0
68,403433276,ud,2,16,17.271004396926482,2,0,0,0,3,284,23.0
69,403433267,ud,2,15,3.2168429599427983,1,0,0,0,2,284,23.0
70,403433288,ud,2,14,72.48382977974121,2,0,0,0,3,284,23.0
71,403433300,ud,2,13,12.90506699663115,1,0,0,0,2,284,23.0
72,403433312,ud,2,12,5.359725143648322,1,0,0,0,2,284,23.0
73,403433342,ud,2,11,5.171978694874852,1,0,0,0,2,284,23.0
74,403433333,ud,2,10,5.790428576842013,1,0,0,0,2,284,23.0
75,403433351,ud,2,9,7.549565864371878,1,0,0,0,2,284,23.0
76,403433369,ud,2,8,61.93765952314814,2,0,0,0,3,284,23.0
77,403433360,ud,2,7,4.075692731052962,1,0,0,0,2,284,23.0
78,403433390,ud,2,6,12.522339042365873,4,0,0,0,5,284,23.0
79,403433381,ud,2,5,35.83294522139216,1,0,0,0,2,284,23.0
80,403433402,ud,2,63,7.944257342733377,1,0,0,0,2,284,23.0
81,403433420,ud,2,4,5.000870128147603,1,0,0,0,2,284,23.0
82,403433411,ud,2,3,5.022679903533993,1,0,0,0,2,284,23.0
83,403433429,ud,2,2,7.632409621885708,2,0,0,0,3,284,23.0
84,403433447,ud,2,1,4.515366653695037,1,0,0,0,2,284,23.0
85,403433465,ud,2,86,265.5827566316122,2,0,0,0,3,284,23.0
86,403433456,ud,2,62,196.3624039583575,1,0,0,0,2,284,23.0
87,403432884,hl,2,2,1666.436209353523,0,61,0,0,56,284,23.0
88,403432953,hl,2,1,1409.653543384863,0,48,0,0,46,284,23.0
89,403430074,cd,1,61,8.084580562845787,0,0,2,1,2,284,23.0
90,403430088,cd,1,60,1.022325570959396,0,0,2,1,2,284,23.0
91,403430095,cd,1,175,0.9286318931350004,0,0,2,2,2,284,23.0
92,403430081,cd,1,59,1.929979160981722,0,0,2,1,2,284,23.0
93,403430109,cd,1,58,1.4329407243635846,0,0,2,1,2,284,23.0
94,403430102,cd,1,182,1.097351813478618,0,0,2,3,2,284,23.0
95,403430125,cd,1,181,1.1633334283182983,0,0,2,3,2,284,23.0
96,403430116,cd,1,107,2.0953620914178814,0,0,4,1,4,284,23.0
97,403430143,cd,1,106,1.7557034266988718,0,0,4,1,4,284,23.0
98,403430132,cd,1,132,2.7998105681838314,0,0,6,1,6,284,23.0
99,403430152,cd,1,131,2.697810568183831,0,0,6,1,6,284,23.0
100,403430171,cd,1,87,1.8197908215596974,0,0,3,1,3,284,23.0
101,403430163,cd,1,86,1.351113231252406,0,0,3,1,3,284,23.0
102,403430189,cd,1,85,1.2117218342773013,0,0,3,1,3,284,23.0
103,403430179,cd,1,121,2.255828975762261,0,0,5,1,5,284,23.0
104,403430206,cd,1,57,1.3575693568305491,0,0,2,1,2,284,23.0
105,403430197,cd,1,105,1.8944267784831592,0,0,4,1,4,284,23.0
106,403430220,cd,1,56,1.1886871290068586,0,0,2,1,2,284,23.0
107,403430213,cd,1,55,1.2155835815064417,0,0,2,1,2,284,23.0
108,403430234,cd,1,54,1.1398319880524481,0,0,2,1,2,284,23.0
109,403430227,cd,1,174,0.8521345536489646,0,0,2,2,2,284,23.0
110,403430248,cd,1,188,0.9292391820031827,0,0,2,6,2,284,23.0
111,403430255,cd,1,190,0.8898738726596667,0,0,2,7,2,284,23.0
112,403430241,cd,1,191,0.965684967972427,0,0,2,8,2,284,23.0
113,403430269,cd,1,53,1.1861175423000014,0,0,2,1,2,284,23.0
114,403430262,cd,1,52,1.2491816988498188,0,0,2,1,2,284,23.0
115,403430283,cd,1,180,0.8869595330415572,0,0,2,3,2,284,23.0
116,403430276,cd,1,51,0.9434659219393065,0,0,2,1,2,284,23.0
117,403430297,cd,1,50,0.9204805702920913,0,0,2,1,2,284,23.0
118,403430290,cd,1,49,0.9204805702920913,0,0,2,1,2,284,23.0
119,403430318,cd,1,84,1.5825960117133522,0,0,3,1,3,284,23.0
120,403430304,cd,1,48,0.9204805702920913,0,0,2,1,2,284,23.0
121,403430311,cd,1,47,0.9093983509694235,0,0,2,1,2,284,23.0
122,403430334,cd,1,46,0.989160583941606,0,0,2,1,2,284,23.0
123,403430326,cd,1,83,1.3060469614993302,0,0,3,1,3,284,23.0
124,403430349,cd,1,104,1.6789331616498817,0,0,4,1,4,284,23.0
125,403430341,cd,1,82,1.3744585479747102,0,0,3,1,3,284,23.0
126,403430365,cd,1,45,0.902671348054914,0,0,2,1,2,284,23.0
127,403430358,cd,1,173,1.1863496656097468,0,0,2,2,2,284,23.0
128,403430379,cd,1,44,0.9325637071202078,0,0,2,1,2,284,23.0
129,403430372,cd,1,43,0.902671348054914,0,0,2,1,2,284,23.0
130,403430393,cd,1,42,0.9056591484669418,0,0,2,1,2,284,23.0
131,403430386,cd,1,41,0.9325637071202078,0,0,2,1,2,284,23.0
132,403430414,cd,1,40,0.9309886372325082,0,0,2,1,2,284,23.0
133,403430400,cd,1,39,0.9056591484669418,0,0,2,1,2,284,23.0
134,403430407,cd,1,38,0.9309886372325082,0,0,2,1,2,284,23.0
135,403430428,cd,1,37,0.9470031342785065,0,0,2,1,2,284,23.0
136,403430421,cd,1,36,0.9445474843144908,0,0,2,1,2,284,23.0
137,403430447,cd,2,35,129.82545592645883,0,0,2,1,2,284,23.0
138,403430435,cd,2,144,682.7965139923131,0,0,7,1,7,284,23.0
139,403430454,cd,2,153,853.9815842669556,0,0,10,1,10,284,23.0
140,403430477,cd,2,120,511.88118631958775,0,0,5,1,5,284,23.0
141,403430469,cd,2,81,178.025385597341,0,0,3,1,3,284,23.0
142,403430487,cd,2,130,548.0455753523247,0,0,6,1,6,284,23.0
143,403430508,cd,2,129,338.8530887801252,0,0,6,1,6,284,23.0
144,403430498,cd,2,119,361.76590471998065,0,0,5,1,5,284,23.0
145,403430519,cd,2,143,525.1327594124691,0,0,7,1,7,284,23.0
146,403430538,cd,2,163,825.3157682222636,0,0,12,1,12,284,23.0
147,403430531,cd,2,187,58.715268668521226,0,0,2,5,2,284,23.0
148,403430555,cd,2,147,522.1134350500747,0,0,8,1,8,284,23.0
149,403430568,cd,2,142,335.8337644177308,0,0,7,1,7,284,23.0
150,403430580,cd,2,159,828.3350925846579,0,0,11,1,11,284,23.0
151,403430604,cd,2,146,523.3117506257787,0,0,8,1,8,284,23.0
152,403430596,cd,2,80,104.17896424416114,0,0,3,1,3,284,23.0
153,403430617,cd,2,162,826.5140837979675,0,0,12,1,12,284,23.0
154,403430634,cd,2,141,337.03207999343476,0,0,7,1,7,284,23.0
155,403430655,cd,2,118,191.2769586902223,0,0,5,1,5,284,23.0
156,403430646,cd,2,103,102.35795545747077,0,0,4,1,4,284,23.0
157,403430665,cd,2,149,631.2457457364939,0,0,9,1,9,284,23.0
158,403430679,cd,2,140,525.7055491853276,0,0,7,1,7,284,23.0
159,403430702,cd,2,117,191.84974846308083,0,0,5,1,5,284,23.0
160,403430691,cd,2,128,339.4258785529837,0,0,6,1,6,284,23.0
161,403430712,cd,2,139,390.96722158622543,0,0,7,1,7,284,23.0
162,403430724,cd,2,158,828.9078823575164,0,0,11,1,11,284,23.0
163,403430749,cd,2,34,127.09178018401673,0,0,2,1,2,284,23.0
164,403430740,cd,2,102,214.18977463007786,0,0,4,1,4,284,23.0
165,403430756,cd,2,152,851.2479085245133,0,0,10,1,10,284,23.0
166,403430771,cd,2,164,859.9630990340415,0,0,13,1,13,284,23.0
167,403430789,cd,2,161,827.9038911547545,0,0,12,1,12,284,23.0
168,403430806,cd,2,151,630.8145443065905,0,0,10,1,10,284,23.0
169,403430821,cd,2,127,341.1076096193476,0,0,6,1,6,284,23.0
170,403430832,cd,2,157,830.5896134238803,0,0,11,1,11,284,23.0
171,403430858,cd,2,138,527.3872802516915,0,0,7,1,7,284,23.0
172,403430848,cd,2,116,193.53147952944477,0,0,5,1,5,284,23.0
173,403430870,cd,2,150,670.4490437560117,0,0,10,1,10,284,23.0
174,403430885,cd,2,160,867.5383906041758,0,0,12,1,12,284,23.0
175,403430909,cd,2,79,106.43348508338359,0,0,3,1,3,284,23.0
176,403430902,cd,2,172,60.96978950774367,0,0,2,2,2,284,23.0
177,403430917,cd,2,126,338.92354990353977,0,0,6,1,6,284,23.0
178,403430940,cd,2,156,828.4055537080725,0,0,11,1,11,284,23.0
179,403430928,cd,2,137,525.2032205358837,0,0,7,1,7,284,23.0
180,403430956,cd,2,115,191.34741981363692,0,0,5,1,5,284,23.0
181,403430975,cd,2,148,631.3162068599084,0,0,9,1,9,284,23.0
182,403430966,cd,2,101,131.391565635035,0,0,4,1,4,284,23.0
183,403430989,cd,2,78,104.24942536757575,0,0,3,1,3,284,23.0
184,403431006,cd,2,145,580.8670515701115,0,0,8,1,8,284,23.0
185,403430997,cd,2,100,136.79454553658073,0,0,4,1,4,284,23.0
186,403431019,cd,2,33,58.78572979193582,0,0,2,1,2,284,23.0
187,403431038,cd,2,77,92.90885968519268,0,0,3,1,3,284,23.0
188,403431026,cd,2,136,513.8626548535007,0,0,7,1,7,284,23.0
189,403431046,cd,2,155,817.0649880256893,0,0,11,1,11,284,23.0
190,403431069,cd,2,154,823.9860389029476,0,0,11,1,11,284,23.0
191,403431062,cd,2,32,47.445164109552756,0,0,2,1,2,284,23.0
192,403431085,cd,2,99,325.6015156872438,0,0,4,1,4,284,23.0
193,403431094,cd,2,135,746.1638824485478,0,0,7,1,7,284,23.0
194,403431113,cd,2,125,784.6342639843384,0,0,6,1,6,284,23.0
195,403431106,cd,2,31,481.43193081214963,0,0,2,1,2,284,23.0
196,403431132,cd,2,30,428.22317229891576,0,0,2,1,2,284,23.0
197,403431124,cd,2,76,537.0957618463774,0,0,3,1,3,284,23.0
198,403431149,cd,2,98,358.86616420641656,0,0,4,1,4,284,23.0
199,403431139,cd,2,114,675.7616744368767,0,0,5,1,5,284,23.0
200,403431165,cd,2,75,297.98765742775794,0,0,3,1,3,284,23.0
201,403431158,cd,2,29,161.77681735825263,0,0,2,1,2,284,23.0
202,403431180,cd,2,28,11.178623029355135,0,0,2,1,2,284,23.0
203,403431173,cd,2,27,215.69393151077688,0,0,2,1,2,284,23.0
204,403431196,cd,2,113,33.73937382643461,0,0,5,1,5,284,23.0
205,403431187,cd,2,97,35.671196470118176,0,0,4,1,4,284,23.0
206,403431214,cd,2,74,29.57945053366394,0,0,3,1,3,284,23.0
207,403431206,cd,2,73,21.97388414107599,0,0,3,1,3,284,23.0
208,403431229,cd,2,171,20.77380523746919,0,0,2,2,2,284,23.0
209,403431222,cd,2,26,23.905706784759552,0,0,2,1,2,284,23.0
210,403431244,cd,2,25,17.43923343426301,0,0,2,1,2,284,23.0
211,403431236,cd,2,72,26.865551173923418,0,0,3,1,3,284,23.0
212,403431258,cd,2,24,39.58914238141047,0,0,2,1,2,284,23.0
213,403431251,cd,2,23,15.90303761883408,0,0,2,1,2,284,23.0
214,403431273,cd,2,112,90.09301211724471,0,0,5,1,5,284,23.0
215,403431265,cd,2,71,40.913474265262195,0,0,3,1,3,284,23.0
216,403431293,cd,2,22,32.43477938794615,0,0,2,1,2,284,23.0
217,403431283,cd,2,111,65.42509730168977,0,0,5,1,5,284,23.0
218,403431311,cd,2,110,79.13475322767697,0,0,5,1,5,284,23.0
219,403431300,cd,2,124,75.30294124753941,0,0,6,1,6,284,23.0
220,403431321,cd,2,96,71.0447626768609,0,0,4,1,4,284,23.0
221,403431338,cd,2,123,93.99040244545738,0,0,6,1,6,284,23.0
222,403431330,cd,2,70,61.00008453171377,0,0,3,1,3,284,23.0
223,403431349,cd,2,134,103.86824639130701,0,0,7,1,7,284,23.0
224,403431368,cd,2,95,50.56944808390935,0,0,4,1,4,284,23.0
225,403431361,cd,2,186,37.38765940288803,0,0,2,5,2,284,23.0
226,403431385,cd,2,184,57.269528402798585,0,0,2,4,2,284,23.0
227,403431377,cd,2,69,65.35951895361467,0,0,3,1,3,284,23.0
228,403431401,cd,2,94,52.912840004740374,0,0,4,1,4,284,23.0
229,403431392,cd,2,93,80.21516817139508,0,0,4,1,4,284,23.0
230,403431417,cd,2,68,43.03499605889074,0,0,3,1,3,284,23.0
231,403431410,cd,2,21,28.179346841110327,0,0,2,1,2,284,23.0
232,403431435,cd,2,20,8.248629334511733,0,0,2,1,2,284,23.0
233,403431425,cd,2,109,46.42291725206902,0,0,5,1,5,284,23.0
234,403431449,cd,2,19,11.144882371017882,0,0,2,1,2,284,23.0
235,403431442,cd,2,18,14.960064073781343,0,0,2,1,2,284,23.0
236,403431464,cd,2,170,26.1409682773871,0,0,2,2,2,284,23.0
237,403431471,cd,2,17,7.6493976937245,0,0,2,1,2,284,23.0
238,403431456,cd,2,67,16.941845008848546,0,0,3,1,3,284,23.0
239,403431485,cd,2,16,7.5779676468555515,0,0,2,1,2,284,23.0
240,403431478,cd,2,169,8.439374513242932,0,0,2,2,2,284,23.0
241,403431499,cd,2,15,21.26212688556322,0,0,2,1,2,284,23.0
242,403431492,cd,2,14,6.17018296032704,0,0,2,1,2,284,23.0
243,403431513,cd,2,185,12.302626589063449,0,0,2,5,2,284,23.0
244,403431506,cd,2,168,7.744705929215053,0,0,2,2,2,284,23.0
245,403431528,cd,2,167,12.480935839885184,0,0,2,2,2,284,23.0
246,403431535,cd,2,177,12.422767526333086,0,0,3,2,3,284,23.0
247,403431520,cd,2,66,9.999937063505387,0,0,3,1,3,284,23.0
248,403431543,cd,2,92,24.81990280362537,0,0,4,1,4,284,23.0
249,403431566,cd,2,13,12.802239175116343,0,0,2,1,2,284,23.0
250,403431552,cd,2,12,25.13135059698441,0,0,2,1,2,284,23.0
251,403431559,cd,2,11,9.619889057739648,0,0,2,1,2,284,23.0
252,403431580,cd,2,10,15.282559115607558,0,0,2,1,2,284,23.0
253,403431573,cd,2,9,15.524351762212508,0,0,2,1,2,284,23.0
254,403431594,cd,2,8,10.275837829436908,0,0,2,1,2,284,23.0
255,403431587,cd,2,179,13.62595777738698,0,0,2,3,2,284,23.0
256,403431609,cd,2,91,16.402940278883456,0,0,4,1,4,284,23.0
257,403431601,cd,2,65,16.69371737118027,0,0,3,1,3,284,23.0
258,403431626,cd,2,133,36.257881045072395,0,0,7,1,7,284,23.0
259,403431618,cd,2,64,12.516534931705795,0,0,3,1,3,284,23.0
260,403431646,cd,2,108,17.815550950104697,0,0,5,1,5,284,23.0
261,403431638,cd,2,63,10.734429361797412,0,0,3,1,3,284,23.0
262,403431656,cd,2,122,34.84527037385114,0,0,6,1,6,284,23.0
263,403431676,cd,2,90,26.95433816442059,0,0,4,1,4,284,23.0
264,403431667,cd,2,89,28.7181679244046,0,0,4,1,4,284,23.0
265,403431693,cd,2,7,7.8493561519541295,0,0,2,1,2,284,23.0
266,403431685,cd,2,62,26.215140789323016,0,0,3,1,3,284,23.0
267,403431709,cd,2,166,23.728555762170735,0,0,2,2,2,284,23.0
268,403431700,cd,2,88,26.291686246921824,0,0,4,1,4,284,23.0
269,403431723,cd,2,6,4.774972470855618,0,0,2,1,2,284,23.0
270,403431716,cd,2,5,17.141715811438896,0,0,2,1,2,284,23.0
271,403431737,cd,2,165,8.211610023989866,0,0,2,2,2,284,23.0
272,403431730,cd,2,183,10.733563124083659,0,0,2,4,2,284,23.0
273,403431752,cd,2,178,8.363566677388416,0,0,2,3,2,284,23.0
274,403431759,cd,2,4,4.675447657566431,0,0,2,1,2,284,23.0
275,403431744,cd,2,176,11.198505028452512,0,0,3,2,3,284,23.0
276,403431773,cd,2,189,17.040641411308332,0,0,2,7,2,284,23.0
277,403431766,cd,2,3,3.3275126045087964,0,0,2,1,2,284,23.0
278,403431787,cd,2,2,8.704134582559073,0,0,2,1,2,284,23.0
279,403431780,cd,2,1,8.637846947207612,0,0,2,1,2,284,23.0
