counter,AS,Type,GranularityValue,SeverityScore,PageRank,NumBadDep,TotalDep,NumberOfVerteces,NumOfCycle,NumSetOfElement,TotNumOfSetOfElement,ADI
1,1324789,ud,2,11,4.813188107734888,1,0,0,0,2,71,11.0
2,1324798,ud,2,6,26.099458712277084,1,0,0,0,2,71,11.0
3,1324771,ud,2,14,3.346767680633958,1,0,0,0,2,71,11.0
4,1324780,ud,2,16,3.2681628151334614,1,0,0,0,2,71,11.0
5,1324816,ud,2,5,7.939766946431,1,0,0,0,2,71,11.0
6,1324825,ud,2,12,36.87065271495892,2,0,0,0,3,71,11.0
7,1324807,ud,2,9,23.63353467241719,1,0,0,0,2,71,11.0
8,1324861,ud,2,15,50.84367727214646,1,0,0,0,2,71,11.0
9,1324834,ud,2,7,8.344486858868137,1,0,0,0,2,71,11.0
10,1324846,ud,2,10,74.03111724045827,3,0,0,0,4,71,11.0
11,1324870,ud,2,1,16.707474203140436,1,0,0,0,2,71,11.0
12,1324879,ud,2,4,17.360545181139578,4,0,0,0,5,71,11.0
13,1324915,ud,2,8,53.84784264427143,1,0,0,0,2,71,11.0
14,1324924,ud,2,2,15.292834827501725,1,0,0,0,2,71,11.0
15,1324897,ud,2,13,28.84578584487103,1,0,0,0,2,71,11.0
16,1324906,ud,2,3,3.118477708338028,1,0,0,0,2,71,11.0
17,1324736,hl,2,1,358.59527286712427,0,27,0,0,27,71,11.0
18,1324374,cd,1,11,2.1028041258683845,0,0,2,1,2,71,11.0
19,1324381,cd,1,22,1.2011537201592686,0,0,2,2,2,71,11.0
20,1324404,cd,1,16,1.9706639886659252,0,0,3,1,3,71,11.0
21,1324412,cd,1,10,1.9342366424553616,0,0,2,1,2,71,11.0
22,1324388,cd,1,15,2.0957308874231098,0,0,3,1,3,71,11.0
23,1324396,cd,1,14,2.0070925600944967,0,0,3,1,3,71,11.0
24,1324434,cd,1,13,1.2445665033431488,0,0,3,1,3,71,11.0
25,1324442,cd,1,9,1.0110325330483252,0,0,2,1,2,71,11.0
26,1324419,cd,1,12,1.9395474698748791,0,0,3,1,3,71,11.0
27,1324427,cd,1,21,0.8982217529820391,0,0,2,2,2,71,11.0
28,1324470,cd,2,8,11.376780555969999,0,0,2,1,2,71,11.0
29,1324477,cd,2,17,14.47364760399132,0,0,4,1,4,71,11.0
30,1324449,cd,1,20,0.9302535863316364,0,0,2,2,2,71,11.0
31,1324463,cd,2,19,12.84724019576014,0,0,2,2,2,71,11.0
32,1324456,cd,2,7,31.67063542860818,0,0,2,1,2,71,11.0
33,1324500,cd,2,23,72.24022803126482,0,0,3,2,3,71,11.0
34,1324508,cd,2,18,59.85269238751496,0,0,2,2,2,71,11.0
35,1324486,cd,2,6,25.63148902135092,0,0,2,1,2,71,11.0
36,1324493,cd,2,24,38.928456830952726,0,0,2,26,2,71,11.0
37,1324529,cd,2,5,10.345159256486035,0,0,2,1,2,71,11.0
38,1324543,cd,2,4,42.05760959290391,0,0,2,1,2,71,11.0
39,1324536,cd,2,3,9.865525934121719,0,0,2,1,2,71,11.0
40,1324515,cd,2,2,16.73214810107278,0,0,2,1,2,71,11.0
41,1324522,cd,2,1,15.441528915673466,0,0,2,1,2,71,11.0
