counter,AS,Type,GranularityValue,SeverityScore,PageRank,NumBadDep,TotalDep,NumberOfVerteces,NumOfCycle,NumSetOfElement,TotNumOfSetOfElement,ADI
1,643178,ud,2,1,29.813404473420196,2,0,0,0,3,20,6.0
2,643187,ud,2,2,42.26170438772946,2,0,0,0,3,20,6.0
3,643072,cd,1,10,1.0271816946782106,0,0,2,8,2,20,6.0
4,643079,cd,2,7,41.43556089463823,0,0,2,1,2,20,6.0
5,643007,cd,1,11,2.657427039448866,0,0,2,11,2,20,6.0
6,643022,cd,1,6,2.206952594207944,0,0,2,1,2,20,6.0
7,643014,cd,1,9,2.7757836083371563,0,0,3,1,3,20,6.0
8,643036,cd,1,8,2.9787666173697955,0,0,3,1,3,20,6.0
9,643029,cd,1,5,2.677086682990955,0,0,2,1,2,20,6.0
10,643051,cd,1,4,1.1066488572617348,0,0,2,1,2,20,6.0
11,643044,cd,1,3,6.821509900301276,0,0,2,1,2,20,6.0
12,643065,cd,1,2,0.9311532775853351,0,0,2,1,2,20,6.0
13,643058,cd,1,1,1.1066488572617348,0,0,2,1,2,20,6.0
