counter,AS,Type,GranularityValue,SeverityScore,PageRank,NumBadDep,TotalDep,NumberOfVerteces,NumOfCycle,NumSetOfElement,TotNumOfSetOfElement,ADI
1,118103819,ud,2,61,16.749254808445034,1,0,0,0,2,252,6.0
2,118103834,ud,2,45,12.847432854389544,4,0,0,0,5,252,6.0
3,118103849,ud,2,30,7.300829882044891,1,0,0,0,2,252,6.0
4,118103867,ud,2,76,3.744300356919595,1,0,0,0,2,252,6.0
5,118103858,ud,2,44,7.598583043620236,1,0,0,0,2,252,6.0
6,118103876,ud,2,29,17.259645951141575,4,0,0,0,5,252,6.0
7,118103903,ud,2,75,23.711859862012055,1,0,0,0,2,252,6.0
8,118103894,ud,2,28,8.290864557745294,1,0,0,0,2,252,6.0
9,118103912,ud,2,72,10.81963487333417,3,0,0,0,4,252,6.0
10,118103924,ud,2,79,2.5117755716492476,1,0,0,0,2,252,6.0
11,118103951,ud,2,71,7.810819089815647,1,0,0,0,2,252,6.0
12,118103942,ud,2,74,7.369527558898134,1,0,0,0,2,252,6.0
13,118103960,ud,2,70,7.364799753868891,1,0,0,0,2,252,6.0
14,118103978,ud,2,69,7.661985957592693,1,0,0,0,2,252,6.0
15,118103969,ud,2,68,7.4749679530062405,1,0,0,0,2,252,6.0
16,118103987,ud,2,27,77.67376707190185,3,0,0,0,4,252,6.0
17,118104011,ud,2,67,7.408134168699546,1,0,0,0,2,252,6.0
18,118104002,ud,2,66,7.359530047306093,1,0,0,0,2,252,6.0
19,118104029,ud,2,26,52.74358384064402,3,0,0,0,4,252,6.0
20,118104020,ud,2,65,7.426412250466312,1,0,0,0,2,252,6.0
21,118104044,ud,2,89,4.1579847091012,1,0,0,0,2,252,6.0
22,118104062,ud,2,25,90.37241538748691,2,0,0,0,3,252,6.0
23,118104053,ud,2,88,8.829308533918216,1,0,0,0,2,252,6.0
24,118103567,ud,2,64,9.671989119412,2,0,0,0,3,252,6.0
25,118103558,ud,2,43,228.05377597665344,2,0,0,0,3,252,6.0
26,118103579,ud,2,42,16.42292633223213,2,0,0,0,3,252,6.0
27,118103588,ud,2,82,12.290172856669,2,0,0,0,3,252,6.0
28,118103612,ud,2,41,16.821838121620857,2,0,0,0,3,252,6.0
29,118103600,ud,2,78,12.527334811733228,3,0,0,0,4,252,6.0
30,118103630,ud,2,40,414.1881816138637,5,0,0,0,6,252,6.0
31,118103642,ud,2,84,2.5748425284578955,1,0,0,0,2,252,6.0
32,118103651,ud,2,39,22.174879153877637,3,0,0,0,4,252,6.0
33,118103675,ud,2,63,3.8056654747611733,1,0,0,0,2,252,6.0
34,118103666,ud,2,52,2.457037770167552,1,0,0,0,2,252,6.0
35,118103693,ud,2,24,5.908019213189937,1,0,0,0,2,252,6.0
36,118103684,ud,2,57,92.43656453163523,1,0,0,0,2,252,6.0
37,118103711,ud,2,87,10.035186572797802,1,0,0,0,2,252,6.0
38,118103702,ud,2,23,3.9320004552866124,1,0,0,0,2,252,6.0
39,118103720,ud,2,22,3.9472384447598086,1,0,0,0,2,252,6.0
40,118103741,ud,2,62,6.259179913645329,1,0,0,0,2,252,6.0
41,118103729,ud,2,38,52.21367603577741,5,0,0,0,6,252,6.0
42,118103750,ud,2,37,18.49380115055363,2,0,0,0,3,252,6.0
43,118103771,ud,2,21,6.906238784884158,1,0,0,0,2,252,6.0
44,118103789,ud,2,20,23.028878242690258,2,0,0,0,3,252,6.0
45,118103780,ud,2,19,13.340215249372374,1,0,0,0,2,252,6.0
46,118103807,ud,2,51,398.75532903531314,2,0,0,0,3,252,6.0
47,118103798,ud,2,50,17.5963582204962,3,0,0,0,4,252,6.0
48,118103438,ud,2,36,28.648065948722326,2,0,0,0,3,252,6.0
49,118103447,ud,2,83,3.890381671927873,1,0,0,0,2,252,6.0
50,118103471,ud,2,18,16.125520562194144,2,0,0,0,3,252,6.0
51,118103456,ud,2,56,12.307732991063048,4,0,0,0,5,252,6.0
52,118103480,ud,2,81,17.672599751931195,1,0,0,0,2,252,6.0
53,118103501,ud,2,35,16.420053858592098,3,0,0,0,4,252,6.0
54,118103492,ud,2,17,57.737503567163316,4,0,0,0,5,252,6.0
55,118103516,ud,2,16,38.568854201153115,2,0,0,0,3,252,6.0
56,118103528,ud,2,15,9.918696068531059,1,0,0,0,2,252,6.0
57,118103549,ud,2,14,27.702317843672922,1,0,0,0,2,252,6.0
58,118103537,ud,2,85,9.528652021282207,2,0,0,0,3,252,6.0
59,118104332,ud,2,13,74.52552106485727,1,0,0,0,2,252,6.0
60,118104323,ud,2,12,7.024569470103707,1,0,0,0,2,252,6.0
61,118104347,ud,2,49,2.1188904133276103,1,0,0,0,2,252,6.0
62,118104365,ud,2,55,7.511592067675096,2,0,0,0,3,252,6.0
63,118104356,ud,2,34,13.685456341424707,1,0,0,0,2,252,6.0
64,118104377,ud,2,11,10.329675938193674,1,0,0,0,2,252,6.0
65,118104389,ud,2,80,4.140163409595327,1,0,0,0,2,252,6.0
66,118104074,ud,2,86,5.184816919030595,1,0,0,0,2,252,6.0
67,118104092,ud,2,10,19.85025083748034,1,0,0,0,2,252,6.0
68,118104083,ud,2,77,9.94012578116445,2,0,0,0,3,252,6.0
69,118104110,ud,2,54,4.460690882072759,1,0,0,0,2,252,6.0
70,118104101,ud,2,9,6.429738013413699,1,0,0,0,2,252,6.0
71,118104119,ud,2,8,178.80504501710917,1,0,0,0,2,252,6.0
72,118104140,ud,2,48,7.443448411652476,1,0,0,0,2,252,6.0
73,118104128,ud,2,47,12.420371520080648,2,0,0,0,3,252,6.0
74,118104149,ud,2,53,10.80971351505308,2,0,0,0,3,252,6.0
75,118104173,ud,2,7,3.39235333025569,1,0,0,0,2,252,6.0
76,118104164,ud,2,33,9.923771833674238,1,0,0,0,2,252,6.0
77,118104185,ud,2,60,35.50881381562773,2,0,0,0,3,252,6.0
78,118104200,ud,2,59,4.926230766417781,1,0,0,0,2,252,6.0
79,118104218,ud,2,73,4.9075004582925414,1,0,0,0,2,252,6.0
80,118104209,ud,2,58,153.5819359149532,1,0,0,0,2,252,6.0
81,118104239,ud,2,6,10.298012372657219,1,0,0,0,2,252,6.0
82,118104230,ud,2,32,3.090246661090371,1,0,0,0,2,252,6.0
83,118104248,ud,2,5,7.012544527869414,1,0,0,0,2,252,6.0
84,118104266,ud,2,4,24.48699510714055,1,0,0,0,2,252,6.0
85,118104284,ud,2,3,6.155559608634303,1,0,0,0,2,252,6.0
86,118104275,ud,2,2,5.101150432222713,1,0,0,0,2,252,6.0
87,118104302,ud,2,46,237.0457370092955,2,0,0,0,3,252,6.0
88,118104293,ud,2,31,17.00834582067383,1,0,0,0,2,252,6.0
89,118104314,ud,2,1,9.237364293066204,1,0,0,0,2,252,6.0
90,118101768,cd,1,99,0.9477801270086554,0,0,2,2,2,252,6.0
91,118101775,cd,1,126,1.8878676843250388,0,0,3,5,3,252,6.0
92,118101760,cd,1,69,1.1996808873304337,0,0,3,1,3,252,6.0
93,118101791,cd,1,78,1.9878240150826243,0,0,4,1,4,252,6.0
94,118101783,cd,1,68,1.5341077995156414,0,0,3,1,3,252,6.0
95,118101800,cd,1,130,1.4341514687580559,0,0,2,7,2,252,6.0
96,118101807,cd,1,125,1.5830255384737468,0,0,2,5,2,252,6.0
97,118101821,cd,1,98,1.0295459408589553,0,0,2,2,2,252,6.0
98,118101814,cd,1,55,1.043994136464923,0,0,2,1,2,252,6.0
99,118101835,cd,1,131,0.9728966888114993,0,0,2,8,2,252,6.0
100,118101828,cd,1,54,1.275042963863376,0,0,2,1,2,252,6.0
101,118101849,cd,1,53,1.2260459198654514,0,0,2,1,2,252,6.0
102,118101842,cd,1,128,0.9210415555005761,0,0,2,6,2,252,6.0
103,118101870,cd,1,52,0.9251184044514899,0,0,2,1,2,252,6.0
104,118101856,cd,1,129,0.8898738726596667,0,0,2,7,2,252,6.0
105,118101863,cd,1,51,0.938197085429751,0,0,2,1,2,252,6.0
106,118101884,cd,1,97,0.9286318931350004,0,0,2,2,2,252,6.0
107,118101877,cd,1,50,1.0093121726219123,0,0,2,1,2,252,6.0
108,118101898,cd,1,49,0.9411593776853151,0,0,2,1,2,252,6.0
109,118101891,cd,1,120,1.023107897808326,0,0,2,3,2,252,6.0
110,118101912,cd,1,48,1.0012709136600462,0,0,2,1,2,252,6.0
111,118101919,cd,1,47,0.9089590884782223,0,0,2,1,2,252,6.0
112,118101905,cd,1,46,1.0585143075696062,0,0,2,1,2,252,6.0
113,118101933,cd,1,45,0.9077490603174153,0,0,2,1,2,252,6.0
114,118101926,cd,1,44,0.9089590884782223,0,0,2,1,2,252,6.0
115,118101947,cd,1,43,1.04411955569785,0,0,2,1,2,252,6.0
116,118101940,cd,1,42,0.9077490603174153,0,0,2,1,2,252,6.0
117,118101961,cd,2,123,475.44153165772843,0,0,2,4,2,252,6.0
118,118101954,cd,1,41,0.9958668379360918,0,0,2,1,2,252,6.0
119,118101982,cd,2,96,14.823300763109078,0,0,2,2,2,252,6.0
120,118101968,cd,2,40,458.2660618940066,0,0,2,1,2,252,6.0
121,118101975,cd,2,39,14.169426769577234,0,0,2,1,2,252,6.0
122,118101996,cd,2,38,104.30153354473832,0,0,2,1,2,252,6.0
123,118101989,cd,2,37,23.07443704800665,0,0,2,1,2,252,6.0
124,118102012,cd,2,67,270.18825892371103,0,0,3,1,3,252,6.0
125,118102003,cd,2,77,225.45215405002548,0,0,4,1,4,252,6.0
126,118101516,cd,1,95,1.0412678953077203,0,0,2,2,2,252,6.0
127,118101507,cd,1,113,3.7641739995373014,0,0,4,2,4,252,6.0
128,118101533,cd,1,76,2.7744924915550966,0,0,4,1,4,252,6.0
129,118101523,cd,1,80,4.677834257667444,0,0,5,1,5,252,6.0
130,118101542,cd,1,86,4.794662364584959,0,0,6,1,6,252,6.0
131,118101564,cd,1,85,4.650540908289029,0,0,6,1,6,252,6.0
132,118101553,cd,1,84,4.794662364584959,0,0,6,1,6,252,6.0
133,118101575,cd,1,83,4.650540908289029,0,0,6,1,6,252,6.0
134,118101597,cd,1,82,4.650540908289029,0,0,6,1,6,252,6.0
135,118101586,cd,1,81,4.746094471971484,0,0,6,1,6,252,6.0
136,118101608,cd,1,112,4.413026528774411,0,0,4,2,4,252,6.0
137,118101625,cd,1,110,3.2608749761250815,0,0,3,2,3,252,6.0
138,118101617,cd,1,109,3.6676823374273066,0,0,3,2,3,252,6.0
139,118101641,cd,1,94,3.543157858768076,0,0,2,2,2,252,6.0
140,118101633,cd,1,108,3.2385746421280994,0,0,3,2,3,252,6.0
141,118101656,cd,1,107,3.38026864662893,0,0,3,2,3,252,6.0
142,118101648,cd,1,106,3.2905169593756822,0,0,3,2,3,252,6.0
143,118101674,cd,1,111,3.744053796235741,0,0,4,2,4,252,6.0
144,118101664,cd,1,114,3.8489134312235382,0,0,5,2,5,252,6.0
145,118101690,cd,1,36,2.0049874094263536,0,0,2,1,2,252,6.0
146,118101683,cd,1,35,2.978695895286495,0,0,2,1,2,252,6.0
147,118101704,cd,1,34,1.0301856654882537,0,0,2,1,2,252,6.0
148,118101711,cd,1,33,0.9208852408606094,0,0,2,1,2,252,6.0
149,118101697,cd,1,32,0.9617316739917254,0,0,2,1,2,252,6.0
150,118101725,cd,1,31,0.9323799408421573,0,0,2,1,2,252,6.0
151,118101718,cd,1,30,1.1486881969282559,0,0,2,1,2,252,6.0
152,118101739,cd,1,29,0.9323799408421573,0,0,2,1,2,252,6.0
153,118101732,cd,1,28,0.9323799408421573,0,0,2,1,2,252,6.0
154,118101753,cd,1,132,1.0036907048791366,0,0,2,11,2,252,6.0
155,118101746,cd,1,93,0.8932039164183164,0,0,2,2,2,252,6.0
156,118101485,cd,1,119,1.3634301294106947,0,0,2,3,2,252,6.0
157,118101478,cd,1,27,2.2420407626725316,0,0,2,1,2,252,6.0
158,118101499,cd,1,105,3.2927477188197125,0,0,3,2,3,252,6.0
159,118101492,cd,1,26,1.1907351392379657,0,0,2,1,2,252,6.0
160,118102282,cd,2,66,15.632608942094633,0,0,3,1,3,252,6.0
161,118102275,cd,2,25,10.510907541928429,0,0,2,1,2,252,6.0
162,118102299,cd,2,65,27.266566160446416,0,0,3,1,3,252,6.0
163,118102290,cd,2,75,33.41921673861747,0,0,4,1,4,252,6.0
164,118102314,cd,2,24,23.517276448960224,0,0,2,1,2,252,6.0
165,118102307,cd,2,23,29.80060429149507,0,0,2,1,2,252,6.0
166,118102328,cd,2,22,11.421333815729662,0,0,2,1,2,252,6.0
167,118102335,cd,2,21,4.51106460351723,0,0,2,1,2,252,6.0
168,118102321,cd,2,20,42.60251779990729,0,0,2,1,2,252,6.0
169,118102349,cd,2,19,14.855874823325701,0,0,2,1,2,252,6.0
170,118102342,cd,2,118,8.253938627823889,0,0,2,3,2,252,6.0
171,118102363,cd,2,18,4.125903276385243,0,0,2,1,2,252,6.0
172,118102356,cd,2,17,10.805476825553198,0,0,2,1,2,252,6.0
173,118102377,cd,2,16,3.575608656726781,0,0,2,1,2,252,6.0
174,118102370,cd,2,92,4.706717486952382,0,0,2,2,2,252,6.0
175,118102398,cd,2,15,15.898404877620157,0,0,2,1,2,252,6.0
176,118102384,cd,2,14,15.5966851111808,0,0,2,1,2,252,6.0
177,118102391,cd,2,13,9.772238474801167,0,0,2,1,2,252,6.0
178,118102412,cd,2,12,3.304723707458406,0,0,2,1,2,252,6.0
179,118102405,cd,2,11,13.040369626851932,0,0,2,1,2,252,6.0
180,118102426,cd,2,64,10.055931617847873,0,0,3,1,3,252,6.0
181,118102419,cd,2,124,12.378709396735443,0,0,2,5,2,252,6.0
182,118102441,cd,2,63,12.699324717364268,0,0,3,1,3,252,6.0
183,118102434,cd,2,117,8.564672822975844,0,0,2,3,2,252,6.0
184,118102456,cd,2,10,6.199938964415399,0,0,2,1,2,252,6.0
185,118102463,cd,2,116,8.437503671439892,0,0,2,3,2,252,6.0
186,118102449,cd,2,9,10.352258190748506,0,0,2,1,2,252,6.0
187,118102478,cd,2,8,5.021850145409127,0,0,2,1,2,252,6.0
188,118102470,cd,2,104,10.819501606579706,0,0,3,2,3,252,6.0
189,118102485,cd,2,7,20.800418552671218,0,0,2,1,2,252,6.0
190,118102028,cd,2,6,5.203130376253448,0,0,2,1,2,252,6.0
191,118102020,cd,2,103,22.45696482310391,0,0,3,2,3,252,6.0
192,118102043,cd,2,5,20.992387499662367,0,0,2,1,2,252,6.0
193,118102035,cd,2,62,8.739500609905651,0,0,3,1,3,252,6.0
194,118102057,cd,2,102,31.84738806112869,0,0,3,2,3,252,6.0
195,118102050,cd,2,91,20.185343222906823,0,0,2,2,2,252,6.0
196,118102072,cd,2,90,44.59610907948915,0,0,2,2,2,252,6.0
197,118102079,cd,2,89,10.663266353082154,0,0,2,2,2,252,6.0
198,118102065,cd,2,127,12.556327672485146,0,0,2,6,2,252,6.0
199,118102093,cd,2,74,12.193049463166307,0,0,4,1,4,252,6.0
200,118102086,cd,2,4,15.503227581285211,0,0,2,1,2,252,6.0
201,118102109,cd,2,122,9.584675490120208,0,0,2,4,2,252,6.0
202,118102102,cd,2,3,8.660397392055867,0,0,2,1,2,252,6.0
203,118102123,cd,2,61,14.083992955307487,0,0,3,1,3,252,6.0
204,118102116,cd,2,115,12.282098949115046,0,0,2,3,2,252,6.0
205,118102138,cd,2,101,61.69343364843999,0,0,3,2,3,252,6.0
206,118102131,cd,2,121,12.462467886401626,0,0,2,4,2,252,6.0
207,118102154,cd,2,73,78.91278631971917,0,0,4,1,4,252,6.0
208,118102146,cd,2,100,62.439526824479145,0,0,3,2,3,252,6.0
209,118102170,cd,2,60,86.54050189686092,0,0,3,1,3,252,6.0
210,118102163,cd,2,133,49.5739287612563,0,0,2,15,2,252,6.0
211,118102185,cd,2,59,48.39079374434628,0,0,3,1,3,252,6.0
212,118102178,cd,2,88,31.917534249106254,0,0,2,2,2,252,6.0
213,118102202,cd,2,87,69.91309212608468,0,0,2,2,2,252,6.0
214,118102193,cd,2,72,85.3573668799509,0,0,4,1,4,252,6.0
215,118102217,cd,2,71,31.080982650580182,0,0,4,1,4,252,6.0
216,118102209,cd,2,58,31.081174592489965,0,0,3,1,3,252,6.0
217,118102234,cd,2,2,8.172673453891143,0,0,2,1,2,252,6.0
218,118102226,cd,2,57,13.294374854057347,0,0,3,1,3,252,6.0
219,118102251,cd,2,70,30.563816664025417,0,0,4,1,4,252,6.0
220,118102241,cd,2,79,33.51808219463072,0,0,5,1,5,252,6.0
221,118102267,cd,2,56,12.777208867502573,0,0,3,1,3,252,6.0
222,118102260,cd,2,1,7.65550746733637,0,0,2,1,2,252,6.0
