counter,AS,Type,GranularityValue,SeverityScore,PageRank,NumBadDep,TotalDep,NumberOfVerteces,NumOfCycle,NumSetOfElement,TotNumOfSetOfElement,ADI
1,462052228,ud,2,65,4.496156044655452,1,0,0,0,2,286,16.0
2,462052249,ud,2,64,8.360406513652023,1,0,0,0,2,286,16.0
3,462052240,ud,2,63,2.1349901270258234,1,0,0,0,2,286,16.0
4,462052270,ud,2,83,3.0037781835998714,1,0,0,0,2,286,16.0
5,462052258,ud,2,79,8.942355368709801,1,0,0,0,2,286,16.0
6,462052279,ud,2,78,51.513363820787745,5,0,0,0,6,286,16.0
7,462052300,ud,2,77,62.2786753735064,1,0,0,0,2,286,16.0
8,462052312,ud,2,62,44.292763919614224,1,0,0,0,2,286,16.0
9,462052330,ud,2,61,27.288332380683162,1,0,0,0,2,286,16.0
10,462052321,ud,2,60,21.357392318738118,1,0,0,0,2,286,16.0
11,462052348,ud,2,59,3.037732113132291,1,0,0,0,2,286,16.0
12,462052339,ud,2,58,27.100251367123768,1,0,0,0,2,286,16.0
13,462052111,ud,2,57,8.546862797721205,1,0,0,0,2,286,16.0
14,462052102,ud,2,56,7.942724422379884,1,0,0,0,2,286,16.0
15,462052120,ud,2,76,7.298264313462794,1,0,0,0,2,286,16.0
16,462052135,ud,2,55,7.0542822891337575,2,0,0,0,3,286,16.0
17,462052147,ud,2,54,21.529799966258764,3,0,0,0,4,286,16.0
18,462052171,ud,2,53,14.158467859966649,1,0,0,0,2,286,16.0
19,462052162,ud,2,52,10.394215491070298,1,0,0,0,2,286,16.0
20,462052189,ud,2,51,8.02039980085829,1,0,0,0,2,286,16.0
21,462052180,ud,2,50,13.331383408608733,1,0,0,0,2,286,16.0
22,462052207,ud,2,49,25.076133889343502,2,0,0,0,3,286,16.0
23,462052198,ud,2,48,11.12661890889186,1,0,0,0,2,286,16.0
24,462052216,ud,2,47,16.861759662666543,2,0,0,0,3,286,16.0
25,462051979,ud,2,46,12.493882707690789,4,0,0,0,5,286,16.0
26,462051970,ud,2,75,6.405186963833212,1,0,0,0,2,286,16.0
27,462051991,ud,2,74,178.41329141378043,1,0,0,0,2,286,16.0
28,462052000,ud,2,45,4.497160308313426,1,0,0,0,2,286,16.0
29,462052030,ud,2,44,5.005348681558215,1,0,0,0,2,286,16.0
30,462052018,ud,2,43,7.603021860195321,2,0,0,0,3,286,16.0
31,462052039,ud,2,42,4.990129667641279,1,0,0,0,2,286,16.0
32,462052060,ud,2,41,69.62024190044302,1,0,0,0,2,286,16.0
33,462052048,ud,2,82,12.94457322694757,2,0,0,0,3,286,16.0
34,462052069,ud,2,40,170.57971635444443,1,0,0,0,2,286,16.0
35,462052084,ud,2,39,270.5685626536836,4,0,0,0,5,286,16.0
36,462051850,ud,2,38,13.088073674970486,1,0,0,0,2,286,16.0
37,462051871,ud,2,81,4.34746223791986,1,0,0,0,2,286,16.0
38,462051859,ud,2,37,12.80765396778849,4,0,0,0,5,286,16.0
39,462051880,ud,2,36,12.221569544243629,1,0,0,0,2,286,16.0
40,462051898,ud,2,35,20.252485005079212,1,0,0,0,2,286,16.0
41,462051889,ud,2,34,14.321544943134167,1,0,0,0,2,286,16.0
42,462051916,ud,2,33,27.102400728684906,1,0,0,0,2,286,16.0
43,462051907,ud,2,32,20.8054672485613,1,0,0,0,2,286,16.0
44,462051931,ud,2,31,6.9106162743576665,1,0,0,0,2,286,16.0
45,462051949,ud,2,30,10.257437688804485,2,0,0,0,3,286,16.0
46,462051940,ud,2,29,101.90403461585251,1,0,0,0,2,286,16.0
47,462051961,ud,2,73,8.868829321363192,1,0,0,0,2,286,16.0
48,462051727,ud,2,84,23.46613726472924,2,0,0,0,3,286,16.0
49,462051718,ud,2,72,488.76769176494764,7,0,0,0,8,286,16.0
50,462051754,ud,2,28,56.29040420758712,2,0,0,0,3,286,16.0
51,462051745,ud,2,27,4.705547784020998,1,0,0,0,2,286,16.0
52,462051766,ud,2,71,74.68406291524298,4,0,0,0,5,286,16.0
53,462051790,ud,2,26,18.618314650653154,2,0,0,0,3,286,16.0
54,462051805,ud,2,25,8.381030191795848,1,0,0,0,2,286,16.0
55,462051820,ud,2,24,84.29733186854594,1,0,0,0,2,286,16.0
56,462051829,ud,2,23,25.10824959002762,5,0,0,0,6,286,16.0
57,462051592,ud,2,22,5.184368537144492,1,0,0,0,2,286,16.0
58,462051610,ud,2,70,83.86677333257055,6,0,0,0,7,286,16.0
59,462051601,ud,2,21,5.677611189216339,1,0,0,0,2,286,16.0
60,462051622,ud,2,20,5.3747220327968535,1,0,0,0,2,286,16.0
61,462051646,ud,2,19,5.171875874930583,1,0,0,0,2,286,16.0
62,462051637,ud,2,69,2.9334047337725813,1,0,0,0,2,286,16.0
63,462051658,ud,2,18,11.443355282257725,1,0,0,0,2,286,16.0
64,462051670,ud,2,17,11.815479678386659,2,0,0,0,3,286,16.0
65,462051691,ud,2,16,6.605184446281322,1,0,0,0,2,286,16.0
66,462051682,ud,2,68,4.504319381996485,1,0,0,0,2,286,16.0
67,462051700,ud,2,15,30.20015279919946,5,0,0,0,6,286,16.0
68,462051463,ud,2,14,54.71775993268512,1,0,0,0,2,286,16.0
69,462051481,ud,2,13,7.508813601031258,1,0,0,0,2,286,16.0
70,462051472,ud,2,12,4.065316365226645,1,0,0,0,2,286,16.0
71,462051493,ud,2,11,17.180923931368998,2,0,0,0,3,286,16.0
72,462051514,ud,2,67,269.77955725256874,3,0,0,0,4,286,16.0
73,462051505,ud,2,10,3.223683935720624,1,0,0,0,2,286,16.0
74,462051523,ud,2,9,7.547902691043616,1,0,0,0,2,286,16.0
75,462051547,ud,2,8,34.10623465050428,1,0,0,0,2,286,16.0
76,462051538,ud,2,80,3.556639968954441,1,0,0,0,2,286,16.0
77,462051565,ud,2,7,86.39268235116226,6,0,0,0,7,286,16.0
78,462051556,ud,2,6,20.803317887000162,1,0,0,0,2,286,16.0
79,462051583,ud,2,5,4.6196293837342655,1,0,0,0,2,286,16.0
80,462051574,ud,2,4,15.162111236036033,2,0,0,0,3,286,16.0
81,462051433,ud,2,3,21.715536169087265,1,0,0,0,2,286,16.0
82,462051424,ud,2,66,550.3493082317177,3,0,0,0,4,286,16.0
83,462051451,ud,2,2,22.445543354202773,2,0,0,0,3,286,16.0
84,462051442,ud,2,1,71.7333250952534,2,0,0,0,3,286,16.0
85,462051369,hl,2,1,1398.928604062707,0,47,0,0,45,286,16.0
86,462051301,hl,2,2,1691.9253820606496,0,60,0,0,55,286,16.0
87,462050191,cd,2,62,5.159439045557594,0,0,2,1,2,286,16.0
88,462050176,cd,2,163,8.329148554026084,0,0,2,3,2,286,16.0
89,462050183,cd,2,158,11.159879743234995,0,0,3,2,3,286,16.0
90,462050205,cd,2,169,13.646819952859989,0,0,2,7,2,286,16.0
91,462050198,cd,2,61,3.335023105891897,0,0,2,1,2,286,16.0
92,462050212,cd,2,60,7.183953775664723,0,0,2,1,2,286,16.0
93,462050056,cd,2,86,12.247367490284711,0,0,3,1,3,286,16.0
94,462050072,cd,2,59,10.241614619956037,0,0,2,1,2,286,16.0
95,462050079,cd,2,115,30.725725032672756,0,0,5,1,5,286,16.0
96,462050064,cd,2,85,16.53739099572852,0,0,3,1,3,286,16.0
97,462050089,cd,2,99,28.37515461698384,0,0,4,1,4,286,16.0
98,462050108,cd,2,58,9.774317333206582,0,0,2,1,2,286,16.0
99,462050098,cd,2,114,29.014494920208087,0,0,5,1,5,286,16.0
100,462050122,cd,2,113,28.3470653661023,0,0,5,1,5,286,16.0
101,462050115,cd,2,57,7.8629549533855805,0,0,2,1,2,286,16.0
102,462050140,cd,2,156,23.889460164735695,0,0,2,2,2,286,16.0
103,462050132,cd,2,84,22.367383541656178,0,0,3,1,3,286,16.0
104,462050154,cd,2,56,4.734514509061679,0,0,2,1,2,286,16.0
105,462050147,cd,2,55,17.30453607999268,0,0,2,1,2,286,16.0
106,462050169,cd,2,155,8.31020773044588,0,0,2,2,2,286,16.0
107,462050161,cd,2,83,12.39252868987111,0,0,3,1,3,286,16.0
108,462049932,cd,2,54,21.241330350897133,0,0,2,1,2,286,16.0
109,462049925,cd,2,53,6.150116603067586,0,0,2,1,2,286,16.0
110,462049946,cd,2,82,9.996621200261806,0,0,3,1,3,286,16.0
111,462049939,cd,2,154,8.155104263428798,0,0,2,2,2,286,16.0
112,462049961,cd,2,166,21.397296921054952,0,0,2,5,2,286,16.0
113,462049954,cd,2,165,12.297257791901304,0,0,2,5,2,286,16.0
114,462049983,cd,2,52,25.82416196812332,0,0,2,1,2,286,16.0
115,462049968,cd,2,153,12.32622240427813,0,0,2,2,2,286,16.0
116,462049975,cd,2,157,12.269200787341479,0,0,3,2,3,286,16.0
117,462049997,cd,2,51,15.345675915305288,0,0,2,1,2,286,16.0
118,462049990,cd,2,50,15.630668187515033,0,0,2,1,2,286,16.0
119,462050011,cd,2,49,12.863266769900918,0,0,2,1,2,286,16.0
120,462050004,cd,2,48,9.67852269457715,0,0,2,1,2,286,16.0
121,462050025,cd,2,112,18.076162721357733,0,0,5,1,5,286,16.0
122,462050018,cd,2,152,12.67127575681752,0,0,2,2,2,286,16.0
123,462050047,cd,2,98,16.192889592418272,0,0,4,1,4,286,16.0
124,462050035,cd,2,134,36.67700000513499,0,0,7,1,7,286,16.0
125,462049807,cd,2,127,94.75061626832394,0,0,6,1,6,286,16.0
126,462049797,cd,2,111,84.53140793978521,0,0,5,1,5,286,16.0
127,462049818,cd,2,151,37.13567740522538,0,0,2,2,2,286,16.0
128,462049834,cd,2,110,91.7531869673874,0,0,5,1,5,286,16.0
129,462049825,cd,2,97,81.53397863884868,0,0,4,1,4,286,16.0
130,462049851,cd,2,47,56.07439759513177,0,0,2,1,2,286,16.0
131,462049844,cd,2,162,54.19706343033707,0,0,2,3,2,286,16.0
132,462049866,cd,2,46,26.962140116827648,0,0,2,1,2,286,16.0
133,462049858,cd,2,81,66.2936059236705,0,0,3,1,3,286,16.0
134,462049880,cd,2,45,11.069540538722425,0,0,2,1,2,286,16.0
135,462049887,cd,2,80,16.836047969076024,0,0,3,1,3,286,16.0
136,462049873,cd,2,44,8.23644240650964,0,0,2,1,2,286,16.0
137,462049902,cd,2,150,26.129550061767063,0,0,2,2,2,286,16.0
138,462049895,cd,2,43,7.649250972026111,0,0,2,1,2,286,16.0
139,462049916,cd,2,96,11.830569306648686,0,0,4,1,4,286,16.0
140,462049909,cd,2,42,7.667857877901252,0,0,2,1,2,286,16.0
141,462049676,cd,2,79,19.335172104217033,0,0,3,1,3,286,16.0
142,462049669,cd,2,41,21.46422499341322,0,0,2,1,2,286,16.0
143,462049691,cd,2,40,16.62880255310237,0,0,2,1,2,286,16.0
144,462049684,cd,2,39,14.595794063945034,0,0,2,1,2,286,16.0
145,462049706,cd,2,95,72.78773765302026,0,0,4,1,4,286,16.0
146,462049698,cd,2,78,62.56852932448153,0,0,3,1,3,286,16.0
147,462049723,cd,2,38,49.31104689421056,0,0,2,1,2,286,16.0
148,462049715,cd,2,77,73.16251274470423,0,0,3,1,3,286,16.0
149,462049739,cd,2,133,93.29387612497085,0,0,7,1,7,286,16.0
150,462049730,cd,2,94,76.15994204564075,0,0,4,1,4,286,16.0
151,462049759,cd,2,109,74.70320190228765,0,0,5,1,5,286,16.0
152,462049751,cd,2,76,35.67893726187228,0,0,3,1,3,286,16.0
153,462049769,cd,2,93,50.85173605179399,0,0,4,1,4,286,16.0
154,462049789,cd,2,75,52.308476195147094,0,0,3,1,3,286,16.0
155,462049778,cd,2,126,83.07466779643211,0,0,6,1,6,286,16.0
156,462049542,cd,2,125,432.499077110362,0,0,6,1,6,286,16.0
157,462049562,cd,2,74,55.96503004944924,0,0,3,1,3,286,16.0
158,462049553,cd,2,92,124.45802434619696,0,0,4,1,4,286,16.0
159,462049581,cd,2,132,426.28475818712064,0,0,7,1,7,286,16.0
160,462049570,cd,2,124,266.01786411183525,0,0,6,1,6,286,16.0
161,462049593,cd,2,164,15.330062220800334,0,0,2,5,2,286,16.0
162,462049615,cd,2,123,424.8310428818291,0,0,6,1,6,286,16.0
163,462049600,cd,2,37,62.17934897269055,0,0,2,1,2,286,16.0
164,462049607,cd,2,73,105.84171301258758,0,0,3,1,3,286,16.0
165,462049626,cd,2,72,253.71519810228307,0,0,3,1,3,286,16.0
166,462049641,cd,2,36,193.48102156576488,0,0,2,1,2,286,16.0
167,462049634,cd,2,35,455.81521145304464,0,0,2,1,2,286,16.0
168,462049662,cd,2,34,15.861872128841394,0,0,2,1,2,286,16.0
169,462049648,cd,2,33,11.016351465845155,0,0,2,1,2,286,16.0
170,462049655,cd,2,149,16.131512956589354,0,0,2,2,2,286,16.0
171,462049420,cd,2,131,439.03832659346875,0,0,7,1,7,286,16.0
172,462049409,cd,2,122,278.7714325181834,0,0,6,1,6,286,16.0
173,462049432,cd,2,71,104.35958649850463,0,0,3,1,3,286,16.0
174,462049452,cd,2,148,60.6972224586076,0,0,2,2,2,286,16.0
175,462049440,cd,2,130,466.2450736681317,0,0,7,1,7,286,16.0
176,462049470,cd,2,108,270.7500565209936,0,0,5,1,5,286,16.0
177,462049459,cd,2,121,431.016950596279,0,0,6,1,6,286,16.0
178,462049480,cd,2,32,124.93229969719485,0,0,2,1,2,286,16.0
179,462049487,cd,2,107,451.5896637949692,0,0,5,1,5,286,16.0
180,462049497,cd,2,91,291.32276971968383,0,0,4,1,4,286,16.0
181,462049513,cd,2,70,90.85983013886062,0,0,3,1,3,286,16.0
182,462049506,cd,2,31,47.19746609896359,0,0,2,1,2,286,16.0
183,462049532,cd,2,106,272.23218303507656,0,0,5,1,5,286,16.0
184,462049521,cd,2,120,417.517194236635,0,0,6,1,6,286,16.0
185,462049293,cd,2,140,473.04015163901204,0,0,9,1,9,286,16.0
186,462049307,cd,2,90,105.75775348490046,0,0,4,1,4,286,16.0
187,462049316,cd,2,137,476.0774816225719,0,0,8,1,8,286,16.0
188,462049339,cd,2,129,315.8105875472865,0,0,7,1,7,286,16.0
189,462049329,cd,2,105,149.4201175247975,0,0,5,1,5,286,16.0
190,462049359,cd,2,139,471.7670140790194,0,0,9,1,9,286,16.0
191,462049351,cd,2,69,65.12278565625155,0,0,3,1,3,286,16.0
192,462049373,cd,2,136,311.50012000373397,0,0,8,1,8,286,16.0
193,462049386,cd,2,119,306.2810911114177,0,0,6,1,6,286,16.0
194,462049397,cd,2,128,428.39579541570487,0,0,7,1,7,286,16.0
195,462049161,cd,2,118,459.0749315297118,0,0,6,1,6,286,16.0
196,462049154,cd,2,30,129.5531538053615,0,0,2,1,2,286,16.0
197,462049183,cd,2,104,316.67227912872613,0,0,5,1,5,286,16.0
198,462049172,cd,2,117,447.24749064331036,0,0,6,1,6,286,16.0
199,462049193,cd,2,135,312.7732575637266,0,0,8,1,8,286,16.0
200,462049206,cd,2,116,146.38278754123758,0,0,6,1,6,286,16.0
201,462049217,cd,2,141,844.140986314087,0,0,10,1,10,286,16.0
202,462049232,cd,2,29,297.22167337637813,0,0,2,1,2,286,16.0
203,462049239,cd,2,142,766.5729845730107,0,0,11,1,11,286,16.0
204,462049255,cd,2,143,805.6408000782394,0,0,12,1,12,286,16.0
205,462049272,cd,2,28,148.89465132287955,0,0,2,1,2,286,16.0
206,462049279,cd,2,138,683.8740922388015,0,0,9,1,9,286,16.0
207,462049037,cd,1,89,1.580516128646427,0,0,4,1,4,286,16.0
208,462049029,cd,1,68,1.0982913637813405,0,0,3,1,3,286,16.0
209,462049053,cd,1,27,0.903900823665581,0,0,2,1,2,286,16.0
210,462049046,cd,1,147,1.1438129929693341,0,0,2,2,2,286,16.0
211,462049067,cd,1,26,0.9376611603705438,0,0,2,1,2,286,16.0
212,462049060,cd,1,25,0.903900823665581,0,0,2,1,2,286,16.0
213,462049081,cd,1,24,0.9071393213308092,0,0,2,1,2,286,16.0
214,462049074,cd,1,23,0.9376611603705438,0,0,2,1,2,286,16.0
215,462049102,cd,1,22,0.9339435676061122,0,0,2,1,2,286,16.0
216,462049088,cd,1,21,0.9071393213308092,0,0,2,1,2,286,16.0
217,462049095,cd,1,20,0.9339435676061122,0,0,2,1,2,286,16.0
218,462049116,cd,1,19,0.9470031342785065,0,0,2,1,2,286,16.0
219,462049109,cd,1,18,0.9445474843144908,0,0,2,1,2,286,16.0
220,462049130,cd,1,17,0.9159342214419538,0,0,2,1,2,286,16.0
221,462049123,cd,1,16,0.9159342214419538,0,0,2,1,2,286,16.0
222,462049144,cd,2,103,456.2105179031359,0,0,5,1,5,286,16.0
223,462049137,cd,1,15,0.9159342214419538,0,0,2,1,2,286,16.0
224,462048908,cd,1,14,1.3902347464986309,0,0,2,1,2,286,16.0
225,462048901,cd,1,13,1.4753512354113367,0,0,2,1,2,286,16.0
226,462048922,cd,1,12,1.1886871290068586,0,0,2,1,2,286,16.0
227,462048915,cd,1,11,1.2458512354113367,0,0,2,1,2,286,16.0
228,462048936,cd,1,10,1.1398319880524481,0,0,2,1,2,286,16.0
229,462048943,cd,1,170,0.965684967972427,0,0,2,8,2,286,16.0
230,462048929,cd,1,146,0.8521345536489646,0,0,2,2,2,286,16.0
231,462048957,cd,1,168,0.8898738726596667,0,0,2,7,2,286,16.0
232,462048950,cd,1,167,0.9292391820031827,0,0,2,6,2,286,16.0
233,462048971,cd,1,9,1.1861175423000014,0,0,2,1,2,286,16.0
234,462048964,cd,1,8,1.251163222991969,0,0,2,1,2,286,16.0
235,462048985,cd,1,161,0.8868083899057555,0,0,2,3,2,286,16.0
236,462048978,cd,1,7,0.9434659219393065,0,0,2,1,2,286,16.0
237,462049006,cd,1,67,1.5825960117133522,0,0,3,1,3,286,16.0
238,462048992,cd,1,145,0.9547111340404297,0,0,2,2,2,286,16.0
239,462048999,cd,1,6,0.9093983509694235,0,0,2,1,2,286,16.0
240,462049022,cd,1,5,0.989160583941606,0,0,2,1,2,286,16.0
241,462049014,cd,1,66,1.3060426190236538,0,0,3,1,3,286,16.0
242,462048780,cd,1,4,8.328763293698652,0,0,2,1,2,286,16.0
243,462048794,cd,1,3,1.022325570959396,0,0,2,1,2,286,16.0
244,462048787,cd,1,2,1.9319472139900475,0,0,2,1,2,286,16.0
245,462048808,cd,1,160,1.097351813478618,0,0,2,3,2,286,16.0
246,462048815,cd,1,88,2.016011618171154,0,0,4,1,4,286,16.0
247,462048801,cd,1,144,0.9286318931350004,0,0,2,2,2,286,16.0
248,462048824,cd,1,102,2.5877765880423693,0,0,5,1,5,286,16.0
249,462048842,cd,1,1,1.7369273300333303,0,0,2,1,2,286,16.0
250,462048834,cd,1,65,1.4269399651871906,0,0,3,1,3,286,16.0
251,462048856,cd,1,101,2.7152765880423693,0,0,5,1,5,286,16.0
252,462048849,cd,1,159,1.1671035029740344,0,0,2,3,2,286,16.0
253,462048874,cd,1,87,2.1437645605236906,0,0,4,1,4,286,16.0
254,462048866,cd,1,64,1.6355418286602859,0,0,3,1,3,286,16.0
255,462048891,cd,1,100,2.216700743867355,0,0,5,1,5,286,16.0
256,462048883,cd,1,63,1.3209264015625937,0,0,3,1,3,286,16.0
