counter,AS,Type,GranularityValue,SeverityScore,PageRank,NumBadDep,TotalDep,NumberOfVerteces,NumOfCycle,NumSetOfElement,TotNumOfSetOfElement,ADI
1,448938701,ud,2,77,7.239044141160447,1,0,0,0,2,284,17.0
2,448938716,ud,2,62,7.025755251723433,2,0,0,0,3,284,17.0
3,448938728,ud,2,61,24.36005153427986,3,0,0,0,4,284,17.0
4,448938743,ud,2,60,11.587784811612282,1,0,0,0,2,284,17.0
5,448938629,ud,2,59,189.6124307554418,1,0,0,0,2,284,17.0
6,448938644,ud,2,58,296.9601941331148,4,0,0,0,5,284,17.0
7,448938662,ud,2,76,4.449253736499901,1,0,0,0,2,284,17.0
8,448938671,ud,2,57,11.76405452850251,2,0,0,0,3,284,17.0
9,448938683,ud,2,56,30.256339460626677,5,0,0,0,6,284,17.0
10,448938563,ud,2,75,7.9635901838314735,1,0,0,0,2,284,17.0
11,448938572,ud,2,74,197.07611033957917,1,0,0,0,2,284,17.0
12,448938581,ud,2,55,7.628414688712461,2,0,0,0,3,284,17.0
13,448938593,ud,2,54,4.511859973407212,1,0,0,0,2,284,17.0
14,448938608,ud,2,53,73.54973226260708,1,0,0,0,2,284,17.0
15,448938617,ud,2,83,13.003770928112186,2,0,0,0,3,284,17.0
16,448938503,ud,2,52,105.80806127624653,1,0,0,0,2,284,17.0
17,448938512,ud,2,73,8.941912867185316,1,0,0,0,2,284,17.0
18,448938521,ud,2,51,10.265135769649124,2,0,0,0,3,284,17.0
19,448938533,ud,2,50,12.504259318091414,4,0,0,0,5,284,17.0
20,448938545,ud,2,49,5.000845397991487,1,0,0,0,2,284,17.0
21,448938554,ud,2,48,5.019083723571432,1,0,0,0,2,284,17.0
22,448938950,ud,2,47,3.0551399643090904,1,0,0,0,2,284,17.0
23,448938959,ud,2,46,9.121573935105225,1,0,0,0,2,284,17.0
24,448938971,ud,2,45,7.959336419347686,1,0,0,0,2,284,17.0
25,448938980,ud,2,44,8.63765401892735,1,0,0,0,2,284,17.0
26,448938989,ud,2,43,13.096701615101434,1,0,0,0,2,284,17.0
27,448938998,ud,2,42,9.878165783991598,1,0,0,0,2,284,17.0
28,448939007,ud,2,41,7.930306758146902,1,0,0,0,2,284,17.0
29,448938884,ud,2,82,3.009488986388047,1,0,0,0,2,284,17.0
30,448938893,ud,2,72,50.69968721949626,5,0,0,0,6,284,17.0
31,448938905,ud,2,71,64.2782736925009,1,0,0,0,2,284,17.0
32,448938926,ud,2,40,41.080159695013016,3,0,0,0,4,284,17.0
33,448938935,ud,2,39,2.133828689046503,1,0,0,0,2,284,17.0
34,448938824,ud,2,38,18.97335219102768,1,0,0,0,2,284,17.0
35,448938833,ud,2,37,5.115428810818996,1,0,0,0,2,284,17.0
36,448938842,ud,2,36,16.90295005450373,2,0,0,0,3,284,17.0
37,448938857,ud,2,81,56.74259979297214,1,0,0,0,2,284,17.0
38,448938866,ud,2,70,9.01590519278728,1,0,0,0,2,284,17.0
39,448938875,ud,2,35,8.356334421253655,1,0,0,0,2,284,17.0
40,448938752,ud,2,34,14.163595240299681,1,0,0,0,2,284,17.0
41,448938761,ud,2,33,12.87116735089953,4,0,0,0,5,284,17.0
42,448938779,ud,2,80,4.368776000868169,1,0,0,0,2,284,17.0
43,448938788,ud,2,32,12.109351190586455,1,0,0,0,2,284,17.0
44,448938797,ud,2,31,26.57614624939601,1,0,0,0,2,284,17.0
45,448938806,ud,2,30,14.105665685866015,1,0,0,0,2,284,17.0
46,448938815,ud,2,29,20.04116369253815,1,0,0,0,2,284,17.0
47,448938179,ud,2,79,3.560001565909495,1,0,0,0,2,284,17.0
48,448938188,ud,2,28,35.87124202428001,1,0,0,0,2,284,17.0
49,448938200,ud,2,27,7.550838963741128,1,0,0,0,2,284,17.0
50,448938209,ud,2,26,14.80881337584056,2,0,0,0,3,284,17.0
51,448938218,ud,2,25,4.62935517570836,1,0,0,0,2,284,17.0
52,448938227,ud,2,24,81.79809925299492,5,0,0,0,6,284,17.0
53,448938236,ud,2,23,5.157856835392485,1,0,0,0,2,284,17.0
54,448938113,ud,2,22,57.763811664823976,1,0,0,0,2,284,17.0
55,448938122,ud,2,21,5.686186034712675,1,0,0,0,2,284,17.0
56,448938131,ud,2,69,82.79549638082361,6,0,0,0,7,284,17.0
57,448938143,ud,2,20,5.382873761288532,1,0,0,0,2,284,17.0
58,448938158,ud,2,19,5.190295459915893,1,0,0,0,2,284,17.0
59,448938167,ud,2,68,290.16030725040946,3,0,0,0,4,284,17.0
60,448938095,ud,2,18,4.072107137269506,1,0,0,0,2,284,17.0
61,448938104,ud,2,17,7.537247242417838,1,0,0,0,2,284,17.0
62,448938437,ud,2,16,72.76979268077929,2,0,0,0,3,284,17.0
63,448938449,ud,2,15,17.3872218888992,2,0,0,0,3,284,17.0
64,448938458,ud,2,14,3.210245520318606,1,0,0,0,2,284,17.0
65,448938473,ud,2,13,13.158848443761233,1,0,0,0,2,284,17.0
66,448938482,ud,2,12,6.9399913001249445,1,0,0,0,2,284,17.0
67,448938491,ud,2,78,265.93631150664316,2,0,0,0,3,284,17.0
68,448938368,ud,2,11,18.694581716773452,2,0,0,0,3,284,17.0
69,448938380,ud,2,10,13.62336282140405,1,0,0,0,2,284,17.0
70,448938389,ud,2,67,202.04356143039894,1,0,0,0,2,284,17.0
71,448938398,ud,2,9,17.03398734436245,4,0,0,0,5,284,17.0
72,448938416,ud,2,8,86.61733073440442,1,0,0,0,2,284,17.0
73,448938425,ud,2,7,13.134381911573087,1,0,0,0,2,284,17.0
74,448938308,ud,2,6,59.28848596034039,2,0,0,0,3,284,17.0
75,448938323,ud,2,5,15.92871306401662,1,0,0,0,2,284,17.0
76,448938335,ud,2,66,73.9270878405394,4,0,0,0,5,284,17.0
77,448938356,ud,2,65,572.8456094478761,3,0,0,0,4,284,17.0
78,448938251,ud,2,64,2.9288301688189233,1,0,0,0,2,284,17.0
79,448938260,ud,2,4,19.238795708818508,1,0,0,0,2,284,17.0
80,448938269,ud,2,3,10.941514189731317,1,0,0,0,2,284,17.0
81,448938278,ud,2,2,4.697140661818861,1,0,0,0,2,284,17.0
82,448938287,ud,2,63,530.7438355108739,7,0,0,0,8,284,17.0
83,448938299,ud,2,1,6.5942763310455526,1,0,0,0,2,284,17.0
84,448937971,hl,2,2,1682.9749073154837,0,60,0,0,55,284,17.0
85,448938039,hl,2,1,1423.9054967503725,0,48,0,0,46,284,17.0
86,448936645,cd,2,150,12.372887742252908,0,0,2,2,2,284,17.0
87,448936652,cd,2,152,12.314075540281628,0,0,3,2,3,284,17.0
88,448936660,cd,2,60,9.666221781122228,0,0,2,1,2,284,17.0
89,448936667,cd,2,59,15.611678048606315,0,0,2,1,2,284,17.0
90,448936674,cd,2,58,15.326343446513619,0,0,2,1,2,284,17.0
91,448936681,cd,2,57,12.844458622986343,0,0,2,1,2,284,17.0
92,448936688,cd,2,56,25.895518798286687,0,0,2,1,2,284,17.0
93,448936695,cd,2,158,13.557879994921723,0,0,2,3,2,284,17.0
94,448936702,cd,2,139,36.82599341742938,0,0,7,1,7,284,17.0
95,448936579,cd,2,55,7.676409625778827,0,0,2,1,2,284,17.0
96,448936586,cd,2,54,7.659371270093361,0,0,2,1,2,284,17.0
97,448936593,cd,2,99,11.845413577104518,0,0,4,1,4,284,17.0
98,448936602,cd,2,53,6.1632489521154525,0,0,2,1,2,284,17.0
99,448936609,cd,2,52,21.249631795334217,0,0,2,1,2,284,17.0
100,448936616,cd,2,149,8.093469839497818,0,0,2,2,2,284,17.0
101,448936623,cd,2,84,10.000052146037437,0,0,3,1,3,284,17.0
102,448936631,cd,2,162,12.302812922071205,0,0,2,5,2,284,17.0
103,448936638,cd,2,161,21.433012366754554,0,0,2,5,2,284,17.0
104,448936513,cd,2,83,70.63795949376707,0,0,3,1,3,284,17.0
105,448936521,cd,2,157,54.01594296966005,0,0,2,3,2,284,17.0
106,448936528,cd,2,169,64.32485165538995,0,0,2,17,2,284,17.0
107,448936535,cd,2,160,74.4118856226391,0,0,3,4,3,284,17.0
108,448936543,cd,2,168,43.33106701546319,0,0,2,8,2,284,17.0
109,448936550,cd,2,51,8.255337295294328,0,0,2,1,2,284,17.0
110,448936557,cd,2,50,11.094295898407577,0,0,2,1,2,284,17.0
111,448936564,cd,2,82,16.90262141224978,0,0,3,1,3,284,17.0
112,448936572,cd,2,148,26.137618546800404,0,0,2,2,2,284,17.0
113,448936452,cd,2,81,26.541558727975513,0,0,3,1,3,284,17.0
114,448936460,cd,2,98,41.6238214299848,0,0,4,1,4,284,17.0
115,448936469,cd,2,80,43.274879234119766,0,0,3,1,3,284,17.0
116,448936477,cd,2,131,93.83534729111739,0,0,6,1,6,284,17.0
117,448936488,cd,2,49,28.19261653211047,0,0,2,1,2,284,17.0
118,448936495,cd,2,97,72.12441095482274,0,0,4,1,4,284,17.0
119,448936504,cd,2,96,80.72499346101623,0,0,4,1,4,284,17.0
120,448936901,cd,2,48,8.72393895636688,0,0,2,1,2,284,17.0
121,448936837,cd,2,47,4.764588468582755,0,0,2,1,2,284,17.0
122,448936844,cd,2,159,10.71432084793642,0,0,2,4,2,284,17.0
123,448936851,cd,2,147,8.197584498934258,0,0,2,2,2,284,17.0
124,448936858,cd,2,156,8.358486781943004,0,0,2,3,2,284,17.0
125,448936865,cd,2,151,11.194957486125979,0,0,3,2,3,284,17.0
126,448936873,cd,2,46,5.181895817875371,0,0,2,1,2,284,17.0
127,448936880,cd,2,45,3.3307086917180984,0,0,2,1,2,284,17.0
128,448936887,cd,2,166,17.081407195287667,0,0,2,7,2,284,17.0
129,448936894,cd,2,44,8.657372104997734,0,0,2,1,2,284,17.0
130,448936772,cd,2,118,29.817502674718874,0,0,5,1,5,284,17.0
131,448936782,cd,2,43,8.115397038164367,0,0,2,1,2,284,17.0
132,448936789,cd,2,42,10.903455493430675,0,0,2,1,2,284,17.0
133,448936796,cd,2,117,30.19135323428658,0,0,5,1,5,284,17.0
134,448936806,cd,2,95,29.514882850095958,0,0,4,1,4,284,17.0
135,448936815,cd,2,79,24.79278391644373,0,0,3,1,3,284,17.0
136,448936823,cd,2,146,23.893901920553,0,0,2,2,2,284,17.0
137,448936830,cd,2,41,17.328905974714978,0,0,2,1,2,284,17.0
138,448936714,cd,2,116,18.2145660607641,0,0,5,1,5,284,17.0
139,448936724,cd,2,140,38.30756713755298,0,0,8,1,8,284,17.0
140,448936737,cd,2,115,16.605461500998473,0,0,5,1,5,284,17.0
141,448936747,cd,2,78,10.594568678530926,0,0,3,1,3,284,17.0
142,448936755,cd,2,94,15.123887780874874,0,0,4,1,4,284,17.0
143,448936764,cd,2,77,15.544868106152668,0,0,3,1,3,284,17.0
144,448936136,cd,2,76,107.05647722056406,0,0,3,1,3,284,17.0
145,448936144,cd,2,138,491.4255434209242,0,0,7,1,7,284,17.0
146,448936156,cd,2,145,61.379267489050264,0,0,2,2,2,284,17.0
147,448936163,cd,2,130,454.2740619147303,0,0,6,1,6,284,17.0
148,448936174,cd,2,114,275.1558440414019,0,0,5,1,5,284,17.0
149,448936184,cd,2,93,295.6568185581329,0,0,4,1,4,284,17.0
150,448936073,cd,2,129,327.0992784291119,0,0,6,1,6,284,17.0
151,448936084,cd,2,128,452.0609734647026,0,0,6,1,6,284,17.0
152,448936095,cd,2,40,127.55745173729505,0,0,2,1,2,284,17.0
153,448936102,cd,2,113,474.77503643146133,0,0,5,1,5,284,17.0
154,448936112,cd,2,137,479.970273604152,0,0,7,1,7,284,17.0
155,448936124,cd,2,136,451.4124925933478,0,0,7,1,7,284,17.0
156,448936004,cd,2,127,452.24340499904383,0,0,6,1,6,284,17.0
157,448936015,cd,2,75,105.02582030487754,0,0,3,1,3,284,17.0
158,448936023,cd,2,164,59.34861057336374,0,0,2,6,2,284,17.0
159,448936030,cd,2,126,270.09272235251024,0,0,6,1,6,284,17.0
160,448936041,cd,2,135,449.21094022583867,0,0,7,1,7,284,17.0
161,448936053,cd,2,112,273.12518712571534,0,0,5,1,5,284,17.0
162,448936063,cd,2,111,272.94275559137424,0,0,5,1,5,284,17.0
163,448935944,cd,2,110,769.4652590785214,0,0,5,1,5,284,17.0
164,448935954,cd,2,74,164.577457305397,0,0,3,1,3,284,17.0
165,448935962,cd,2,109,502.36667381117275,0,0,5,1,5,284,17.0
166,448935972,cd,2,134,450.35136564294794,0,0,7,1,7,284,17.0
167,448935984,cd,2,125,271.2331477696195,0,0,6,1,6,284,17.0
168,448935995,cd,2,92,103.13378094878169,0,0,4,1,4,284,17.0
169,448936392,cd,2,73,55.50239443071571,0,0,3,1,3,284,17.0
170,448936400,cd,2,91,67.12629679976122,0,0,4,1,4,284,17.0
171,448936409,cd,2,108,83.74831332386825,0,0,5,1,5,284,17.0
172,448936419,cd,2,124,82.09725551973328,0,0,6,1,6,284,17.0
173,448936430,cd,2,133,92.18428948698244,0,0,7,1,7,284,17.0
174,448936442,cd,2,107,65.47523899562627,0,0,5,1,5,284,17.0
175,448936321,cd,2,72,21.894352711908905,0,0,3,1,3,284,17.0
176,448936329,cd,2,106,33.48213752352119,0,0,5,1,5,284,17.0
177,448936339,cd,2,39,23.847299470481282,0,0,2,1,2,284,17.0
178,448936346,cd,2,144,20.53041576268076,0,0,2,2,2,284,17.0
179,448936353,cd,2,71,26.535631042441622,0,0,3,1,3,284,17.0
180,448936361,cd,2,38,17.170354343463703,0,0,2,1,2,284,17.0
181,448936368,cd,2,37,16.348397673775388,0,0,2,1,2,284,17.0
182,448936375,cd,2,36,14.397476897844076,0,0,2,1,2,284,17.0
183,448936382,cd,2,105,82.21144492207188,0,0,5,1,5,284,17.0
184,448936260,cd,2,35,58.978565934368,0,0,2,1,2,284,17.0
185,448936267,cd,2,70,104.6557756658818,0,0,3,1,3,284,17.0
186,448936275,cd,2,69,259.4537862838654,0,0,3,1,3,284,17.0
187,448936283,cd,2,34,478.1148235930299,0,0,2,1,2,284,17.0
188,448936290,cd,2,33,215.9940107134006,0,0,2,1,2,284,17.0
189,448936297,cd,2,32,11.157536136765412,0,0,2,1,2,284,17.0
190,448936304,cd,2,68,29.4298690023327,0,0,3,1,3,284,17.0
191,448936312,cd,2,90,35.43508428209356,0,0,4,1,4,284,17.0
192,448936193,cd,2,123,447.59438134986567,0,0,6,1,6,284,17.0
193,448936204,cd,2,122,440.4387329045371,0,0,6,1,6,284,17.0
194,448936215,cd,2,67,93.22114821037087,0,0,3,1,3,284,17.0
195,448936223,cd,2,31,47.54393847885708,0,0,2,1,2,284,17.0
196,448936230,cd,2,89,123.2568396268689,0,0,4,1,4,284,17.0
197,448936239,cd,2,104,272.75514248671965,0,0,5,1,5,284,17.0
198,448936249,cd,2,121,451.8733603600481,0,0,6,1,6,284,17.0
199,448935616,cd,1,66,1.3207769340315219,0,0,3,1,3,284,17.0
200,448935624,cd,1,103,2.214824818095699,0,0,5,1,5,284,17.0
201,448935634,cd,1,30,1.4745967746234006,0,0,2,1,2,284,17.0
202,448935641,cd,1,29,1.387944749874026,0,0,2,1,2,284,17.0
203,448935648,cd,1,28,1.2450967746234007,0,0,2,1,2,284,17.0
204,448935655,cd,1,27,1.1886871290068586,0,0,2,1,2,284,17.0
205,448935662,cd,1,143,0.8521345536489646,0,0,2,2,2,284,17.0
206,448935669,cd,1,26,1.1398319880524481,0,0,2,1,2,284,17.0
207,448935676,cd,1,167,0.965684967972427,0,0,2,8,2,284,17.0
208,448935557,cd,1,102,2.586880808939357,0,0,5,1,5,284,17.0
209,448935567,cd,1,65,1.4268575407543098,0,0,3,1,3,284,17.0
210,448935575,cd,1,25,1.7366868152526749,0,0,2,1,2,284,17.0
211,448935582,cd,1,155,1.167020818506971,0,0,2,3,2,284,17.0
212,448935589,cd,1,101,2.714380808939357,0,0,5,1,5,284,17.0
213,448935599,cd,1,64,1.635382546993116,0,0,3,1,3,284,17.0
214,448935607,cd,1,88,2.1428077281290063,0,0,4,1,4,284,17.0
215,448935513,cd,1,24,8.22319467368148,0,0,2,1,2,284,17.0
216,448935520,cd,1,23,1.929979160981722,0,0,2,1,2,284,17.0
217,448935527,cd,1,22,1.022325570959396,0,0,2,1,2,284,17.0
218,448935534,cd,1,142,0.9286318931350004,0,0,2,2,2,284,17.0
219,448935541,cd,1,154,1.097351813478618,0,0,2,3,2,284,17.0
220,448935548,cd,1,87,2.015197875698189,0,0,4,1,4,284,17.0
221,448935877,cd,2,120,481.1850176283178,0,0,6,1,6,284,17.0
222,448935888,cd,2,100,477.77386660267354,0,0,5,1,5,284,17.0
223,448935898,cd,2,119,693.0677395286533,0,0,6,1,6,284,17.0
224,448935909,cd,2,21,300.1729451029733,0,0,2,1,2,284,17.0
225,448935916,cd,2,132,736.8522929163175,0,0,7,1,7,284,17.0
226,448935928,cd,2,20,155.67226616421678,0,0,2,1,2,284,17.0
227,448935935,cd,2,86,590.3470412051931,0,0,4,1,4,284,17.0
228,448935814,cd,1,19,0.9325637071202078,0,0,2,1,2,284,17.0
229,448935821,cd,1,18,0.9325637071202078,0,0,2,1,2,284,17.0
230,448935828,cd,1,17,0.9056591484669418,0,0,2,1,2,284,17.0
231,448935835,cd,1,16,0.9056591484669418,0,0,2,1,2,284,17.0
232,448935842,cd,1,15,0.9309886372325082,0,0,2,1,2,284,17.0
233,448935849,cd,1,14,0.9309886372325082,0,0,2,1,2,284,17.0
234,448935856,cd,1,13,0.9445474843144908,0,0,2,1,2,284,17.0
235,448935863,cd,1,12,0.9470031342785065,0,0,2,1,2,284,17.0
236,448935870,cd,2,11,130.55628190850726,0,0,2,1,2,284,17.0
237,448935746,cd,1,10,0.9093983509694235,0,0,2,1,2,284,17.0
238,448935753,cd,1,63,1.5825960117133522,0,0,3,1,3,284,17.0
239,448935761,cd,1,62,1.3060426190236538,0,0,3,1,3,284,17.0
240,448935769,cd,1,9,0.989160583941606,0,0,2,1,2,284,17.0
241,448935776,cd,1,61,1.0982913637813405,0,0,3,1,3,284,17.0
242,448935784,cd,1,85,1.580516128646427,0,0,4,1,4,284,17.0
243,448935793,cd,1,141,1.1438129929693341,0,0,2,2,2,284,17.0
244,448935800,cd,1,8,0.902671348054914,0,0,2,1,2,284,17.0
245,448935807,cd,1,7,0.902671348054914,0,0,2,1,2,284,17.0
246,448935683,cd,1,163,0.9292391820031827,0,0,2,6,2,284,17.0
247,448935690,cd,1,165,0.8898738726596667,0,0,2,7,2,284,17.0
248,448935697,cd,1,6,1.2491816988498188,0,0,2,1,2,284,17.0
249,448935704,cd,1,5,1.1861175423000014,0,0,2,1,2,284,17.0
250,448935711,cd,1,4,0.9434659219393065,0,0,2,1,2,284,17.0
251,448935718,cd,1,153,0.8868083899057555,0,0,2,3,2,284,17.0
252,448935725,cd,1,3,0.9204805702920913,0,0,2,1,2,284,17.0
253,448935732,cd,1,2,0.9204805702920913,0,0,2,1,2,284,17.0
254,448935739,cd,1,1,0.9204805702920913,0,0,2,1,2,284,17.0
