counter,AS,Type,GranularityValue,SeverityScore,PageRank,NumBadDep,TotalDep,NumberOfVerteces,NumOfCycle,NumSetOfElement,TotNumOfSetOfElement,ADI
1,1669751,ud,2,3,24.777083131905847,2,0,0,0,3,100,26.0
2,1669784,ud,2,6,61.493181391440885,4,0,0,0,5,100,26.0
3,1669763,ud,2,5,55.652056266557764,6,0,0,0,7,100,26.0
4,1669817,ud,2,2,23.184467967965467,2,0,0,0,3,100,26.0
5,1669805,ud,2,7,19.404493643164844,2,0,0,0,3,100,26.0
6,1669796,ud,2,1,8.56534144366907,1,0,0,0,2,100,26.0
7,1669829,ud,2,4,28.82289909908307,1,0,0,0,2,100,26.0
8,1669620,hl,1,3,34.75463332625923,0,63,0,0,62,100,26.0
9,1669692,hl,2,2,187.07345397224975,0,26,0,0,21,100,26.0
10,1669726,hl,2,1,105.3844685778837,0,17,0,0,16,100,26.0
11,1669144,cd,2,44,43.66335351156506,0,0,4,1,4,100,26.0
12,1669136,cd,2,28,35.28798495510563,0,0,3,1,3,100,26.0
13,1669129,cd,2,88,40.90224849591494,0,0,2,3,2,100,26.0
14,1669122,cd,2,14,21.466913875301117,0,0,2,1,2,100,26.0
15,1669177,cd,2,27,17.79254048342777,0,0,3,1,3,100,26.0
16,1669169,cd,2,26,17.58549213220605,0,0,3,1,3,100,26.0
17,1669162,cd,2,13,19.024544985377876,0,0,2,1,2,100,26.0
18,1669153,cd,2,43,32.555925794427544,0,0,4,1,4,100,26.0
19,1669211,cd,2,25,16.990417364906804,0,0,3,1,3,100,26.0
20,1669201,cd,2,58,41.62922589109399,0,0,5,1,5,100,26.0
21,1669192,cd,2,42,33.25385733463456,0,0,4,1,4,100,26.0
22,1669185,cd,2,12,11.009787090908727,0,0,2,1,2,100,26.0
23,1669236,cd,2,11,27.7540908539036,0,0,2,1,2,100,26.0
24,1669228,cd,2,24,36.129459410363026,0,0,3,1,3,100,26.0
25,1669219,cd,2,41,30.76598094201767,0,0,4,1,4,100,26.0
26,1668381,cd,1,57,7.758083896846537,0,0,5,1,5,100,26.0
27,1668369,cd,1,68,8.946689276739367,0,0,7,1,7,100,26.0
28,1668361,cd,1,23,5.782088758883003,0,0,3,1,3,100,26.0
29,1668354,cd,1,10,2.617546961561536,0,0,2,1,2,100,26.0
30,1668411,cd,1,40,6.087553476270993,0,0,4,1,4,100,26.0
31,1668401,cd,1,56,6.94279674203388,0,0,5,1,5,100,26.0
32,1668391,cd,1,55,6.250107387476502,0,0,5,1,5,100,26.0
33,1668443,cd,1,84,5.456050499318576,0,0,2,2,2,100,26.0
34,1668435,cd,1,22,5.176168225635881,0,0,3,1,3,100,26.0
35,1668428,cd,1,89,4.323087370172669,0,0,2,5,2,100,26.0
36,1668420,cd,1,21,3.6654599117233766,0,0,3,1,3,100,26.0
37,1668477,cd,1,39,5.823061822791861,0,0,4,1,4,100,26.0
38,1668468,cd,1,38,5.381377096415639,0,0,4,1,4,100,26.0
39,1668458,cd,1,54,6.3864606979498655,0,0,5,1,5,100,26.0
40,1668450,cd,1,20,4.621994591851541,0,0,3,1,3,100,26.0
41,1668505,cd,1,53,5.844861909650825,0,0,5,1,5,100,26.0
42,1668498,cd,1,9,2.090630909936404,0,0,2,1,2,100,26.0
43,1668486,cd,1,67,8.442771194653073,0,0,7,1,7,100,26.0
44,1668539,cd,1,72,10.385117123273265,0,0,8,1,8,100,26.0
45,1668528,cd,1,62,8.480939259384703,0,0,6,1,6,100,26.0
46,1668515,cd,1,71,8.464571281512036,0,0,8,1,8,100,26.0
47,1668574,cd,1,19,4.276017382704865,0,0,3,1,3,100,26.0
48,1668562,cd,1,66,9.425740288879044,0,0,7,1,7,100,26.0
49,1668552,cd,1,52,8.075759871179786,0,0,5,1,5,100,26.0
50,1668603,cd,1,37,5.9622024142851044,0,0,4,1,4,100,26.0
51,1668595,cd,1,85,7.335193223375637,0,0,3,2,3,100,26.0
52,1668582,cd,1,70,8.245707172265336,0,0,8,1,8,100,26.0
53,1668639,cd,1,36,4.552285934228464,0,0,4,1,4,100,26.0
54,1668623,cd,1,79,11.49016388457549,0,0,11,1,11,100,26.0
55,1668612,cd,1,61,8.11402566324057,0,0,6,1,6,100,26.0
56,1668665,cd,1,35,6.349559557142247,0,0,4,1,4,100,26.0
57,1668658,cd,1,8,2.6171286442867894,0,0,2,1,2,100,26.0
58,1668648,cd,1,51,6.561097260620803,0,0,5,1,5,100,26.0
59,1668700,cd,1,34,3.961853104173225,0,0,4,1,4,100,26.0
60,1668688,cd,1,65,10.360081983441763,0,0,7,1,7,100,26.0
61,1668674,cd,1,74,12.264259847330326,0,0,9,1,9,100,26.0
62,1668726,cd,1,64,7.639479815530488,0,0,7,1,7,100,26.0
63,1668709,cd,1,81,12.623350640983372,0,0,12,1,12,100,26.0
64,1668764,cd,1,50,5.87646538594852,0,0,5,1,5,100,26.0
65,1668748,cd,1,78,11.663973806589151,0,0,11,1,11,100,26.0
66,1668738,cd,1,49,5.6854726906363435,0,0,5,1,5,100,26.0
67,1668790,cd,1,77,10.636290254308824,0,0,10,1,10,100,26.0
68,1668783,cd,1,7,1.3519556849400278,0,0,2,1,2,100,26.0
69,1668774,cd,1,33,4.152845799485402,0,0,4,1,4,100,26.0
70,1668823,cd,1,60,6.007769556055276,0,0,6,1,6,100,26.0
71,1668805,cd,1,83,12.945647506402304,0,0,13,1,13,100,26.0
72,1668862,cd,1,6,1.4389921892327298,0,0,2,1,2,100,26.0
73,1668851,cd,1,59,6.0948060603479774,0,0,6,1,6,100,26.0
74,1668834,cd,1,80,12.814343336295547,0,0,12,1,12,100,26.0
75,1668879,cd,1,82,13.032684010695005,0,0,13,1,13,100,26.0
76,1668869,cd,1,48,4.371186473884859,0,0,5,1,5,100,26.0
77,1668925,cd,1,5,2.603385137793283,0,0,2,1,2,100,26.0
78,1668916,cd,1,32,6.335816050648741,0,0,4,1,4,100,26.0
79,1668907,cd,1,86,6.316971842765265,0,0,4,2,4,100,26.0
80,1668897,cd,1,47,7.331918365946467,0,0,5,1,5,100,26.0
81,1668958,cd,1,76,11.264882674603427,0,0,10,1,10,100,26.0
82,1668946,cd,1,63,8.95552542250995,0,0,7,1,7,100,26.0
83,1668932,cd,1,73,10.30550584020921,0,0,9,1,9,100,26.0
84,1668981,cd,1,75,11.147680751526504,0,0,10,1,10,100,26.0
85,1668973,cd,1,18,4.209802801179478,0,0,3,1,3,100,26.0
86,1669015,cd,1,46,6.315839800979888,0,0,5,1,5,100,26.0
87,1669006,cd,1,31,6.218614127571818,0,0,4,1,4,100,26.0
88,1668996,cd,1,45,6.273339800979887,0,0,5,1,5,100,26.0
89,1669054,cd,1,4,2.848978893382904,0,0,2,1,2,100,26.0
90,1669045,cd,1,30,7.2205166054169,0,0,4,1,4,100,26.0
91,1669032,cd,1,69,11.304883012936106,0,0,8,1,8,100,26.0
92,1669025,cd,1,87,5.326381896983298,0,0,2,3,2,100,26.0
93,1669083,cd,2,3,32.17616726019662,0,0,2,1,2,100,26.0
94,1669075,cd,2,17,66.58069035074072,0,0,3,1,3,100,26.0
95,1669068,cd,2,2,36.674857285889374,0,0,2,1,2,100,26.0
96,1669061,cd,2,90,58.205321794281296,0,0,2,10,2,100,26.0
97,1669114,cd,2,16,57.79601844003854,0,0,3,1,3,100,26.0
98,1669107,cd,2,1,41.53257847031078,0,0,2,1,2,100,26.0
99,1669099,cd,2,15,48.43960722992438,0,0,3,1,3,100,26.0
100,1669090,cd,2,29,56.8149757863838,0,0,4,1,4,100,26.0
