counter,AS,Type,GranularityValue,SeverityScore,PageRank,NumBadDep,TotalDep,NumberOfVerteces,NumOfCycle,NumSetOfElement,TotNumOfSetOfElement,ADI
1,107359849,ud,2,43,393.7121217054049,5,0,0,0,6,242,6.0
2,107359858,ud,2,23,37.86308000175824,2,0,0,0,3,242,6.0
3,107359867,ud,2,47,2.458811131193306,1,0,0,0,2,242,6.0
4,107359816,ud,2,42,11.597799434878642,1,0,0,0,2,242,6.0
5,107359825,ud,2,73,6.816784157739476,2,0,0,0,3,242,6.0
6,107359837,ud,2,75,11.366744063342578,2,0,0,0,3,242,6.0
7,107359777,ud,2,41,216.59013355731844,2,0,0,0,3,242,6.0
8,107359786,ud,2,83,5.684371210633911,1,0,0,0,2,242,6.0
9,107359795,ud,2,40,27.69466252209109,1,0,0,0,2,242,6.0
10,107359804,ud,2,46,15.478691123184799,2,0,0,0,3,242,6.0
11,107359747,ud,2,39,16.47834468937432,3,0,0,0,4,242,6.0
12,107359765,ud,2,68,9.75520030224997,2,0,0,0,3,242,6.0
13,107359969,ud,2,22,6.602151568647683,1,0,0,0,2,242,6.0
14,107359978,ud,2,74,6.429893774542105,2,0,0,0,3,242,6.0
15,107359987,ud,2,45,16.783360294151365,3,0,0,0,4,242,6.0
16,107359996,ud,2,53,376.8994922461353,2,0,0,0,3,242,6.0
17,107359939,ud,2,65,6.444847403749372,1,0,0,0,2,242,6.0
18,107359957,ud,2,38,18.685151511935555,2,0,0,0,3,242,6.0
19,107359918,ud,2,21,3.9559303261680427,1,0,0,0,2,242,6.0
20,107359927,ud,2,37,48.416199643522575,5,0,0,0,6,242,6.0
21,107359876,ud,2,52,88.98691324871973,1,0,0,0,2,242,6.0
22,107359885,ud,2,20,3.9316156898777477,1,0,0,0,2,242,6.0
23,107359894,ud,2,19,5.909558239630625,1,0,0,0,2,242,6.0
24,107359903,ud,2,36,21.57656087147749,3,0,0,0,4,242,6.0
25,107360101,ud,2,35,23.26998230427387,5,0,0,0,6,242,6.0
26,107360122,ud,2,18,7.569039145607645,1,0,0,0,2,242,6.0
27,107360068,ud,2,34,9.809730740833974,3,0,0,0,4,242,6.0
28,107360083,ud,2,76,10.101444886321778,3,0,0,0,4,242,6.0
29,107360092,ud,2,17,87.5230462940212,2,0,0,0,3,242,6.0
30,107360041,ud,2,67,3.747680251974871,1,0,0,0,2,242,6.0
31,107360050,ud,2,16,6.744233812555883,1,0,0,0,2,242,6.0
32,107360059,ud,2,33,7.596104615562876,1,0,0,0,2,242,6.0
33,107360008,ud,2,32,17.21904116424054,2,0,0,0,3,242,6.0
34,107360020,ud,2,64,16.861846516115385,1,0,0,0,2,242,6.0
35,107360029,ud,2,15,22.780123898849993,2,0,0,0,3,242,6.0
36,107360230,ud,2,63,7.431619615548862,1,0,0,0,2,242,6.0
37,107360239,ud,2,62,7.500885422312446,1,0,0,0,2,242,6.0
38,107360248,ud,2,61,7.389488848446891,1,0,0,0,2,242,6.0
39,107360197,ud,2,14,51.788557089788775,3,0,0,0,4,242,6.0
40,107360209,ud,2,60,7.383523810158862,1,0,0,0,2,242,6.0
41,107360221,ud,2,59,7.450996766241053,1,0,0,0,2,242,6.0
42,107360167,ud,2,58,7.686729505974994,1,0,0,0,2,242,6.0
43,107360179,ud,2,66,7.394637932659145,1,0,0,0,2,242,6.0
44,107360131,ud,2,82,2.567435309772414,1,0,0,0,2,242,6.0
45,107360146,ud,2,78,21.757540637743716,1,0,0,0,2,242,6.0
46,107360155,ud,2,13,75.82294164645847,3,0,0,0,4,242,6.0
47,107359717,ud,2,31,15.889076074277915,2,0,0,0,3,242,6.0
48,107359732,ud,2,56,12.330419898093147,4,0,0,0,5,242,6.0
49,107359681,ud,2,81,3.885562316620053,1,0,0,0,2,242,6.0
50,107359690,ud,2,12,56.81869569160639,4,0,0,0,5,242,6.0
51,107359699,ud,2,11,15.74642723790052,2,0,0,0,3,242,6.0
52,107359708,ud,2,80,17.274466038354664,1,0,0,0,2,242,6.0
53,107359672,ud,2,10,12.196217909370027,1,0,0,0,2,242,6.0
54,107360353,ud,2,9,168.01038791965877,1,0,0,0,2,242,6.0
55,107360362,ud,2,70,4.46057760600365,1,0,0,0,2,242,6.0
56,107360371,ud,2,51,10.436836235108322,2,0,0,0,3,242,6.0
57,107360383,ud,2,50,7.353817592363737,1,0,0,0,2,242,6.0
58,107360326,ud,2,77,4.908790102031844,1,0,0,0,2,242,6.0
59,107360335,ud,2,55,143.8036414634604,1,0,0,0,2,242,6.0
60,107360344,ud,2,72,4.934048446812538,1,0,0,0,2,242,6.0
61,107360299,ud,2,84,5.1856975427501375,1,0,0,0,2,242,6.0
62,107360308,ud,2,30,19.798672973885648,1,0,0,0,2,242,6.0
63,107360317,ud,2,8,6.402481054371177,1,0,0,0,2,242,6.0
64,107360257,ud,2,57,7.837982606476394,1,0,0,0,2,242,6.0
65,107360269,ud,2,69,5.175321042328769,1,0,0,0,2,242,6.0
66,107360278,ud,2,79,9.942240022538586,2,0,0,0,3,242,6.0
67,107360287,ud,2,7,3.433602013852148,1,0,0,0,2,242,6.0
68,107360488,ud,2,29,15.943830335846366,1,0,0,0,2,242,6.0
69,107360497,ud,2,49,224.91450122631142,2,0,0,0,3,242,6.0
70,107360509,ud,2,6,17.647910369402442,2,0,0,0,3,242,6.0
71,107360449,ud,2,5,10.249289521869887,1,0,0,0,2,242,6.0
72,107360461,ud,2,4,5.157056364765456,1,0,0,0,2,242,6.0
73,107360470,ud,2,3,24.722773142404833,1,0,0,0,2,242,6.0
74,107360431,ud,2,28,3.105808292954889,1,0,0,0,2,242,6.0
75,107360440,ud,2,2,7.056331929269988,1,0,0,0,2,242,6.0
76,107360392,ud,2,27,9.051976705479307,1,0,0,0,2,242,6.0
77,107360401,ud,2,1,6.1932807283024065,1,0,0,0,2,242,6.0
78,107360413,ud,2,54,32.677700609969364,2,0,0,0,3,242,6.0
79,107360551,ud,2,44,13.678697014132798,1,0,0,0,2,242,6.0
80,107360560,ud,2,71,7.530339831181611,2,0,0,0,3,242,6.0
81,107360575,ud,2,26,10.179614353659359,1,0,0,0,2,242,6.0
82,107360518,ud,2,25,71.93693847860263,1,0,0,0,2,242,6.0
83,107360533,ud,2,48,2.1243910592166326,1,0,0,0,2,242,6.0
84,107360542,ud,2,24,6.840819041039931,1,0,0,0,2,242,6.0
85,107357798,cd,1,85,3.8075130838061657,0,0,4,1,4,242,6.0
86,107357807,cd,1,71,3.4026356555597586,0,0,3,1,3,242,6.0
87,107357815,cd,1,70,3.5637835228786123,0,0,3,1,3,242,6.0
88,107357823,cd,1,84,3.68461224549399,0,0,4,1,4,242,6.0
89,107357766,cd,1,54,3.8592053465737113,0,0,2,1,2,242,6.0
90,107357773,cd,1,69,3.4536196053296733,0,0,3,1,3,242,6.0
91,107357781,cd,1,68,3.527830486281669,0,0,3,1,3,242,6.0
92,107357789,cd,1,83,3.8075130838061657,0,0,4,1,4,242,6.0
93,107357745,cd,1,53,2.256416521435926,0,0,2,1,2,242,6.0
94,107357759,cd,1,52,1.1825842399286781,0,0,2,1,2,242,6.0
95,107357752,cd,1,118,1.3625376656785941,0,0,2,3,2,242,6.0
96,107357922,cd,1,82,2.8646629002407855,0,0,4,1,4,242,6.0
97,107357931,cd,1,95,5.69316802708847,0,0,7,1,7,242,6.0
98,107357943,cd,1,92,5.028311044734199,0,0,6,1,6,242,6.0
99,107357891,cd,1,94,5.807011577930462,0,0,7,1,7,242,6.0
100,107357903,cd,1,91,5.732680438106531,0,0,6,1,6,242,6.0
101,107357914,cd,1,67,2.3638491248837137,0,0,3,1,3,242,6.0
102,107357862,cd,1,96,6.122796188070026,0,0,8,1,8,242,6.0
103,107357875,cd,1,110,1.017200951121247,0,0,2,2,2,242,6.0
104,107357882,cd,1,81,2.4381802647076443,0,0,4,1,4,242,6.0
105,107357832,cd,1,66,3.8696450885798885,0,0,3,1,3,242,6.0
106,107357840,cd,1,88,5.139972320403425,0,0,5,1,5,242,6.0
107,107357850,cd,1,93,5.654749977749606,0,0,7,1,7,242,6.0
108,107358050,cd,1,80,1.663499484506399,0,0,4,1,4,242,6.0
109,107358059,cd,1,109,1.0875787072201604,0,0,2,2,2,242,6.0
110,107358066,cd,1,123,1.888039776727618,0,0,3,5,3,242,6.0
111,107358074,cd,1,65,1.5342560996718766,0,0,3,1,3,242,6.0
112,107358020,cd,1,51,0.9345649253492514,0,0,2,1,2,242,6.0
113,107358027,cd,1,79,1.1902347424865796,0,0,4,1,4,242,6.0
114,107358036,cd,1,108,0.8932039164183164,0,0,2,2,2,242,6.0
115,107358043,cd,1,129,1.036012552657135,0,0,2,11,2,242,6.0
116,107357985,cd,1,50,1.8291647326443443,0,0,2,1,2,242,6.0
117,107357999,cd,1,49,1.1486881969282559,0,0,2,1,2,242,6.0
118,107357992,cd,1,48,0.9272752502315662,0,0,2,1,2,242,6.0
119,107358006,cd,1,47,0.9345649253492514,0,0,2,1,2,242,6.0
120,107358013,cd,1,46,0.9345649253492514,0,0,2,1,2,242,6.0
121,107357954,cd,1,90,5.028311044734199,0,0,6,1,6,242,6.0
122,107357965,cd,1,89,5.028311044734199,0,0,6,1,6,242,6.0
123,107357976,cd,1,78,4.806193558893801,0,0,4,1,4,242,6.0
124,107358182,cd,1,117,1.023107897808326,0,0,2,3,2,242,6.0
125,107358189,cd,1,45,0.9411593776853151,0,0,2,1,2,242,6.0
126,107358196,cd,1,44,1.0585143075696062,0,0,2,1,2,242,6.0
127,107358203,cd,1,43,1.0012709136600462,0,0,2,1,2,242,6.0
128,107358147,cd,1,42,0.938197085429751,0,0,2,1,2,242,6.0
129,107358154,cd,1,41,0.9251184044514899,0,0,2,1,2,242,6.0
130,107358161,cd,1,40,1.0093121726219123,0,0,2,1,2,242,6.0
131,107358175,cd,1,107,1.0401914094917224,0,0,2,2,2,242,6.0
132,107358168,cd,1,106,0.9286318931350004,0,0,2,2,2,242,6.0
133,107358119,cd,1,128,0.9728966888114993,0,0,2,8,2,242,6.0
134,107358112,cd,1,39,1.275042963863376,0,0,2,1,2,242,6.0
135,107358126,cd,1,125,0.9210415555005761,0,0,2,6,2,242,6.0
136,107358133,cd,1,38,1.2260459198654514,0,0,2,1,2,242,6.0
137,107358140,cd,1,127,0.8898738726596667,0,0,2,7,2,242,6.0
138,107358082,cd,1,77,1.987990410091837,0,0,4,1,4,242,6.0
139,107358091,cd,1,126,1.4343054663076575,0,0,2,7,2,242,6.0
140,107358098,cd,1,122,1.5833285627136524,0,0,2,5,2,242,6.0
141,107358105,cd,1,37,1.0442725038550107,0,0,2,1,2,242,6.0
142,107358722,cd,2,116,8.449894284603246,0,0,2,3,2,242,6.0
143,107358729,cd,2,36,5.0484564989616345,0,0,2,1,2,242,6.0
144,107358736,cd,2,35,20.790021013563297,0,0,2,1,2,242,6.0
145,107358311,cd,2,105,19.51876740120064,0,0,2,2,2,242,6.0
146,107358304,cd,2,34,22.21605069609435,0,0,2,1,2,242,6.0
147,107358318,cd,2,113,31.21724827574505,0,0,3,2,3,242,6.0
148,107358326,cd,2,112,22.53669049519116,0,0,3,2,3,242,6.0
149,107358334,cd,2,33,12.536214015596856,0,0,2,1,2,242,6.0
150,107358273,cd,2,76,216.43719658937536,0,0,4,1,4,242,6.0
151,107358282,cd,2,64,259.63658323576436,0,0,3,1,3,242,6.0
152,107358290,cd,2,104,14.534280104352558,0,0,2,2,2,242,6.0
153,107358297,cd,2,32,13.910966703215376,0,0,2,1,2,242,6.0
154,107358245,cd,1,31,1.04411955569785,0,0,2,1,2,242,6.0
155,107358252,cd,2,120,505.4276156865899,0,0,2,4,2,242,6.0
156,107358259,cd,2,30,305.95750483725925,0,0,2,1,2,242,6.0
157,107358266,cd,2,29,100.94022980610262,0,0,2,1,2,242,6.0
158,107358210,cd,1,28,0.9089590884782223,0,0,2,1,2,242,6.0
159,107358217,cd,1,27,0.9089590884782223,0,0,2,1,2,242,6.0
160,107358231,cd,1,26,0.9077490603174153,0,0,2,1,2,242,6.0
161,107358224,cd,1,25,0.9077490603174153,0,0,2,1,2,242,6.0
162,107358238,cd,1,24,0.9958668379360918,0,0,2,1,2,242,6.0
163,107358434,cd,2,63,63.9631015749207,0,0,3,1,3,242,6.0
164,107358442,cd,2,23,47.88064514367042,0,0,2,1,2,242,6.0
165,107358449,cd,2,75,71.51674377683216,0,0,4,1,4,242,6.0
166,107358458,cd,2,87,107.59182597960454,0,0,5,1,5,242,6.0
167,107358406,cd,2,119,9.489115038835852,0,0,2,4,2,242,6.0
168,107358413,cd,2,115,12.351291462548966,0,0,2,3,2,242,6.0
169,107358420,cd,2,103,10.411350742363595,0,0,2,2,2,242,6.0
170,107358427,cd,2,22,11.000435254575487,0,0,2,1,2,242,6.0
171,107358369,cd,2,102,44.55087616025664,0,0,2,2,2,242,6.0
172,107358383,cd,2,74,12.243350112975762,0,0,4,1,4,242,6.0
173,107358376,cd,2,21,8.702382772386692,0,0,2,1,2,242,6.0
174,107358399,cd,2,101,10.74051061348811,0,0,2,2,2,242,6.0
175,107358392,cd,2,20,15.430718461196943,0,0,2,1,2,242,6.0
176,107358341,cd,2,19,7.688801369545376,0,0,2,1,2,242,6.0
177,107358348,cd,2,18,21.006468378648947,0,0,2,1,2,242,6.0
178,107358355,cd,2,17,5.180641717640583,0,0,2,1,2,242,6.0
179,107358362,cd,2,124,12.609938567936616,0,0,2,6,2,242,6.0
180,107358561,cd,2,73,28.738576178541877,0,0,4,1,4,242,6.0
181,107358570,cd,2,16,7.83975880105011,0,0,2,1,2,242,6.0
182,107358577,cd,2,62,12.658637310912086,0,0,3,1,3,242,6.0
183,107358585,cd,2,61,24.749527982879577,0,0,3,1,3,242,6.0
184,107358529,cd,2,15,6.96270276701399,0,0,2,1,2,242,6.0
185,107358536,cd,2,60,12.16199863523707,0,0,3,1,3,242,6.0
186,107358544,cd,2,86,29.881444536615373,0,0,5,1,5,242,6.0
187,107358554,cd,2,14,7.343120125375092,0,0,2,1,2,242,6.0
188,107358497,cd,2,13,21.687141253543658,0,0,2,1,2,242,6.0
189,107358504,cd,2,59,27.691130676376925,0,0,3,1,3,242,6.0
190,107358512,cd,2,72,27.861520144505757,0,0,4,1,4,242,6.0
191,107358521,cd,2,58,11.781581276875968,0,0,3,1,3,242,6.0
192,107358468,cd,2,100,47.39670347649367,0,0,2,2,2,242,6.0
193,107358475,cd,2,57,75.79363726718438,0,0,3,1,3,242,6.0
194,107358483,cd,2,99,39.718555064412016,0,0,2,2,2,242,6.0
195,107358490,cd,2,12,51.1823666065953,0,0,2,1,2,242,6.0
196,107358692,cd,2,56,10.053441543388047,0,0,3,1,3,242,6.0
197,107358700,cd,2,98,10.146691019345987,0,0,2,2,2,242,6.0
198,107358707,cd,2,114,7.8117997709415254,0,0,2,3,2,242,6.0
199,107358714,cd,2,111,10.829871376998435,0,0,3,2,3,242,6.0
200,107358657,cd,2,11,13.03024282664121,0,0,2,1,2,242,6.0
201,107358671,cd,2,10,9.765517007386599,0,0,2,1,2,242,6.0
202,107358664,cd,2,9,15.89714053902862,0,0,2,1,2,242,6.0
203,107358678,cd,2,8,3.31406336314848,0,0,2,1,2,242,6.0
204,107358685,cd,2,121,12.376169311253253,0,0,2,5,2,242,6.0
205,107358629,cd,2,7,10.106282355220742,0,0,2,1,2,242,6.0
206,107358636,cd,2,97,4.70160235893614,0,0,2,2,2,242,6.0
207,107358643,cd,2,6,3.5779109149007584,0,0,2,1,2,242,6.0
208,107358650,cd,2,5,15.58621478496112,0,0,2,1,2,242,6.0
209,107358593,cd,2,4,27.13929321004724,0,0,2,1,2,242,6.0
210,107358607,cd,2,3,4.5136392571041215,0,0,2,1,2,242,6.0
211,107358600,cd,2,2,42.58949032601291,0,0,2,1,2,242,6.0
212,107358614,cd,2,1,8.88581501164091,0,0,2,1,2,242,6.0
213,107358621,cd,2,55,7.999008263329101,0,0,3,1,3,242,6.0
