counter,AS,Type,GranularityValue,SeverityScore,PageRank,NumBadDep,TotalDep,NumberOfVerteces,NumOfCycle,NumSetOfElement,TotNumOfSetOfElement,ADI
1,577172,ud,2,2,42.28940951877608,2,0,0,0,3,20,7.0
2,577184,ud,2,1,30.009965791310258,2,0,0,0,3,20,7.0
3,577001,cd,1,11,2.6574270394488653,0,0,2,11,2,20,7.0
4,577016,cd,1,7,2.2069525942079435,0,0,2,1,2,20,7.0
5,577023,cd,1,6,2.6770866829909545,0,0,2,1,2,20,7.0
6,577008,cd,1,9,2.775783608337156,0,0,3,1,3,20,7.0
7,577038,cd,1,5,6.821509900301276,0,0,2,1,2,20,7.0
8,577030,cd,1,8,2.978766617369795,0,0,3,1,3,20,7.0
9,577052,cd,1,4,1.1066488572617348,0,0,2,1,2,20,7.0
10,577045,cd,1,3,1.1066488572617348,0,0,2,1,2,20,7.0
11,577066,cd,1,10,1.0271816946782106,0,0,2,8,2,20,7.0
12,577059,cd,1,2,0.9311532775853351,0,0,2,1,2,20,7.0
13,577073,cd,2,1,41.779195593421775,0,0,2,1,2,20,7.0
