counter,AS,Type,GranularityValue,SeverityScore,PageRank,NumBadDep,TotalDep,NumberOfVerteces,NumOfCycle,NumSetOfElement,TotNumOfSetOfElement,ADI
1,33290235,ud,2,54,5.321697277208951,1,0,0,0,2,192,3.0
2,33290223,ud,2,30,14.308969523930308,1,0,0,0,2,192,3.0
3,33290214,ud,2,29,7.191394583461578,1,0,0,0,2,192,3.0
4,33290205,ud,2,66,6.6532600615031665,1,0,0,0,2,192,3.0
5,33290187,ud,2,39,42.55498706829829,3,0,0,0,4,192,3.0
6,33290178,ud,2,50,13.724603567688455,1,0,0,0,2,192,3.0
7,33290169,ud,2,28,25.109174897846263,1,0,0,0,2,192,3.0
8,33290160,ud,2,43,245.01114228077847,1,0,0,0,2,192,3.0
9,33290151,ud,2,65,3.1313058271862135,1,0,0,0,2,192,3.0
10,33290142,ud,2,49,3.2537987959362136,1,0,0,0,2,192,3.0
11,33290133,ud,2,27,44.15760690785775,2,0,0,0,3,192,3.0
12,33290124,ud,2,26,47.10148642644836,3,0,0,0,4,192,3.0
13,33290115,ud,2,11,4.4069668553764245,1,0,0,0,2,192,3.0
14,33290106,ud,2,34,5.309902271923535,1,0,0,0,2,192,3.0
15,33290097,ud,2,25,26.76786029167529,1,0,0,0,2,192,3.0
16,33290088,ud,2,24,7.75779643192822,1,0,0,0,2,192,3.0
17,33290073,ud,2,10,11.094688587876037,1,0,0,0,2,192,3.0
18,33290064,ud,2,38,7.051621385474408,2,0,0,0,3,192,3.0
19,33290049,ud,2,53,21.22610084031055,3,0,0,0,4,192,3.0
20,33290040,ud,2,23,235.6508038880341,2,0,0,0,3,192,3.0
21,33290025,ud,2,56,16.327505946770046,3,0,0,0,4,192,3.0
22,33290016,ud,2,44,4.2128429594274115,1,0,0,0,2,192,3.0
23,33290007,ud,2,22,36.875494734670575,2,0,0,0,3,192,3.0
24,33289995,ud,2,21,6.662519353740976,2,0,0,0,3,192,3.0
25,33289986,ud,2,60,5.0068484704425575,1,0,0,0,2,192,3.0
26,33289977,ud,2,64,5.333457027403667,1,0,0,0,2,192,3.0
27,33289968,ud,2,59,5.121906647607972,1,0,0,0,2,192,3.0
28,33289959,ud,2,52,16.890405825007093,2,0,0,0,3,192,3.0
29,33289950,ud,2,20,27.731853226913906,1,0,0,0,2,192,3.0
30,33289941,ud,2,33,10.381828958011184,1,0,0,0,2,192,3.0
31,33289932,ud,2,47,5.235790977674744,1,0,0,0,2,192,3.0
32,33289923,ud,2,42,170.11911233223475,1,0,0,0,2,192,3.0
33,33289908,ud,2,19,11.169853791282671,3,0,0,0,4,192,3.0
34,33289896,ud,2,55,16.691956861794186,4,0,0,0,5,192,3.0
35,33289887,ud,2,32,17.61559148384832,1,0,0,0,2,192,3.0
36,33290592,ud,2,18,3.4134597261994735,1,0,0,0,2,192,3.0
37,33290583,ud,2,9,12.123286798533723,1,0,0,0,2,192,3.0
38,33290559,ud,2,8,23.543776193605073,5,0,0,0,6,192,3.0
39,33290547,ud,2,7,4.533811698851662,1,0,0,0,2,192,3.0
40,33290535,ud,2,17,15.875321777666198,2,0,0,0,3,192,3.0
41,33290523,ud,2,6,7.181766036918625,1,0,0,0,2,192,3.0
42,33290514,ud,2,16,10.811891118328594,1,0,0,0,2,192,3.0
43,33290505,ud,2,5,6.27962754770645,1,0,0,0,2,192,3.0
44,33290496,ud,2,15,24.250642166387465,2,0,0,0,3,192,3.0
45,33290481,ud,2,58,134.69036197566055,1,0,0,0,2,192,3.0
46,33290469,ud,2,41,33.69067375458367,2,0,0,0,3,192,3.0
47,33290460,ud,2,37,5.62979436617547,1,0,0,0,2,192,3.0
48,33290451,ud,2,46,5.560256071359978,1,0,0,0,2,192,3.0
49,33290442,ud,2,4,3.5566602662972207,1,0,0,0,2,192,3.0
50,33290433,ud,2,3,6.112648005744283,1,0,0,0,2,192,3.0
51,33290424,ud,2,14,2.8711493528854004,1,0,0,0,2,192,3.0
52,33290415,ud,2,2,8.406606951271801,1,0,0,0,2,192,3.0
53,33290403,ud,2,36,6.946050338877407,2,0,0,0,3,192,3.0
54,33290385,ud,2,13,69.63557069156047,4,0,0,0,5,192,3.0
55,33290370,ud,2,1,71.68111507165565,3,0,0,0,4,192,3.0
56,33290355,ud,2,12,37.131370061952246,2,0,0,0,3,192,3.0
57,33290346,ud,2,51,10.141062120029368,1,0,0,0,2,192,3.0
58,33290337,ud,2,31,5.421985150977965,1,0,0,0,2,192,3.0
59,33290319,ud,2,48,10.434932161914963,4,0,0,0,5,192,3.0
60,33290304,ud,2,57,7.41799512017517,1,0,0,0,2,192,3.0
61,33290295,ud,2,63,1.8547507614968968,1,0,0,0,2,192,3.0
62,33290286,ud,2,62,6.825152175874648,1,0,0,0,2,192,3.0
63,33290277,ud,2,61,10.063364792410445,1,0,0,0,2,192,3.0
64,33290268,ud,2,40,5.106763136142876,1,0,0,0,2,192,3.0
65,33290253,ud,2,45,38.00776184220057,5,0,0,0,6,192,3.0
66,33290244,ud,2,35,4.232724608878565,1,0,0,0,2,192,3.0
67,33288701,cd,1,48,0.8969774885306333,0,0,2,1,2,192,3.0
68,33288694,cd,1,96,1.023107897808326,0,0,2,3,2,192,3.0
69,33288687,cd,1,47,0.9180206458436979,0,0,2,1,2,192,3.0
70,33288672,cd,1,46,1.0984798986889897,0,0,2,1,2,192,3.0
71,33288679,cd,1,57,1.2563053579273398,0,0,3,1,3,192,3.0
72,33288665,cd,1,45,1.2479315646862637,0,0,2,1,2,192,3.0
73,33288658,cd,1,44,1.0347298986889895,0,0,2,1,2,192,3.0
74,33288651,cd,1,78,0.9286318931350004,0,0,2,2,2,192,3.0
75,33288644,cd,1,43,1.0093121726219123,0,0,2,1,2,192,3.0
76,33288637,cd,1,42,1.0328727159255284,0,0,2,1,2,192,3.0
77,33288630,cd,1,100,1.3393886150648733,0,0,2,5,2,192,3.0
78,33288623,cd,1,99,1.201466697450366,0,0,2,5,2,192,3.0
79,33288608,cd,1,41,1.2790572402378695,0,0,2,1,2,192,3.0
80,33288615,cd,1,98,1.609656039551659,0,0,3,4,3,192,3.0
81,33288601,cd,1,40,1.7455184104300958,0,0,2,1,2,192,3.0
82,33288594,cd,1,39,1.545166346521784,0,0,2,1,2,192,3.0
83,33288587,cd,1,77,0.8935846363501359,0,0,2,2,2,192,3.0
84,33288580,cd,1,103,1.167846070096367,0,0,2,11,2,192,3.0
85,33288572,cd,1,56,1.422043534465871,0,0,3,1,3,192,3.0
86,33288564,cd,1,55,1.2735479936318683,0,0,3,1,3,192,3.0
87,33288557,cd,1,38,1.1486881969282559,0,0,2,1,2,192,3.0
88,33288550,cd,1,37,3.070367130395549,0,0,2,1,2,192,3.0
89,33288542,cd,1,54,3.1792241303888353,0,0,3,1,3,192,3.0
90,33288533,cd,1,65,3.3080783314118305,0,0,4,1,4,192,3.0
91,33288525,cd,1,90,3.3254051479978246,0,0,3,2,3,192,3.0
92,33288518,cd,1,76,3.5848488959385127,0,0,2,2,2,192,3.0
93,33288510,cd,1,89,3.2757363749850645,0,0,3,2,3,192,3.0
94,33288502,cd,1,88,3.2751495778930266,0,0,3,2,3,192,3.0
95,33288494,cd,1,87,3.650874195616872,0,0,3,2,3,192,3.0
96,33288484,cd,1,66,4.676866969096566,0,0,5,1,5,192,3.0
97,33288475,cd,1,64,2.7508879722730324,0,0,4,1,4,192,3.0
98,33288464,cd,1,70,4.646276072846352,0,0,6,1,6,192,3.0
99,33288453,cd,1,69,4.746011335121455,0,0,6,1,6,192,3.0
100,33288442,cd,1,68,4.646276072846352,0,0,6,1,6,192,3.0
101,33288431,cd,1,67,4.646276072846352,0,0,6,1,6,192,3.0
102,33288422,cd,1,93,4.378651202229975,0,0,4,2,4,192,3.0
103,33288413,cd,1,92,3.6628526315700607,0,0,4,2,4,192,3.0
104,33288404,cd,1,91,3.6628526315700607,0,0,4,2,4,192,3.0
105,33288396,cd,1,86,3.389639553083841,0,0,3,2,3,192,3.0
106,33288389,cd,1,75,1.0362812478999168,0,0,2,2,2,192,3.0
107,33288381,cd,1,85,3.501776288511418,0,0,3,2,3,192,3.0
108,33288373,cd,1,84,3.3133958614611005,0,0,3,2,3,192,3.0
109,33288366,cd,1,95,1.3416477228435078,0,0,2,3,2,192,3.0
110,33288359,cd,1,36,2.228571941351877,0,0,2,1,2,192,3.0
111,33289136,cd,2,35,9.623819698694911,0,0,2,1,2,192,3.0
112,33289143,cd,2,34,16.80574600676036,0,0,2,1,2,192,3.0
113,33289129,cd,2,33,15.395204680969798,0,0,2,1,2,192,3.0
114,33289122,cd,2,32,10.31409299782942,0,0,2,1,2,192,3.0
115,33289115,cd,2,31,6.2891960238756175,0,0,2,1,2,192,3.0
116,33289108,cd,2,102,11.084459256987616,0,0,2,6,2,192,3.0
117,33289101,cd,2,30,6.1758356078587955,0,0,2,1,2,192,3.0
118,33289094,cd,2,29,5.317552079209673,0,0,2,1,2,192,3.0
119,33289080,cd,2,28,5.277738851950376,0,0,2,1,2,192,3.0
120,33289087,cd,2,27,4.361164567108265,0,0,2,1,2,192,3.0
121,33289073,cd,2,26,20.37157626662525,0,0,2,1,2,192,3.0
122,33289065,cd,2,83,10.892269693903074,0,0,3,2,3,192,3.0
123,33289058,cd,2,94,8.59496354511208,0,0,2,3,2,192,3.0
124,33289049,cd,2,63,11.043557332996707,0,0,4,1,4,192,3.0
125,33289042,cd,2,25,5.621572182018744,0,0,2,1,2,192,3.0
126,33289035,cd,2,24,6.014996725698824,0,0,2,1,2,192,3.0
127,33289026,cd,2,62,11.43698187667679,0,0,4,1,4,192,3.0
128,33289018,cd,2,53,17.230141812698825,0,0,3,1,3,192,3.0
129,33289009,cd,2,61,20.010395054144922,0,0,4,1,4,192,3.0
130,33289002,cd,2,23,13.711482097967128,0,0,2,1,2,192,3.0
131,33288995,cd,2,22,13.3234831650006,0,0,2,1,2,192,3.0
132,33288987,cd,2,52,16.35050955473399,0,0,3,1,3,192,3.0
133,33288980,cd,2,21,42.652779771264825,0,0,2,1,2,192,3.0
134,33288973,cd,2,20,46.10386488143973,0,0,2,1,2,192,3.0
135,33288965,cd,2,51,71.89262897671229,0,0,3,1,3,192,3.0
136,33288957,cd,2,82,54.309984695017626,0,0,3,2,3,192,3.0
137,33288948,cd,2,60,87.57395648667972,0,0,4,1,4,192,3.0
138,33288941,cd,2,104,47.8900381501288,0,0,2,15,2,192,3.0
139,33288933,cd,2,81,61.12261028462012,0,0,3,2,3,192,3.0
140,33288925,cd,2,80,61.91574897000082,0,0,3,2,3,192,3.0
141,33288916,cd,2,59,78.0201042900815,0,0,4,1,4,192,3.0
142,33288909,cd,2,19,39.407814737129506,0,0,2,1,2,192,3.0
143,33288902,cd,2,18,36.87581784289981,0,0,2,1,2,192,3.0
144,33288894,cd,2,50,44.0794973107495,0,0,3,1,3,192,3.0
145,33288880,cd,2,74,9.34040223502992,0,0,2,2,2,192,3.0
146,33288887,cd,2,73,33.826797357997364,0,0,2,2,2,192,3.0
147,33288864,cd,2,17,8.813770698541447,0,0,2,1,2,192,3.0
148,33288871,cd,2,58,12.411096422685851,0,0,4,1,4,192,3.0
149,33288857,cd,2,16,16.268480371215734,0,0,2,1,2,192,3.0
150,33288850,cd,2,72,10.927250433790077,0,0,2,2,2,192,3.0
151,33288843,cd,2,71,45.86232529589742,0,0,2,2,2,192,3.0
152,33288836,cd,2,101,12.24691356338699,0,0,2,6,2,192,3.0
153,33288828,cd,2,79,20.47154472214521,0,0,3,2,3,192,3.0
154,33288821,cd,2,15,46.06846301307012,0,0,2,1,2,192,3.0
155,33288814,cd,2,14,13.537850942458716,0,0,2,1,2,192,3.0
156,33288800,cd,2,13,8.230686632422607,0,0,2,1,2,192,3.0
157,33288807,cd,2,12,10.977217819274792,0,0,2,1,2,192,3.0
158,33288792,cd,2,49,8.040419901477582,0,0,3,1,3,192,3.0
159,33288785,cd,2,11,5.553701702254873,0,0,2,1,2,192,3.0
160,33288778,cd,2,97,367.67474989878195,0,0,2,4,2,192,3.0
161,33288771,cd,1,10,0.9434659219393065,0,0,2,1,2,192,3.0
162,33288764,cd,1,9,0.976964018675651,0,0,2,1,2,192,3.0
163,33288757,cd,1,8,1.0289066319308913,0,0,2,1,2,192,3.0
164,33288750,cd,1,7,0.99962094355203,0,0,2,1,2,192,3.0
165,33288736,cd,1,6,0.9772294012305583,0,0,2,1,2,192,3.0
166,33288743,cd,1,5,1.0554663088970133,0,0,2,1,2,192,3.0
167,33288729,cd,1,4,1.0316579776532786,0,0,2,1,2,192,3.0
168,33288722,cd,1,3,0.9911498523934539,0,0,2,1,2,192,3.0
169,33288715,cd,1,2,1.0436901921539523,0,0,2,1,2,192,3.0
170,33288708,cd,1,1,0.8969774885306333,0,0,2,1,2,192,3.0
