counter,AS,Type,GranularityValue,SeverityScore,PageRank,NumBadDep,TotalDep,NumberOfVerteces,NumOfCycle,NumSetOfElement,TotNumOfSetOfElement,ADI
1,769307,ud,2,1,17.33823968300665,1,0,0,0,2,94,23.0
2,769316,ud,2,7,53.09693556968203,6,0,0,0,7,94,23.0
3,769337,ud,2,6,57.99225606711795,4,0,0,0,5,94,23.0
4,769358,ud,2,3,7.2469611064831145,1,0,0,0,2,94,23.0
5,769349,ud,2,4,11.902906951925306,1,0,0,0,2,94,23.0
6,769367,ud,2,8,19.367869133844643,2,0,0,0,3,94,23.0
7,769388,ud,2,5,27.403300101114255,1,0,0,0,2,94,23.0
8,769379,ud,2,2,22.06585123529147,2,0,0,0,3,94,23.0
9,769174,hl,1,3,27.421729281522335,0,62,0,0,61,94,23.0
10,769245,hl,2,2,176.89677095890116,0,26,0,0,21,94,23.0
11,769279,hl,2,1,101.66001983466583,0,20,0,0,19,94,23.0
12,768493,cd,1,15,1.28384090691161,0,0,2,1,2,94,23.0
13,768509,cd,1,33,4.28155191195637,0,0,4,1,4,94,23.0
14,768500,cd,1,32,2.7770226238307747,0,0,4,1,4,94,23.0
15,768526,cd,1,14,2.7883701950372055,0,0,2,1,2,94,23.0
16,768518,cd,1,25,3.3123539719701,0,0,3,1,3,94,23.0
17,768533,cd,1,44,5.12466160263975,0,0,6,1,6,94,23.0
18,768554,cd,1,47,2.674136913224514,0,0,3,2,3,94,23.0
19,768544,cd,1,41,4.5671422218615145,0,0,5,1,5,94,23.0
20,768572,cd,1,43,4.77433262196141,0,0,6,1,6,94,23.0
21,768562,cd,1,40,3.940178120139117,0,0,5,1,5,94,23.0
22,768583,cd,1,31,4.752762432495539,0,0,4,1,4,94,23.0
23,768606,cd,1,45,2.707181611323932,0,0,2,2,2,94,23.0
24,768592,cd,1,13,1.4404264865614949,0,0,2,1,2,94,23.0
25,768599,cd,1,12,1.4120741449027876,0,0,2,1,2,94,23.0
26,768623,cd,1,30,3.0703960931261336,0,0,4,1,4,94,23.0
27,768613,cd,1,39,3.9045505949484265,0,0,5,1,5,94,23.0
28,768632,cd,1,11,1.8747624044578226,0,0,2,1,2,94,23.0
29,768639,cd,1,29,3.5792898360309353,0,0,4,1,4,94,23.0
30,768648,cd,1,24,2.7451353342086424,0,0,3,1,3,94,23.0
31,768656,cd,1,10,1.9385124044578228,0,0,2,1,2,94,23.0
32,768663,cd,1,38,4.569670133188314,0,0,5,1,5,94,23.0
33,768682,cd,1,48,3.4574351668136782,0,0,2,4,2,94,23.0
34,768673,cd,1,28,3.709180461030935,0,0,4,1,4,94,23.0
35,768697,cd,1,23,1.4450060851128335,0,0,3,1,3,94,23.0
36,768689,cd,1,46,4.291589668635971,0,0,3,2,3,94,23.0
37,768712,cd,1,9,1.015879029159123,0,0,2,1,2,94,23.0
38,768719,cd,2,49,55.37971158351705,0,0,2,10,2,94,23.0
39,768705,cd,1,8,1.031166886488104,0,0,2,1,2,94,23.0
40,768733,cd,2,37,74.77083112175076,0,0,5,1,5,94,23.0
41,768726,cd,2,7,34.82736982684152,0,0,2,1,2,94,23.0
42,768750,cd,2,42,65.29867109832624,0,0,6,1,6,94,23.0
43,768743,cd,2,6,30.48630072734946,0,0,2,1,2,94,23.0
44,768761,cd,2,22,45.90755156009254,0,0,3,1,3,94,23.0
45,768776,cd,2,21,55.413452588194474,0,0,3,1,3,94,23.0
46,768769,cd,2,5,39.99220175545139,0,0,2,1,2,94,23.0
47,768799,cd,2,27,50.23362120371988,0,0,4,1,4,94,23.0
48,768784,cd,2,4,20.397019701850855,0,0,2,1,2,94,23.0
49,768791,cd,2,20,42.901867210745436,0,0,3,1,3,94,23.0
50,768808,cd,2,3,26.380096681597326,0,0,2,1,2,94,23.0
51,768815,cd,2,26,38.439462226856584,0,0,4,1,4,94,23.0
52,768824,cd,2,36,45.77121621983103,0,0,5,1,5,94,23.0
53,768844,cd,2,19,24.69351628095641,0,0,3,1,3,94,23.0
54,768834,cd,2,35,37.44960115211423,0,0,5,1,5,94,23.0
55,768862,cd,2,18,15.330268517871879,0,0,3,1,3,94,23.0
56,768852,cd,2,34,36.75288182621567,0,0,5,1,5,94,23.0
57,768877,cd,2,17,24.333882564522902,0,0,3,1,3,94,23.0
58,768870,cd,2,2,17.00212857154846,0,0,2,1,2,94,23.0
59,768893,cd,2,1,9.551159186677028,0,0,2,1,2,94,23.0
60,768885,cd,2,16,16.667761705647088,0,0,3,1,3,94,23.0
