counter,AS,Type,GranularityValue,SeverityScore,PageRank,NumBadDep,TotalDep,NumberOfVerteces,NumOfCycle,NumSetOfElement,TotNumOfSetOfElement,ADI
1,64350160,ud,2,58,16.41761269827419,3,0,0,0,4,289,5.0
2,64350169,ud,2,21,10.777633307153618,3,0,0,0,4,289,5.0
3,64350196,ud,2,52,14.433772404628863,2,0,0,0,3,289,5.0
4,64350178,ud,2,51,8.801867049526194,1,0,0,0,2,289,5.0
5,64350187,ud,2,57,196.65706300006462,2,0,0,0,3,289,5.0
6,64351171,ud,2,40,2.186454487098853,1,0,0,0,2,289,5.0
7,64351132,ud,2,92,2.0379584016485346,1,0,0,0,2,289,5.0
8,64351105,ud,2,94,14.710615200198756,1,0,0,0,2,289,5.0
9,64351114,ud,2,72,18.705994457345408,4,0,0,0,5,289,5.0
10,64351153,ud,2,56,85.37733798692437,1,0,0,0,2,289,5.0
11,64351162,ud,2,69,13.64965703476629,1,0,0,0,2,289,5.0
12,64351141,ud,2,50,6.982234184063795,2,0,0,0,3,289,5.0
13,64351063,ud,2,20,7.075004081464218,1,0,0,0,2,289,5.0
14,64351045,ud,2,49,3.110878807050534,1,0,0,0,2,289,5.0
15,64351054,ud,2,19,10.42857651740471,1,0,0,0,2,289,5.0
16,64351096,ud,2,39,6.461883468932784,1,0,0,0,2,289,5.0
17,64351072,ud,2,38,19.82887946517573,3,0,0,0,4,289,5.0
18,64351084,ud,2,18,16.932083398806334,1,0,0,0,2,289,5.0
19,64351000,ud,2,17,22.073697598767133,1,0,0,0,2,289,5.0
20,64350979,ud,2,68,37.45068402095444,2,0,0,0,3,289,5.0
21,64350991,ud,2,16,6.29794511018388,1,0,0,0,2,289,5.0
22,64351030,ud,2,15,6.197815779119432,1,0,0,0,2,289,5.0
23,64351012,ud,2,14,5.172182133796051,1,0,0,0,2,289,5.0
24,64351021,ud,2,78,5.190789692181843,1,0,0,0,2,289,5.0
25,64350934,ud,2,95,12.512142022061097,3,0,0,0,4,289,5.0
26,64350913,ud,2,48,6.8809256266283825,1,0,0,0,2,289,5.0
27,64350922,ud,2,55,5.0410249927321225,2,0,0,0,3,289,5.0
28,64350961,ud,2,47,5.414257025399881,1,0,0,0,2,289,5.0
29,64350970,ud,2,13,20.768222148205965,1,0,0,0,2,289,5.0
30,64350952,ud,2,80,145.20289419356226,1,0,0,0,2,289,5.0
31,64350868,ud,2,64,12.89164848098774,2,0,0,0,3,289,5.0
32,64350877,ud,2,12,9.736308412424437,1,0,0,0,2,289,5.0
33,64350859,ud,2,11,3.365378382755486,1,0,0,0,2,289,5.0
34,64350904,ud,2,63,6.901787920025533,1,0,0,0,2,289,5.0
35,64350889,ud,2,37,7.870397803237193,1,0,0,0,2,289,5.0
36,64350805,ud,2,36,7.208363289762069,1,0,0,0,2,289,5.0
37,64350793,ud,2,90,7.331653042964355,1,0,0,0,2,289,5.0
38,64350838,ud,2,10,6.25285209124371,1,0,0,0,2,289,5.0
39,64350847,ud,2,74,19.99558404670131,1,0,0,0,2,289,5.0
40,64350820,ud,2,35,2.8861803661669536,1,0,0,0,2,289,5.0
41,64350829,ud,2,54,9.218842847745607,1,0,0,0,2,289,5.0
42,64350739,ud,2,88,7.320556616706203,1,0,0,0,2,289,5.0
43,64350748,ud,2,46,2.0420485125539627,1,0,0,0,2,289,5.0
44,64350721,ud,2,87,7.387327395962107,1,0,0,0,2,289,5.0
45,64350730,ud,2,86,7.388605055581873,1,0,0,0,2,289,5.0
46,64350778,ud,2,34,4.365838811353584,1,0,0,0,2,289,5.0
47,64350766,ud,2,33,9.4899985972338,1,0,0,0,2,289,5.0
48,64350673,ud,2,9,74.08606788566448,3,0,0,0,4,289,5.0
49,64350682,ud,2,85,7.5188027190209965,1,0,0,0,2,289,5.0
50,64350664,ud,2,91,9.283604273359295,2,0,0,0,3,289,5.0
51,64350712,ud,2,84,7.777731844840028,1,0,0,0,2,289,5.0
52,64350691,ud,2,32,67.16710450463242,4,0,0,0,5,289,5.0
53,64350700,ud,2,83,7.325146249938968,1,0,0,0,2,289,5.0
54,64350616,ud,2,62,12.72915569908982,1,0,0,0,2,289,5.0
55,64350595,ud,2,45,22.862005071805385,5,0,0,0,6,289,5.0
56,64350646,ud,2,8,93.73089637596642,2,0,0,0,3,289,5.0
57,64350655,ud,2,82,7.436774487229416,1,0,0,0,2,289,5.0
58,64350625,ud,2,77,4.087580638972701,2,0,0,0,3,289,5.0
59,64350637,ud,2,44,4.065626831911868,1,0,0,0,2,289,5.0
60,64350544,ud,2,67,359.8458772340296,2,0,0,0,3,289,5.0
61,64350553,ud,2,66,15.178788812770883,3,0,0,0,4,289,5.0
62,64350532,ud,2,60,15.759817105375294,2,0,0,0,3,289,5.0
63,64350586,ud,2,79,12.086837699424404,1,0,0,0,2,289,5.0
64,64350568,ud,2,59,12.5978482011359,4,0,0,0,5,289,5.0
65,64350466,ud,2,43,18.059556668468993,2,0,0,0,3,289,5.0
66,64350478,ud,2,81,6.264225140073441,1,0,0,0,2,289,5.0
67,64350514,ud,2,89,3.613920399265588,1,0,0,0,2,289,5.0
68,64350523,ud,2,65,9.339022365140503,1,0,0,0,2,289,5.0
69,64350496,ud,2,53,7.565719874153126,1,0,0,0,2,289,5.0
70,64350505,ud,2,7,6.205302196358598,1,0,0,0,2,289,5.0
71,64350421,ud,2,42,40.69450161032344,5,0,0,0,6,289,5.0
72,64350403,ud,2,76,74.31946592071704,1,0,0,0,2,289,5.0
73,64350412,ud,2,6,8.465497924718782,1,0,0,0,2,289,5.0
74,64350457,ud,2,31,3.9851827055465585,1,0,0,0,2,289,5.0
75,64350433,ud,2,30,6.004677966071754,1,0,0,0,2,289,5.0
76,64350445,ud,2,93,29.048777105800312,2,0,0,0,3,289,5.0
77,64350352,ud,2,29,9.928778488048117,2,0,0,0,3,289,5.0
78,64350367,ud,2,28,5.3024028401279635,1,0,0,0,2,289,5.0
79,64350343,ud,2,61,2.459500913402216,1,0,0,0,2,289,5.0
80,64350385,ud,2,27,5.899665429454895,1,0,0,0,2,289,5.0
81,64350394,ud,2,26,3.920785430624021,1,0,0,0,2,289,5.0
82,64350376,ud,2,75,5.178763812656491,1,0,0,0,2,289,5.0
83,64350292,ud,2,5,4.282033794701708,1,0,0,0,2,289,5.0
84,64350301,ud,2,25,6.878379131123783,1,0,0,0,2,289,5.0
85,64350274,ud,2,4,37.046771132366324,2,0,0,0,3,289,5.0
86,64350283,ud,2,71,17.442006573603773,3,0,0,0,4,289,5.0
87,64350334,ud,2,3,49.20980627483216,3,0,0,0,4,289,5.0
88,64350310,ud,2,24,9.533686751625266,2,0,0,0,3,289,5.0
89,64350319,ud,2,41,29.522883800030016,3,0,0,0,4,289,5.0
90,64350235,ud,2,70,3.201339470106465,1,0,0,0,2,289,5.0
91,64350208,ud,2,2,12.075912794889287,1,0,0,0,2,289,5.0
92,64350223,ud,2,1,5.796353667719671,2,0,0,0,3,289,5.0
93,64350256,ud,2,23,27.674234725325622,1,0,0,0,2,289,5.0
94,64350265,ud,2,22,305.49729873933154,4,0,0,0,5,289,5.0
95,64350247,ud,2,73,9.460115452157012,1,0,0,0,2,289,5.0
96,64348117,cd,1,150,1.4223362656059053,0,0,2,5,2,289,5.0
97,64348124,cd,1,147,1.871377002999733,0,0,3,4,3,289,5.0
98,64348103,cd,1,69,1.0625153553485935,0,0,2,1,2,289,5.0
99,64348110,cd,1,135,0.8938531912850416,0,0,2,2,2,289,5.0
100,64348149,cd,1,149,1.564250481329101,0,0,2,5,2,289,5.0
101,64348156,cd,1,68,1.0462011977184604,0,0,2,1,2,289,5.0
102,64348132,cd,1,101,1.525398163017356,0,0,3,1,3,289,5.0
103,64348140,cd,1,113,1.9744389004111838,0,0,4,1,4,289,5.0
104,64348053,cd,1,115,5.140623896127843,0,0,5,1,5,289,5.0
105,64348063,cd,1,112,4.804987893616798,0,0,4,1,4,289,5.0
106,64348032,cd,1,111,2.444514497188643,0,0,4,1,4,289,5.0
107,64348041,cd,1,123,5.808420497610086,0,0,7,1,7,289,5.0
108,64348086,cd,1,100,1.2358309497919633,0,0,3,1,3,289,5.0
109,64348094,cd,1,110,1.4335787942266103,0,0,4,1,4,289,5.0
110,64348079,cd,1,67,1.1486881969282559,0,0,2,1,2,289,5.0
111,64348072,cd,1,134,0.9235657562828938,0,0,2,2,2,289,5.0
112,64347989,cd,1,99,2.370100083894148,0,0,3,1,3,289,5.0
113,64347997,cd,1,122,5.690829041185516,0,0,7,1,7,289,5.0
114,64347970,cd,1,121,5.889316381498077,0,0,7,1,7,289,5.0
115,64347982,cd,1,133,1.0208751102793718,0,0,2,2,2,289,5.0
116,64348020,cd,1,120,5.626237250653205,0,0,7,1,7,289,5.0
117,64348009,cd,1,119,5.73400608431559,0,0,6,1,6,289,5.0
118,64347920,cd,1,98,3.8671653965637414,0,0,3,1,3,289,5.0
119,64347928,cd,1,118,5.029100078957139,0,0,6,1,6,289,5.0
120,64347911,cd,1,109,3.6774653587551924,0,0,4,1,4,289,5.0
121,64347961,cd,1,108,2.873359480036447,0,0,4,1,4,289,5.0
122,64347939,cd,1,117,5.029100078957139,0,0,6,1,6,289,5.0
123,64347950,cd,1,116,5.029100078957139,0,0,6,1,6,289,5.0
124,64347861,cd,1,97,3.4498570353381783,0,0,3,1,3,289,5.0
125,64347869,cd,1,96,3.5217799710311177,0,0,3,1,3,289,5.0
126,64347847,cd,1,142,1.3641182476900302,0,0,2,3,2,289,5.0
127,64347840,cd,1,66,2.2602670753818805,0,0,2,1,2,289,5.0
128,64347854,cd,1,65,3.8533455603880524,0,0,2,1,2,289,5.0
129,64347895,cd,1,95,3.3963175929796323,0,0,3,1,3,289,5.0
130,64347903,cd,1,94,3.557463807853802,0,0,3,1,3,289,5.0
131,64347877,cd,1,107,3.8044206553330118,0,0,4,1,4,289,5.0
132,64347886,cd,1,106,3.8044206553330118,0,0,4,1,4,289,5.0
133,64349014,cd,2,64,5.052517501024216,0,0,2,1,2,289,5.0
134,64349021,cd,2,63,20.742362412243505,0,0,2,1,2,289,5.0
135,64348993,cd,2,62,5.215752262975288,0,0,2,1,2,289,5.0
136,64349007,cd,2,61,7.593893668030221,0,0,2,1,2,289,5.0
137,64349000,cd,2,146,14.398618079866495,0,0,2,4,2,289,5.0
138,64348950,cd,2,60,8.262478976141914,0,0,2,1,2,289,5.0
139,64348957,cd,2,59,6.373251965485884,0,0,2,1,2,289,5.0
140,64348934,cd,2,93,18.09498354739735,0,0,3,1,3,289,5.0
141,64348942,cd,2,92,13.194181091628323,0,0,3,1,3,289,5.0
142,64348979,cd,2,58,52.63384960547691,0,0,2,1,2,289,5.0
143,64348986,cd,2,57,10.005750864716653,0,0,2,1,2,289,5.0
144,64348964,cd,2,91,43.52172366850638,0,0,3,1,3,289,5.0
145,64348972,cd,2,145,33.396284527178295,0,0,2,4,2,289,5.0
146,64348887,cd,2,148,12.317530291565646,0,0,2,5,2,289,5.0
147,64348894,cd,2,56,5.053118832261035,0,0,2,1,2,289,5.0
148,64348865,cd,2,55,12.993719646247396,0,0,2,1,2,289,5.0
149,64348879,cd,2,90,10.017719882748034,0,0,3,1,3,289,5.0
150,64348872,cd,2,54,15.52230543262064,0,0,2,1,2,289,5.0
151,64348917,cd,2,53,14.933308726051443,0,0,2,1,2,289,5.0
152,64348924,cd,2,114,22.448715496376966,0,0,5,1,5,289,5.0
153,64348901,cd,2,52,3.2140991408645996,0,0,2,1,2,289,5.0
154,64348908,cd,2,105,20.034112880847445,0,0,4,1,4,289,5.0
155,64348822,cd,2,51,5.48184380272312,0,0,2,1,2,289,5.0
156,64348829,cd,2,141,8.115537836555145,0,0,2,3,2,289,5.0
157,64348801,cd,2,50,42.55472722811327,0,0,2,1,2,289,5.0
158,64348815,cd,2,49,15.267704209624618,0,0,2,1,2,289,5.0
159,64348808,cd,2,48,11.796145341584783,0,0,2,1,2,289,5.0
160,64348851,cd,2,47,15.841408734996687,0,0,2,1,2,289,5.0
161,64348858,cd,2,46,9.73342215696717,0,0,2,1,2,289,5.0
162,64348836,cd,2,139,10.44224402515281,0,0,3,2,3,289,5.0
163,64348844,cd,2,45,3.5788064216265263,0,0,2,1,2,289,5.0
164,64348756,cd,2,44,7.260406576415448,0,0,2,1,2,289,5.0
165,64348763,cd,2,89,11.532709243100774,0,0,3,1,3,289,5.0
166,64348741,cd,2,43,6.799762274248781,0,0,2,1,2,289,5.0
167,64348748,cd,2,88,11.072064940934107,0,0,3,1,3,289,5.0
168,64348786,cd,2,87,20.340304186977352,0,0,3,1,3,289,5.0
169,64348794,cd,2,42,20.93591205512767,0,0,2,1,2,289,5.0
170,64348771,cd,2,41,7.257209953282948,0,0,2,1,2,289,5.0
171,64348778,cd,2,86,11.529512619968274,0,0,3,1,3,289,5.0
172,64348695,cd,2,132,29.20840074338843,0,0,2,2,2,289,5.0
173,64348702,cd,2,104,80.5791460455871,0,0,4,1,4,289,5.0
174,64348679,cd,2,85,83.815234149285,0,0,3,1,3,289,5.0
175,64348672,cd,2,155,48.49996729956899,0,0,2,15,2,289,5.0
176,64348687,cd,2,138,45.263879195871084,0,0,3,2,3,289,5.0
177,64348725,cd,2,40,17.049445629784415,0,0,2,1,2,289,5.0
178,64348732,cd,2,103,25.696773885099404,0,0,4,1,4,289,5.0
179,64348711,cd,2,131,67.42622375468132,0,0,2,2,2,289,5.0
180,64348718,cd,2,39,18.417969591215737,0,0,2,1,2,289,5.0
181,64348627,cd,2,84,32.378937503314944,0,0,3,1,3,289,5.0
182,64348635,cd,2,38,27.52485411108561,0,0,2,1,2,289,5.0
183,64348610,cd,2,102,12.258404861428758,0,0,4,1,4,289,5.0
184,64348619,cd,2,83,29.786720515367488,0,0,3,1,3,289,5.0
185,64348656,cd,2,82,62.869206750326825,0,0,3,1,3,289,5.0
186,64348664,cd,2,137,60.94061997382687,0,0,3,2,3,289,5.0
187,64348642,cd,2,37,28.007896370993606,0,0,2,1,2,289,5.0
188,64348649,cd,2,130,46.81372829784417,0,0,2,2,2,289,5.0
189,64348567,cd,2,36,5.311318121875379,0,0,2,1,2,289,5.0
190,64348574,cd,2,81,8.803682840966207,0,0,3,1,3,289,5.0
191,64348544,cd,2,136,22.408125241020823,0,0,3,2,3,289,5.0
192,64348559,cd,2,80,14.015198866892742,0,0,3,1,3,289,5.0
193,64348552,cd,2,35,12.566057205400007,0,0,2,1,2,289,5.0
194,64348596,cd,2,129,10.76277800233572,0,0,2,2,2,289,5.0
195,64348603,cd,2,34,8.707857637367363,0,0,2,1,2,289,5.0
196,64348582,cd,2,128,44.928911663355734,0,0,2,2,2,289,5.0
197,64348589,cd,2,33,15.698861884266854,0,0,2,1,2,289,5.0
198,64348501,cd,2,79,173.70242970861622,0,0,3,1,3,289,5.0
199,64348509,cd,2,32,81.01651866406962,0,0,2,1,2,289,5.0
200,64348486,cd,2,31,298.08578774260496,0,0,2,1,2,289,5.0
201,64348493,cd,2,78,170.61210046276813,0,0,3,1,3,289,5.0
202,64348530,cd,2,30,15.700274244259276,0,0,2,1,2,289,5.0
203,64348537,cd,2,127,28.44713539222061,0,0,2,2,2,289,5.0
204,64348516,cd,2,29,112.15593387835096,0,0,2,1,2,289,5.0
205,64348523,cd,2,152,12.62635739591434,0,0,2,6,2,289,5.0
206,64348437,cd,1,28,0.9726507333081327,0,0,2,1,2,289,5.0
207,64348444,cd,1,27,1.026929882813199,0,0,2,1,2,289,5.0
208,64348422,cd,1,26,0.9299244593682441,0,0,2,1,2,289,5.0
209,64348429,cd,1,77,1.1935425777139437,0,0,3,1,3,289,5.0
210,64348465,cd,1,25,0.9434871730436679,0,0,2,1,2,289,5.0
211,64348479,cd,2,144,421.6059667254543,0,0,2,4,2,289,5.0
212,64348472,cd,1,24,0.9716135751860664,0,0,2,1,2,289,5.0
213,64348451,cd,1,23,1.0072948866581197,0,0,2,1,2,289,5.0
214,64348458,cd,1,22,1.0651195051010667,0,0,2,1,2,289,5.0
215,64348372,cd,1,76,1.937335641632579,0,0,3,1,3,289,5.0
216,64348380,cd,1,21,1.0436873018843515,0,0,2,1,2,289,5.0
217,64348357,cd,1,20,1.6236388471764016,0,0,2,1,2,289,5.0
218,64348364,cd,1,75,2.3030784768755095,0,0,3,1,3,289,5.0
219,64348401,cd,1,19,1.0364958341003125,0,0,2,1,2,289,5.0
220,64348415,cd,1,140,1.023107897808326,0,0,2,3,2,289,5.0
221,64348408,cd,1,18,1.0364958341003125,0,0,2,1,2,289,5.0
222,64348387,cd,1,17,0.978911438262943,0,0,2,1,2,289,5.0
223,64348394,cd,1,16,1.0364958341003125,0,0,2,1,2,289,5.0
224,64348311,cd,1,15,0.934450558564734,0,0,2,1,2,289,5.0
225,64348304,cd,1,126,1.2060313879255227,0,0,2,2,2,289,5.0
226,64348318,cd,1,14,0.934450558564734,0,0,2,1,2,289,5.0
227,64348290,cd,1,13,1.2569706300337016,0,0,2,1,2,289,5.0
228,64348297,cd,1,143,1.2060313879255227,0,0,2,4,2,289,5.0
229,64348341,cd,1,74,1.9092276870871245,0,0,3,1,3,289,5.0
230,64348349,cd,1,73,1.9092276870871245,0,0,3,1,3,289,5.0
231,64348325,cd,1,72,1.9092276870871245,0,0,3,1,3,289,5.0
232,64348333,cd,1,71,1.9092276870871245,0,0,3,1,3,289,5.0
233,64348241,cd,1,12,0.9371189750416224,0,0,2,1,2,289,5.0
234,64348255,cd,1,11,0.9371189750416224,0,0,2,1,2,289,5.0
235,64348248,cd,1,10,0.9371189750416224,0,0,2,1,2,289,5.0
236,64348227,cd,1,9,0.9434659219393065,0,0,2,1,2,289,5.0
237,64348234,cd,1,8,0.912624487545252,0,0,2,1,2,289,5.0
238,64348276,cd,1,7,1.0093121726219123,0,0,2,1,2,289,5.0
239,64348283,cd,1,125,0.9286318931350004,0,0,2,2,2,289,5.0
240,64348262,cd,1,6,3.89008365243341,0,0,2,1,2,289,5.0
241,64348269,cd,1,5,1.3034499270223199,0,0,2,1,2,289,5.0
242,64348178,cd,1,124,0.9473341094295695,0,0,2,2,2,289,5.0
243,64348185,cd,1,4,1.275042963863376,0,0,2,1,2,289,5.0
244,64348163,cd,1,3,2.391270737626374,0,0,2,1,2,289,5.0
245,64348170,cd,1,70,1.9064054594968773,0,0,3,1,3,289,5.0
246,64348213,cd,1,153,0.8898738726596667,0,0,2,7,2,289,5.0
247,64348220,cd,1,2,0.938197085429751,0,0,2,1,2,289,5.0
248,64348199,cd,1,151,0.9210415555005761,0,0,2,6,2,289,5.0
249,64348192,cd,1,154,0.9728966888114993,0,0,2,8,2,289,5.0
250,64348206,cd,1,1,1.2260459198654514,0,0,2,1,2,289,5.0
