counter,AS,Type,GranularityValue,SeverityScore,PageRank,NumBadDep,TotalDep,NumberOfVerteces,NumOfCycle,NumSetOfElement,TotNumOfSetOfElement,ADI
1,209453176,ud,2,33,8.896538031429568,1,0,0,0,2,253,4.0
2,209453164,ud,2,43,5.6198195553102455,2,0,0,0,3,253,4.0
3,209453155,ud,2,58,7.7559163798568385,1,0,0,0,2,253,4.0
4,209453146,ud,2,71,7.723125076935666,1,0,0,0,2,253,4.0
5,209453134,ud,2,18,9.591976204987763,1,0,0,0,2,253,4.0
6,209453125,ud,2,17,21.44443599816035,2,0,0,0,3,253,4.0
7,209453116,ud,2,42,16.305651236908172,1,0,0,0,2,253,4.0
8,209453107,ud,2,79,2.38451968253418,1,0,0,0,2,253,4.0
9,209453098,ud,2,70,93.3645922629014,1,0,0,0,2,253,4.0
10,209453083,ud,2,16,2.1466688848322852,1,0,0,0,2,253,4.0
11,209453071,ud,2,50,10.520415414832026,2,0,0,0,3,253,4.0
12,209453056,ud,2,32,3.0562763045514485,1,0,0,0,2,253,4.0
13,209453203,ud,2,15,14.50506635414435,2,0,0,0,3,253,4.0
14,209453194,ud,2,31,4.159070969180041,1,0,0,0,2,253,4.0
15,209453185,ud,2,49,5.345550016487001,1,0,0,0,2,253,4.0
16,209452414,ud,2,30,40.17177870730491,1,0,0,0,2,253,4.0
17,209452405,ud,2,69,434.9447151447514,2,0,0,0,3,253,4.0
18,209452396,ud,2,14,10.078946554818927,1,0,0,0,2,253,4.0
19,209452384,ud,2,57,94.55248982570016,2,0,0,0,3,253,4.0
20,209452372,ud,2,29,17.931800249821865,3,0,0,0,4,253,4.0
21,209452363,ud,2,56,3.255251961045107,1,0,0,0,2,253,4.0
22,209452354,ud,2,13,14.404725928421984,1,0,0,0,2,253,4.0
23,209452345,ud,2,12,9.471038650314107,1,0,0,0,2,253,4.0
24,209452336,ud,2,28,28.07451764507729,2,0,0,0,3,253,4.0
25,209452543,ud,2,72,505.08447728636594,7,0,0,0,8,253,4.0
26,209452534,ud,2,78,5.205377069604095,1,0,0,0,2,253,4.0
27,209452525,ud,2,41,3.9546648925556585,1,0,0,0,2,253,4.0
28,209452516,ud,2,27,5.930800784882858,1,0,0,0,2,253,4.0
29,209452507,ud,2,26,4.165885185434618,1,0,0,0,2,253,4.0
30,209452498,ud,2,4,7.127818836298859,1,0,0,0,2,253,4.0
31,209452486,ud,2,55,9.602259293322472,1,0,0,0,2,253,4.0
32,209452477,ud,2,48,7.166828995194461,1,0,0,0,2,253,4.0
33,209452468,ud,2,25,6.139634482844166,1,0,0,0,2,253,4.0
34,209452456,ud,2,40,7.632904725438154,1,0,0,0,2,253,4.0
35,209452447,ud,2,54,68.23050446866112,1,0,0,0,2,253,4.0
36,209452432,ud,2,77,3.724075780111849,1,0,0,0,2,253,4.0
37,209452423,ud,2,74,290.4244108361818,3,0,0,0,4,253,4.0
38,209452669,ud,2,24,170.0116648125136,1,0,0,0,2,253,4.0
39,209452660,ud,2,11,18.102293660514853,1,0,0,0,2,253,4.0
40,209452648,ud,2,23,19.03237228471346,2,0,0,0,3,253,4.0
41,209452633,ud,2,73,9.682165069880012,2,0,0,0,3,253,4.0
42,209452624,ud,2,10,28.31692916579835,1,0,0,0,2,253,4.0
43,209452609,ud,2,62,55.79925618700197,3,0,0,0,4,253,4.0
44,209452588,ud,2,61,289.0320716424833,4,0,0,0,5,253,4.0
45,209452579,ud,2,68,183.47797550633453,1,0,0,0,2,253,4.0
46,209452561,ud,2,22,17.210979934207874,4,0,0,0,5,253,4.0
47,209452795,ud,2,9,7.7605645638469944,2,0,0,0,3,253,4.0
48,209452786,ud,2,39,4.978646807036309,1,0,0,0,2,253,4.0
49,209452777,ud,2,21,5.0571284145025786,1,0,0,0,2,253,4.0
50,209452768,ud,2,8,7.0272162720335505,1,0,0,0,2,253,4.0
51,209452759,ud,2,3,22.48422748573856,1,0,0,0,2,253,4.0
52,209452750,ud,2,67,173.8901534495,1,0,0,0,2,253,4.0
53,209452738,ud,2,47,11.913312030292499,2,0,0,0,3,253,4.0
54,209452729,ud,2,20,6.8431069240683,1,0,0,0,2,253,4.0
55,209452720,ud,2,66,4.436840557464588,1,0,0,0,2,253,4.0
56,209452702,ud,2,38,28.49917166365934,4,0,0,0,5,253,4.0
57,209452690,ud,2,37,9.966541497076438,2,0,0,0,3,253,4.0
58,209452678,ud,2,76,13.44581200776115,2,0,0,0,3,253,4.0
59,209452918,ud,2,60,10.424934704763695,2,0,0,0,3,253,4.0
60,209452909,ud,2,65,9.415886056393408,1,0,0,0,2,253,4.0
61,209452897,ud,2,75,3.9337976878367034,1,0,0,0,2,253,4.0
62,209452888,ud,2,46,101.08459958773726,1,0,0,0,2,253,4.0
63,209452879,ud,2,64,27.48098551395782,1,0,0,0,2,253,4.0
64,209452867,ud,2,7,36.66691624210533,2,0,0,0,3,253,4.0
65,209452852,ud,2,59,12.807652281987075,4,0,0,0,5,253,4.0
66,209452837,ud,2,19,196.59558648816522,1,0,0,0,2,253,4.0
67,209452825,ud,2,45,12.505804349698558,4,0,0,0,5,253,4.0
68,209452816,ud,2,6,4.577121101018884,1,0,0,0,2,253,4.0
69,209452807,ud,2,5,18.02628509574899,1,0,0,0,2,253,4.0
70,209453041,ud,2,36,52.283025185785625,5,0,0,0,6,253,4.0
71,209453032,ud,2,63,9.461475652188078,1,0,0,0,2,253,4.0
72,209453023,ud,2,2,6.55598503357829,1,0,0,0,2,253,4.0
73,209453014,ud,2,53,11.554628528648768,1,0,0,0,2,253,4.0
74,209452993,ud,2,52,65.64177894790787,3,0,0,0,4,253,4.0
75,209452984,ud,2,1,8.680883574266746,1,0,0,0,2,253,4.0
76,209452969,ud,2,35,72.48892940791684,5,0,0,0,6,253,4.0
77,209452960,ud,2,44,14.344131390331594,1,0,0,0,2,253,4.0
78,209452939,ud,2,51,23.166423464255903,3,0,0,0,4,253,4.0
79,209452930,ud,2,34,49.96044138472323,3,0,0,0,4,253,4.0
80,209451134,cd,2,140,4.752608649761177,0,0,2,2,2,253,4.0
81,209451126,cd,2,151,11.423188413604523,0,0,3,2,3,253,4.0
82,209451112,cd,2,139,8.247186128651055,0,0,2,2,2,253,4.0
83,209451119,cd,2,158,8.648370670552321,0,0,2,3,2,253,4.0
84,209451105,cd,2,160,10.726169574126,0,0,2,4,2,253,4.0
85,209451098,cd,2,57,4.994900957858285,0,0,2,1,2,253,4.0
86,209451091,cd,2,138,12.564518778269669,0,0,2,2,2,253,4.0
87,209451084,cd,2,162,15.849466320311953,0,0,2,5,2,253,4.0
88,209451077,cd,2,56,26.154727402092885,0,0,2,1,2,253,4.0
89,209451069,cd,2,86,36.699465681120756,0,0,3,1,3,253,4.0
90,209451062,cd,2,55,17.548617618444148,0,0,2,1,2,253,4.0
91,209451054,cd,2,85,25.65790125303893,0,0,3,1,3,253,4.0
92,209451044,cd,2,114,31.637739538008468,0,0,5,1,5,253,4.0
93,209451036,cd,2,84,12.144627633866698,0,0,3,1,3,253,4.0
94,209451026,cd,2,113,35.2451417056292,0,0,5,1,5,253,4.0
95,209451015,cd,2,120,36.066077963452486,0,0,6,1,6,253,4.0
96,209451205,cd,2,54,8.424992641281186,0,0,2,1,2,253,4.0
97,209451198,cd,2,53,8.49057524712353,0,0,2,1,2,253,4.0
98,209451184,cd,2,157,7.984278588289505,0,0,2,3,2,253,4.0
99,209451191,cd,2,166,16.613233717577906,0,0,2,7,2,253,4.0
100,209451177,cd,2,137,5.219215769300225,0,0,2,2,2,253,4.0
101,209451169,cd,2,83,8.326640999994742,0,0,3,1,3,253,4.0
102,209451162,cd,2,136,11.291421138801596,0,0,2,2,2,253,4.0
103,209451155,cd,2,159,17.718711569487105,0,0,2,4,2,253,4.0
104,209451148,cd,2,52,3.348485215125157,0,0,2,1,2,253,4.0
105,209451141,cd,2,51,42.235371030807016,0,0,2,1,2,253,4.0
106,209450109,cd,1,50,1.768620000730778,0,0,2,1,2,253,4.0
107,209450101,cd,1,82,1.8628423191411103,0,0,3,1,3,253,4.0
108,209450094,cd,1,49,1.267733351873885,0,0,2,1,2,253,4.0
109,209450087,cd,1,48,1.0768742958912922,0,0,2,1,2,253,4.0
110,209450079,cd,1,81,2.2759210856643888,0,0,3,1,3,253,4.0
111,209450070,cd,1,97,2.8104210346896976,0,0,4,1,4,253,4.0
112,209450062,cd,1,80,2.112834635240806,0,0,3,1,3,253,4.0
113,209450055,cd,1,47,1.3572051529368752,0,0,2,1,2,253,4.0
114,209450047,cd,1,79,1.9444021266587643,0,0,3,1,3,253,4.0
115,209450037,cd,1,112,3.24188679336761,0,0,5,1,5,253,4.0
116,209450029,cd,1,78,2.0294021266587645,0,0,3,1,3,253,4.0
117,209450019,cd,1,111,2.794064247715291,0,0,5,1,5,253,4.0
118,209450000,cd,1,135,1.227022644354833,0,0,2,2,2,253,4.0
119,209450007,cd,1,122,3.349847357163522,0,0,7,1,7,253,4.0
120,209449993,cd,1,46,1.1174005033183214,0,0,2,1,2,253,4.0
121,209449986,cd,1,134,1.3687533255422566,0,0,2,2,2,253,4.0
122,209450238,cd,1,150,3.6285650433102856,0,0,3,2,3,253,4.0
123,209450230,cd,1,149,3.860755090448554,0,0,3,2,3,253,4.0
124,209450223,cd,1,133,1.0535739976700564,0,0,2,2,2,253,4.0
125,209450215,cd,1,77,2.632051184119615,0,0,3,1,3,253,4.0
126,209450206,cd,1,96,4.820188410009031,0,0,4,1,4,253,4.0
127,209450196,cd,1,110,4.811528510356941,0,0,5,1,5,253,4.0
128,209450186,cd,1,109,4.717071948550117,0,0,5,1,5,253,4.0
129,209450176,cd,1,108,4.860096133023264,0,0,5,1,5,253,4.0
130,209450166,cd,1,107,4.860096133023264,0,0,5,1,5,253,4.0
131,209450156,cd,1,106,4.717071948550117,0,0,5,1,5,253,4.0
132,209450146,cd,1,105,4.717071948550117,0,0,5,1,5,253,4.0
133,209450138,cd,1,148,4.426699501808761,0,0,3,2,3,253,4.0
134,209450131,cd,1,169,1.0032606444655403,0,0,2,11,2,253,4.0
135,209450124,cd,1,132,1.1371703259126167,0,0,2,2,2,253,4.0
136,209450116,cd,1,76,1.3906873245789104,0,0,3,1,3,253,4.0
137,209450362,cd,1,45,0.941424761944106,0,0,2,1,2,253,4.0
138,209450355,cd,1,44,0.941424761944106,0,0,2,1,2,253,4.0
139,209450348,cd,1,43,0.9077490603174153,0,0,2,1,2,253,4.0
140,209450341,cd,1,42,0.9077490603174153,0,0,2,1,2,253,4.0
141,209450334,cd,1,41,1.2192346809488406,0,0,2,1,2,253,4.0
142,209450327,cd,1,40,0.9199480552210805,0,0,2,1,2,253,4.0
143,209450312,cd,1,39,3.197650623374339,0,0,2,1,2,253,4.0
144,209450319,cd,1,75,1.2747878528816454,0,0,3,1,3,253,4.0
145,209450305,cd,1,131,3.9725897664481513,0,0,2,2,2,253,4.0
146,209450297,cd,1,147,3.5989230638557825,0,0,3,2,3,253,4.0
147,209450289,cd,1,146,3.5989230638557825,0,0,3,2,3,253,4.0
148,209450281,cd,1,145,3.59911771345181,0,0,3,2,3,253,4.0
149,209450273,cd,1,144,3.6366602814055238,0,0,3,2,3,253,4.0
150,209450265,cd,1,143,3.7220650433102858,0,0,3,2,3,253,4.0
151,209450255,cd,1,154,4.1996645714153455,0,0,5,2,5,253,4.0
152,209450246,cd,1,153,4.096485609864535,0,0,4,2,4,253,4.0
153,209450493,cd,2,104,378.29663954408915,0,0,5,1,5,253,4.0
154,209450485,cd,2,74,221.1549495986096,0,0,3,1,3,253,4.0
155,209450476,cd,2,95,381.1796499766927,0,0,4,1,4,253,4.0
156,209450469,cd,2,38,99.58141477914903,0,0,2,1,2,253,4.0
157,209450462,cd,2,37,403.17177001700423,0,0,2,1,2,253,4.0
158,209450455,cd,2,36,135.18750034021895,0,0,2,1,2,253,4.0
159,209450446,cd,2,94,503.15051664971475,0,0,4,1,4,253,4.0
160,209450432,cd,2,165,575.9013322409085,0,0,2,7,2,253,4.0
161,209450439,cd,2,35,341.9017136019239,0,0,2,1,2,253,4.0
162,209450425,cd,1,34,0.9215862499374121,0,0,2,1,2,253,4.0
163,209450418,cd,1,33,0.9215862499374121,0,0,2,1,2,253,4.0
164,209450411,cd,1,32,0.9215862499374121,0,0,2,1,2,253,4.0
165,209450404,cd,1,31,0.9497119632913453,0,0,2,1,2,253,4.0
166,209450397,cd,1,30,0.9477775659691995,0,0,2,1,2,253,4.0
167,209450390,cd,1,29,0.9342959962146382,0,0,2,1,2,253,4.0
168,209450376,cd,1,28,0.9089590884782223,0,0,2,1,2,253,4.0
169,209450383,cd,1,27,0.9342959962146382,0,0,2,1,2,253,4.0
170,209450369,cd,1,26,0.9089590884782223,0,0,2,1,2,253,4.0
171,209450613,cd,2,119,392.9082354589406,0,0,6,1,6,253,4.0
172,209450606,cd,2,130,34.93606696253832,0,0,2,2,2,253,4.0
173,209450595,cd,2,118,393.57081372031166,0,0,6,1,6,253,4.0
174,209450583,cd,2,121,416.316604829826,0,0,7,1,7,253,4.0
175,209450575,cd,2,73,142.02729705909206,0,0,3,1,3,253,4.0
176,209450565,cd,2,103,287.38879172514584,0,0,5,1,5,253,4.0
177,209450556,cd,2,93,263.60083187855264,0,0,4,1,4,253,4.0
178,209450547,cd,2,92,390.74159620824247,0,0,4,1,4,253,4.0
179,209450539,cd,2,72,230.7168958301594,0,0,3,1,3,253,4.0
180,209450528,cd,2,117,451.8572514744531,0,0,6,1,6,253,4.0
181,209450520,cd,2,71,153.9676017206735,0,0,3,1,3,253,4.0
182,209450510,cd,2,102,435.56583691821714,0,0,5,1,5,253,4.0
183,209450503,cd,2,25,109.14336101069881,0,0,2,1,2,253,4.0
184,209450748,cd,2,129,10.690899540560146,0,0,2,2,2,253,4.0
185,209450741,cd,2,24,8.03460151287652,0,0,2,1,2,253,4.0
186,209450733,cd,2,70,22.717734830488446,0,0,3,1,3,253,4.0
187,209450726,cd,2,23,24.18044162662799,0,0,2,1,2,253,4.0
188,209450718,cd,2,69,23.61511209802336,0,0,3,1,3,253,4.0
189,209450704,cd,2,128,274.23613407862103,0,0,2,2,2,253,4.0
190,209450711,cd,2,22,10.568182955325469,0,0,2,1,2,253,4.0
191,209450696,cd,2,68,434.2608344567041,0,0,3,1,3,253,4.0
192,209450686,cd,2,101,379.1425031547402,0,0,5,1,5,253,4.0
193,209450678,cd,2,67,97.54426795719648,0,0,3,1,3,253,4.0
194,209450669,cd,2,91,125.82414540660716,0,0,4,1,4,253,4.0
195,209450661,cd,2,142,49.49284577702692,0,0,3,2,3,253,4.0
196,209450651,cd,2,100,247.3976802260677,0,0,5,1,5,253,4.0
197,209450641,cd,2,99,392.8656017896622,0,0,5,1,5,253,4.0
198,209450632,cd,2,90,232.84090141157913,0,0,4,1,4,253,4.0
199,209450624,cd,2,66,111.26736659211855,0,0,3,1,3,253,4.0
200,209450877,cd,2,127,46.08270022924707,0,0,2,2,2,253,4.0
201,209450869,cd,2,141,59.41826291026073,0,0,3,2,3,253,4.0
202,209450860,cd,2,152,57.48698065926131,0,0,4,2,4,253,4.0
203,209450853,cd,2,170,46.791900534627274,0,0,2,15,2,253,4.0
204,209450845,cd,2,65,62.19765766926719,0,0,3,1,3,253,4.0
205,209450838,cd,2,21,29.70956965494812,0,0,2,1,2,253,4.0
206,209450829,cd,2,89,60.45379833689161,0,0,4,1,4,253,4.0
207,209450821,cd,2,64,45.048041202251696,0,0,3,1,3,253,4.0
208,209450813,cd,2,63,77.88847272690361,0,0,3,1,3,253,4.0
209,209450804,cd,2,88,93.22694427420718,0,0,4,1,4,253,4.0
210,209450797,cd,2,20,62.16175823324176,0,0,2,1,2,253,4.0
211,209450790,cd,2,19,21.474471320098914,0,0,2,1,2,253,4.0
212,209450776,cd,2,18,11.62650380678593,0,0,2,1,2,253,4.0
213,209450783,cd,2,17,6.344028325977505,0,0,2,1,2,253,4.0
214,209450769,cd,2,16,8.636510515859555,0,0,2,1,2,253,4.0
215,209450762,cd,2,15,14.34886325153995,0,0,2,1,2,253,4.0
216,209450755,cd,2,126,39.330924301464904,0,0,2,2,2,253,4.0
217,209451007,cd,2,62,15.752029801487431,0,0,3,1,3,253,4.0
218,209450996,cd,2,116,35.108238613272896,0,0,6,1,6,253,4.0
219,209450989,cd,2,14,7.540532450033563,0,0,2,1,2,253,4.0
220,209450981,cd,2,61,12.532732034682546,0,0,3,1,3,253,4.0
221,209450974,cd,2,13,7.960899328062467,0,0,2,1,2,253,4.0
222,209450966,cd,2,60,12.953098912711452,0,0,3,1,3,253,4.0
223,209450955,cd,2,115,35.5286054913018,0,0,6,1,6,253,4.0
224,209450948,cd,2,12,25.582844874492753,0,0,2,1,2,253,4.0
225,209450941,cd,2,156,13.050130288723384,0,0,2,3,2,253,4.0
226,209450934,cd,2,11,11.655689023057946,0,0,2,1,2,253,4.0
227,209450920,cd,2,10,9.729182970115065,0,0,2,1,2,253,4.0
228,209450927,cd,2,9,15.774560819539422,0,0,2,1,2,253,4.0
229,209450913,cd,2,8,15.535120156638644,0,0,2,1,2,253,4.0
230,209450906,cd,2,7,25.40694009224716,0,0,2,1,2,253,4.0
231,209450899,cd,2,6,12.975830422196001,0,0,2,1,2,253,4.0
232,209450891,cd,2,59,10.095923665402061,0,0,3,1,3,253,4.0
233,209450884,cd,2,161,12.457967989067283,0,0,2,5,2,253,4.0
234,209449979,cd,1,125,1.0287182700920414,0,0,2,2,2,253,4.0
235,209449972,cd,1,5,0.9434659219393065,0,0,2,1,2,253,4.0
236,209449965,cd,1,4,1.1861175423000014,0,0,2,1,2,253,4.0
237,209449958,cd,1,164,0.8898738726596667,0,0,2,7,2,253,4.0
238,209449944,cd,1,167,0.965684967972427,0,0,2,8,2,253,4.0
239,209449951,cd,1,163,0.9292391820031827,0,0,2,6,2,253,4.0
240,209449937,cd,1,3,1.1320041183236926,0,0,2,1,2,253,4.0
241,209449930,cd,1,124,0.8932025872994627,0,0,2,2,2,253,4.0
242,209449923,cd,1,168,1.3559382514586025,0,0,2,10,2,253,4.0
243,209449913,cd,1,98,2.241652156313445,0,0,5,1,5,253,4.0
244,209449904,cd,1,87,2.0132968297585205,0,0,4,1,4,253,4.0
245,209449896,cd,1,58,1.4497982051300378,0,0,3,1,3,253,4.0
246,209449889,cd,1,155,1.2912085146337862,0,0,2,3,2,253,4.0
247,209449882,cd,1,123,0.9286318931350004,0,0,2,2,2,253,4.0
248,209449875,cd,1,2,2.255029910372322,0,0,2,1,2,253,4.0
249,209449868,cd,1,1,1.0093121726219123,0,0,2,1,2,253,4.0
