counter,AS,Type,GranularityValue,SeverityScore,PageRank,NumBadDep,TotalDep,NumberOfVerteces,NumOfCycle,NumSetOfElement,TotNumOfSetOfElement,ADI
1,468583395,ud,2,57,24.921199540656634,5,0,0,0,6,275,21.0
2,468583419,ud,2,56,26.34145035796676,1,0,0,0,2,275,21.0
3,468583365,ud,2,55,56.607186617906116,2,0,0,0,3,275,21.0
4,468583380,ud,2,54,104.77107268457347,3,0,0,0,4,275,21.0
5,468583341,ud,2,53,18.07232680869666,2,0,0,0,3,275,21.0
6,468583329,ud,2,52,15.231524775158348,1,0,0,0,2,275,21.0
7,468583353,ud,2,69,539.9544952404683,3,0,0,0,4,275,21.0
8,468583305,ud,2,74,28.876419057200394,2,0,0,0,3,275,21.0
9,468583296,ud,2,51,470.9436010380265,6,0,0,0,7,275,21.0
10,468583320,ud,2,50,101.27371365614073,1,0,0,0,2,275,21.0
11,468583272,ud,2,68,72.49957089637594,4,0,0,0,5,275,21.0
12,468583239,ud,2,49,5.36879121173647,1,0,0,0,2,275,21.0
13,468583263,ud,2,48,11.496942741953745,1,0,0,0,2,275,21.0
14,468583248,ud,2,47,5.163077858651571,1,0,0,0,2,275,21.0
15,468583212,ud,2,46,5.67059601743787,1,0,0,0,2,275,21.0
16,468583203,ud,2,45,5.172918383477157,1,0,0,0,2,275,21.0
17,468583221,ud,2,67,106.61214579811165,8,0,0,0,9,275,21.0
18,468583182,ud,2,44,4.615118921517354,1,0,0,0,2,275,21.0
19,468583173,ud,2,43,26.396106317429858,3,0,0,0,4,275,21.0
20,468583194,ud,2,42,7.526826300820792,1,0,0,0,2,275,21.0
21,468583164,ud,2,41,91.39991804864977,5,0,0,0,6,275,21.0
22,468583155,ud,2,66,2.9298196279055637,1,0,0,0,2,275,21.0
23,468584010,ud,2,40,12.82512118833277,1,0,0,0,2,275,21.0
24,468584019,ud,2,39,4.511723668888228,1,0,0,0,2,275,21.0
25,468583974,ud,2,65,7.172255188868838,1,0,0,0,2,275,21.0
26,468583998,ud,2,38,16.93309648038685,2,0,0,0,3,275,21.0
27,468583989,ud,2,37,3.035360495756192,1,0,0,0,2,275,21.0
28,468583947,ud,2,36,3.0369543758699598,1,0,0,0,2,275,21.0
29,468583965,ud,2,35,8.637317363906078,1,0,0,0,2,275,21.0
30,468583956,ud,2,34,7.9556352166710465,1,0,0,0,2,275,21.0
31,468583914,ud,2,33,45.72213498314744,1,0,0,0,2,275,21.0
32,468583932,ud,2,75,2.5681818214278986,1,0,0,0,2,275,21.0
33,468583923,ud,2,32,39.52945048716435,3,0,0,0,4,275,21.0
34,468583872,ud,2,64,48.65183977901753,5,0,0,0,6,275,21.0
35,468583902,ud,2,31,2.137451739860765,1,0,0,0,2,275,21.0
36,468583893,ud,2,63,56.88091161866268,1,0,0,0,2,275,21.0
37,468583851,ud,2,62,10.688055764989631,1,0,0,0,2,275,21.0
38,468583842,ud,2,30,8.20949088289975,1,0,0,0,2,275,21.0
39,468583863,ud,2,73,3.003517187265448,1,0,0,0,2,275,21.0
40,468583812,ud,2,29,10.234528171605893,2,0,0,0,3,275,21.0
41,468583833,ud,2,28,6.94766118074827,1,0,0,0,2,275,21.0
42,468583824,ud,2,61,10.614376666440494,1,0,0,0,2,275,21.0
43,468583785,ud,2,27,12.748819363983142,4,0,0,0,5,275,21.0
44,468583803,ud,2,60,176.8321022151046,1,0,0,0,2,275,21.0
45,468583758,ud,2,72,4.349223983866969,1,0,0,0,2,275,21.0
46,468583749,ud,2,26,14.158030335351302,1,0,0,0,2,275,21.0
47,468583767,ud,2,25,49.41126680597425,4,0,0,0,5,275,21.0
48,468583725,ud,2,24,21.418200391017276,3,0,0,0,4,275,21.0
49,468583716,ud,2,23,6.6847498782785095,1,0,0,0,2,275,21.0
50,468583740,ud,2,22,10.271016582826478,1,0,0,0,2,275,21.0
51,468583689,ud,2,21,4.699575738183158,1,0,0,0,2,275,21.0
52,468583707,ud,2,59,4.413546785356255,1,0,0,0,2,275,21.0
53,468583662,ud,2,20,11.703808927968707,2,0,0,0,3,275,21.0
54,468583671,ud,2,19,30.232693280110844,5,0,0,0,6,275,21.0
55,468583626,ud,2,18,21.1877726947531,1,0,0,0,2,275,21.0
56,468583644,ud,2,17,271.65876573041857,4,0,0,0,5,275,21.0
57,468583635,ud,2,16,169.72620823386077,1,0,0,0,2,275,21.0
58,468583590,ud,2,15,5.08040955169867,1,0,0,0,2,275,21.0
59,468583614,ud,2,71,12.62001431461789,2,0,0,0,3,275,21.0
60,468583605,ud,2,14,70.89953068852452,1,0,0,0,2,275,21.0
61,468583560,ud,2,13,7.6708803101691645,2,0,0,0,3,275,21.0
62,468583581,ud,2,12,5.014412844089149,1,0,0,0,2,275,21.0
63,468583572,ud,2,11,16.229094004788728,1,0,0,0,2,275,21.0
64,468583533,ud,2,10,12.564036646266713,4,0,0,0,5,275,21.0
65,468583545,ud,2,9,4.56231802699917,1,0,0,0,2,275,21.0
66,468583500,ud,2,8,7.547824405681016,1,0,0,0,2,275,21.0
67,468583491,ud,2,7,3.2138509758911518,1,0,0,0,2,275,21.0
68,468583518,ud,2,58,262.18423871469645,3,0,0,0,4,275,21.0
69,468583509,ud,2,70,3.565999606425444,1,0,0,0,2,275,21.0
70,468583467,ud,2,6,70.71967716344074,2,0,0,0,3,275,21.0
71,468583458,ud,2,5,4.067211847400539,1,0,0,0,2,275,21.0
72,468583479,ud,2,4,17.075469483191917,2,0,0,0,3,275,21.0
73,468583428,ud,2,3,21.957358304163236,2,0,0,0,3,275,21.0
74,468583449,ud,2,2,55.17160360555152,1,0,0,0,2,275,21.0
75,468583440,ud,2,1,34.05955815981038,1,0,0,0,2,275,21.0
76,468583101,hl,2,1,1367.9518236859385,0,46,0,0,44,275,21.0
77,468583033,hl,2,2,1646.2065369797635,0,60,0,0,55,275,21.0
78,468581354,cd,2,135,332.9558736377023,0,0,10,1,10,275,21.0
79,468581369,cd,2,114,136.09265981054463,0,0,6,1,6,275,21.0
80,468581313,cd,2,140,488.6133248429303,0,0,11,1,11,275,21.0
81,468581338,cd,2,139,492.2295152965568,0,0,11,1,11,275,21.0
82,468581329,cd,2,90,69.8348226435534,0,0,4,1,4,275,21.0
83,468581283,cd,2,134,329.33968318407574,0,0,10,1,10,275,21.0
84,468581306,cd,2,163,16.729938083323905,0,0,2,5,2,275,21.0
85,468581298,cd,2,79,55.37940236432845,0,0,3,1,3,275,21.0
86,468581254,cd,2,133,496.10750570486033,0,0,10,1,10,275,21.0
87,468581269,cd,2,127,336.8338640460059,0,0,9,1,9,275,21.0
88,468581231,cd,2,104,123.05113848863091,0,0,5,1,5,275,21.0
89,468581216,cd,2,132,484.779122677649,0,0,10,1,10,275,21.0
90,468581241,cd,2,122,192.97357142920734,0,0,8,1,8,275,21.0
91,468581196,cd,2,162,91.75434884123403,0,0,2,5,2,275,21.0
92,468581186,cd,2,103,150.5180051462952,0,0,5,1,5,275,21.0
93,468581203,cd,2,121,351.2592093817564,0,0,8,1,8,275,21.0
94,468581161,cd,2,113,189.14267194872545,0,0,6,1,6,275,21.0
95,468581172,cd,2,126,510.532851040611,0,0,9,1,9,275,21.0
96,468581130,cd,2,131,491.8519507189855,0,0,10,1,10,275,21.0
97,468581145,cd,2,138,489.2190360054604,0,0,11,1,11,275,21.0
98,468581100,cd,2,137,528.9221773307013,0,0,11,1,11,275,21.0
99,468581093,cd,2,153,58.618028240383666,0,0,2,2,2,275,21.0
100,468581116,cd,2,125,332.57830906013095,0,0,9,1,9,275,21.0
101,468581071,cd,2,118,170.4617716271,0,0,7,1,7,275,21.0
102,468581060,cd,2,112,131.83710482466978,0,0,6,1,6,275,21.0
103,468581083,cd,2,102,118.79558350275606,0,0,5,1,5,275,21.0
104,468581036,cd,2,89,137.47648382438146,0,0,4,1,4,275,21.0
105,468581045,cd,2,130,507.0003078721066,0,0,10,1,10,275,21.0
106,468580997,cd,2,129,803.0110700226186,0,0,10,1,10,275,21.0
107,468581023,cd,2,120,281.8380811017948,0,0,8,1,8,275,21.0
108,468581012,cd,2,111,119.7215436687638,0,0,6,1,6,275,21.0
109,468580966,cd,2,141,768.7379363700848,0,0,12,1,12,275,21.0
110,468580983,cd,2,124,643.737428363764,0,0,9,1,9,275,21.0
111,468580936,cd,2,136,727.8948208477598,0,0,11,1,11,275,21.0
112,468580959,cd,2,54,148.6459900489626,0,0,2,1,2,275,21.0
113,468580952,cd,2,53,290.7219982281341,0,0,2,1,2,275,21.0
114,468580902,cd,2,101,386.0978885381432,0,0,5,1,5,275,21.0
115,468580922,cd,2,123,441.11172276064923,0,0,9,1,9,275,21.0
116,468580912,cd,2,100,281.4549353661862,0,0,5,1,5,275,21.0
117,468580874,cd,2,99,442.25387540631516,0,0,5,1,5,275,21.0
118,468580867,cd,1,52,0.9470031342785065,0,0,2,1,2,275,21.0
119,468580891,cd,2,110,447.46719164513934,0,0,6,1,6,275,21.0
120,468580884,cd,2,51,120.86369631442967,0,0,2,1,2,275,21.0
121,468580846,cd,1,50,0.9339435676061122,0,0,2,1,2,275,21.0
122,468580839,cd,1,49,0.9071393213308092,0,0,2,1,2,275,21.0
123,468580832,cd,1,48,0.9071393213308092,0,0,2,1,2,275,21.0
124,468580860,cd,1,47,0.9445474843144908,0,0,2,1,2,275,21.0
125,468580853,cd,1,46,0.9339435676061122,0,0,2,1,2,275,21.0
126,468580811,cd,1,45,0.903900823665581,0,0,2,1,2,275,21.0
127,468580804,cd,1,44,0.903900823665581,0,0,2,1,2,275,21.0
128,468580825,cd,1,43,0.9376611603705438,0,0,2,1,2,275,21.0
129,468580818,cd,1,42,0.9376611603705438,0,0,2,1,2,275,21.0
130,468580780,cd,1,78,1.0982913637813405,0,0,3,1,3,275,21.0
131,468580773,cd,1,41,0.989160583941606,0,0,2,1,2,275,21.0
132,468580797,cd,1,152,1.1438129929693341,0,0,2,2,2,275,21.0
133,468580788,cd,1,88,1.580516128646427,0,0,4,1,4,275,21.0
134,468580750,cd,1,40,0.9093983509694235,0,0,2,1,2,275,21.0
135,468580743,cd,1,151,0.9547599431411304,0,0,2,2,2,275,21.0
136,468580736,cd,1,159,0.8887482058773934,0,0,2,3,2,275,21.0
137,468580765,cd,1,77,1.3060426190236538,0,0,3,1,3,275,21.0
138,468580757,cd,1,76,1.5825960117133522,0,0,3,1,3,275,21.0
139,468580715,cd,1,165,0.8898738726596667,0,0,2,7,2,275,21.0
140,468580708,cd,1,164,0.9292391820031827,0,0,2,6,2,275,21.0
141,468580729,cd,1,39,0.9434659219393065,0,0,2,1,2,275,21.0
142,468580722,cd,1,38,1.1861175423000014,0,0,2,1,2,275,21.0
143,468580687,cd,1,150,0.8521345536489646,0,0,2,2,2,275,21.0
144,468580680,cd,1,37,1.1763728068343176,0,0,2,1,2,275,21.0
145,468580673,cd,1,36,1.2450515024543125,0,0,2,1,2,275,21.0
146,468580701,cd,1,167,0.965684967972427,0,0,2,8,2,275,21.0
147,468580694,cd,1,35,1.1398319880524481,0,0,2,1,2,275,21.0
148,468580649,cd,1,98,2.211734443814178,0,0,5,1,5,275,21.0
149,468580641,cd,1,75,1.3214552468895975,0,0,3,1,3,275,21.0
150,468580666,cd,1,34,1.3855673363023893,0,0,2,1,2,275,21.0
151,468580659,cd,1,33,1.4745515024543125,0,0,2,1,2,275,21.0
152,468580614,cd,1,97,2.7146568006251925,0,0,5,1,5,275,21.0
153,468580632,cd,1,87,2.1439539897797735,0,0,4,1,4,275,21.0
154,468580624,cd,1,74,1.635703702010931,0,0,3,1,3,275,21.0
155,468580582,cd,1,96,2.587156800625192,0,0,5,1,5,275,21.0
156,468580607,cd,1,158,1.1671912747134425,0,0,2,3,2,275,21.0
157,468580600,cd,1,32,1.7371754344733374,0,0,2,1,2,275,21.0
158,468580592,cd,1,73,1.4270274608934652,0,0,3,1,3,275,21.0
159,468580559,cd,1,149,0.9286318931350004,0,0,2,2,2,275,21.0
160,468580552,cd,1,31,1.022325570959396,0,0,2,1,2,275,21.0
161,468580545,cd,1,30,1.9319472139900475,0,0,2,1,2,275,21.0
162,468580573,cd,1,86,2.015304685744614,0,0,4,1,4,275,21.0
163,468580566,cd,1,157,1.097351813478618,0,0,2,3,2,275,21.0
164,468580538,cd,1,29,8.030840874177645,0,0,2,1,2,275,21.0
165,468582030,cd,2,28,5.16129526999398,0,0,2,1,2,275,21.0
166,468582022,cd,2,155,11.29692252189746,0,0,3,2,3,275,21.0
167,468582037,cd,2,27,3.339605759276581,0,0,2,1,2,275,21.0
168,468581993,cd,2,26,4.749965814781443,0,0,2,1,2,275,21.0
169,468581986,cd,2,148,23.864196367917863,0,0,2,2,2,275,21.0
170,468582015,cd,2,156,8.42223056002842,0,0,2,3,2,275,21.0
171,468582008,cd,2,147,8.394278744578589,0,0,2,2,2,275,21.0
172,468582000,cd,2,72,12.48126349805548,0,0,3,1,3,275,21.0
173,468581961,cd,2,25,9.957474844523032,0,0,2,1,2,275,21.0
174,468581953,cd,2,71,14.761380715914607,0,0,3,1,3,275,21.0
175,468581978,cd,2,70,10.9722604969919,0,0,3,1,3,275,21.0
176,468581968,cd,2,95,29.546627071765315,0,0,5,1,5,275,21.0
177,468581932,cd,2,94,32.94377899031439,0,0,5,1,5,275,21.0
178,468581921,cd,2,109,33.658354613022745,0,0,6,1,6,275,21.0
179,468581942,cd,2,108,35.21659129757495,0,0,6,1,6,275,21.0
180,468581898,cd,2,69,12.700551105831078,0,0,3,1,3,275,21.0
181,468581913,cd,2,68,14.369412415540982,0,0,3,1,3,275,21.0
182,468581906,cd,2,24,7.8966452344395055,0,0,2,1,2,275,21.0
183,468581865,cd,2,23,3.5875334714074514,0,0,2,1,2,275,21.0
184,468581858,cd,2,22,15.293604966475876,0,0,2,1,2,275,21.0
185,468581887,cd,2,107,33.15576168749143,0,0,6,1,6,275,21.0
186,468581879,cd,2,67,22.336054588547285,0,0,3,1,3,275,21.0
187,468581872,cd,2,21,17.268462093518977,0,0,2,1,2,275,21.0
188,468581837,cd,2,20,9.699904817652227,0,0,2,1,2,275,21.0
189,468581830,cd,2,19,15.56183259212964,0,0,2,1,2,275,21.0
190,468581851,cd,2,18,12.806193577633747,0,0,2,1,2,275,21.0
191,468581844,cd,2,17,24.27072452504415,0,0,2,1,2,275,21.0
192,468581807,cd,2,66,23.741774035192456,0,0,3,1,3,275,21.0
193,468581800,cd,2,161,12.297109683934355,0,0,2,5,2,275,21.0
194,468581792,cd,2,65,9.996529726185052,0,0,3,1,3,275,21.0
195,468581823,cd,2,146,12.50570801886596,0,0,2,2,2,275,21.0
196,468581815,cd,2,154,12.418334249312124,0,0,3,2,3,275,21.0
197,468581771,cd,2,16,6.153782185326051,0,0,2,1,2,275,21.0
198,468581764,cd,2,15,7.641574215285809,0,0,2,1,2,275,21.0
199,468581785,cd,2,145,8.011664095752304,0,0,2,2,2,275,21.0
200,468581778,cd,2,14,21.24179132807224,0,0,2,1,2,275,21.0
201,468581741,cd,2,144,24.388258442026064,0,0,2,2,2,275,21.0
202,468581733,cd,2,64,16.79614604810917,0,0,3,1,3,275,21.0
203,468581755,cd,2,85,11.816934989136225,0,0,4,1,4,275,21.0
204,468581748,cd,2,13,7.930726563408293,0,0,2,1,2,275,21.0
205,468581704,cd,2,160,73.79586651304257,0,0,3,4,3,275,21.0
206,468581697,cd,2,12,30.911583953143708,0,0,2,1,2,275,21.0
207,468581726,cd,2,11,10.943748181399496,0,0,2,1,2,275,21.0
208,468581719,cd,2,10,8.227679656680825,0,0,2,1,2,275,21.0
209,468581712,cd,2,166,42.35889592269406,0,0,2,8,2,275,21.0
210,468581673,cd,2,143,53.320113999947125,0,0,2,2,2,275,21.0
211,468581689,cd,2,63,47.239805348506906,0,0,3,1,3,275,21.0
212,468581680,cd,2,84,56.942258480474564,0,0,4,1,4,275,21.0
213,468581645,cd,2,93,81.09633233118105,0,0,5,1,5,275,21.0
214,468581634,cd,2,106,90.79878546314872,0,0,6,1,6,275,21.0
215,468581663,cd,2,92,80.36711226901953,0,0,5,1,5,275,21.0
216,468581655,cd,2,62,54.33643774168866,0,0,3,1,3,275,21.0
217,468581610,cd,2,83,64.76811093581786,0,0,4,1,4,275,21.0
218,468581601,cd,2,82,70.66465913705187,0,0,4,1,4,275,21.0
219,468581627,cd,2,9,26.16675593941636,0,0,2,1,2,275,21.0
220,468581619,cd,2,61,40.885514942962,0,0,3,1,3,275,21.0
221,468581577,cd,2,168,64.09341338107491,0,0,2,16,2,275,21.0
222,468581570,cd,2,8,16.031730890366628,0,0,2,1,2,275,21.0
223,468581592,cd,2,81,79.35078852727798,0,0,4,1,4,275,21.0
224,468581584,cd,2,60,69.64833539531033,0,0,3,1,3,275,21.0
225,468581548,cd,2,59,24.89550164730157,0,0,3,1,3,275,21.0
226,468581541,cd,2,142,17.389166378303887,0,0,2,2,2,275,21.0
227,468581563,cd,2,7,13.940304177227693,0,0,2,1,2,275,21.0
228,468581556,cd,2,6,11.838516608720859,0,0,2,1,2,275,21.0
229,468581519,cd,2,5,194.21965752550653,0,0,2,1,2,275,21.0
230,468581512,cd,2,4,446.9942268924516,0,0,2,1,2,275,21.0
231,468581504,cd,2,58,239.36587103789148,0,0,3,1,3,275,21.0
232,468581533,cd,2,57,21.945985908638516,0,0,3,1,3,275,21.0
233,468581526,cd,2,3,10.942241359259377,0,0,2,1,2,275,21.0
234,468581484,cd,2,105,271.3908906192642,0,0,6,1,6,275,21.0
235,468581472,cd,2,117,288.41570109897225,0,0,7,1,7,275,21.0
236,468581495,cd,2,80,226.82424687928872,0,0,4,1,4,275,21.0
237,468581449,cd,2,119,447.6893427578268,0,0,8,1,8,275,21.0
238,468581441,cd,2,56,74.63297554159733,0,0,3,1,3,275,21.0
239,468581462,cd,2,91,126.29916366594131,0,0,5,1,5,275,21.0
240,468581414,cd,2,128,478.19772818798634,0,0,10,1,10,275,21.0
241,468581429,cd,2,116,156.8075490961009,0,0,7,1,7,275,21.0
242,468581380,cd,2,115,174.7173266129749,0,0,7,1,7,275,21.0
243,468581407,cd,2,2,44.963805709384545,0,0,2,1,2,275,21.0
244,468581399,cd,2,55,77.32900350548347,0,0,3,1,3,275,21.0
245,468581392,cd,2,1,62.87358322625852,0,0,2,1,2,275,21.0
