counter,AS,Type,GranularityValue,SeverityScore,PageRank,NumBadDep,TotalDep,NumberOfVerteces,NumOfCycle,NumSetOfElement,TotNumOfSetOfElement,ADI
1,873113,hl,1,1,2.694633153278439,0,10,0,0,12,14,5.0
2,873098,cd,1,1,1.0273798089811228,0,0,2,8,2,14,5.0
