counter,AS,Type,GranularityValue,SeverityScore,PageRank,NumBadDep,TotalDep,NumberOfVerteces,NumOfCycle,NumSetOfElement,TotNumOfSetOfElement,ADI
1,178117273,ud,2,102,7.266869707492528,1,0,0,0,2,289,4.0
2,178117264,ud,2,39,4.163166831810253,1,0,0,0,2,289,4.0
3,178117255,ud,2,70,3.1207235248341756,1,0,0,0,2,289,4.0
4,178117309,ud,2,38,29.937510188578134,2,0,0,0,3,289,4.0
5,178117300,ud,2,101,7.320127911319973,1,0,0,0,2,289,4.0
6,178117291,ud,2,100,7.307846974444058,1,0,0,0,2,289,4.0
7,178117282,ud,2,99,7.262926012467551,1,0,0,0,2,289,4.0
8,178117339,ud,2,98,7.701435643233006,1,0,0,0,2,289,4.0
9,178117330,ud,2,97,7.366782145229066,1,0,0,0,2,289,4.0
10,178117321,ud,2,24,9.348908063091093,1,0,0,0,2,289,4.0
11,178117369,ud,2,96,7.257312219971162,1,0,0,0,2,289,4.0
12,178117357,ud,2,95,7.558788986148881,1,0,0,0,2,289,4.0
13,178117348,ud,2,5,12.374276680194665,1,0,0,0,2,289,4.0
14,178117150,ud,2,43,51.59239570037888,5,0,0,0,6,289,4.0
15,178117141,ud,2,85,10.024526066632156,1,0,0,0,2,289,4.0
16,178117120,ud,2,69,17.784431796183757,1,0,0,0,2,289,4.0
17,178117174,ud,2,30,2.960070722981681,1,0,0,0,2,289,4.0
18,178117159,ud,2,58,10.450722233925138,2,0,0,0,3,289,4.0
19,178117207,ud,2,37,8.002839808055679,1,0,0,0,2,289,4.0
20,178117192,ud,2,23,2.114955401092132,1,0,0,0,2,289,4.0
21,178117243,ud,2,12,14.01812957011964,2,0,0,0,3,289,4.0
22,178117234,ud,2,11,3.428089463832072,1,0,0,0,2,289,4.0
23,178117225,ud,2,57,5.320278625866439,1,0,0,0,2,289,4.0
24,178117216,ud,2,17,5.114297753987644,1,0,0,0,2,289,4.0
25,178117405,ud,2,16,13.129192899071079,1,0,0,0,2,289,4.0
26,178117396,ud,2,48,5.523385118064975,2,0,0,0,3,289,4.0
27,178117387,ud,2,84,7.563082639069586,1,0,0,0,2,289,4.0
28,178117378,ud,2,68,7.589216133031165,1,0,0,0,2,289,4.0
29,178116763,ud,2,47,3.9384625315807034,1,0,0,0,2,289,4.0
30,178116799,ud,2,46,4.942711212864336,1,0,0,0,2,289,4.0
31,178116781,ud,2,56,12.383960381677849,4,0,0,0,5,289,4.0
32,178116772,ud,2,36,5.9113055818586755,1,0,0,0,2,289,4.0
33,178116826,ud,2,29,207.85920610339076,1,0,0,0,2,289,4.0
34,178116817,ud,2,42,178.2548983743123,1,0,0,0,2,289,4.0
35,178116808,ud,2,28,4.998603811972988,1,0,0,0,2,289,4.0
36,178116859,ud,2,94,3.8731439043909943,1,0,0,0,2,289,4.0
37,178116847,ud,2,51,9.940631578473951,2,0,0,0,3,289,4.0
38,178116835,ud,2,93,13.28008530106656,2,0,0,0,3,289,4.0
39,178116637,ud,2,22,29.360084739528823,1,0,0,0,2,289,4.0
40,178116625,ud,2,87,9.502512660281798,2,0,0,0,3,289,4.0
41,178116616,ud,2,55,19.244601970268157,2,0,0,0,3,289,4.0
42,178116670,ud,2,21,19.35061615336906,1,0,0,0,2,289,4.0
43,178116661,ud,2,10,9.37202166734573,1,0,0,0,2,289,4.0
44,178116646,ud,2,32,23.73950646620506,2,0,0,0,3,289,4.0
45,178116700,ud,2,31,7.058790737843566,1,0,0,0,2,289,4.0
46,178116691,ud,2,83,4.393998373655245,1,0,0,0,2,289,4.0
47,178116679,ud,2,27,18.979836854896913,2,0,0,0,3,289,4.0
48,178116730,ud,2,61,55.39017140855967,5,0,0,0,6,289,4.0
49,178116721,ud,2,92,5.192685935410807,1,0,0,0,2,289,4.0
50,178116709,ud,2,60,12.107255292748125,2,0,0,0,3,289,4.0
51,178117021,ud,2,45,53.15246452024455,3,0,0,0,4,289,4.0
52,178117012,ud,2,54,13.1271976642545,1,0,0,0,2,289,4.0
53,178117003,ud,2,1,6.422405120489373,1,0,0,0,2,289,4.0
54,178116994,ud,2,4,26.572477383606056,1,0,0,0,2,289,4.0
55,178117042,ud,2,67,23.081195521065858,3,0,0,0,4,289,4.0
56,178117030,ud,2,15,10.962136619143529,1,0,0,0,2,289,4.0
57,178117084,ud,2,82,103.74390132406512,1,0,0,0,2,289,4.0
58,178117075,ud,2,3,8.471065897865179,1,0,0,0,2,289,4.0
59,178117060,ud,2,62,76.80217856130136,3,0,0,0,4,289,4.0
60,178117111,ud,2,41,77.15948981512905,5,0,0,0,6,289,4.0
61,178117102,ud,2,91,2.7842324997865697,1,0,0,0,2,289,4.0
62,178117093,ud,2,50,19.211891622747057,1,0,0,0,2,289,4.0
63,178116889,ud,2,71,12.860711720213237,4,0,0,0,5,289,4.0
64,178116877,ud,2,20,38.393296777157516,2,0,0,0,3,289,4.0
65,178116868,ud,2,81,27.69418302240831,1,0,0,0,2,289,4.0
66,178116925,ud,2,9,18.91176641050422,1,0,0,0,2,289,4.0
67,178116916,ud,2,19,7.613125557762279,2,0,0,0,3,289,4.0
68,178116907,ud,2,80,185.1508211972808,1,0,0,0,2,289,4.0
69,178116958,ud,2,79,9.977078196404603,1,0,0,0,2,289,4.0
70,178116946,ud,2,72,10.701140065549705,2,0,0,0,3,289,4.0
71,178116937,ud,2,18,4.520851587703501,1,0,0,0,2,289,4.0
72,178116985,ud,2,78,2.4700426908889,1,0,0,0,2,289,4.0
73,178116976,ud,2,53,14.664446372547534,1,0,0,0,2,289,4.0
74,178116967,ud,2,8,7.281029938224389,1,0,0,0,2,289,4.0
75,178116307,ud,2,59,16.306489490548714,3,0,0,0,4,289,4.0
76,178116340,ud,2,88,311.94226933271887,3,0,0,0,4,289,4.0
77,178116331,ud,2,90,3.6865467697252434,1,0,0,0,2,289,4.0
78,178116322,ud,2,66,72.24188737728242,1,0,0,0,2,289,4.0
79,178116508,ud,2,35,4.1444898387764955,1,0,0,0,2,289,4.0
80,178116499,ud,2,52,6.837296710930545,1,0,0,0,2,289,4.0
81,178116490,ud,2,26,6.0530401087767345,1,0,0,0,2,289,4.0
82,178116481,ud,2,14,3.834611669434684,1,0,0,0,2,289,4.0
83,178116538,ud,2,7,5.004347672120977,1,0,0,0,2,289,4.0
84,178116526,ud,2,2,6.899922200842778,1,0,0,0,2,289,4.0
85,178116517,ud,2,65,9.773107623668158,1,0,0,0,2,289,4.0
86,178116571,ud,2,86,546.1478365396728,7,0,0,0,8,289,4.0
87,178116559,ud,2,75,309.16433763330235,4,0,0,0,5,289,4.0
88,178116547,ud,2,74,42.455242840701686,3,0,0,0,4,289,4.0
89,178116607,ud,2,77,194.42305357668738,1,0,0,0,2,289,4.0
90,178116583,ud,2,34,17.285758811197194,4,0,0,0,5,289,4.0
91,178116382,ud,2,76,466.83174184963616,2,0,0,0,3,289,4.0
92,178116373,ud,2,6,9.981657858548527,1,0,0,0,2,289,4.0
93,178116361,ud,2,64,97.18733942955137,2,0,0,0,3,289,4.0
94,178116352,ud,2,33,26.510642177656322,1,0,0,0,2,289,4.0
95,178116412,ud,2,13,8.744693907338423,2,0,0,0,3,289,4.0
96,178116403,ud,2,44,7.589937802482929,1,0,0,0,2,289,4.0
97,178116391,ud,2,63,3.2337931585505255,1,0,0,0,2,289,4.0
98,178116442,ud,2,49,18.960268483800544,2,0,0,0,3,289,4.0
99,178116433,ud,2,25,28.45120493673719,2,0,0,0,3,289,4.0
100,178116424,ud,2,73,19.703617442062708,3,0,0,0,4,289,4.0
101,178116466,ud,2,89,6.070373390656209,1,0,0,0,2,289,4.0
102,178116454,ud,2,40,19.422934647931008,2,0,0,0,3,289,4.0
103,178114202,cd,1,63,0.9089590884782223,0,0,2,1,2,289,4.0
104,178114195,cd,1,62,0.941424761944106,0,0,2,1,2,289,4.0
105,178114188,cd,1,61,0.941424761944106,0,0,2,1,2,289,4.0
106,178114181,cd,1,60,0.9077490603174153,0,0,2,1,2,289,4.0
107,178114237,cd,1,59,0.9497119632913453,0,0,2,1,2,289,4.0
108,178114230,cd,1,58,0.9477775659691995,0,0,2,1,2,289,4.0
109,178114223,cd,1,57,0.9342959962146382,0,0,2,1,2,289,4.0
110,178114216,cd,1,56,0.9342959962146382,0,0,2,1,2,289,4.0
111,178114209,cd,1,55,0.9089590884782223,0,0,2,1,2,289,4.0
112,178114265,cd,1,168,1.0297218259629104,0,0,2,3,2,289,4.0
113,178114258,cd,1,54,0.9223369732586171,0,0,2,1,2,289,4.0
114,178114251,cd,1,53,0.9223369732586171,0,0,2,1,2,289,4.0
115,178114244,cd,1,52,0.9223369732586171,0,0,2,1,2,289,4.0
116,178114301,cd,2,118,531.6587959779065,0,0,5,1,5,289,4.0
117,178114293,cd,2,91,465.2203723728045,0,0,3,1,3,289,4.0
118,178114286,cd,2,51,367.5697834268839,0,0,2,1,2,289,4.0
119,178114279,cd,2,172,624.9207409567688,0,0,2,5,2,289,4.0
120,178114272,cd,1,50,0.94338191062512,0,0,2,1,2,289,4.0
121,178114078,cd,1,49,1.0947243984672828,0,0,2,1,2,289,4.0
122,178114071,cd,1,48,1.1098153107223958,0,0,2,1,2,289,4.0
123,178114064,cd,1,47,1.2174971006546844,0,0,2,1,2,289,4.0
124,178114057,cd,1,46,0.9199480552210805,0,0,2,1,2,289,4.0
125,178114050,cd,1,179,1.003276148965731,0,0,2,11,2,289,4.0
126,178114110,cd,1,160,1.1783734445516045,0,0,2,2,2,289,4.0
127,178114102,cd,1,90,1.9930802399796521,0,0,3,1,3,289,4.0
128,178114092,cd,1,117,2.7050104928942007,0,0,5,1,5,289,4.0
129,178114085,cd,1,159,1.3527273718283175,0,0,2,2,2,289,4.0
130,178114135,cd,1,104,2.7056156083227485,0,0,4,1,4,289,4.0
131,178114125,cd,1,116,3.195609420651135,0,0,5,1,5,289,4.0
132,178114117,cd,1,89,1.9080802399796521,0,0,3,1,3,289,4.0
133,178114174,cd,1,45,0.9077490603174153,0,0,2,1,2,289,4.0
134,178114167,cd,1,44,1.1847501901775706,0,0,2,1,2,289,4.0
135,178114159,cd,1,88,2.1840938437706434,0,0,3,1,3,289,4.0
136,178114151,cd,1,87,2.077478019642151,0,0,3,1,3,289,4.0
137,178114144,cd,1,43,1.341396224214104,0,0,2,1,2,289,4.0
138,178114462,cd,2,115,270.41382006009326,0,0,5,1,5,289,4.0
139,178114454,cd,2,163,50.697293414905644,0,0,3,2,3,289,4.0
140,178114441,cd,2,142,498.038222145683,0,0,8,1,8,289,4.0
141,178114433,cd,2,86,119.37717820230554,0,0,3,1,3,289,4.0
142,178114490,cd,2,158,35.05931095517647,0,0,2,2,2,289,4.0
143,178114481,cd,2,103,254.7758376003641,0,0,4,1,4,289,4.0
144,178114472,cd,2,102,135.0151606620347,0,0,4,1,4,289,4.0
145,178114519,cd,2,130,426.35979946409645,0,0,6,1,6,289,4.0
146,178114508,cd,2,129,446.9764485019149,0,0,6,1,6,289,4.0
147,178114497,cd,2,128,424.0812476916143,0,0,6,1,6,289,4.0
148,178114559,cd,2,114,410.6485120928216,0,0,5,1,5,289,4.0
149,178114551,cd,2,85,106.16096616542698,0,0,3,1,3,289,4.0
150,178114542,cd,2,101,422.8754552301773,0,0,4,1,4,289,4.0
151,178114530,cd,2,139,460.1967535941729,0,0,7,1,7,289,4.0
152,178114335,cd,2,113,409.784636748169,0,0,5,1,5,289,4.0
153,178114327,cd,2,84,244.28098742824184,0,0,3,1,3,289,4.0
154,178114320,cd,2,42,108.88232803018329,0,0,2,1,2,289,4.0
155,178114311,cd,2,100,413.36987395757785,0,0,4,1,4,289,4.0
156,178114360,cd,2,127,481.410970786431,0,0,6,1,6,289,4.0
157,178114352,cd,2,83,253.78656870084126,0,0,3,1,3,289,4.0
158,178114345,cd,2,41,118.38790930278272,0,0,2,1,2,289,4.0
159,178114392,cd,2,99,163.24569811359748,0,0,4,1,4,289,4.0
160,178114382,cd,2,112,301.8470681613317,0,0,5,1,5,289,4.0
161,178114371,cd,2,126,449.19889117705145,0,0,6,1,6,289,4.0
162,178114423,cd,2,111,423.8647241297001,0,0,5,1,5,289,4.0
163,178114413,cd,2,110,298.64435751165604,0,0,5,1,5,289,4.0
164,178114401,cd,2,138,493.0674110883434,0,0,7,1,7,289,4.0
165,178113690,cd,1,40,2.2355547151302386,0,0,2,1,2,289,4.0
166,178113679,cd,1,125,5.441336619225931,0,0,6,1,6,289,4.0
167,178113668,cd,1,124,5.441336619225931,0,0,6,1,6,289,4.0
168,178113719,cd,1,123,5.441336619225931,0,0,6,1,6,289,4.0
169,178113708,cd,1,122,5.59795734932999,0,0,6,1,6,289,4.0
170,178113697,cd,1,121,5.549759740855613,0,0,6,1,6,289,4.0
171,178113749,cd,1,141,6.565453983443483,0,0,8,1,8,289,4.0
172,178113741,cd,1,82,2.7193674407429604,0,0,3,1,3,289,4.0
173,178113730,cd,1,120,6.255830798225432,0,0,6,1,6,289,4.0
174,178113788,cd,1,137,6.257000621537477,0,0,7,1,7,289,4.0
175,178113776,cd,1,136,6.205085642124059,0,0,7,1,7,289,4.0
176,178113762,cd,1,143,6.659471198335579,0,0,9,1,9,289,4.0
177,178113657,cd,1,119,5.59795734932999,0,0,6,1,6,289,4.0
178,178113648,cd,1,98,5.20643613666668,0,0,4,1,4,289,4.0
179,178113949,cd,1,178,1.1318650383167577,0,0,2,10,2,289,4.0
180,178113942,cd,1,171,1.3863816882060078,0,0,2,5,2,289,4.0
181,178113934,cd,1,81,1.626048102837665,0,0,3,1,3,289,4.0
182,178113927,cd,1,39,1.1486881969282559,0,0,2,1,2,289,4.0
183,178113920,cd,1,157,0.9286318931350004,0,0,2,2,2,289,4.0
184,178113978,cd,1,177,0.965684967972427,0,0,2,8,2,289,4.0
185,178113971,cd,1,38,1.1320063897236556,0,0,2,1,2,289,4.0
186,178113964,cd,1,156,0.8932025872994627,0,0,2,2,2,289,4.0
187,178113956,cd,1,80,1.2181649153187426,0,0,3,1,3,289,4.0
188,178114013,cd,1,155,1.0287182700920414,0,0,2,2,2,289,4.0
189,178114006,cd,1,37,0.9434659219393065,0,0,2,1,2,289,4.0
190,178113999,cd,1,36,1.1861175423000014,0,0,2,1,2,289,4.0
191,178113992,cd,1,176,0.8898738726596667,0,0,2,7,2,289,4.0
192,178113985,cd,1,174,0.9292391820031827,0,0,2,6,2,289,4.0
193,178114043,cd,1,154,1.1371935289286799,0,0,2,2,2,289,4.0
194,178114035,cd,1,79,1.3907107534540772,0,0,3,1,3,289,4.0
195,178114028,cd,1,35,1.267733351873885,0,0,2,1,2,289,4.0
196,178114020,cd,1,78,1.3142558267084516,0,0,3,1,3,289,4.0
197,178113823,cd,1,135,6.351817902357661,0,0,7,1,7,289,4.0
198,178113816,cd,1,153,1.0202718002536153,0,0,2,2,2,289,4.0
199,178113809,cd,1,167,1.3064033612180017,0,0,2,3,2,289,4.0
200,178113800,cd,1,97,2.7205372640550065,0,0,4,1,4,289,4.0
201,178113847,cd,1,134,6.103051765096433,0,0,7,1,7,289,4.0
202,178113835,cd,1,133,6.1253586420829755,0,0,7,1,7,289,4.0
203,178113880,cd,1,109,5.66472660638763,0,0,5,1,5,289,4.0
204,178113871,cd,1,96,3.3519096023508452,0,0,4,1,4,289,4.0
205,178113859,cd,1,132,6.090323848978857,0,0,7,1,7,289,4.0
206,178113913,cd,1,34,1.0093121726219123,0,0,2,1,2,289,4.0
207,178113905,cd,1,77,2.1596795380263343,0,0,3,1,3,289,4.0
208,178113898,cd,1,33,3.7878359321476966,0,0,2,1,2,289,4.0
209,178113890,cd,1,76,4.169005519090355,0,0,3,1,3,289,4.0
210,178115097,cd,2,166,7.912076749014975,0,0,2,3,2,289,4.0
211,178115090,cd,2,152,5.0864722060496845,0,0,2,2,2,289,4.0
212,178115083,cd,2,151,7.352605429082982,0,0,2,2,2,289,4.0
213,178115076,cd,2,32,4.35672074792239,0,0,2,1,2,289,4.0
214,178115118,cd,2,31,8.261474913898045,0,0,2,1,2,289,4.0
215,178115111,cd,2,30,8.313741901821203,0,0,2,1,2,289,4.0
216,178115104,cd,2,175,16.213598427332222,0,0,2,7,2,289,4.0
217,178114719,cd,2,29,14.68547243901899,0,0,2,1,2,289,4.0
218,178114712,cd,2,28,31.669544425129956,0,0,2,1,2,289,4.0
219,178114704,cd,2,75,29.05842686691661,0,0,3,1,3,289,4.0
220,178114694,cd,2,108,35.636845122330264,0,0,5,1,5,289,4.0
221,178114748,cd,2,27,50.490715945951116,0,0,2,1,2,289,4.0
222,178114741,cd,2,26,40.87032587297422,0,0,2,1,2,289,4.0
223,178114733,cd,2,74,23.46778778290141,0,0,3,1,3,289,4.0
224,178114726,cd,2,25,24.04300221164694,0,0,2,1,2,289,4.0
225,178114778,cd,2,180,50.74101321717548,0,0,2,15,2,289,4.0
226,178114769,cd,2,95,93.78110928240271,0,0,4,1,4,289,4.0
227,178114762,cd,2,150,43.03074725953599,0,0,2,2,2,289,4.0
228,178114755,cd,2,24,14.618277169110257,0,0,2,1,2,289,4.0
229,178114815,cd,2,73,76.60639961517275,0,0,3,1,3,289,4.0
230,178114807,cd,2,72,58.19163309789936,0,0,3,1,3,289,4.0
231,178114799,cd,2,71,65.35201399231205,0,0,3,1,3,289,4.0
232,178114792,cd,2,23,48.568862217339294,0,0,2,1,2,289,4.0
233,178114785,cd,2,22,21.838986966763873,0,0,2,1,2,289,4.0
234,178114591,cd,2,107,35.31144722907509,0,0,5,1,5,289,4.0
235,178114584,cd,2,21,439.88620532545315,0,0,2,1,2,289,4.0
236,178114576,cd,2,70,473.1232804216527,0,0,3,1,3,289,4.0
237,178114569,cd,2,149,304.0343938923167,0,0,2,2,2,289,4.0
238,178114619,cd,2,140,46.52932258286882,0,0,8,1,8,289,4.0
239,178114609,cd,2,106,17.225870737196846,0,0,5,1,5,289,4.0
240,178114601,cd,2,69,16.393649412333588,0,0,3,1,3,289,4.0
241,178114650,cd,2,131,42.561030773140864,0,0,7,1,7,289,4.0
242,178114640,cd,2,105,19.332529131438502,0,0,5,1,5,289,4.0
243,178114632,cd,2,68,13.333194363819459,0,0,3,1,3,289,4.0
244,178114685,cd,2,94,34.96482496661695,0,0,4,1,4,289,4.0
245,178114678,cd,2,20,9.62966493067293,0,0,2,1,2,289,4.0
246,178114671,cd,2,19,8.114653777644772,0,0,2,1,2,289,4.0
247,178114662,cd,2,93,15.36423732171055,0,0,4,1,4,289,4.0
248,178114975,cd,2,148,8.279072604852725,0,0,2,2,2,289,4.0
249,178114967,cd,2,67,12.2625724578998,0,0,3,1,3,289,4.0
250,178114960,cd,2,18,4.901353884516739,0,0,2,1,2,289,4.0
251,178114953,cd,2,165,12.94164277791117,0,0,2,3,2,289,4.0
252,178114946,cd,2,17,9.796270748743574,0,0,2,1,2,289,4.0
253,178115004,cd,2,170,15.029449563370694,0,0,2,5,2,289,4.0
254,178114997,cd,2,147,4.6881802117959115,0,0,2,2,2,289,4.0
255,178114990,cd,2,164,8.536942821330818,0,0,2,3,2,289,4.0
256,178114982,cd,2,162,11.300907513174279,0,0,3,2,3,289,4.0
257,178115033,cd,2,16,32.42420532965952,0,0,2,1,2,289,4.0
258,178115025,cd,2,66,25.505135436551242,0,0,3,1,3,289,4.0
259,178115018,cd,2,146,15.69852091067646,0,0,2,2,2,289,4.0
260,178115011,cd,2,15,10.446508849997299,0,0,2,1,2,289,4.0
261,178115068,cd,2,65,18.983150007893634,0,0,3,1,3,289,4.0
262,178115061,cd,2,145,11.30915928897098,0,0,2,2,2,289,4.0
263,178115054,cd,2,14,3.30003709582577,0,0,2,1,2,289,4.0
264,178115047,cd,2,13,3.5924922380167446,0,0,2,1,2,289,4.0
265,178115040,cd,2,12,42.588674330279105,0,0,2,1,2,289,4.0
266,178114844,cd,2,173,12.554060764105394,0,0,2,6,2,289,4.0
267,178114837,cd,2,11,25.4336780596731,0,0,2,1,2,289,4.0
268,178114830,cd,2,10,10.545611372587324,0,0,2,1,2,289,4.0
269,178114823,cd,2,144,41.0169234306694,0,0,2,2,2,289,4.0
270,178114873,cd,2,9,10.89037207890962,0,0,2,1,2,289,4.0
271,178114866,cd,2,8,5.006485147017874,0,0,2,1,2,289,4.0
272,178114859,cd,2,7,7.447421895242262,0,0,2,1,2,289,4.0
273,178114851,cd,2,161,19.414635773355513,0,0,3,2,3,289,4.0
274,178114910,cd,2,64,10.045711237339587,0,0,3,1,3,289,4.0
275,178114903,cd,2,6,6.301007397571869,0,0,2,1,2,289,4.0
276,178114896,cd,2,5,8.575368853176874,0,0,2,1,2,289,4.0
277,178114887,cd,2,92,13.982447659087807,0,0,4,1,4,289,4.0
278,178114880,cd,2,4,10.827556220374385,0,0,2,1,2,289,4.0
279,178114939,cd,2,3,15.906155494640055,0,0,2,1,2,289,4.0
280,178114932,cd,2,2,15.604293944983123,0,0,2,1,2,289,4.0
281,178114925,cd,2,1,13.046776923749864,0,0,2,1,2,289,4.0
282,178114918,cd,2,169,12.376642509661913,0,0,2,5,2,289,4.0
