counter,AS,Type,GranularityValue,SeverityScore,PageRank,NumBadDep,TotalDep,NumberOfVerteces,NumOfCycle,NumSetOfElement,TotNumOfSetOfElement,ADI
1,709055,ud,2,2,42.261704387729445,2,0,0,0,3,20,7.0
2,709046,ud,2,1,29.8134044734202,2,0,0,0,3,20,7.0
3,708875,cd,1,11,2.657427039448866,0,0,2,11,2,20,7.0
4,708890,cd,1,7,2.206952594207944,0,0,2,1,2,20,7.0
5,708882,cd,1,9,2.7757836083371563,0,0,3,1,3,20,7.0
6,708904,cd,1,8,2.9787666173697955,0,0,3,1,3,20,7.0
7,708897,cd,1,6,2.677086682990955,0,0,2,1,2,20,7.0
8,708926,cd,1,5,1.1066488572617348,0,0,2,1,2,20,7.0
9,708912,cd,1,4,6.821509900301276,0,0,2,1,2,20,7.0
10,708919,cd,1,3,1.1066488572617348,0,0,2,1,2,20,7.0
11,708940,cd,1,10,1.0271816946782106,0,0,2,8,2,20,7.0
12,708933,cd,1,2,0.9311532775853351,0,0,2,1,2,20,7.0
13,708947,cd,2,1,41.435560894638236,0,0,2,1,2,20,7.0
