counter,AS,Type,GranularityValue,SeverityScore,PageRank,NumBadDep,TotalDep,NumberOfVerteces,NumOfCycle,NumSetOfElement,TotNumOfSetOfElement,ADI
1,1076234,ud,2,7,27.68551874447817,1,0,0,0,2,93,24.0
2,1076150,ud,2,4,22.213260427059566,2,0,0,0,3,93,24.0
3,1076141,ud,2,6,58.69533734981153,4,0,0,0,5,93,24.0
4,1076165,ud,2,2,17.594706822534206,1,0,0,0,2,93,24.0
5,1076174,ud,2,5,53.505359703475904,6,0,0,0,7,93,24.0
6,1076210,ud,2,1,7.201774373538287,1,0,0,0,2,93,24.0
7,1076219,ud,2,8,19.611944139799217,2,0,0,0,3,93,24.0
8,1076201,ud,2,3,12.045275388128905,1,0,0,0,2,93,24.0
9,1076008,hl,1,3,27.63279843458898,0,62,0,0,61,93,24.0
10,1076079,hl,2,2,178.3231934790937,0,26,0,0,21,93,24.0
11,1076113,hl,2,1,102.31397990303533,0,20,0,0,19,93,24.0
12,1075321,cd,1,48,3.2618110453834306,0,0,2,5,2,93,24.0
13,1075352,cd,1,29,2.894568971310223,0,0,3,1,3,93,24.0
14,1075328,cd,1,16,1.4851336736785448,0,0,2,1,2,93,24.0
15,1075335,cd,1,28,2.5996498440956355,0,0,3,1,3,93,24.0
16,1075343,cd,1,41,3.632428548644885,0,0,4,1,4,93,24.0
17,1075376,cd,1,27,3.5089228342703622,0,0,3,1,3,93,24.0
18,1075384,cd,1,45,3.6072736783172172,0,0,3,2,3,93,24.0
19,1075360,cd,1,40,3.296346920397561,0,0,4,1,4,93,24.0
20,1075369,cd,1,15,2.4761441297211118,0,0,2,1,2,93,24.0
21,1075408,cd,1,14,1.4082110399240924,0,0,2,1,2,93,24.0
22,1075415,cd,1,47,3.4882739974602535,0,0,2,4,2,93,24.0
23,1075422,cd,1,39,4.286550378801252,0,0,4,1,4,93,24.0
24,1075392,cd,1,38,4.4533509314543025,0,0,4,1,4,93,24.0
25,1075401,cd,1,13,1.4392182607515347,0,0,2,1,2,93,24.0
26,1075447,cd,1,37,3.6184635909078504,0,0,4,1,4,93,24.0
27,1075431,cd,1,12,1.8996847680085758,0,0,2,1,2,93,24.0
28,1075438,cd,1,36,3.7058542159078502,0,0,4,1,4,93,24.0
29,1075474,cd,1,35,3.0976282080715674,0,0,4,1,4,93,24.0
30,1075483,cd,1,11,1.8784347680085758,0,0,2,1,2,93,24.0
31,1075456,cd,1,26,2.7723863377707647,0,0,3,1,3,93,24.0
32,1075464,cd,1,42,3.943705461208652,0,0,5,1,5,93,24.0
33,1075505,cd,1,25,1.4449918676959008,0,0,3,1,3,93,24.0
34,1075513,cd,1,10,1.0311619340679539,0,0,2,1,2,93,24.0
35,1075490,cd,1,44,4.334351250597339,0,0,3,2,3,93,24.0
36,1075498,cd,1,43,2.7662616426614637,0,0,2,2,2,93,24.0
37,1075542,cd,2,34,53.851554878424764,0,0,4,1,4,93,24.0
38,1075551,cd,2,24,46.40275308252608,0,0,3,1,3,93,24.0
39,1075520,cd,1,9,1.015813747351848,0,0,2,1,2,93,24.0
40,1075527,cd,2,23,63.456279576454826,0,0,3,1,3,93,24.0
41,1075535,cd,2,8,30.81321491902508,0,0,2,1,2,93,24.0
42,1075574,cd,2,49,56.007477780556144,0,0,2,10,2,93,24.0
43,1075581,cd,2,7,35.16206768042877,0,0,2,1,2,93,24.0
44,1075559,cd,2,6,40.50077986179861,0,0,2,1,2,93,24.0
45,1075566,cd,2,22,56.09031802529962,0,0,3,1,3,93,24.0
46,1075602,cd,2,33,31.03312026459259,0,0,4,1,4,93,24.0
47,1075611,cd,2,21,15.443582101091586,0,0,3,1,3,93,24.0
48,1075588,cd,2,46,38.6278781229007,0,0,2,3,2,93,24.0
49,1075595,cd,2,5,11.771324522362665,0,0,2,1,2,93,24.0
50,1075636,cd,2,4,16.973957096883368,0,0,2,1,2,93,24.0
51,1075643,cd,2,20,16.65770075458198,0,0,3,1,3,93,24.0
52,1075619,cd,2,32,40.01229705628305,0,0,4,1,4,93,24.0
53,1075628,cd,2,19,32.56349526038437,0,0,3,1,3,93,24.0
54,1075667,cd,2,31,31.45563428691182,0,0,4,1,4,93,24.0
55,1075676,cd,2,18,15.866096123410816,0,0,3,1,3,93,24.0
56,1075651,cd,2,3,9.496947050617255,0,0,2,1,2,93,24.0
57,1075658,cd,2,30,29.128668384050837,0,0,4,1,4,93,24.0
58,1075698,cd,2,17,33.76122497075449,0,0,3,1,3,93,24.0
59,1075684,cd,2,2,20.58313006860063,0,0,2,1,2,93,24.0
60,1075691,cd,2,1,26.31242317485581,0,0,2,1,2,93,24.0
