counter,AS,Type,GranularityValue,SeverityScore,PageRank,NumBadDep,TotalDep,NumberOfVerteces,NumOfCycle,NumSetOfElement,TotNumOfSetOfElement,ADI
1,155922886,ud,2,54,19.64393548601538,3,0,0,0,4,277,6.0
2,155922907,ud,2,38,15.252935503028363,1,0,0,0,2,277,6.0
3,155922898,ud,2,37,16.883243067361366,1,0,0,0,2,277,6.0
4,155922919,ud,2,68,95.54109545320284,1,0,0,0,2,277,6.0
5,155922937,ud,2,84,6.226559094969787,1,0,0,0,2,277,6.0
6,155922928,ud,2,36,6.912072878277423,1,0,0,0,2,277,6.0
7,155922826,ud,2,72,8.70302815724124,1,0,0,0,2,277,6.0
8,155922844,ud,2,94,7.097627882586673,1,0,0,0,2,277,6.0
9,155922835,ud,2,35,4.028611400214119,1,0,0,0,2,277,6.0
10,155922862,ud,2,34,7.106842587387536,1,0,0,0,2,277,6.0
11,155922853,ud,2,95,2.183356278975041,1,0,0,0,2,277,6.0
12,155922871,ud,2,53,12.565998573715632,4,0,0,0,5,277,6.0
13,155923273,ud,2,67,4.118317166752162,1,0,0,0,2,277,6.0
14,155923264,ud,2,71,40.71522869425597,3,0,0,0,4,277,6.0
15,155923294,ud,2,85,3.279149281217718,1,0,0,0,2,277,6.0
16,155923282,ud,2,90,10.091953261426248,1,0,0,0,2,277,6.0
17,155923303,ud,2,70,7.175428139841808,1,0,0,0,2,277,6.0
18,155923324,ud,2,66,275.8324958013386,2,0,0,0,3,277,6.0
19,155923315,ud,2,33,25.946022929002464,1,0,0,0,2,277,6.0
20,155923213,ud,2,32,9.432418604548612,1,0,0,0,2,277,6.0
21,155923204,ud,2,31,79.5067675196093,1,0,0,0,2,277,6.0
22,155923222,ud,2,52,11.856552802985732,2,0,0,0,3,277,6.0
23,155923246,ud,2,30,219.06947849927568,1,0,0,0,2,277,6.0
24,155923234,ud,2,65,10.455623055604553,2,0,0,0,3,277,6.0
25,155923255,ud,2,64,189.67623105222154,1,0,0,0,2,277,6.0
26,155923405,ud,2,63,10.049447188932977,2,0,0,0,3,277,6.0
27,155923393,ud,2,88,12.452023462200847,2,0,0,0,3,277,6.0
28,155923417,ud,2,29,27.694612451647313,1,0,0,0,2,277,6.0
29,155923426,ud,2,62,19.484860381065452,3,0,0,0,4,277,6.0
30,155923450,ud,2,61,12.35499606178595,4,0,0,0,5,277,6.0
31,155923441,ud,2,69,5.493607855144192,2,0,0,0,3,277,6.0
32,155923333,ud,2,28,19.051296512524043,1,0,0,0,2,277,6.0
33,155923354,ud,2,27,10.76105982858029,1,0,0,0,2,277,6.0
34,155923345,ud,2,26,16.710642089328907,2,0,0,0,3,277,6.0
35,155923372,ud,2,25,10.051889267769454,1,0,0,0,2,277,6.0
36,155923363,ud,2,51,13.685849658835508,1,0,0,0,2,277,6.0
37,155923381,ud,2,24,2.117415828038011,1,0,0,0,2,277,6.0
38,155923018,ud,2,23,8.539172627963238,1,0,0,0,2,277,6.0
39,155923009,ud,2,50,10.006970088442513,1,0,0,0,2,277,6.0
40,155923027,ud,2,22,17.27005501730864,4,0,0,0,5,277,6.0
41,155923054,ud,2,83,7.327695324141356,1,0,0,0,2,277,6.0
42,155923045,ud,2,82,7.3779142161293265,1,0,0,0,2,277,6.0
43,155923063,ud,2,81,7.390567338818014,1,0,0,0,2,277,6.0
44,155922946,ud,2,49,53.18829581549211,5,0,0,0,6,277,6.0
45,155922961,ud,2,21,19.135621708668857,2,0,0,0,3,277,6.0
46,155922988,ud,2,60,455.9295965242426,2,0,0,0,3,277,6.0
47,155922979,ud,2,20,20.54983280707603,1,0,0,0,2,277,6.0
48,155922997,ud,2,80,5.27763578858878,1,0,0,0,2,277,6.0
49,155923147,ud,2,19,6.156069093512832,1,0,0,0,2,277,6.0
50,155923138,ud,2,18,5.140827689402375,1,0,0,0,2,277,6.0
51,155923156,ud,2,48,3.1084619388123933,1,0,0,0,2,277,6.0
52,155923177,ud,2,17,7.012843400957609,1,0,0,0,2,277,6.0
53,155923168,ud,2,16,10.22260600535951,1,0,0,0,2,277,6.0
54,155923195,ud,2,15,7.08315326055887,1,0,0,0,2,277,6.0
55,155923186,ud,2,14,94.60974013357776,2,0,0,0,3,277,6.0
56,155923081,ud,2,13,77.12104208956248,3,0,0,0,4,277,6.0
57,155923072,ud,2,79,7.630194948322916,1,0,0,0,2,277,6.0
58,155923096,ud,2,78,7.77587027966987,1,0,0,0,2,277,6.0
59,155923114,ud,2,77,7.437580203581027,1,0,0,0,2,277,6.0
60,155923105,ud,2,76,7.333206427392896,1,0,0,0,2,277,6.0
61,155923123,ud,2,47,474.2630929214823,6,0,0,0,7,277,6.0
62,155923780,ud,2,12,18.253365808708548,2,0,0,0,3,277,6.0
63,155923807,ud,2,75,18.83847424014427,1,0,0,0,2,277,6.0
64,155923795,ud,2,11,18.73544454986075,2,0,0,0,3,277,6.0
65,155923819,ud,2,46,266.1681966230155,2,0,0,0,3,277,6.0
66,155923828,ud,2,87,9.517689072278912,2,0,0,0,3,277,6.0
67,155923726,ud,2,59,4.926072170671969,1,0,0,0,2,277,6.0
68,155923717,ud,2,45,4.511832089417871,1,0,0,0,2,277,6.0
69,155923735,ud,2,44,7.5155786147282,2,0,0,0,3,277,6.0
70,155923756,ud,2,43,16.344679327142394,3,0,0,0,4,277,6.0
71,155923747,ud,2,89,3.8907829863191528,1,0,0,0,2,277,6.0
72,155923768,ud,2,42,2.4668994462580978,1,0,0,0,2,277,6.0
73,155923531,ud,2,10,12.618754167796297,1,0,0,0,2,277,6.0
74,155923522,ud,2,9,7.594646979934064,1,0,0,0,2,277,6.0
75,155923540,ud,2,41,23.106778530927023,3,0,0,0,4,277,6.0
76,155923558,ud,2,8,53.12056103989161,3,0,0,0,4,277,6.0
77,155923582,ud,2,93,3.139907299272041,1,0,0,0,2,277,6.0
78,155923573,ud,2,86,4.384674015920101,1,0,0,0,2,277,6.0
79,155923465,ud,2,7,29.1356013198836,2,0,0,0,3,277,6.0
80,155923480,ud,2,6,5.917261788667883,1,0,0,0,2,277,6.0
81,155923501,ud,2,58,17.642886534479498,1,0,0,0,2,277,6.0
82,155923489,ud,2,5,3.9341780427419057,1,0,0,0,2,277,6.0
83,155923513,ud,2,74,3.7463103692977207,1,0,0,0,2,277,6.0
84,155923657,ud,2,4,6.436216567576918,1,0,0,0,2,277,6.0
85,155923675,ud,2,3,3.425744829685609,1,0,0,0,2,277,6.0
86,155923666,ud,2,57,9.951746193522073,2,0,0,0,3,277,6.0
87,155923687,ud,2,91,5.189880815075691,1,0,0,0,2,277,6.0
88,155923708,ud,2,2,38.308136869967356,2,0,0,0,3,277,6.0
89,155923699,ud,2,40,4.950011731635957,1,0,0,0,2,277,6.0
90,155923591,ud,2,1,66.48038567502923,5,0,0,0,6,277,6.0
91,155923609,ud,2,73,7.336996772036466,1,0,0,0,2,277,6.0
92,155923627,ud,2,39,13.805980707478167,2,0,0,0,3,277,6.0
93,155923618,ud,2,56,3.911050768089697,1,0,0,0,2,277,6.0
94,155923645,ud,2,92,7.8806746183861005,1,0,0,0,2,277,6.0
95,155923636,ud,2,55,25.35704651346894,1,0,0,0,2,277,6.0
96,155920718,cd,1,137,3.8157977552208586,0,0,5,2,5,277,6.0
97,155920710,cd,1,132,3.347478666662045,0,0,3,2,3,277,6.0
98,155920728,cd,1,136,3.711018842280768,0,0,4,2,4,277,6.0
99,155920745,cd,1,131,3.2280849999542935,0,0,3,2,3,277,6.0
100,155920737,cd,1,130,3.2577269794087966,0,0,3,2,3,277,6.0
101,155920761,cd,1,59,2.9454556693924245,0,0,2,1,2,277,6.0
102,155920753,cd,1,129,3.205778122967753,0,0,3,2,3,277,6.0
103,155920655,cd,1,135,4.393435476585244,0,0,4,2,4,277,6.0
104,155920644,cd,1,99,4.773054434718987,0,0,6,1,6,277,6.0
105,155920664,cd,1,128,3.659508263803451,0,0,3,2,3,277,6.0
106,155920672,cd,1,142,1.361651722140775,0,0,2,3,2,277,6.0
107,155920679,cd,1,134,3.7315576852472767,0,0,4,2,4,277,6.0
108,155920703,cd,1,121,3.5082104179072267,0,0,2,2,2,277,6.0
109,155920688,cd,1,120,1.0413238027731113,0,0,2,2,2,277,6.0
110,155920695,cd,1,127,3.260006497832472,0,0,3,2,3,277,6.0
111,155920841,cd,1,78,2.359835587356826,0,0,3,1,3,277,6.0
112,155920834,cd,1,58,2.686791999925406,0,0,2,1,2,277,6.0
113,155920856,cd,1,57,1.2148232301964623,0,0,2,1,2,277,6.0
114,155920863,cd,1,56,0.9698404409226699,0,0,2,1,2,277,6.0
115,155920849,cd,1,55,1.2489490834745385,0,0,2,1,2,277,6.0
116,155920877,cd,1,54,1.1211155865609812,0,0,2,1,2,277,6.0
117,155920870,cd,1,53,0.9698404409226699,0,0,2,1,2,277,6.0
118,155920891,cd,1,77,1.7038684387325642,0,0,3,1,3,277,6.0
119,155920884,cd,1,52,1.0639720067101677,0,0,2,1,2,277,6.0
120,155920782,cd,1,76,1.6553744990301105,0,0,3,1,3,277,6.0
121,155920768,cd,1,51,1.1486881969282559,0,0,2,1,2,277,6.0
122,155920775,cd,1,147,1.4147964609203263,0,0,2,5,2,277,6.0
123,155920798,cd,1,152,1.1452221297328253,0,0,2,7,2,277,6.0
124,155920790,cd,1,75,1.2300946152133,0,0,3,1,3,277,6.0
125,155920812,cd,1,154,1.0036907048791366,0,0,2,11,2,277,6.0
126,155920805,cd,1,119,0.8932025872994627,0,0,2,2,2,277,6.0
127,155920827,cd,1,118,0.9477801270086554,0,0,2,2,2,277,6.0
128,155920819,cd,1,74,1.1996808873304334,0,0,3,1,3,277,6.0
129,155920589,cd,1,98,4.632339102310497,0,0,6,1,6,277,6.0
130,155920580,cd,1,85,2.7849891300855094,0,0,4,1,4,277,6.0
131,155920600,cd,1,97,4.632339102310497,0,0,6,1,6,277,6.0
132,155920622,cd,1,96,4.632339102310497,0,0,6,1,6,277,6.0
133,155920611,cd,1,95,4.7244871328586155,0,0,6,1,6,277,6.0
134,155920633,cd,1,94,4.773054434718987,0,0,6,1,6,277,6.0
135,155920570,cd,1,91,4.6578554555419105,0,0,5,1,5,277,6.0
136,155920563,cd,1,50,2.251693126422892,0,0,2,1,2,277,6.0
137,155921230,cd,2,126,35.471125633311544,0,0,3,2,3,277,6.0
138,155921216,cd,2,49,7.9881848270488405,0,0,2,1,2,277,6.0
139,155921223,cd,2,117,23.771805777591695,0,0,2,2,2,277,6.0
140,155921246,cd,2,116,44.4668678712203,0,0,2,2,2,277,6.0
141,155921238,cd,2,125,22.354242739215778,0,0,3,2,3,277,6.0
142,155921260,cd,2,48,15.339267219818954,0,0,2,1,2,277,6.0
143,155921253,cd,2,115,69.80249368872578,0,0,2,2,2,277,6.0
144,155921275,cd,2,90,109.57144308738746,0,0,5,1,5,277,6.0
145,155921267,cd,2,73,68.17176198832006,0,0,3,1,3,277,6.0
146,155921165,cd,2,114,300.0930176149395,0,0,2,2,2,277,6.0
147,155921157,cd,2,72,225.4965313090775,0,0,3,1,3,277,6.0
148,155921180,cd,2,47,107.76726442894225,0,0,2,1,2,277,6.0
149,155921172,cd,2,71,218.7431217124137,0,0,3,1,3,277,6.0
150,155921194,cd,2,46,23.524295781941454,0,0,2,1,2,277,6.0
151,155921187,cd,2,45,9.890591617303517,0,0,2,1,2,277,6.0
152,155921209,cd,2,44,5.2743251039107495,0,0,2,1,2,277,6.0
153,155921201,cd,2,70,7.696714537924613,0,0,3,1,3,277,6.0
154,155921358,cd,2,43,23.997507972690265,0,0,2,1,2,277,6.0
155,155921344,cd,2,42,14.713478707596018,0,0,2,1,2,277,6.0
156,155921351,cd,2,113,15.572746004665149,0,0,2,2,2,277,6.0
157,155921372,cd,2,41,10.267097766120223,0,0,2,1,2,277,6.0
158,155921365,cd,2,40,31.79734955506926,0,0,2,1,2,277,6.0
159,155921388,cd,2,39,8.657690309260031,0,0,2,1,2,277,6.0
160,155921379,cd,2,84,12.194506009898834,0,0,4,1,4,277,6.0
161,155921402,cd,2,38,10.795574289591041,0,0,2,1,2,277,6.0
162,155921395,cd,2,112,10.66729127872324,0,0,2,2,2,277,6.0
163,155921293,cd,2,111,48.9413355627333,0,0,2,2,2,277,6.0
164,155921285,cd,2,124,56.48299002639918,0,0,3,2,3,277,6.0
165,155921309,cd,2,123,61.00149668061134,0,0,3,2,3,277,6.0
166,155921300,cd,2,83,73.19703065413667,0,0,4,1,4,277,6.0
167,155921326,cd,2,89,85.2571917720147,0,0,5,1,5,277,6.0
168,155921317,cd,2,133,59.0219130690831,0,0,4,2,4,277,6.0
169,155921336,cd,2,69,56.17462795723675,0,0,3,1,3,277,6.0
170,155920968,cd,1,110,1.1643812693925693,0,0,2,2,2,277,6.0
171,155920975,cd,1,37,0.8899784923786149,0,0,2,1,2,277,6.0
172,155920989,cd,1,36,0.94338191062512,0,0,2,1,2,277,6.0
173,155920982,cd,1,109,1.0721124610360704,0,0,2,2,2,277,6.0
174,155921003,cd,1,35,0.9411593776853151,0,0,2,1,2,277,6.0
175,155920996,cd,1,141,1.023107897808326,0,0,2,3,2,277,6.0
176,155921017,cd,1,34,1.0012709136600462,0,0,2,1,2,277,6.0
177,155921010,cd,1,33,1.0585143075696062,0,0,2,1,2,277,6.0
178,155920907,cd,1,82,2.1903049894434674,0,0,4,1,4,277,6.0
179,155920899,cd,1,68,1.6444428201034724,0,0,3,1,3,277,6.0
180,155920925,cd,1,32,1.539661863970211,0,0,2,1,2,277,6.0
181,155920916,cd,1,81,2.034038122649101,0,0,4,1,4,277,6.0
182,155920941,cd,1,67,1.760200734342772,0,0,3,1,3,277,6.0
183,155920932,cd,1,80,2.3060629036827667,0,0,4,1,4,277,6.0
184,155920959,cd,1,79,1.974181630068309,0,0,4,1,4,277,6.0
185,155920949,cd,1,88,2.5200437994083043,0,0,5,1,5,277,6.0
186,155921101,cd,1,31,1.2260459198654514,0,0,2,1,2,277,6.0
187,155921094,cd,1,149,0.9210415555005761,0,0,2,6,2,277,6.0
188,155921115,cd,1,30,0.9251184044514899,0,0,2,1,2,277,6.0
189,155921108,cd,1,151,0.8898738726596667,0,0,2,7,2,277,6.0
190,155921129,cd,1,108,0.9286318931350004,0,0,2,2,2,277,6.0
191,155921122,cd,1,29,1.0093121726219123,0,0,2,1,2,277,6.0
192,155921150,cd,2,28,348.47507272387617,0,0,2,1,2,277,6.0
193,155921136,cd,2,148,12.49248932956613,0,0,2,6,2,277,6.0
194,155921143,cd,2,145,563.3841203246091,0,0,2,4,2,277,6.0
195,155921038,cd,1,27,0.9077490603174153,0,0,2,1,2,277,6.0
196,155921024,cd,1,26,0.9089590884782223,0,0,2,1,2,277,6.0
197,155921031,cd,1,25,0.9089590884782223,0,0,2,1,2,277,6.0
198,155921052,cd,1,24,1.04411955569785,0,0,2,1,2,277,6.0
199,155921045,cd,1,23,0.9077490603174153,0,0,2,1,2,277,6.0
200,155921066,cd,1,107,0.9038212824571703,0,0,2,2,2,277,6.0
201,155921059,cd,1,22,0.9958668379360918,0,0,2,1,2,277,6.0
202,155921080,cd,1,21,1.275042963863376,0,0,2,1,2,277,6.0
203,155921087,cd,1,153,0.9728966888114993,0,0,2,8,2,277,6.0
204,155921073,cd,1,106,0.9105438252173587,0,0,2,2,2,277,6.0
205,155921736,cd,2,122,10.861969190968678,0,0,3,2,3,277,6.0
206,155921729,cd,2,105,11.40741654597264,0,0,2,2,2,277,6.0
207,155921744,cd,2,140,8.46783094504266,0,0,2,3,2,277,6.0
208,155921678,cd,2,104,7.377599674460403,0,0,2,2,2,277,6.0
209,155921664,cd,2,103,7.289397890038112,0,0,2,2,2,277,6.0
210,155921671,cd,2,139,6.029637422785923,0,0,2,3,2,277,6.0
211,155921692,cd,2,66,14.128011941210442,0,0,3,1,3,277,6.0
212,155921685,cd,2,144,12.499787412970703,0,0,2,4,2,277,6.0
213,155921707,cd,2,146,12.379071247149874,0,0,2,5,2,277,6.0
214,155921700,cd,2,20,42.58940511210468,0,0,2,1,2,277,6.0
215,155921722,cd,2,102,16.204544868983692,0,0,2,2,2,277,6.0
216,155921714,cd,2,65,10.052807382380703,0,0,3,1,3,277,6.0
217,155921487,cd,2,93,39.77421325130392,0,0,6,1,6,277,6.0
218,155921479,cd,2,64,12.45573193308034,0,0,3,1,3,277,6.0
219,155921498,cd,2,19,7.350607707867134,0,0,2,1,2,277,6.0
220,155921513,cd,2,87,36.42704226778545,0,0,5,1,5,277,6.0
221,155921505,cd,2,63,15.593263204724432,0,0,3,1,3,277,6.0
222,155921531,cd,2,18,3.588411534460305,0,0,2,1,2,277,6.0
223,155921523,cd,2,62,12.123279125595696,0,0,3,1,3,277,6.0
224,155921416,cd,2,17,30.59064949845727,0,0,2,1,2,277,6.0
225,155921423,cd,2,61,30.333199494257414,0,0,3,1,3,277,6.0
226,155921409,cd,2,16,38.847582775215635,0,0,2,1,2,277,6.0
227,155921431,cd,2,86,39.89702634691419,0,0,5,1,5,277,6.0
228,155921453,cd,2,92,40.26050324436241,0,0,6,1,6,277,6.0
229,155921441,cd,2,100,42.86646460309653,0,0,7,1,7,277,6.0
230,155921464,cd,2,15,7.836897700925629,0,0,2,1,2,277,6.0
231,155921471,cd,2,60,12.942021926138834,0,0,3,1,3,277,6.0
232,155921608,cd,2,14,25.839369754083926,0,0,2,1,2,277,6.0
233,155921615,cd,2,13,12.176954435324056,0,0,2,1,2,277,6.0
234,155921601,cd,2,12,10.651209877822946,0,0,2,1,2,277,6.0
235,155921629,cd,2,101,4.707143430746736,0,0,2,2,2,277,6.0
236,155921622,cd,2,143,12.87604069181208,0,0,2,4,2,277,6.0
237,155921643,cd,2,11,20.799363469730906,0,0,2,1,2,277,6.0
238,155921636,cd,2,10,5.05313211466208,0,0,2,1,2,277,6.0
239,155921657,cd,2,9,6.25813209230864,0,0,2,1,2,277,6.0
240,155921650,cd,2,8,3.1202090323927223,0,0,2,1,2,277,6.0
241,155921545,cd,2,150,10.962066941635035,0,0,2,7,2,277,6.0
242,155921538,cd,2,7,13.541617255434119,0,0,2,1,2,277,6.0
243,155921566,cd,2,6,15.596016697249706,0,0,2,1,2,277,6.0
244,155921552,cd,2,138,12.952458145118726,0,0,2,3,2,277,6.0
245,155921559,cd,2,5,7.906866906836171,0,0,2,1,2,277,6.0
246,155921580,cd,2,4,13.03321014623835,0,0,2,1,2,277,6.0
247,155921573,cd,2,3,9.78903245018821,0,0,2,1,2,277,6.0
248,155921594,cd,2,2,4.546119300870908,0,0,2,1,2,277,6.0
249,155921587,cd,2,1,15.912274632102097,0,0,2,1,2,277,6.0
