counter,AS,Type,GranularityValue,SeverityScore,PageRank,NumBadDep,TotalDep,NumberOfVerteces,NumOfCycle,NumSetOfElement,TotNumOfSetOfElement,ADI
1,322753338,ud,2,82,4.532647012727474,1,0,0,0,2,307,16.0
2,322753329,ud,2,68,12.127427438272246,2,0,0,0,3,307,16.0
3,322753320,ud,2,89,5.200821339134223,1,0,0,0,2,307,16.0
4,322753305,ud,2,49,5.856697082915423,1,0,0,0,2,307,16.0
5,322753296,ud,2,67,6.942296705632062,1,0,0,0,2,307,16.0
6,322753284,ud,2,94,80.72839092313453,6,0,0,0,7,307,16.0
7,322753401,ud,2,48,17.070196417079497,4,0,0,0,5,307,16.0
8,322753392,ud,2,47,197.028062148912,1,0,0,0,2,307,16.0
9,322753383,ud,2,46,75.08501522313298,1,0,0,0,2,307,16.0
10,322753371,ud,2,88,13.135188503272161,2,0,0,0,3,307,16.0
11,322753350,ud,2,45,6.871623798606768,1,0,0,0,2,307,16.0
12,322753470,ud,2,81,212.53079951449521,1,0,0,0,2,307,16.0
13,322753455,ud,2,66,72.61581208059772,3,0,0,0,4,307,16.0
14,322753434,ud,2,44,17.893830935952,1,0,0,0,2,307,16.0
15,322753419,ud,2,87,50.97791023242422,5,0,0,0,6,307,16.0
16,322753527,ud,2,43,4.762465239428382,1,0,0,0,2,307,16.0
17,322753518,ud,2,42,3.942901339223961,1,0,0,0,2,307,16.0
18,322753506,ud,2,80,9.580590761076845,2,0,0,0,3,307,16.0
19,322753479,ud,2,41,80.80694701980147,1,0,0,0,2,307,16.0
20,322753080,ud,2,65,60.48109622929928,1,0,0,0,2,307,16.0
21,322753071,ud,2,40,7.581282274805606,1,0,0,0,2,307,16.0
22,322753056,ud,2,86,3.5726029953009073,1,0,0,0,2,307,16.0
23,322753047,ud,2,79,302.6586421902407,3,0,0,0,4,307,16.0
24,322753035,ud,2,39,9.71421125974487,1,0,0,0,2,307,16.0
25,322753026,ud,2,64,7.776628453261122,1,0,0,0,2,307,16.0
26,322753143,ud,2,78,606.1973492140555,3,0,0,0,4,307,16.0
27,322753134,ud,2,63,3.075588866892897,1,0,0,0,2,307,16.0
28,322753122,ud,2,38,17.43639633101289,2,0,0,0,3,307,16.0
29,322753110,ud,2,62,87.48877682753896,2,0,0,0,3,307,16.0
30,322753098,ud,2,37,62.43747675858762,2,0,0,0,3,307,16.0
31,322753089,ud,2,36,2.964189377292377,1,0,0,0,2,307,16.0
32,322753215,ud,2,61,73.31099388686813,6,0,0,0,7,307,16.0
33,322753206,ud,2,35,5.13955653016873,1,0,0,0,2,307,16.0
34,322753197,ud,2,34,13.54341797354741,2,0,0,0,3,307,16.0
35,322753188,ud,2,33,13.906014804086285,1,0,0,0,2,307,16.0
36,322753170,ud,2,32,18.87338872278665,2,0,0,0,3,307,16.0
37,322753161,ud,2,31,10.730136101396191,1,0,0,0,2,307,16.0
38,322753152,ud,2,30,10.78504317115061,1,0,0,0,2,307,16.0
39,322753275,ud,2,29,7.9037005254044,1,0,0,0,2,307,16.0
40,322753266,ud,2,60,8.876494759863508,1,0,0,0,2,307,16.0
41,322753257,ud,2,28,4.103375033485964,1,0,0,0,2,307,16.0
42,322753245,ud,2,27,9.214260656994712,1,0,0,0,2,307,16.0
43,322753236,ud,2,26,18.873850083778535,1,0,0,0,2,307,16.0
44,322753227,ud,2,90,3.0100005102219063,1,0,0,0,2,307,16.0
45,322752828,ud,2,77,8.544516253107172,1,0,0,0,2,307,16.0
46,322752819,ud,2,25,8.074576022948124,1,0,0,0,2,307,16.0
47,322752810,ud,2,76,518.2255017825014,6,0,0,0,7,307,16.0
48,322752882,ud,2,75,47.172536935961574,4,0,0,0,5,307,16.0
49,322752873,ud,2,24,8.327209541643743,1,0,0,0,2,307,16.0
50,322752858,ud,2,59,31.53789884558305,3,0,0,0,4,307,16.0
51,322752849,ud,2,23,5.949350145933707,1,0,0,0,2,307,16.0
52,322752837,ud,2,22,17.03474721309211,2,0,0,0,3,307,16.0
53,322752954,ud,2,21,8.855771077938972,1,0,0,0,2,307,16.0
54,322752945,ud,2,20,20.32024596079301,1,0,0,0,2,307,16.0
55,322752936,ud,2,85,61.35192909392733,1,0,0,0,2,307,16.0
56,322752927,ud,2,19,2.1129080110921676,1,0,0,0,2,307,16.0
57,322752918,ud,2,58,30.247180145522357,5,0,0,0,6,307,16.0
58,322752909,ud,2,74,68.1101072554903,1,0,0,0,2,307,16.0
59,322752897,ud,2,84,3.253571303531011,1,0,0,0,2,307,16.0
60,322753017,ud,2,18,5.519132315382166,2,0,0,0,3,307,16.0
61,322753008,ud,2,17,13.717169949098691,1,0,0,0,2,307,16.0
62,322752999,ud,2,57,5.312162051736076,1,0,0,0,2,307,16.0
63,322752990,ud,2,16,3.0450990224846057,1,0,0,0,2,307,16.0
64,322752981,ud,2,92,82.21784273353433,5,0,0,0,6,307,16.0
65,322752972,ud,2,15,25.740574816429245,1,0,0,0,2,307,16.0
66,322752963,ud,2,14,26.400944210751245,1,0,0,0,2,307,16.0
67,322753854,ud,2,73,27.47775787490488,1,0,0,0,2,307,16.0
68,322753845,ud,2,72,6.614834316369987,1,0,0,0,2,307,16.0
69,322753836,ud,2,13,5.8232531294876555,1,0,0,0,2,307,16.0
70,322753827,ud,2,12,8.114582923163553,1,0,0,0,2,307,16.0
71,322753815,ud,2,11,3.9856062225705244,1,0,0,0,2,307,16.0
72,322753797,ud,2,56,23.877025712825485,3,0,0,0,4,307,16.0
73,322753866,ud,2,55,14.317462453849132,1,0,0,0,2,307,16.0
74,322753593,ud,2,54,12.793338968811886,4,0,0,0,5,307,16.0
75,322753581,ud,2,53,10.536160011582874,2,0,0,0,3,307,16.0
76,322753572,ud,2,52,111.6879753057512,1,0,0,0,2,307,16.0
77,322753563,ud,2,10,7.298314885967812,1,0,0,0,2,307,16.0
78,322753554,ud,2,71,8.452463469948723,1,0,0,0,2,307,16.0
79,322753536,ud,2,9,5.928735213499605,1,0,0,0,2,307,16.0
80,322753650,ud,2,51,313.7270717595032,4,0,0,0,5,307,16.0
81,322753629,ud,2,93,49.49875186631891,5,0,0,0,6,307,16.0
82,322753620,ud,2,8,35.97773216141262,2,0,0,0,3,307,16.0
83,322753611,ud,2,83,3.86258249733105,1,0,0,0,2,307,16.0
84,322753719,ud,2,7,15.847197012901846,1,0,0,0,2,307,16.0
85,322753707,ud,2,6,4.988250658447181,1,0,0,0,2,307,16.0
86,322753692,ud,2,5,7.785856727987582,2,0,0,0,3,307,16.0
87,322753680,ud,2,50,12.473221966150076,4,0,0,0,5,307,16.0
88,322753668,ud,2,4,9.962493932926616,2,0,0,0,3,307,16.0
89,322753785,ud,2,3,38.87888209010757,3,0,0,0,4,307,16.0
90,322753776,ud,2,2,4.5847003607352,1,0,0,0,2,307,16.0
91,322753764,ud,2,70,208.2332680900758,1,0,0,0,2,307,16.0
92,322753752,ud,2,91,282.7696318328865,2,0,0,0,3,307,16.0
93,322753740,ud,2,1,5.041755481617001,1,0,0,0,2,307,16.0
94,322753731,ud,2,69,7.804151108698575,1,0,0,0,2,307,16.0
95,322752686,hl,2,2,1774.2799468400522,0,61,0,0,56,307,16.0
96,322752755,hl,2,1,1516.6143667731283,0,47,0,0,45,307,16.0
97,322750264,cd,2,124,676.3605775029331,0,0,5,1,5,307,16.0
98,322750254,cd,2,123,544.9366335294088,0,0,5,1,5,307,16.0
99,322750246,cd,2,91,200.98222420030956,0,0,3,1,3,307,16.0
100,322750238,cd,2,90,286.61147545647015,0,0,3,1,3,307,16.0
101,322750231,cd,2,65,132.81096361474766,0,0,2,1,2,307,16.0
102,322750220,cd,2,142,518.833427504945,0,0,6,1,6,307,16.0
103,322750210,cd,2,122,512.6110417805053,0,0,5,1,5,307,16.0
104,322750325,cd,2,141,285.410661310433,0,0,6,1,6,307,16.0
105,322750312,cd,2,155,675.159763356896,0,0,8,1,8,307,16.0
106,322750302,cd,2,121,285.9756113775719,0,0,5,1,5,307,16.0
107,322750294,cd,2,89,94.25357939458854,0,0,3,1,3,307,16.0
108,322750285,cd,2,108,305.89120428584295,0,0,4,1,4,307,16.0
109,322750274,cd,2,140,695.6403063323058,0,0,6,1,6,307,16.0
110,322750398,cd,2,154,675.9212708871902,0,0,8,1,8,307,16.0
111,322750387,cd,2,139,286.1721688407272,0,0,6,1,6,307,16.0
112,322750378,cd,2,107,94.4501368577438,0,0,4,1,4,307,16.0
113,322750367,cd,2,138,474.05365756034615,0,0,6,1,6,307,16.0
114,322750360,cd,2,182,46.80885765784518,0,0,2,4,2,307,16.0
115,322750348,cd,2,152,675.7247134240349,0,0,7,1,7,307,16.0
116,322750336,cd,2,151,473.48870749320724,0,0,7,1,7,307,16.0
117,322750461,cd,2,150,681.1716325240584,0,0,7,1,7,307,16.0
118,322750451,cd,2,120,291.4225304775954,0,0,5,1,5,307,16.0
119,322750441,cd,2,119,493.9692504686172,0,0,5,1,5,307,16.0
120,322750434,cd,2,64,114.16917230285958,0,0,2,1,2,307,16.0
121,322750423,cd,2,137,344.723096680195,0,0,6,1,6,307,16.0
122,322750411,cd,2,149,474.2502150235014,0,0,7,1,7,307,16.0
123,322750011,cd,1,186,0.9292391820031827,0,0,2,6,2,307,16.0
124,322750004,cd,1,191,0.965684967972427,0,0,2,8,2,307,16.0
125,322749997,cd,1,63,1.137319731714256,0,0,2,1,2,307,16.0
126,322749990,cd,1,173,0.8547313951671193,0,0,2,2,2,307,16.0
127,322749981,cd,1,106,1.455139996795596,0,0,4,1,4,307,16.0
128,322749974,cd,1,172,0.9877734491175338,0,0,2,2,2,307,16.0
129,322749967,cd,1,62,1.1871155769667872,0,0,2,1,2,307,16.0
130,322749960,cd,1,61,1.2663307407382918,0,0,2,1,2,307,16.0
131,322749953,cd,1,60,1.4107662175363886,0,0,2,1,2,307,16.0
132,322750074,cd,1,59,0.9093983509694235,0,0,2,1,2,307,16.0
133,322750067,cd,1,58,0.9199727504242585,0,0,2,1,2,307,16.0
134,322750060,cd,1,57,0.9199727504242585,0,0,2,1,2,307,16.0
135,322750053,cd,1,56,0.9199727504242585,0,0,2,1,2,307,16.0
136,322750046,cd,1,181,0.8869717617192113,0,0,2,3,2,307,16.0
137,322750039,cd,1,55,0.9434659219393065,0,0,2,1,2,307,16.0
138,322750032,cd,1,54,1.1861175423000014,0,0,2,1,2,307,16.0
139,322750025,cd,1,53,1.2478551949017695,0,0,2,1,2,307,16.0
140,322750018,cd,1,189,0.8898738726596667,0,0,2,7,2,307,16.0
141,322750140,cd,1,52,0.9061260414943357,0,0,2,1,2,307,16.0
142,322750133,cd,1,51,0.9061260414943357,0,0,2,1,2,307,16.0
143,322750126,cd,1,193,1.0040626726989215,0,0,2,11,2,307,16.0
144,322750119,cd,1,171,1.1426234086585445,0,0,2,2,2,307,16.0
145,322750111,cd,1,88,1.3967456461484207,0,0,3,1,3,307,16.0
146,322750104,cd,1,50,1.7530212403913308,0,0,2,1,2,307,16.0
147,322750096,cd,1,87,1.8528653886485087,0,0,3,1,3,307,16.0
148,322750089,cd,1,49,1.267733351873885,0,0,2,1,2,307,16.0
149,322750081,cd,1,86,1.3063528220560114,0,0,3,1,3,307,16.0
150,322750203,cd,2,190,577.8271482292372,0,0,2,8,2,307,16.0
151,322750196,cd,1,48,0.9481982059018178,0,0,2,1,2,307,16.0
152,322750189,cd,1,47,0.9445474843144908,0,0,2,1,2,307,16.0
153,322750182,cd,1,46,0.9407492550217555,0,0,2,1,2,307,16.0
154,322750175,cd,1,45,0.9407492550217555,0,0,2,1,2,307,16.0
155,322750168,cd,1,44,0.9092398732830309,0,0,2,1,2,307,16.0
156,322750161,cd,1,43,0.9092398732830309,0,0,2,1,2,307,16.0
157,322750154,cd,1,42,0.9551576731397148,0,0,2,1,2,307,16.0
158,322750147,cd,1,41,0.9551576731397148,0,0,2,1,2,307,16.0
159,322749881,cd,1,40,1.4649965435355092,0,0,2,1,2,307,16.0
160,322749872,cd,1,105,1.9973835667846043,0,0,4,1,4,307,16.0
161,322749865,cd,1,39,1.4836878835954346,0,0,2,1,2,307,16.0
162,322749858,cd,1,180,1.2683449410619612,0,0,2,3,2,307,16.0
163,322749851,cd,1,170,0.9286318931350004,0,0,2,2,2,307,16.0
164,322749844,cd,1,38,2.195036379875908,0,0,2,1,2,307,16.0
165,322749837,cd,1,37,1.0093121726219123,0,0,2,1,2,307,16.0
166,322749943,cd,1,118,2.4993855370584965,0,0,5,1,5,307,16.0
167,322749935,cd,1,85,1.8983269864391767,0,0,3,1,3,307,16.0
168,322749924,cd,1,136,2.9028975259911536,0,0,6,1,6,307,16.0
169,322749917,cd,1,169,1.0853433156795158,0,0,2,2,2,307,16.0
170,322749908,cd,1,104,1.9107797554898156,0,0,4,1,4,307,16.0
171,322749897,cd,1,135,3.0048975259911535,0,0,6,1,6,307,16.0
172,322749888,cd,1,103,2.5591143140368473,0,0,4,1,4,307,16.0
173,322751286,cd,2,117,18.024241142007906,0,0,5,1,5,307,16.0
174,322751279,cd,2,36,7.92706287759011,0,0,2,1,2,307,16.0
175,322751269,cd,2,116,18.40595411148952,0,0,5,1,5,307,16.0
176,322751258,cd,2,134,31.569132327072516,0,0,6,1,6,307,16.0
177,322751248,cd,2,115,31.439272443866574,0,0,5,1,5,307,16.0
178,322751241,cd,2,35,10.977779342315767,0,0,2,1,2,307,16.0
179,322751353,cd,2,168,8.347057721258398,0,0,2,2,2,307,16.0
180,322751346,cd,2,34,4.815321910899801,0,0,2,1,2,307,16.0
181,322751339,cd,2,167,23.45958260760193,0,0,2,2,2,307,16.0
182,322751331,cd,2,84,22.71155839437006,0,0,3,1,3,307,16.0
183,322751322,cd,2,102,26.822645797414005,0,0,4,1,4,307,16.0
184,322751314,cd,2,83,13.65946758183101,0,0,3,1,3,307,16.0
185,322751307,cd,2,33,7.545349908108495,0,0,2,1,2,307,16.0
186,322751296,cd,2,133,31.1874193575909,0,0,6,1,6,307,16.0
187,322751418,cd,2,179,7.907019455894808,0,0,2,3,2,307,16.0
188,322751411,cd,2,166,7.337251505343959,0,0,2,2,2,307,16.0
189,322751404,cd,2,32,3.2971551858994865,0,0,2,1,2,307,16.0
190,322751397,cd,2,31,42.22987837409003,0,0,2,1,2,307,16.0
191,322751390,cd,2,165,4.676693257144391,0,0,2,2,2,307,16.0
192,322751383,cd,2,164,7.4699026787162754,0,0,2,2,2,307,16.0
193,322751375,cd,2,175,11.353406703187227,0,0,3,2,3,307,16.0
194,322751368,cd,2,178,8.61480302075714,0,0,2,3,2,307,16.0
195,322751360,cd,2,82,12.374962932825106,0,0,3,1,3,307,16.0
196,322751446,cd,2,188,16.76263885293787,0,0,2,7,2,307,16.0
197,322751439,cd,2,30,8.559874624204149,0,0,2,1,2,307,16.0
198,322751432,cd,2,29,8.504829313329243,0,0,2,1,2,307,16.0
199,322751425,cd,2,163,5.085443513359293,0,0,2,2,2,307,16.0
200,322751037,cd,2,28,14.530293637923727,0,0,2,1,2,307,16.0
201,322751028,cd,2,101,36.07665142365117,0,0,4,1,4,307,16.0
202,322751021,cd,2,27,21.439006372318392,0,0,2,1,2,307,16.0
203,322751014,cd,2,26,6.217101410609389,0,0,2,1,2,307,16.0
204,322751007,cd,2,25,8.221922010317257,0,0,2,1,2,307,16.0
205,322751000,cd,2,24,13.27980104219261,0,0,2,1,2,307,16.0
206,322750993,cd,2,162,38.2375976772768,0,0,2,2,2,307,16.0
207,322750986,cd,2,161,10.393121255750534,0,0,2,2,2,307,16.0
208,322750978,cd,2,81,16.811910590019888,0,0,3,1,3,307,16.0
209,322751101,cd,2,100,48.64688361289805,0,0,4,1,4,307,16.0
210,322751094,cd,2,23,26.84985270608757,0,0,2,1,2,307,16.0
211,322751086,cd,2,80,34.71657996155295,0,0,3,1,3,307,16.0
212,322751078,cd,2,79,28.209924168185793,0,0,3,1,3,307,16.0
213,322751069,cd,2,99,38.83846479798579,0,0,4,1,4,307,16.0
214,322751061,cd,2,78,25.158834267723726,0,0,3,1,3,307,16.0
215,322751054,cd,2,22,18.573723179810976,0,0,2,1,2,307,16.0
216,322751044,cd,2,114,50.00695507499628,0,0,5,1,5,307,16.0
217,322751166,cd,2,160,12.302607639919428,0,0,2,2,2,307,16.0
218,322751159,cd,2,185,21.766886786264795,0,0,2,5,2,307,16.0
219,322751151,cd,2,77,10.035632229083266,0,0,3,1,3,307,16.0
220,322751144,cd,2,184,12.360450908331076,0,0,2,5,2,307,16.0
221,322751136,cd,2,76,49.15629196733462,0,0,3,1,3,307,16.0
222,322751129,cd,2,187,35.22598831598951,0,0,2,7,2,307,16.0
223,322751119,cd,2,113,61.53091037915704,0,0,5,1,5,307,16.0
224,322751110,cd,2,98,64.3394101884429,0,0,4,1,4,307,16.0
225,322751230,cd,2,132,32.136267169081925,0,0,6,1,6,307,16.0
226,322751223,cd,2,21,17.173906031597557,0,0,2,1,2,307,16.0
227,322751216,cd,2,177,13.283517359420747,0,0,2,3,2,307,16.0
228,322751209,cd,2,20,12.89584648736233,0,0,2,1,2,307,16.0
229,322751202,cd,2,19,15.34306548988615,0,0,2,1,2,307,16.0
230,322751195,cd,2,18,15.650595766432511,0,0,2,1,2,307,16.0
231,322751188,cd,2,17,9.661379610186971,0,0,2,1,2,307,16.0
232,322751181,cd,2,16,25.245539035142457,0,0,2,1,2,307,16.0
233,322751173,cd,2,174,12.25387735432383,0,0,3,2,3,307,16.0
234,322750778,cd,2,15,13.027032491219487,0,0,2,1,2,307,16.0
235,322750770,cd,2,75,28.928085451615342,0,0,3,1,3,307,16.0
236,322750763,cd,2,14,24.862047462367546,0,0,2,1,2,307,16.0
237,322750756,cd,2,13,14.75992798478783,0,0,2,1,2,307,16.0
238,322750749,cd,2,159,20.785566415207384,0,0,2,2,2,307,16.0
239,322750742,cd,2,12,10.391246458542614,0,0,2,1,2,307,16.0
240,322750735,cd,2,11,225.79821601576617,0,0,2,1,2,307,16.0
241,322750728,cd,2,10,499.8307724754244,0,0,2,1,2,307,16.0
242,322750720,cd,2,74,701.5018283391131,0,0,3,1,3,307,16.0
243,322750838,cd,2,112,69.95200650630446,0,0,5,1,5,307,16.0
244,322750827,cd,2,131,83.7372893919482,0,0,6,1,6,307,16.0
245,322750819,cd,2,73,35.891479365578306,0,0,3,1,3,307,16.0
246,322750809,cd,2,111,72.33376193082478,0,0,5,1,5,307,16.0
247,322750800,cd,2,97,62.74572713152667,0,0,4,1,4,307,16.0
248,322750792,cd,2,72,47.843043007356314,0,0,3,1,3,307,16.0
249,322750785,cd,2,9,17.000463910556732,0,0,2,1,2,307,16.0
250,322750911,cd,2,96,80.15089006063218,0,0,4,1,4,307,16.0
251,322750904,cd,2,183,24.48795190445488,0,0,2,5,2,307,16.0
252,322750895,cd,2,95,59.24657046847974,0,0,4,1,4,307,16.0
253,322750886,cd,2,94,46.59691540340303,0,0,4,1,4,307,16.0
254,322750878,cd,2,71,30.44437538627189,0,0,3,1,3,307,16.0
255,322750867,cd,2,130,84.8546906304748,0,0,6,1,6,307,16.0
256,322750860,cd,2,8,26.276669442610018,0,0,2,1,2,307,16.0
257,322750848,cd,2,148,94.44272542977292,0,0,7,1,7,307,16.0
258,322750971,cd,2,7,14.70450248507687,0,0,2,1,2,307,16.0
259,322750964,cd,2,6,11.17194473643332,0,0,2,1,2,307,16.0
260,322750957,cd,2,5,10.882275185053382,0,0,2,1,2,307,16.0
261,322750950,cd,2,4,39.39340304763883,0,0,2,1,2,307,16.0
262,322750942,cd,2,70,71.20090112927133,0,0,3,1,3,307,16.0
263,322750935,cd,2,176,61.61286632997322,0,0,2,3,2,307,16.0
264,322750928,cd,2,192,55.66017113716371,0,0,2,11,2,307,16.0
265,322750920,cd,2,69,70.56285526133406,0,0,3,1,3,307,16.0
266,322750525,cd,2,157,868.7552685085361,0,0,10,1,10,307,16.0
267,322750512,cd,2,153,597.0565358867958,0,0,8,1,8,307,16.0
268,322750505,cd,2,158,53.85903367029832,0,0,2,2,2,307,16.0
269,322750494,cd,2,129,481.10383357279926,0,0,6,1,6,307,16.0
270,322750484,cd,2,110,293.0257873900251,0,0,5,1,5,307,16.0
271,322750473,cd,2,128,500.91746900016216,0,0,6,1,6,307,16.0
272,322750585,cd,2,68,101.30375540704168,0,0,3,1,3,307,16.0
273,322750573,cd,2,147,682.774889436488,0,0,7,1,7,307,16.0
274,322750561,cd,2,146,518.7932772564778,0,0,7,1,7,307,16.0
275,322750554,cd,2,3,172.25985932701875,0,0,2,1,2,307,16.0
276,322750540,cd,2,156,667.0842126448474,0,0,9,1,9,307,16.0
277,322750647,cd,2,93,133.90350763677665,0,0,4,1,4,307,16.0
278,322750638,cd,2,92,130.76316394745376,0,0,4,1,4,307,16.0
279,322750626,cd,2,145,679.5289728295647,0,0,7,1,7,307,16.0
280,322750615,cd,2,127,477.857916965876,0,0,6,1,6,307,16.0
281,322750605,cd,2,109,289.7798707831017,0,0,5,1,5,307,16.0
282,322750593,cd,2,144,480.96945034454177,0,0,7,1,7,307,16.0
283,322750709,cd,2,126,473.7697240651937,0,0,6,1,6,307,16.0
284,322750702,cd,2,2,39.35702206198478,0,0,2,1,2,307,16.0
285,322750694,cd,2,67,86.80174379872815,0,0,3,1,3,307,16.0
286,322750683,cd,2,125,466.60182196448574,0,0,6,1,6,307,16.0
287,322750671,cd,2,143,668.2728778281745,0,0,7,1,7,307,16.0
288,322750663,cd,2,66,98.05783880011833,0,0,3,1,3,307,16.0
289,322750656,cd,2,1,50.61311706337496,0,0,2,1,2,307,16.0
