counter,AS,Type,GranularityValue,SeverityScore,PageRank,NumBadDep,TotalDep,NumberOfVerteces,NumOfCycle,NumSetOfElement,TotNumOfSetOfElement,ADI
1,3496741,ud,2,7,31.2987437034324,3,0,0,0,4,106,21.0
2,3496750,ud,2,6,56.81610070912775,6,0,0,0,7,106,21.0
3,3496732,ud,2,2,18.60799425777888,1,0,0,0,2,106,21.0
4,3496813,ud,2,5,28.29981409088787,1,0,0,0,2,106,21.0
5,3496792,ud,2,4,20.0103937106345,2,0,0,0,3,106,21.0
6,3496768,ud,2,3,60.82629698824047,4,0,0,0,5,106,21.0
7,3496783,ud,2,1,7.482388411343237,1,0,0,0,2,106,21.0
8,3496587,hl,1,3,29.32460058205427,0,70,0,0,69,106,21.0
9,3496695,hl,2,2,192.61094451865154,0,29,0,0,24,106,21.0
10,3496666,hl,2,1,118.49941438058431,0,21,0,0,19,106,21.0
11,3495988,cd,1,40,4.607922423924416,0,0,5,1,5,106,21.0
12,3495998,cd,1,14,1.8921681712325453,0,0,2,1,2,106,21.0
13,3495970,cd,1,33,3.608313448887097,0,0,4,1,4,106,21.0
14,3495979,cd,1,32,3.7369837387421696,0,0,4,1,4,106,21.0
15,3495955,cd,1,51,2.8580702061599945,0,0,2,2,2,106,21.0
16,3495962,cd,1,25,2.776752520027843,0,0,3,1,3,106,21.0
17,3495938,cd,1,39,5.025246933664598,0,0,5,1,5,106,21.0
18,3495948,cd,1,13,1.4420984779037602,0,0,2,1,2,106,21.0
19,3496053,cd,1,12,1.0062686063344164,0,0,2,1,2,106,21.0
20,3496060,cd,1,11,0.9963336972975115,0,0,2,1,2,106,21.0
21,3496039,cd,1,53,3.4479707554231616,0,0,2,3,2,106,21.0
22,3496032,cd,1,10,1.8300812147108063,0,0,2,1,2,106,21.0
23,3496046,cd,1,9,1.3410029070257117,0,0,2,1,2,106,21.0
24,3496023,cd,1,31,3.0837393595453726,0,0,4,1,4,106,21.0
25,3496005,cd,1,52,4.279531684282416,0,0,3,2,3,106,21.0
26,3496013,cd,1,38,3.9153002884046266,0,0,5,1,5,106,21.0
27,3496113,cd,2,48,79.02861954771998,0,0,7,1,7,106,21.0
28,3496125,cd,2,24,47.72987584428759,0,0,3,1,3,106,21.0
29,3496106,cd,2,8,31.961442124176678,0,0,2,1,2,106,21.0
30,3496081,cd,2,54,57.6450255131603,0,0,2,11,2,106,21.0
31,3496095,cd,2,44,88.9437692165927,0,0,6,1,6,106,21.0
32,3496088,cd,2,7,35.66133228525105,0,0,2,1,2,106,21.0
33,3496067,cd,2,6,23.390412195645965,0,0,2,1,2,106,21.0
34,3496074,cd,2,5,17.92797141732741,0,0,2,1,2,106,21.0
35,3496184,cd,2,43,60.98518943566538,0,0,6,1,6,106,21.0
36,3496165,cd,2,30,54.35225389596749,0,0,4,1,4,106,21.0
37,3496174,cd,2,37,52.501832187978664,0,0,5,1,5,106,21.0
38,3496148,cd,2,4,20.79956599485353,0,0,2,1,2,106,21.0
39,3496155,cd,2,36,62.83561114365421,0,0,5,1,5,106,21.0
40,3496133,cd,2,23,67.76966252325246,0,0,3,1,3,106,21.0
41,3496141,cd,2,3,41.66150445031398,0,0,2,1,2,106,21.0
42,3496242,cd,2,22,26.62272096972625,0,0,3,1,3,106,21.0
43,3496250,cd,2,42,49.43810742547192,0,0,6,1,6,106,21.0
44,3496230,cd,2,47,57.92146467315864,0,0,7,1,7,106,21.0
45,3496210,cd,2,41,50.407284635043055,0,0,6,1,6,106,21.0
46,3496221,cd,2,29,37.71653518938954,0,0,4,1,4,106,21.0
47,3496195,cd,2,50,29.686445732232993,0,0,2,2,2,106,21.0
48,3496202,cd,2,21,39.811082742325155,0,0,3,1,3,106,21.0
49,3496294,cd,2,2,9.72755485101258,0,0,2,1,2,106,21.0
50,3496278,cd,2,20,26.411328665014132,0,0,3,1,3,106,21.0
51,3496286,cd,2,19,17.181082324992204,0,0,3,1,3,106,21.0
52,3496261,cd,2,28,36.7473579798184,0,0,4,1,4,106,21.0
53,3496270,cd,2,18,15.832165705030206,0,0,3,1,3,106,21.0
54,3495859,cd,1,27,3.9687126742163037,0,0,4,1,4,106,21.0
55,3495868,cd,1,35,5.248847231517374,0,0,5,1,5,106,21.0
56,3495847,cd,1,46,6.747317145245098,0,0,7,1,7,106,21.0
57,3495840,cd,1,1,1.5899318840593386,0,0,2,1,2,106,21.0
58,3495832,cd,1,17,2.7033711754375687,0,0,3,1,3,106,21.0
59,3495930,cd,1,16,3.5267770199368735,0,0,3,1,3,106,21.0
60,3495905,cd,1,49,7.093423681432787,0,0,8,1,8,106,21.0
61,3495918,cd,1,45,6.261862752573533,0,0,7,1,7,106,21.0
62,3495896,cd,1,26,4.081491950518086,0,0,4,1,4,106,21.0
63,3495878,cd,1,15,4.152655974060243,0,0,3,1,3,106,21.0
64,3495886,cd,1,34,6.069361446362254,0,0,5,1,5,106,21.0
