counter,AS,Type,GranularityValue,SeverityScore,PageRank,NumBadDep,TotalDep,NumberOfVerteces,NumOfCycle,NumSetOfElement,TotNumOfSetOfElement,ADI
1,338391,ud,2,12,35.88571409082596,2,0,0,0,3,66,15.0
2,338400,ud,2,7,7.532811398733628,1,0,0,0,2,66,15.0
3,338412,ud,2,9,73.10310840173008,3,0,0,0,4,66,15.0
4,338427,ud,2,5,11.879097645233932,1,0,0,0,2,66,15.0
5,338436,ud,2,13,46.848100224603925,1,0,0,0,2,66,15.0
6,338445,ud,2,1,17.877529955339476,1,0,0,0,2,66,15.0
7,338454,ud,2,6,17.366476374796747,4,0,0,0,5,66,15.0
8,338472,ud,2,11,28.849969971811618,1,0,0,0,2,66,15.0
9,338481,ud,2,8,48.69143063488964,1,0,0,0,2,66,15.0
10,338490,ud,2,2,15.261527568396225,1,0,0,0,2,66,15.0
11,338499,ud,2,10,3.5286745175680396,1,0,0,0,2,66,15.0
12,338508,ud,2,4,27.190992807555,1,0,0,0,2,66,15.0
13,338517,ud,2,3,8.004100300396907,1,0,0,0,2,66,15.0
14,338356,hl,2,1,339.43651474641644,0,27,0,0,27,66,15.0
15,338010,cd,1,11,2.562956920159719,0,0,2,1,2,66,15.0
16,338017,cd,1,21,1.2144172984017065,0,0,2,2,2,66,15.0
17,338024,cd,1,15,2.1101076051241927,0,0,3,1,3,66,15.0
18,338032,cd,1,14,2.0281076639253683,0,0,3,1,3,66,15.0
19,338040,cd,1,13,1.9856076639253681,0,0,3,1,3,66,15.0
20,338055,cd,1,12,1.951239282095864,0,0,3,1,3,66,15.0
21,338048,cd,1,10,1.9448584689004564,0,0,2,1,2,66,15.0
22,338063,cd,1,20,0.8958900997127444,0,0,2,2,2,66,15.0
23,338070,cd,1,16,1.3155475980144016,0,0,4,1,4,66,15.0
24,338079,cd,1,9,1.0133794098985627,0,0,2,1,2,66,15.0
25,338086,cd,1,19,0.9324658635747881,0,0,2,2,2,66,15.0
26,338093,cd,2,8,30.083649030697984,0,0,2,1,2,66,15.0
27,338100,cd,2,23,41.61083170942574,0,0,2,23,2,66,15.0
28,338107,cd,2,22,74.42824636741582,0,0,3,2,3,66,15.0
29,338115,cd,2,18,10.519213550539089,0,0,2,2,2,66,15.0
30,338122,cd,2,7,12.550509547325072,0,0,2,1,2,66,15.0
31,338129,cd,2,17,58.35972246935861,0,0,2,2,2,66,15.0
32,338143,cd,2,6,15.457478702410981,0,0,2,1,2,66,15.0
33,338136,cd,2,5,25.54446557123573,0,0,2,1,2,66,15.0
34,338150,cd,2,4,10.320548434854405,0,0,2,1,2,66,15.0
35,338157,cd,2,3,16.68905683988934,0,0,2,1,2,66,15.0
36,338164,cd,2,2,9.851413563134486,0,0,2,1,2,66,15.0
37,338171,cd,2,1,42.06385987797194,0,0,2,1,2,66,15.0
