counter,AS,Type,GranularityValue,SeverityScore,PageRank,NumBadDep,TotalDep,NumberOfVerteces,NumOfCycle,NumSetOfElement,TotNumOfSetOfElement,ADI
1,301659647,ud,2,36,2.113773999006934,1,0,0,0,2,283,13.0
2,301659638,ud,2,86,66.80635380480112,4,0,0,0,5,283,13.0
3,301659629,ud,2,35,3.073701269204645,1,0,0,0,2,283,13.0
4,301659620,ud,2,73,64.94178241759214,1,0,0,0,2,283,13.0
5,301659608,ud,2,61,26.5721529632307,2,0,0,0,3,283,13.0
6,301659599,ud,2,83,2.411672509110798,1,0,0,0,2,283,13.0
7,301659584,ud,2,60,38.38004479119989,3,0,0,0,4,283,13.0
8,301659575,ud,2,59,14.319232421255851,1,0,0,0,2,283,13.0
9,301659563,ud,2,72,27.479138613115843,1,0,0,0,2,283,13.0
10,301659554,ud,2,34,36.462958273466135,2,0,0,0,3,283,13.0
11,301659536,ud,2,58,12.832931078873898,4,0,0,0,5,283,13.0
12,301659527,ud,2,82,3.8772653670011747,1,0,0,0,2,283,13.0
13,301659512,ud,2,57,23.670069372099228,3,0,0,0,4,283,13.0
14,301659497,ud,2,56,39.96073096032897,3,0,0,0,4,283,13.0
15,301660157,ud,2,33,9.463629729179496,1,0,0,0,2,283,13.0
16,301660148,ud,2,32,10.146312656085222,1,0,0,0,2,283,13.0
17,301660139,ud,2,77,589.6649938696198,3,0,0,0,4,283,13.0
18,301660130,ud,2,71,4.412857100505764,1,0,0,0,2,283,13.0
19,301660118,ud,2,55,11.93943915229437,2,0,0,0,3,283,13.0
20,301660109,ud,2,31,6.914253628797153,1,0,0,0,2,283,13.0
21,301660100,ud,2,81,5.1984669664413845,1,0,0,0,2,283,13.0
22,301660091,ud,2,54,3.9400123155672664,1,0,0,0,2,283,13.0
23,301660082,ud,2,30,4.718315870430521,1,0,0,0,2,283,13.0
24,301660067,ud,2,29,5.925159247561563,1,0,0,0,2,283,13.0
25,301660046,ud,2,88,58.68453583419673,4,0,0,0,5,283,13.0
26,301660025,ud,2,76,9.603785807181982,2,0,0,0,3,283,13.0
27,301660010,ud,2,28,5.174976179680007,1,0,0,0,2,283,13.0
28,301659998,ud,2,27,16.43502618378627,2,0,0,0,3,283,13.0
29,301659986,ud,2,53,87.65237442392915,2,0,0,0,3,283,13.0
30,301659971,ud,2,80,3.5724103235337115,1,0,0,0,2,283,13.0
31,301659962,ud,2,75,284.7683147792558,3,0,0,0,4,283,13.0
32,301659953,ud,2,52,7.581993336491203,1,0,0,0,2,283,13.0
33,301659944,ud,2,51,3.0755841903897543,1,0,0,0,2,283,13.0
34,301659935,ud,2,26,2.963811930610947,1,0,0,0,2,283,13.0
35,301659926,ud,2,50,60.387099656075975,1,0,0,0,2,283,13.0
36,301659917,ud,2,25,4.113150512358713,1,0,0,0,2,283,13.0
37,301659902,ud,2,49,82.40115704491427,3,0,0,0,4,283,13.0
38,301659893,ud,2,24,5.8334726480337125,1,0,0,0,2,283,13.0
39,301659884,ud,2,48,6.872473189668847,1,0,0,0,2,283,13.0
40,301659875,ud,2,47,8.965662805959223,1,0,0,0,2,283,13.0
41,301659866,ud,2,23,7.91427422107678,1,0,0,0,2,283,13.0
42,301659857,ud,2,84,3.0091885312296753,1,0,0,0,2,283,13.0
43,301659848,ud,2,46,59.290362726212464,5,0,0,0,6,283,13.0
44,301659839,ud,2,22,17.07428760000442,1,0,0,0,2,283,13.0
45,301659830,ud,2,21,9.700979565993457,1,0,0,0,2,283,13.0
46,301659821,ud,2,45,7.782204801304312,1,0,0,0,2,283,13.0
47,301659809,ud,2,44,5.281595765375878,1,0,0,0,2,283,13.0
48,301659800,ud,2,20,12.370077003038656,1,0,0,0,2,283,13.0
49,301659791,ud,2,19,5.9336701349705585,1,0,0,0,2,283,13.0
50,301659779,ud,2,18,17.020195133435845,2,0,0,0,3,283,13.0
51,301659770,ud,2,43,5.563268542626852,2,0,0,0,3,283,13.0
52,301659761,ud,2,17,8.370067087357546,1,0,0,0,2,283,13.0
53,301659752,ud,2,16,5.80680787041662,1,0,0,0,2,283,13.0
54,301659743,ud,2,42,8.050162595772155,1,0,0,0,2,283,13.0
55,301659731,ud,2,74,6.68031809416932,1,0,0,0,2,283,13.0
56,301659722,ud,2,15,3.852500291519092,1,0,0,0,2,283,13.0
57,301659713,ud,2,14,8.16800069949634,1,0,0,0,2,283,13.0
58,301659704,ud,2,70,8.922070452841874,1,0,0,0,2,283,13.0
59,301659695,ud,2,79,61.38569741173521,1,0,0,0,2,283,13.0
60,301659686,ud,2,69,494.9307212827713,6,0,0,0,7,283,13.0
61,301659674,ud,2,13,8.853897639904115,1,0,0,0,2,283,13.0
62,301659665,ud,2,12,28.626727184767823,2,0,0,0,3,283,13.0
63,301659656,ud,2,41,30.333077662000832,5,0,0,0,6,283,13.0
64,301660454,ud,2,68,291.76593089983106,4,0,0,0,5,283,13.0
65,301660445,ud,2,11,181.2243474729404,1,0,0,0,2,283,13.0
66,301660433,ud,2,78,13.477381521237271,2,0,0,0,3,283,13.0
67,301660424,ud,2,40,9.957996845297204,2,0,0,0,3,283,13.0
68,301660403,ud,2,39,110.92568409068954,1,0,0,0,2,283,13.0
69,301660394,ud,2,67,8.818571631319678,1,0,0,0,2,283,13.0
70,301660382,ud,2,66,10.471842933351613,2,0,0,0,3,283,13.0
71,301660373,ud,2,10,7.120261626748484,1,0,0,0,2,283,13.0
72,301660361,ud,2,87,256.54648640642387,2,0,0,0,3,283,13.0
73,301660352,ud,2,9,4.5835309813115135,1,0,0,0,2,283,13.0
74,301660343,ud,2,65,191.0399767600077,1,0,0,0,2,283,13.0
75,301660334,ud,2,8,15.070736887803685,1,0,0,0,2,283,13.0
76,301660322,ud,2,7,7.8472155663064775,2,0,0,0,3,283,13.0
77,301660304,ud,2,38,12.46253446917185,4,0,0,0,5,283,13.0
78,301660295,ud,2,64,7.809303257079265,1,0,0,0,2,283,13.0
79,301660286,ud,2,6,5.04261632915593,1,0,0,0,2,283,13.0
80,301660277,ud,2,37,4.984151845285055,1,0,0,0,2,283,13.0
81,301660262,ud,2,63,72.21276580798161,3,0,0,0,4,283,13.0
82,301660241,ud,2,5,17.059443039745503,4,0,0,0,5,283,13.0
83,301660232,ud,2,62,195.81514338753217,1,0,0,0,2,283,13.0
84,301660223,ud,2,4,18.197118517097586,1,0,0,0,2,283,13.0
85,301660199,ud,2,85,50.377925189544186,5,0,0,0,6,283,13.0
86,301660184,ud,2,3,19.13777921745962,2,0,0,0,3,283,13.0
87,301660175,ud,2,2,9.42148231356358,1,0,0,0,2,283,13.0
88,301660166,ud,2,1,14.163674501394503,1,0,0,0,2,283,13.0
89,301659429,hl,2,1,1702.9308194313412,0,60,0,0,57,283,13.0
90,301658368,cd,2,64,8.565160068907897,0,0,2,1,2,283,13.0
91,301658375,cd,2,142,16.754426011244092,0,0,2,7,2,283,13.0
92,301658361,cd,2,63,8.51096315735799,0,0,2,1,2,283,13.0
93,301658354,cd,2,136,7.890500478725906,0,0,2,3,2,283,13.0
94,301658347,cd,2,129,5.171613907715694,0,0,2,2,2,283,13.0
95,301658339,cd,2,88,8.235959594652702,0,0,3,1,3,283,13.0
96,301658332,cd,2,62,3.2993028440340337,0,0,2,1,2,283,13.0
97,301658325,cd,2,61,42.232228050075435,0,0,2,1,2,283,13.0
98,301658318,cd,2,128,4.692277241559614,0,0,2,2,2,283,13.0
99,301658311,cd,2,127,7.538339305912395,0,0,2,2,2,283,13.0
100,301658296,cd,2,135,8.634127613367212,0,0,2,3,2,283,13.0
101,301658303,cd,2,131,11.378104532205064,0,0,3,2,3,283,13.0
102,301658289,cd,2,126,8.33443922669018,0,0,2,2,2,283,13.0
103,301658281,cd,2,87,12.363769667492251,0,0,3,1,3,283,13.0
104,301658274,cd,2,60,4.973559487100227,0,0,2,1,2,283,13.0
105,301658267,cd,2,125,23.70624149052825,0,0,2,2,2,283,13.0
106,301658259,cd,2,86,22.179040170435496,0,0,3,1,3,283,13.0
107,301658251,cd,2,85,11.093586132445562,0,0,3,1,3,283,13.0
108,301658241,cd,2,107,29.505309795135318,0,0,5,1,5,283,13.0
109,301658231,cd,2,106,33.03295784735194,0,0,5,1,5,283,13.0
110,301658220,cd,2,112,33.786407072483044,0,0,6,1,6,283,13.0
111,301658209,cd,2,111,35.29017456829457,0,0,6,1,6,283,13.0
112,301658201,cd,2,84,14.994792651731942,0,0,3,1,3,283,13.0
113,301658194,cd,2,59,9.964197276807662,0,0,2,1,2,283,13.0
114,301658186,cd,2,83,12.98006167148935,0,0,3,1,3,283,13.0
115,301658179,cd,2,58,7.94946629656507,0,0,2,1,2,283,13.0
116,301658168,cd,2,110,33.27544358805197,0,0,6,1,6,283,13.0
117,301658160,cd,2,82,14.621234184662189,0,0,3,1,3,283,13.0
118,301658153,cd,2,57,17.118326455716044,0,0,2,1,2,283,13.0
119,301658146,cd,2,134,13.288327802617475,0,0,2,3,2,283,13.0
120,301658139,cd,2,56,12.888152919574232,0,0,2,1,2,283,13.0
121,301658132,cd,2,55,15.338371423373262,0,0,2,1,2,283,13.0
122,301658125,cd,2,54,15.649347176913722,0,0,2,1,2,283,13.0
123,301658118,cd,2,53,9.667984145779661,0,0,2,1,2,283,13.0
124,301657596,cd,1,52,0.9092398732830309,0,0,2,1,2,283,13.0
125,301657589,cd,1,51,0.9551576731397148,0,0,2,1,2,283,13.0
126,301657582,cd,1,50,0.9551576731397148,0,0,2,1,2,283,13.0
127,301657568,cd,1,49,0.9061260414943357,0,0,2,1,2,283,13.0
128,301657575,cd,1,48,0.9061260414943357,0,0,2,1,2,283,13.0
129,301657561,cd,1,144,1.0040626726989215,0,0,2,11,2,283,13.0
130,301657554,cd,1,124,1.1426234086585443,0,0,2,2,2,283,13.0
131,301657546,cd,1,81,1.3967456461484204,0,0,3,1,3,283,13.0
132,301657539,cd,1,47,1.7614134010608669,0,0,2,1,2,283,13.0
133,301657531,cd,1,80,1.8581468443546396,0,0,3,1,3,283,13.0
134,301657524,cd,1,46,1.267733351873885,0,0,2,1,2,283,13.0
135,301657516,cd,1,79,1.3063308585963824,0,0,3,1,3,283,13.0
136,301657509,cd,1,45,0.9093983509694235,0,0,2,1,2,283,13.0
137,301657502,cd,1,44,0.9199727504242585,0,0,2,1,2,283,13.0
138,301657488,cd,1,43,0.9199727504242585,0,0,2,1,2,283,13.0
139,301657495,cd,1,42,0.9199727504242585,0,0,2,1,2,283,13.0
140,301657481,cd,1,133,0.8869717617192113,0,0,2,3,2,283,13.0
141,301657474,cd,1,41,0.9434659219393065,0,0,2,1,2,283,13.0
142,301657467,cd,1,40,1.1861175423000014,0,0,2,1,2,283,13.0
143,301657460,cd,1,39,1.2478799641396296,0,0,2,1,2,283,13.0
144,301657453,cd,1,141,0.8898738726596667,0,0,2,7,2,283,13.0
145,301657446,cd,1,139,0.9292391820031827,0,0,2,6,2,283,13.0
146,301657432,cd,1,38,1.137319731714256,0,0,2,1,2,283,13.0
147,301657439,cd,1,143,0.965684967972427,0,0,2,8,2,283,13.0
148,301657425,cd,1,123,0.8547313951671193,0,0,2,2,2,283,13.0
149,301657416,cd,1,96,1.455154006829964,0,0,4,1,4,283,13.0
150,301657409,cd,1,122,0.9877735587734154,0,0,2,2,2,283,13.0
151,301657402,cd,1,37,1.187761406415829,0,0,2,1,2,283,13.0
152,301657395,cd,1,36,1.6311915075069539,0,0,2,1,2,283,13.0
153,301657386,cd,1,95,2.6385807837662023,0,0,4,1,4,283,13.0
154,301657379,cd,1,121,1.0670653635814178,0,0,2,2,2,283,13.0
155,301657370,cd,1,94,2.0978507973810605,0,0,4,1,4,283,13.0
156,301657360,cd,1,105,3.1664962620563912,0,0,5,1,5,283,13.0
157,301657353,cd,1,35,1.1745713211392441,0,0,2,1,2,283,13.0
158,301657343,cd,1,104,3.329252219614218,0,0,5,1,5,283,13.0
159,301657335,cd,1,78,2.126210028285336,0,0,3,1,3,283,13.0
160,301657325,cd,1,103,3.0644962620563914,0,0,5,1,5,283,13.0
161,301657317,cd,1,77,2.699836972182285,0,0,3,1,3,283,13.0
162,301657309,cd,1,76,2.1509057823254887,0,0,3,1,3,283,13.0
163,301657302,cd,1,34,1.9482869759688224,0,0,2,1,2,283,13.0
164,301657288,cd,1,120,0.9286318931350004,0,0,2,2,2,283,13.0
165,301657295,cd,1,132,1.268344989932964,0,0,2,3,2,283,13.0
166,301657281,cd,1,33,2.1950397236019095,0,0,2,1,2,283,13.0
167,301657274,cd,1,32,1.0093121726219123,0,0,2,1,2,283,13.0
168,301658104,cd,2,119,12.423483064651904,0,0,2,2,2,283,13.0
169,301658111,cd,2,31,26.525835974056136,0,0,2,1,2,283,13.0
170,301658096,cd,2,130,12.319968544227972,0,0,3,2,3,283,13.0
171,301658088,cd,2,75,23.953712393686573,0,0,3,1,3,283,13.0
172,301658080,cd,2,74,10.03644268005954,0,0,3,1,3,283,13.0
173,301658073,cd,2,138,12.361688148614377,0,0,2,5,2,283,13.0
174,301658066,cd,2,30,21.63545471800693,0,0,2,1,2,283,13.0
175,301658059,cd,2,29,18.181729360799032,0,0,2,1,2,283,13.0
176,301658051,cd,2,73,31.278997839023877,0,0,3,1,3,283,13.0
177,301658043,cd,2,72,37.44959903509584,0,0,3,1,3,283,13.0
178,301658033,cd,2,102,54.81596063321173,0,0,5,1,5,283,13.0
179,301658024,cd,2,93,57.543467903791125,0,0,4,1,4,283,13.0
180,301658016,cd,2,71,50.587149783337125,0,0,3,1,3,283,13.0
181,301658005,cd,2,109,74.90982950190701,0,0,6,1,6,283,13.0
182,301657998,cd,2,140,36.13559142182474,0,0,2,7,2,283,13.0
183,301657988,cd,2,101,72.25556667970392,0,0,5,1,5,283,13.0
184,301657978,cd,2,100,63.25580697531478,0,0,5,1,5,283,13.0
185,301657969,cd,2,92,65.29924855924993,0,0,4,1,4,283,13.0
186,301657962,cd,2,28,21.4405667765681,0,0,2,1,2,283,13.0
187,301657955,cd,2,27,6.235818208437708,0,0,2,1,2,283,13.0
188,301657948,cd,2,26,8.195497482068404,0,0,2,1,2,283,13.0
189,301657941,cd,2,118,10.273498565338674,0,0,2,2,2,283,13.0
190,301657934,cd,2,117,42.85144062211475,0,0,2,2,2,283,13.0
191,301657927,cd,2,25,13.41159152765809,0,0,2,1,2,283,13.0
192,301657912,cd,2,24,10.799790141863378,0,0,2,1,2,283,13.0
193,301657919,cd,2,70,16.485196051205634,0,0,3,1,3,283,13.0
194,301657905,cd,2,23,14.600570219678998,0,0,2,1,2,283,13.0
195,301657898,cd,2,22,7.924048795334434,0,0,2,1,2,283,13.0
196,301657891,cd,2,21,37.445999442593944,0,0,2,1,2,283,13.0
197,301657884,cd,2,20,38.96455187948817,0,0,2,1,2,283,13.0
198,301657876,cd,2,69,45.759246054898256,0,0,3,1,3,283,13.0
199,301657868,cd,2,68,74.05510561859806,0,0,3,1,3,283,13.0
200,301657859,cd,2,91,80.84979979400815,0,0,4,1,4,283,13.0
201,301657851,cd,2,67,42.66971460866461,0,0,3,1,3,283,13.0
202,301657844,cd,2,19,30.850264985716485,0,0,2,1,2,283,13.0
203,301657834,cd,2,99,64.79006141766662,0,0,5,1,5,283,13.0
204,301657825,cd,2,90,57.99536724225654,0,0,4,1,4,283,13.0
205,301657818,cd,2,18,58.729452985006134,0,0,2,1,2,283,13.0
206,301657811,cd,2,17,15.328598314255341,0,0,2,1,2,283,13.0
207,301657804,cd,2,16,14.690890874250478,0,0,2,1,2,283,13.0
208,301657797,cd,2,116,16.496274386819966,0,0,2,2,2,283,13.0
209,301657790,cd,2,15,24.731514651412166,0,0,2,1,2,283,13.0
210,301657776,cd,2,14,30.176404626794007,0,0,2,1,2,283,13.0
211,301657783,cd,2,115,39.97924716881371,0,0,2,2,2,283,13.0
212,301657769,cd,2,137,36.1425296499294,0,0,2,4,2,283,13.0
213,301657762,cd,2,114,44.24444356413347,0,0,2,2,2,283,13.0
214,301657755,cd,2,13,10.606919480430378,0,0,2,1,2,283,13.0
215,301657748,cd,2,12,207.48374804928324,0,0,2,1,2,283,13.0
216,301657741,cd,2,11,213.73175197715994,0,0,2,1,2,283,13.0
217,301657733,cd,2,66,431.3309580696202,0,0,3,1,3,283,13.0
218,301657726,cd,2,10,482.24195779491583,0,0,2,1,2,283,13.0
219,301657719,cd,2,9,217.33679687910657,0,0,2,1,2,283,13.0
220,301657711,cd,2,65,277.4641304314059,0,0,3,1,3,283,13.0
221,301657700,cd,2,108,495.9681026844445,0,0,6,1,6,283,13.0
222,301657693,cd,2,8,132.90611787104908,0,0,2,1,2,283,13.0
223,301657683,cd,2,98,492.44883456661154,0,0,5,1,5,283,13.0
224,301657674,cd,2,89,636.3075558336324,0,0,4,1,4,283,13.0
225,301657662,cd,2,113,767.7334631762789,0,0,7,1,7,283,13.0
226,301657648,cd,2,7,323.0871686980586,0,0,2,1,2,283,13.0
227,301657655,cd,2,6,161.26869641100598,0,0,2,1,2,283,13.0
228,301657638,cd,2,97,808.3865919225851,0,0,5,1,5,283,13.0
229,301657624,cd,1,5,0.9445474843144908,0,0,2,1,2,283,13.0
230,301657631,cd,1,4,0.9481982059018178,0,0,2,1,2,283,13.0
231,301657617,cd,1,3,0.9407492550217555,0,0,2,1,2,283,13.0
232,301657610,cd,1,2,0.9407492550217555,0,0,2,1,2,283,13.0
233,301657603,cd,1,1,0.9092398732830309,0,0,2,1,2,283,13.0
