counter,AS,Type,GranularityValue,SeverityScore,PageRank,NumBadDep,TotalDep,NumberOfVerteces,NumOfCycle,NumSetOfElement,TotNumOfSetOfElement,ADI
1,8083067,ud,2,6,16.96558381140219,4,0,0,0,5,77,4.0
2,8083058,ud,2,13,57.947347636631214,2,0,0,0,3,77,4.0
3,8083049,ud,2,22,29.814734164748806,1,0,0,0,2,77,4.0
4,8083040,ud,2,24,48.28950282855881,1,0,0,0,2,77,4.0
5,8083031,ud,2,21,27.797440492460204,1,0,0,0,2,77,4.0
6,8083022,ud,2,5,6.793205913215776,1,0,0,0,2,77,4.0
7,8083013,ud,2,12,8.131753147649473,1,0,0,0,2,77,4.0
8,8083004,ud,2,18,5.598005134841509,1,0,0,0,2,77,4.0
9,8082995,ud,2,2,6.0714218916349205,1,0,0,0,2,77,4.0
10,8082986,ud,2,4,23.21347375411428,1,0,0,0,2,77,4.0
11,8083199,ud,2,11,28.065552499234762,1,0,0,0,2,77,4.0
12,8083190,ud,2,10,78.8542969909081,2,0,0,0,3,77,4.0
13,8083181,ud,2,19,30.53698576368851,4,0,0,0,5,77,4.0
14,8083172,ud,2,17,4.103822907235102,1,0,0,0,2,77,4.0
15,8083163,ud,2,16,14.502085661537041,1,0,0,0,2,77,4.0
16,8083151,ud,2,27,6.364204972538635,2,0,0,0,3,77,4.0
17,8083133,ud,2,9,79.9289882728922,4,0,0,0,5,77,4.0
18,8083124,ud,2,23,6.683873799933432,1,0,0,0,2,77,4.0
19,8083109,ud,2,26,59.573313318926886,3,0,0,0,4,77,4.0
20,8083094,ud,2,3,27.16262341534553,2,0,0,0,3,77,4.0
21,8083085,ud,2,1,14.55364765895762,1,0,0,0,2,77,4.0
22,8083277,ud,2,8,4.038148752015514,1,0,0,0,2,77,4.0
23,8083268,ud,2,7,4.222349063274252,1,0,0,0,2,77,4.0
24,8083259,ud,2,15,3.381689187252026,1,0,0,0,2,77,4.0
25,8083244,ud,2,20,5.721975247798085,2,0,0,0,3,77,4.0
26,8083229,ud,2,14,2.508242990525372,1,0,0,0,2,77,4.0
27,8083220,ud,2,25,10.241755265666605,4,0,0,0,5,77,4.0
28,8082426,cd,1,17,2.2854777116738685,0,0,2,1,2,77,4.0
29,8082552,cd,2,16,8.532801805244723,0,0,2,1,2,77,4.0
30,8082559,cd,2,28,11.91065262209158,0,0,4,1,4,77,4.0
31,8082545,cd,2,36,10.403247891240895,0,0,2,2,2,77,4.0
32,8082538,cd,2,15,12.360531370029804,0,0,2,1,2,77,4.0
33,8082531,cd,2,35,37.152097689997575,0,0,2,2,2,77,4.0
34,8082524,cd,1,14,1.0095964060836673,0,0,2,1,2,77,4.0
35,8082517,cd,1,34,0.9288998250544446,0,0,2,2,2,77,4.0
36,8082510,cd,1,13,1.4240787041374798,0,0,2,1,2,77,4.0
37,8082496,cd,1,12,1.158695348188753,0,0,2,1,2,77,4.0
38,8082503,cd,1,33,0.8927299231497382,0,0,2,2,2,77,4.0
39,8082488,cd,1,24,1.332664691447602,0,0,3,1,3,77,4.0
40,8082479,cd,1,27,1.6550556620559194,0,0,4,1,4,77,4.0
41,8082471,cd,1,23,1.2509743735391734,0,0,3,1,3,77,4.0
42,8082463,cd,1,22,2.108326801449043,0,0,3,1,3,77,4.0
43,8082455,cd,1,21,1.9882322788145692,0,0,3,1,3,77,4.0
44,8082440,cd,1,11,1.8844332361725744,0,0,2,1,2,77,4.0
45,8082447,cd,1,20,2.0246608502431407,0,0,3,1,3,77,4.0
46,8082433,cd,1,32,1.3760810019466327,0,0,2,2,2,77,4.0
47,8082687,cd,2,10,15.109844994247371,0,0,2,1,2,77,4.0
48,8082679,cd,2,19,13.13679135481354,0,0,3,1,3,77,4.0
49,8082670,cd,2,26,14.695901925982609,0,0,4,1,4,77,4.0
50,8082661,cd,2,25,9.653623870842399,0,0,4,1,4,77,4.0
51,8082650,cd,2,30,18.808649236528208,0,0,6,1,6,77,4.0
52,8082643,cd,2,9,5.6154751188268826,0,0,2,1,2,77,4.0
53,8082633,cd,2,29,16.72462560539887,0,0,5,1,5,77,4.0
54,8082626,cd,2,8,11.10811561831584,0,0,2,1,2,77,4.0
55,8082619,cd,2,7,4.821265757800138,0,0,2,1,2,77,4.0
56,8082612,cd,2,6,43.21361419231753,0,0,2,1,2,77,4.0
57,8082605,cd,2,5,19.27508237304444,0,0,2,1,2,77,4.0
58,8082598,cd,2,31,55.02143068808086,0,0,2,2,2,77,4.0
59,8082591,cd,2,4,19.410789853254872,0,0,2,1,2,77,4.0
60,8082583,cd,2,18,30.53774946506872,0,0,3,1,3,77,4.0
61,8082568,cd,2,38,36.44803511943083,0,0,2,15,2,77,4.0
62,8082575,cd,2,37,69.21554658388399,0,0,3,2,3,77,4.0
63,8082708,cd,2,3,10.030335104985493,0,0,2,1,2,77,4.0
64,8082701,cd,2,2,9.560591311649688,0,0,2,1,2,77,4.0
65,8082694,cd,2,1,16.172551591658202,0,0,2,1,2,77,4.0
