counter,AS,Type,GranularityValue,SeverityScore,PageRank,NumBadDep,TotalDep,NumberOfVerteces,NumOfCycle,NumSetOfElement,TotNumOfSetOfElement,ADI
1,1490966,ud,2,10,14.341063723660106,1,0,0,0,2,102,23.0
2,1490975,ud,2,9,25.280160088239512,1,0,0,0,2,102,23.0
3,1490957,ud,2,8,19.034265681025957,1,0,0,0,2,102,23.0
4,1490993,ud,2,7,19.813282439043142,1,0,0,0,2,102,23.0
5,1491002,ud,2,6,27.873866444787804,1,0,0,0,2,102,23.0
6,1490984,ud,2,5,24.144737331479547,1,0,0,0,2,102,23.0
7,1491029,ud,2,4,23.184018937145552,1,0,0,0,2,102,23.0
8,1491038,ud,2,12,12.936055002495934,1,0,0,0,2,102,23.0
9,1491011,ud,2,3,22.822119437042705,1,0,0,0,2,102,23.0
10,1491020,ud,2,14,63.276454927667004,4,0,0,0,5,102,23.0
11,1491056,ud,2,15,20.314435427253883,2,0,0,0,3,102,23.0
12,1491068,ud,2,2,13.205640966900143,1,0,0,0,2,102,23.0
13,1491047,ud,2,11,8.564731126917787,1,0,0,0,2,102,23.0
14,1491089,ud,2,1,17.898842924265995,1,0,0,0,2,102,23.0
15,1491077,ud,2,13,29.428083906780856,1,0,0,0,2,102,23.0
16,1490802,hl,1,4,33.994652543146344,0,62,0,0,61,102,23.0
17,1490873,hl,2,3,191.99314283856592,0,26,0,0,21,102,23.0
18,1490907,hl,2,2,108.06387655688103,0,17,0,0,16,102,23.0
19,1490932,hl,2,1,154.0698222700568,0,17,0,0,15,102,23.0
20,1489938,cd,1,64,6.080403417085799,0,0,6,1,6,102,23.0
21,1489949,cd,1,14,1.565904181934495,0,0,2,1,2,102,23.0
22,1489927,cd,1,63,5.998003245674002,0,0,6,1,6,102,23.0
23,1489983,cd,1,54,6.037160302379613,0,0,5,1,5,102,23.0
24,1489956,cd,1,53,4.390214246099136,0,0,5,1,5,102,23.0
25,1489966,cd,1,83,11.835783691742403,0,0,12,1,12,102,23.0
26,1490002,cd,1,62,9.014175197491504,0,0,6,1,6,102,23.0
27,1490013,cd,1,39,6.144657027083956,0,0,4,1,4,102,23.0
28,1489993,cd,1,38,4.34697113139295,0,0,4,1,4,102,23.0
29,1490042,cd,1,61,7.654802589893873,0,0,6,1,6,102,23.0
30,1490022,cd,1,13,2.5735372954402034,0,0,2,1,2,102,23.0
31,1490029,cd,1,74,9.05062919381132,0,0,8,1,8,102,23.0
32,1490067,cd,1,71,9.98111989991589,0,0,7,1,7,102,23.0
33,1490079,cd,1,73,10.94959744718804,0,0,8,1,8,102,23.0
34,1490053,cd,1,77,10.01910674108347,0,0,9,1,9,102,23.0
35,1490100,cd,1,76,9.88719230655966,0,0,9,1,9,102,23.0
36,1490092,cd,1,27,4.131812031903056,0,0,3,1,3,102,23.0
37,1490133,cd,1,52,6.107649986053193,0,0,5,1,5,102,23.0
38,1490143,cd,1,70,7.027704866736516,0,0,7,1,7,102,23.0
39,1490114,cd,1,51,6.065149986053194,0,0,5,1,5,102,23.0
40,1490124,cd,1,37,6.012742592560146,0,0,4,1,4,102,23.0
41,1490163,cd,1,60,8.16728106935778,0,0,6,1,6,102,23.0
42,1490174,cd,1,88,6.771454465440333,0,0,4,2,4,102,23.0
43,1490155,cd,1,26,4.12173270000915,0,0,3,1,3,102,23.0
44,1490194,cd,1,12,2.902366952120927,0,0,2,1,2,102,23.0
45,1490201,cd,2,91,55.539830661599694,0,0,2,10,2,102,23.0
46,1490183,cd,1,59,7.636310835313695,0,0,6,1,6,102,23.0
47,1490229,cd,2,25,54.495978429964055,0,0,3,1,3,102,23.0
48,1490237,cd,2,11,22.566684452085603,0,0,2,1,2,102,23.0
49,1490208,cd,2,58,87.77973730952579,0,0,6,1,6,102,23.0
50,1490219,cd,2,50,79.55945764728696,0,0,5,1,5,102,23.0
51,1490260,cd,2,24,50.00442825768306,0,0,3,1,3,102,23.0
52,1490268,cd,2,10,28.58435844808473,0,0,2,1,2,102,23.0
53,1490244,cd,2,23,43.98675426168394,0,0,3,1,3,102,23.0
54,1490252,cd,2,22,66.35381668038681,0,0,3,1,3,102,23.0
55,1490294,cd,2,21,50.72822725788876,0,0,3,1,3,102,23.0
56,1490302,cd,2,69,82.96813390581487,0,0,7,1,7,102,23.0
57,1490275,cd,2,68,82.24433490560916,0,0,7,1,7,102,23.0
58,1490287,cd,2,9,29.308157448290423,0,0,2,1,2,102,23.0
59,1490325,cd,2,67,73.45490073840693,0,0,7,1,7,102,23.0
60,1490314,cd,2,57,74.74785424357603,0,0,6,1,6,102,23.0
61,1490356,cd,2,49,59.66221273294862,0,0,5,1,5,102,23.0
62,1490366,cd,2,66,72.86785369984877,0,0,7,1,7,102,23.0
63,1490337,cd,2,48,60.2492597715068,0,0,5,1,5,102,23.0
64,1490347,cd,2,36,61.542213276675895,0,0,4,1,4,102,23.0
65,1490387,cd,2,20,27.428156904563163,0,0,3,1,3,102,23.0
66,1490395,cd,2,47,75.08004626712278,0,0,5,1,5,102,23.0
67,1490378,cd,2,35,48.8482267141615,0,0,4,1,4,102,23.0
68,1490420,cd,2,8,19.326425028321417,0,0,2,1,2,102,23.0
69,1490427,cd,2,19,18.093535097893167,0,0,3,1,3,102,23.0
70,1490405,cd,2,7,53.654125637983796,0,0,2,1,2,102,23.0
71,1490412,cd,2,18,27.546704690560247,0,0,3,1,3,102,23.0
72,1490435,cd,2,6,11.008678192414298,0,0,2,1,2,102,23.0
73,1489557,cd,1,5,1.2928655314044406,0,0,2,1,2,102,23.0
74,1489564,cd,1,46,4.8127932610510955,0,0,5,1,5,102,23.0
75,1489548,cd,1,34,5.695524546699017,0,0,4,1,4,102,23.0
76,1489591,cd,1,17,4.790670110839551,0,0,3,1,3,102,23.0
77,1489599,cd,1,90,4.1853789838891,0,0,2,5,2,102,23.0
78,1489574,cd,1,16,2.7297048382314077,0,0,3,1,3,102,23.0
79,1489582,cd,1,33,4.610635398888498,0,0,4,1,4,102,23.0
80,1489623,cd,1,84,5.261308902630415,0,0,2,2,2,102,23.0
81,1489630,cd,1,87,5.122629819569807,0,0,3,2,3,102,23.0
82,1489606,cd,1,32,6.486843686752339,0,0,4,1,4,102,23.0
83,1489615,cd,1,15,4.39003749093476,0,0,3,1,3,102,23.0
84,1489648,cd,1,45,5.981845178063885,0,0,5,1,5,102,23.0
85,1489658,cd,1,4,1.7532625480458228,0,0,2,1,2,102,23.0
86,1489638,cd,1,44,6.632775382379725,0,0,5,1,5,102,23.0
87,1489685,cd,1,86,4.380446307314075,0,0,3,2,3,102,23.0
88,1489693,cd,1,65,9.13575861662993,0,0,7,1,7,102,23.0
89,1489665,cd,1,31,5.201390615608338,0,0,4,1,4,102,23.0
90,1489674,cd,1,56,6.711536178418255,0,0,6,1,6,102,23.0
91,1489715,cd,1,89,5.194217172531436,0,0,2,3,2,102,23.0
92,1489722,cd,1,78,10.189623370645673,0,0,10,1,10,102,23.0
93,1489705,cd,1,43,7.200336366933392,0,0,5,1,5,102,23.0
94,1489746,cd,1,42,6.3151736566461585,0,0,5,1,5,102,23.0
95,1489756,cd,1,3,2.4969453040982117,0,0,2,1,2,102,23.0
96,1489737,cd,1,30,4.434243095989069,0,0,4,1,4,102,23.0
97,1489781,cd,1,85,7.075147733188526,0,0,3,2,3,102,23.0
98,1489789,cd,1,41,7.031503008897347,0,0,5,1,5,102,23.0
99,1489763,cd,1,29,6.068065035741965,0,0,4,1,4,102,23.0
100,1489772,cd,1,28,5.751633217560146,0,0,4,1,4,102,23.0
101,1489815,cd,1,55,6.396390802033612,0,0,6,1,6,102,23.0
102,1489799,cd,1,80,11.183293529418068,0,0,11,1,11,102,23.0
103,1489826,cd,1,72,8.171592447687416,0,0,8,1,8,102,23.0
104,1489839,cd,1,82,12.151771076690217,0,0,12,1,12,102,23.0
105,1489873,cd,1,79,11.792540577036217,0,0,11,1,11,102,23.0
106,1489863,cd,1,40,4.70620163104695,0,0,5,1,5,102,23.0
107,1489856,cd,1,2,1.8818915668823086,0,0,2,1,2,102,23.0
108,1489910,cd,1,81,11.753383520330605,0,0,12,1,12,102,23.0
109,1489889,cd,1,1,1.4835040105226978,0,0,2,1,2,102,23.0
110,1489896,cd,1,75,9.389079369141008,0,0,9,1,9,102,23.0
