counter,AS,Type,GranularityValue,SeverityScore,PageRank,NumBadDep,TotalDep,NumberOfVerteces,NumOfCycle,NumSetOfElement,TotNumOfSetOfElement,ADI
1,24699766,ud,2,31,23.565305741204135,1,0,0,0,2,170,15.0
2,24699751,ud,2,37,43.12133630826467,3,0,0,0,4,170,15.0
3,24699742,ud,2,30,14.59242580863842,1,0,0,0,2,170,15.0
4,24699733,ud,2,29,7.25215447801992,1,0,0,0,2,170,15.0
5,24699721,ud,2,13,8.237325205080538,2,0,0,0,3,170,15.0
6,24699712,ud,2,36,5.428149656653019,1,0,0,0,2,170,15.0
7,24699703,ud,2,23,25.16513258370861,1,0,0,0,2,170,15.0
8,24699694,ud,2,12,4.538015263984894,1,0,0,0,2,170,15.0
9,24699676,ud,2,22,6.53882615769653,1,0,0,0,2,170,15.0
10,24699664,ud,2,35,14.197817340265102,5,0,0,0,6,170,15.0
11,24699655,ud,2,11,5.484575953207777,1,0,0,0,2,170,15.0
12,24699892,ud,2,34,6.8710713903758975,2,0,0,0,3,170,15.0
13,24699874,ud,2,10,70.57254177942244,3,0,0,0,4,170,15.0
14,24699862,ud,2,21,37.44946949905268,2,0,0,0,3,170,15.0
15,24699850,ud,2,28,69.33887105304773,4,0,0,0,5,170,15.0
16,24699841,ud,2,45,216.81158836958355,1,0,0,0,2,170,15.0
17,24699832,ud,2,49,1.6622335762300136,1,0,0,0,2,170,15.0
18,24699823,ud,2,44,16.702912856063254,2,0,0,0,3,170,15.0
19,24699814,ud,2,47,3.1037109217801744,1,0,0,0,2,170,15.0
20,24699805,ud,2,46,3.6129021514128943,1,0,0,0,2,170,15.0
21,24699796,ud,2,38,70.9750295149809,1,0,0,0,2,170,15.0
22,24699787,ud,2,40,3.6670877138464526,1,0,0,0,2,170,15.0
23,24699778,ud,2,9,39.0915875238176,2,0,0,0,3,170,15.0
24,24699646,ud,2,8,31.007751543991205,1,0,0,0,2,170,15.0
25,24699634,ud,2,20,7.668604566677596,2,0,0,0,3,170,15.0
26,24699619,ud,2,19,6.505311651696218,2,0,0,0,3,170,15.0
27,24699610,ud,2,18,27.74027515186188,1,0,0,0,2,170,15.0
28,24699592,ud,2,27,35.96776144801144,5,0,0,0,6,170,15.0
29,24699583,ud,2,48,151.60554048045867,1,0,0,0,2,170,15.0
30,24699574,ud,2,17,216.37465094272233,2,0,0,0,3,170,15.0
31,24699565,ud,2,42,10.442066341927958,1,0,0,0,2,170,15.0
32,24700024,ud,2,7,3.9862408249421795,1,0,0,0,2,170,15.0
33,24700015,ud,2,33,3.8567791016109108,1,0,0,0,2,170,15.0
34,24700003,ud,2,16,15.45887852576313,2,0,0,0,3,170,15.0
35,24699991,ud,2,15,14.555701667604126,1,0,0,0,2,170,15.0
36,24699982,ud,2,6,7.154715139955738,1,0,0,0,2,170,15.0
37,24699973,ud,2,14,11.211151955988141,1,0,0,0,2,170,15.0
38,24699964,ud,2,5,6.25697518339887,1,0,0,0,2,170,15.0
39,24699955,ud,2,43,5.454490645824699,1,0,0,0,2,170,15.0
40,24699943,ud,2,41,31.56854211633658,2,0,0,0,3,170,15.0
41,24699934,ud,2,32,6.055021964441626,1,0,0,0,2,170,15.0
42,24699925,ud,2,4,3.480736181374447,1,0,0,0,2,170,15.0
43,24699916,ud,2,26,2.871366810313789,1,0,0,0,2,170,15.0
44,24699907,ud,2,3,5.57581813757102,1,0,0,0,2,170,15.0
45,24700084,ud,2,25,3.07210144020761,1,0,0,0,2,170,15.0
46,24700072,ud,2,24,18.82623754453109,2,0,0,0,3,170,15.0
47,24700063,ud,2,2,13.307516210702289,1,0,0,0,2,170,15.0
48,24700042,ud,2,1,17.15928938464153,4,0,0,0,5,170,15.0
49,24700033,ud,2,39,6.073607684765754,1,0,0,0,2,170,15.0
50,24699524,hl,2,1,716.2276044430957,0,33,0,0,34,170,15.0
51,24698747,cd,2,72,9.409151052242185,0,0,2,2,2,170,15.0
52,24698740,cd,2,33,17.538197773139707,0,0,2,1,2,170,15.0
53,24698731,cd,2,62,12.345746533305132,0,0,4,1,4,170,15.0
54,24698724,cd,2,32,8.774635488886751,0,0,2,1,2,170,15.0
55,24698717,cd,2,71,10.894030017866726,0,0,2,2,2,170,15.0
56,24698710,cd,2,31,16.86645419020448,0,0,2,1,2,170,15.0
57,24698696,cd,2,30,326.74379224265,0,0,2,1,2,170,15.0
58,24698703,cd,2,70,46.51509784344864,0,0,2,2,2,170,15.0
59,24698689,cd,1,29,0.9434659219393065,0,0,2,1,2,170,15.0
60,24698682,cd,1,28,1.1446730971813126,0,0,2,1,2,170,15.0
61,24698675,cd,1,27,1.0272826169708655,0,0,2,1,2,170,15.0
62,24698668,cd,1,26,1.2318414981849495,0,0,2,1,2,170,15.0
63,24698660,cd,1,52,1.254153283815047,0,0,3,1,3,170,15.0
64,24698653,cd,1,25,1.0910326169708655,0,0,2,1,2,170,15.0
65,24698646,cd,1,69,0.9286318931350004,0,0,2,2,2,170,15.0
66,24698632,cd,1,24,1.4430160225643585,0,0,2,1,2,170,15.0
67,24698639,cd,1,23,1.0093121726219123,0,0,2,1,2,170,15.0
68,24698625,cd,1,22,1.7528810394169705,0,0,2,1,2,170,15.0
69,24698873,cd,2,61,20.106262208244033,0,0,4,1,4,170,15.0
70,24698866,cd,2,21,5.710374478514293,0,0,2,1,2,170,15.0
71,24698858,cd,2,51,9.230769139816394,0,0,3,1,3,170,15.0
72,24698848,cd,2,66,20.96011754215067,0,0,5,1,5,170,15.0
73,24698841,cd,2,20,42.66711181200091,0,0,2,1,2,170,15.0
74,24698834,cd,2,19,43.90343848011315,0,0,2,1,2,170,15.0
75,24698826,cd,2,50,70.8456011747431,0,0,3,1,3,170,15.0
76,24698819,cd,2,80,47.85665444124845,0,0,2,15,2,170,15.0
77,24698810,cd,2,60,86.43374012806503,0,0,4,1,4,170,15.0
78,24698801,cd,2,76,71.37986103607372,0,0,4,4,4,170,15.0
79,24698791,cd,2,65,87.51411878003698,0,0,5,1,5,170,15.0
80,24698776,cd,2,18,19.0211257048328,0,0,2,1,2,170,15.0
81,24698783,cd,2,49,62.28856248330307,0,0,3,1,3,170,15.0
82,24698768,cd,2,48,52.92526601256262,0,0,3,1,3,170,15.0
83,24698761,cd,2,17,31.322929620182286,0,0,2,1,2,170,15.0
84,24698754,cd,2,16,42.72668616698472,0,0,2,1,2,170,15.0
85,24698492,cd,1,47,2.7529091959850565,0,0,3,1,3,170,15.0
86,24698484,cd,1,46,2.850322044542749,0,0,3,1,3,170,15.0
87,24698474,cd,1,64,3.538552501330023,0,0,5,1,5,170,15.0
88,24698465,cd,1,59,3.4702991142404294,0,0,4,1,4,170,15.0
89,24698457,cd,1,45,2.730501374617318,0,0,3,1,3,170,15.0
90,24698450,cd,1,68,0.9724138928881108,0,0,2,2,2,170,15.0
91,24698442,cd,1,44,2.715259085801666,0,0,3,1,3,170,15.0
92,24698433,cd,1,58,3.073856728790461,0,0,4,1,4,170,15.0
93,24698424,cd,1,57,3.073856728790461,0,0,4,1,4,170,15.0
94,24698416,cd,1,43,2.82915118940882,0,0,3,1,3,170,15.0
95,24698409,cd,1,75,1.3581205466028972,0,0,2,3,2,170,15.0
96,24698402,cd,1,15,2.220132245200147,0,0,2,1,2,170,15.0
97,24698617,cd,1,42,1.8400753242040548,0,0,3,1,3,170,15.0
98,24698610,cd,1,14,1.44225155852874,0,0,2,1,2,170,15.0
99,24698601,cd,1,56,2.164648937953936,0,0,4,1,4,170,15.0
100,24698593,cd,1,41,1.7668251722786215,0,0,3,1,3,170,15.0
101,24698586,cd,1,77,1.4882134729414735,0,0,2,5,2,170,15.0
102,24698579,cd,1,67,0.8937555495956111,0,0,2,2,2,170,15.0
103,24698572,cd,1,13,1.522941954127528,0,0,2,1,2,170,15.0
104,24698565,cd,1,12,1.0874070253331327,0,0,2,1,2,170,15.0
105,24698556,cd,1,55,1.4349441755209786,0,0,4,1,4,170,15.0
106,24698548,cd,1,40,1.235067998565965,0,0,3,1,3,170,15.0
107,24698540,cd,1,39,2.642948717874219,0,0,3,1,3,170,15.0
108,24698532,cd,1,38,2.7851782481533385,0,0,3,1,3,170,15.0
109,24698523,cd,1,54,2.8622249654200376,0,0,4,1,4,170,15.0
110,24698516,cd,1,11,2.929714431329301,0,0,2,1,2,170,15.0
111,24698508,cd,1,37,2.764917282637987,0,0,3,1,3,170,15.0
112,24698500,cd,1,36,2.715259085801666,0,0,3,1,3,170,15.0
113,24699002,cd,2,10,15.434559100126354,0,0,2,1,2,170,15.0
114,24698995,cd,2,9,9.656698278346298,0,0,2,1,2,170,15.0
115,24698988,cd,2,8,10.372178775114747,0,0,2,1,2,170,15.0
116,24698981,cd,2,7,6.222851584256575,0,0,2,1,2,170,15.0
117,24698974,cd,2,79,10.74115167183445,0,0,2,7,2,170,15.0
118,24698960,cd,2,6,5.275229842512175,0,0,2,1,2,170,15.0
119,24698967,cd,2,5,6.060785719666004,0,0,2,1,2,170,15.0
120,24698953,cd,2,78,8.9722370883383,0,0,2,6,2,170,15.0
121,24698945,cd,2,73,10.710224087303292,0,0,3,2,3,170,15.0
122,24698938,cd,2,74,8.357681147501088,0,0,2,3,2,170,15.0
123,24698931,cd,2,4,11.258893320592463,0,0,2,1,2,170,15.0
124,24698924,cd,2,3,12.723386854140387,0,0,2,1,2,170,15.0
125,24698916,cd,2,35,16.670953195177464,0,0,3,1,3,170,15.0
126,24698907,cd,2,53,19.17810564744773,0,0,4,1,4,170,15.0
127,24698899,cd,2,34,9.77099531647204,0,0,3,1,3,170,15.0
128,24698892,cd,2,2,6.25060065516994,0,0,2,1,2,170,15.0
129,24698882,cd,2,63,21.500343718806313,0,0,5,1,5,170,15.0
130,24699009,cd,2,1,16.878871649336038,0,0,2,1,2,170,15.0
