counter,AS,Type,GranularityValue,SeverityScore,PageRank,NumBadDep,TotalDep,NumberOfVerteces,NumOfCycle,NumSetOfElement,TotNumOfSetOfElement,ADI
1,1176830,ud,2,7,59.10875018302241,4,0,0,0,5,93,21.0
2,1176800,ud,2,3,17.597747452765084,1,0,0,0,2,93,21.0
3,1176809,ud,2,6,53.9556125385665,6,0,0,0,7,93,21.0
4,1176851,ud,2,2,7.21103070433891,1,0,0,0,2,93,21.0
5,1176860,ud,2,8,19.59888725083264,2,0,0,0,3,93,21.0
6,1176842,ud,2,4,12.125728667328996,1,0,0,0,2,93,21.0
7,1176884,ud,2,5,28.183698585688813,1,0,0,0,2,93,21.0
8,1176872,ud,2,1,22.22352059989404,2,0,0,0,3,93,21.0
9,1176667,hl,1,3,27.17491266578561,0,62,0,0,61,93,21.0
10,1176738,hl,2,2,179.93170092182632,0,26,0,0,21,93,21.0
11,1176772,hl,2,1,102.71238481902091,0,20,0,0,19,93,21.0
12,1175929,cd,1,53,3.2391119265943558,0,0,2,5,2,93,21.0
13,1175960,cd,1,29,2.872862158818904,0,0,3,1,3,93,21.0
14,1175936,cd,1,14,1.4847532921339661,0,0,2,1,2,93,21.0
15,1175943,cd,1,28,2.5982487923817414,0,0,3,1,3,93,21.0
16,1175951,cd,1,37,3.610369718480547,0,0,4,1,4,93,21.0
17,1175984,cd,1,27,3.483477950200984,0,0,3,1,3,93,21.0
18,1175992,cd,1,51,3.861445616521693,0,0,4,2,4,93,21.0
19,1175968,cd,1,36,3.2727103388001852,0,0,4,1,4,93,21.0
20,1175977,cd,1,13,2.4713570241021783,0,0,2,1,2,93,21.0
21,1176018,cd,1,49,2.758573748697526,0,0,2,2,2,93,21.0
22,1176025,cd,1,26,3.059050239760216,0,0,3,1,3,93,21.0
23,1176001,cd,1,42,4.709383932806378,0,0,5,1,5,93,21.0
24,1176011,cd,1,12,1.4287050662739966,0,0,2,1,2,93,21.0
25,1176056,cd,1,35,3.5641120458751345,0,0,4,1,4,93,21.0
26,1176033,cd,1,52,3.3818073465932628,0,0,2,3,2,93,21.0
27,1176040,cd,1,11,1.8482466383840297,0,0,2,1,2,93,21.0
28,1176047,cd,1,34,3.651502670875135,0,0,4,1,4,93,21.0
29,1176083,cd,1,33,3.0416801693164324,0,0,4,1,4,93,21.0
30,1176092,cd,1,10,1.8269966383840295,0,0,2,1,2,93,21.0
31,1176065,cd,1,25,2.7161737295904502,0,0,3,1,3,93,21.0
32,1176073,cd,1,41,3.889618485601118,0,0,5,1,5,93,21.0
33,1176115,cd,1,9,1.0311619340679539,0,0,2,1,2,93,21.0
34,1176122,cd,1,8,1.015813747351848,0,0,2,1,2,93,21.0
35,1176099,cd,1,50,4.2297456628779475,0,0,3,2,3,93,21.0
36,1176107,cd,1,24,1.4449918676959008,0,0,3,1,3,93,21.0
37,1176147,cd,2,23,56.55810182285096,0,0,3,1,3,93,21.0
38,1176155,cd,2,7,36.13234219452556,0,0,2,1,2,93,21.0
39,1176129,cd,2,54,51.94569906411296,0,0,2,10,2,93,21.0
40,1176136,cd,2,44,79.15253359750372,0,0,6,1,6,93,21.0
41,1176180,cd,2,48,74.04311064768625,0,0,7,1,7,93,21.0
42,1176162,cd,2,40,71.74097238305453,0,0,5,1,5,93,21.0
43,1176172,cd,2,22,46.83627611429549,0,0,3,1,3,93,21.0
44,1176214,cd,2,32,49.18541274005591,0,0,4,1,4,93,21.0
45,1176223,cd,2,21,41.42747378269249,0,0,3,1,3,93,21.0
46,1176192,cd,2,6,26.4105164859701,0,0,2,1,2,93,21.0
47,1176199,cd,2,20,59.70363802147638,0,0,3,1,3,93,21.0
48,1176207,cd,2,5,21.0017141543671,0,0,2,1,2,93,21.0
49,1176250,cd,2,47,74.42968273073079,0,0,7,1,7,93,21.0
50,1176231,cd,2,19,47.22284819734003,0,0,3,1,3,93,21.0
51,1176239,cd,2,43,67.0181215162816,0,0,6,1,6,93,21.0
52,1176278,cd,2,46,66.05858343560988,0,0,7,1,7,93,21.0
53,1176262,cd,2,4,26.797088569014633,0,0,2,1,2,93,21.0
54,1176269,cd,2,31,54.98078715470345,0,0,4,1,4,93,21.0
55,1176312,cd,2,18,25.15761400148041,0,0,3,1,3,93,21.0
56,1176290,cd,2,39,54.021249074031715,0,0,5,1,5,93,21.0
57,1176300,cd,2,45,65.37864694874737,0,0,7,1,7,93,21.0
58,1176336,cd,2,38,68.05835379004154,0,0,5,1,5,93,21.0
59,1176346,cd,2,17,15.309866320287512,0,0,3,1,3,93,21.0
60,1176320,cd,2,30,45.583373629805806,0,0,4,1,4,93,21.0
61,1176329,cd,2,3,48.609458214014204,0,0,2,1,2,93,21.0
62,1176369,cd,2,16,16.651107727244472,0,0,3,1,3,93,21.0
63,1176377,cd,2,2,9.517917387172073,0,0,2,1,2,93,21.0
64,1176354,cd,2,15,24.353039597533087,0,0,3,1,3,93,21.0
65,1176362,cd,2,1,16.941478383083894,0,0,2,1,2,93,21.0
