counter,AS,Type,GranularityValue,SeverityScore,PageRank,NumBadDep,TotalDep,NumberOfVerteces,NumOfCycle,NumSetOfElement,TotNumOfSetOfElement,ADI
1,526280,ud,2,1,39.041396027710114,2,0,0,0,3,16,9.0
2,526152,cd,1,7,2.5390483135144564,0,0,3,1,3,16,9.0
3,526145,cd,1,5,1.9621450984075084,0,0,2,1,2,16,9.0
4,526168,cd,1,4,2.530661948624175,0,0,2,1,2,16,9.0
5,526175,cd,1,8,2.999621767260175,0,0,4,1,4,16,9.0
6,526160,cd,1,6,2.5958325821654764,0,0,3,1,3,16,9.0
7,526184,cd,1,3,6.880265952876738,0,0,2,1,2,16,9.0
8,526191,cd,1,2,1.1066488572617348,0,0,2,1,2,16,9.0
9,526205,cd,1,9,1.0290543671665136,0,0,2,8,2,16,9.0
10,526198,cd,1,1,1.1066488572617348,0,0,2,1,2,16,9.0
