counter,AS,Type,GranularityValue,SeverityScore,PageRank,NumBadDep,TotalDep,NumberOfVerteces,NumOfCycle,NumSetOfElement,TotNumOfSetOfElement,ADI
1,2962814,ud,2,1,8.652539462740496,1,0,0,0,2,102,21.0
2,2962802,ud,2,5,60.909517998167296,4,0,0,0,5,102,21.0
3,2962760,ud,2,4,32.77941219381892,3,0,0,0,4,102,21.0
4,2962781,ud,2,7,57.286807863621455,6,0,0,0,7,102,21.0
5,2962769,ud,2,3,25.33883631232083,2,0,0,0,3,102,21.0
6,2962823,ud,2,6,20.018440038668132,2,0,0,0,3,102,21.0
7,2962835,ud,2,2,28.055222419368974,1,0,0,0,2,102,21.0
8,2962597,hl,1,4,30.34632867122213,0,66,0,0,65,102,21.0
9,2962672,hl,2,3,188.76199413815624,0,26,0,0,21,102,21.0
10,2962733,hl,2,2,160.25865855887628,0,19,0,0,16,102,21.0
11,2962706,hl,2,1,118.17306663965294,0,19,0,0,17,102,21.0
12,2961772,cd,1,25,3.468498824897972,0,0,3,1,3,102,21.0
13,2961761,cd,1,48,6.147214314078303,0,0,6,1,6,102,21.0
14,2961787,cd,1,24,2.5532750463417395,0,0,3,1,3,102,21.0
15,2961780,cd,1,14,1.2796684978221011,0,0,2,1,2,102,21.0
16,2961749,cd,1,52,7.166151681676821,0,0,7,1,7,102,21.0
17,2961835,cd,1,13,1.7546490769679928,0,0,2,1,2,102,21.0
18,2961826,cd,1,34,3.95433413396171,0,0,4,1,4,102,21.0
19,2961851,cd,1,41,4.487690596405985,0,0,5,1,5,102,21.0
20,2961842,cd,1,33,3.468753228807468,0,0,4,1,4,102,21.0
21,2961802,cd,1,58,3.5531340855160667,0,0,2,5,2,102,21.0
22,2961795,cd,1,55,2.4625778364211826,0,0,2,2,2,102,21.0
23,2961817,cd,1,32,5.145364647649685,0,0,4,1,4,102,21.0
24,2961809,cd,1,23,4.139443659172896,0,0,3,1,3,102,21.0
25,2961900,cd,1,31,4.9073812683582325,0,0,4,1,4,102,21.0
26,2961892,cd,1,56,5.074818990900363,0,0,3,2,3,102,21.0
27,2961916,cd,1,30,4.24952088974398,0,0,4,1,4,102,21.0
28,2961909,cd,1,12,2.0959697764855187,0,0,2,1,2,102,21.0
29,2961868,cd,1,57,4.055881623301847,0,0,2,3,2,102,21.0
30,2961861,cd,1,11,2.0763828199637793,0,0,2,1,2,102,21.0
31,2961883,cd,1,29,4.163558933222242,0,0,4,1,4,102,21.0
32,2961875,cd,1,22,3.1446215656237246,0,0,3,1,3,102,21.0
33,2961956,cd,1,51,5.559939046624744,0,0,7,1,7,102,21.0
34,2961980,cd,1,47,5.046644709644622,0,0,6,1,6,102,21.0
35,2961968,cd,1,50,6.065582077243139,0,0,7,1,7,102,21.0
36,2961932,cd,1,53,6.578876414223261,0,0,8,1,8,102,21.0
37,2961925,cd,1,10,1.4892703829334826,0,0,2,1,2,102,21.0
38,2961945,cd,1,46,4.425325300964799,0,0,6,1,6,102,21.0
39,2962030,cd,1,49,6.102335972403494,0,0,7,1,7,102,21.0
40,2962020,cd,1,40,3.948784859145031,0,0,5,1,5,102,21.0
41,2962042,cd,1,39,4.9084517756991985,0,0,5,1,5,102,21.0
42,2961991,cd,1,45,5.927389143297715,0,0,6,1,6,102,21.0
43,2962013,cd,1,9,1.5260242780938373,0,0,2,1,2,102,21.0
44,2962002,cd,1,44,5.083398604804977,0,0,6,1,6,102,21.0
45,2962089,cd,2,8,35.61339752961021,0,0,2,1,2,102,21.0
46,2962082,cd,2,59,56.81888403264274,0,0,2,11,2,102,21.0
47,2962106,cd,2,7,31.45792704469744,0,0,2,1,2,102,21.0
48,2962096,cd,2,38,79.47086720561882,0,0,5,1,5,102,21.0
49,2962061,cd,1,54,3.288164858918407,0,0,2,2,2,102,21.0
50,2962052,cd,1,28,3.7738380300392533,0,0,4,1,4,102,21.0
51,2962075,cd,2,6,19.903765692404892,0,0,2,1,2,102,21.0
52,2962068,cd,2,5,23.860964149020774,0,0,2,1,2,102,21.0
53,2962155,cd,2,27,54.301562001750646,0,0,4,1,4,102,21.0
54,2962147,cd,2,21,45.321749615726056,0,0,3,1,3,102,21.0
55,2962171,cd,2,4,29.644394020262574,0,0,2,1,2,102,21.0
56,2962164,cd,2,3,20.87270739467958,0,0,2,1,2,102,21.0
57,2962124,cd,2,20,47.282716459084725,0,0,3,1,3,102,21.0
58,2962113,cd,2,43,69.9346996320608,0,0,6,1,6,102,21.0
59,2962140,cd,2,2,40.75190535081341,0,0,2,1,2,102,21.0
60,2962132,cd,2,19,56.57669476520069,0,0,3,1,3,102,21.0
61,2962215,cd,2,42,49.53486436911797,0,0,6,1,6,102,21.0
62,2962236,cd,2,18,28.883578078429483,0,0,3,1,3,102,21.0
63,2962226,cd,2,37,40.55505198309338,0,0,5,1,5,102,21.0
64,2962187,cd,2,36,52.296377193238655,0,0,5,1,5,102,21.0
65,2962178,cd,2,26,43.316564807214064,0,0,4,1,4,102,21.0
66,2962207,cd,2,17,26.882881196141884,0,0,3,1,3,102,21.0
67,2962197,cd,2,35,41.307632776930824,0,0,5,1,5,102,21.0
68,2962252,cd,2,16,18.514059901525684,0,0,3,1,3,102,21.0
69,2962244,cd,2,15,17.157514058405667,0,0,3,1,3,102,21.0
70,2962260,cd,2,1,11.073484020027593,0,0,2,1,2,102,21.0
