(footprint "LGA10_BMP390_BOS-L" (version 20221018) (generator pcbnew)
  (layer "F.Cu")
  (tags "BMP390 ")
  (attr smd)
  (fp_text reference "REF**" (at 0 0 unlocked) (layer "F.SilkS")
      (effects (font (size 1 1) (thickness 0.15)))
    (tstamp 8c1011d2-bb23-4a86-bbcf-1aa8ac245aae)
  )
  (fp_text value "LGA10_BMP390_BOS" (at 0 0 unlocked) (layer "F.Fab")
      (effects (font (size 1 1) (thickness 0.15)))
    (tstamp 05eabddb-4823-4ce2-a67b-335bd7ccd2bf)
  )
  (fp_text user "*" (at -1.6256 -0.500126 unlocked) (layer "F.SilkS")
      (effects (font (size 1 1) (thickness 0.15)))
    (tstamp 57679b9c-fc67-4508-86a1-9dbbef8df1fb)
  )
  (fp_text user "*" (at -1.6256 -0.500126) (layer "F.SilkS")
      (effects (font (size 1 1) (thickness 0.15)))
    (tstamp 974429ed-b061-41fc-ae5a-c72aae4fcf57)
  )
  (fp_text user "*" (at 0.127 -0.500126) (layer "F.Fab")
      (effects (font (size 1 1) (thickness 0.15)))
    (tstamp 285eab4c-6bb2-47f1-8363-7bb3a1930182)
  )
  (fp_text user "${REFERENCE}" (at 0 0 unlocked) (layer "F.Fab")
      (effects (font (size 1 1) (thickness 0.15)))
    (tstamp b5b405a2-e3c0-440b-ae67-14ae9263f1b6)
  )
  (fp_text user "*" (at 0.127 -0.500126 unlocked) (layer "F.Fab")
      (effects (font (size 1 1) (thickness 0.15)))
    (tstamp f18a94f4-81b0-4d0e-957e-286d31a44512)
  )
  (fp_line (start -1.1557 -1.1557) (end -1.1557 -0.701273)
    (stroke (width 0.1524) (type solid)) (layer "F.SilkS") (tstamp b32e94ab-27c2-4aee-abe1-967e181e82f4))
  (fp_line (start -1.1557 0.701273) (end -1.1557 1.1557)
    (stroke (width 0.1524) (type solid)) (layer "F.SilkS") (tstamp c0c16033-ec4a-47ce-b015-7c71561ac676))
  (fp_line (start -1.1557 1.1557) (end -0.45121 1.1557)
    (stroke (width 0.1524) (type solid)) (layer "F.SilkS") (tstamp d8603b2d-fb21-4faa-97b6-fde25b78e4e9))
  (fp_line (start -0.45121 -1.1557) (end -1.1557 -1.1557)
    (stroke (width 0.1524) (type solid)) (layer "F.SilkS") (tstamp 4ad7dd07-1fdf-4501-be34-475a4765e6bd))
  (fp_line (start 0.45121 1.1557) (end 1.1557 1.1557)
    (stroke (width 0.1524) (type solid)) (layer "F.SilkS") (tstamp 93afe186-ae39-4927-a221-14605ad522cf))
  (fp_line (start 1.1557 -1.1557) (end 0.45121 -1.1557)
    (stroke (width 0.1524) (type solid)) (layer "F.SilkS") (tstamp 7b03ee04-9bdd-4dac-aca9-4f39ab669b9b))
  (fp_line (start 1.1557 -0.701273) (end 1.1557 -1.1557)
    (stroke (width 0.1524) (type solid)) (layer "F.SilkS") (tstamp da765d49-c780-4822-98c2-a30a8be9ed3d))
  (fp_line (start 1.1557 1.1557) (end 1.1557 0.701273)
    (stroke (width 0.1524) (type solid)) (layer "F.SilkS") (tstamp 1fa8e882-a462-4475-b419-2c38a3355ea1))
  (fp_poly
    (pts
      (xy -0.440563 -1.0922)
      (xy -0.440563 -1.3462)
      (xy -0.059563 -1.3462)
      (xy -0.059563 -1.0922)
    )

    (stroke (width 0) (type solid)) (fill solid) (layer "F.SilkS") (tstamp 604f9280-6362-4191-95c3-574796e2f113))
  (fp_line (start -1.1303 -1.1303) (end -0.453263 -1.1303)
    (stroke (width 0.1524) (type solid)) (layer "F.CrtYd") (tstamp a08ca901-5b4d-4eb5-a17f-6dfb15c743d4))
  (fp_line (start -1.1303 -0.703326) (end -1.1303 -1.1303)
    (stroke (width 0.1524) (type solid)) (layer "F.CrtYd") (tstamp 65a6dbb6-3ba0-4908-91e2-f0eef7184ce2))
  (fp_line (start -1.1303 -0.703326) (end -1.1303 -0.703326)
    (stroke (width 0.1524) (type solid)) (layer "F.CrtYd") (tstamp 4f0e1a4b-e64e-4fa1-ab42-47b63b7bac6d))
  (fp_line (start -1.1303 0.703326) (end -1.1303 -0.703326)
    (stroke (width 0.1524) (type solid)) (layer "F.CrtYd") (tstamp 8dbac0a7-2dd0-4c16-aaaa-f66e4912bc49))
  (fp_line (start -1.1303 0.703326) (end -1.1303 0.703326)
    (stroke (width 0.1524) (type solid)) (layer "F.CrtYd") (tstamp 562ab8d2-b519-4691-a286-8a608dfab013))
  (fp_line (start -1.1303 1.1303) (end -1.1303 0.703326)
    (stroke (width 0.1524) (type solid)) (layer "F.CrtYd") (tstamp 88375e7d-7f16-4ce3-8a73-d45c52fa8d18))
  (fp_line (start -0.453263 -1.1303) (end -0.453263 -1.1303)
    (stroke (width 0.1524) (type solid)) (layer "F.CrtYd") (tstamp e2d2b6ff-e6f6-4335-879a-dda459a868d6))
  (fp_line (start -0.453263 -1.1303) (end 0.453263 -1.1303)
    (stroke (width 0.1524) (type solid)) (layer "F.CrtYd") (tstamp 1ee75edb-c034-4097-bb5a-39b8be98ef31))
  (fp_line (start -0.453263 1.1303) (end -1.1303 1.1303)
    (stroke (width 0.1524) (type solid)) (layer "F.CrtYd") (tstamp 53aeba90-d33e-4c36-b350-8ca71fb6dd4b))
  (fp_line (start -0.453263 1.1303) (end -0.453263 1.1303)
    (stroke (width 0.1524) (type solid)) (layer "F.CrtYd") (tstamp 698d2a15-10eb-4318-9098-ceb2d49281c3))
  (fp_line (start 0.453263 -1.1303) (end 0.453263 -1.1303)
    (stroke (width 0.1524) (type solid)) (layer "F.CrtYd") (tstamp 8410b53d-af7b-484d-82c8-a9d51949c3d9))
  (fp_line (start 0.453263 -1.1303) (end 1.1303 -1.1303)
    (stroke (width 0.1524) (type solid)) (layer "F.CrtYd") (tstamp 5905dfe4-c7ff-4754-824c-cad11acaff2c))
  (fp_line (start 0.453263 1.1303) (end -0.453263 1.1303)
    (stroke (width 0.1524) (type solid)) (layer "F.CrtYd") (tstamp a63e428c-6dc6-4997-b215-c17a830ea271))
  (fp_line (start 0.453263 1.1303) (end 0.453263 1.1303)
    (stroke (width 0.1524) (type solid)) (layer "F.CrtYd") (tstamp 69dd3166-3547-4de6-9c63-2787fc6d453a))
  (fp_line (start 1.1303 -1.1303) (end 1.1303 -0.703326)
    (stroke (width 0.1524) (type solid)) (layer "F.CrtYd") (tstamp 24d59b1a-9518-437f-b924-c531d214f6ef))
  (fp_line (start 1.1303 -0.703326) (end 1.1303 -0.703326)
    (stroke (width 0.1524) (type solid)) (layer "F.CrtYd") (tstamp 73071bc8-0502-4b7b-96ad-eab679ea3374))
  (fp_line (start 1.1303 -0.703326) (end 1.1303 0.703326)
    (stroke (width 0.1524) (type solid)) (layer "F.CrtYd") (tstamp 8710abca-bc05-4e7a-ad32-9949ad6bfdcc))
  (fp_line (start 1.1303 0.703326) (end 1.1303 0.703326)
    (stroke (width 0.1524) (type solid)) (layer "F.CrtYd") (tstamp e078e637-2a10-461e-b857-e9f85c5a0463))
  (fp_line (start 1.1303 0.703326) (end 1.1303 1.1303)
    (stroke (width 0.1524) (type solid)) (layer "F.CrtYd") (tstamp 0040e134-e5ff-430e-8802-09040a73bf21))
  (fp_line (start 1.1303 1.1303) (end 0.453263 1.1303)
    (stroke (width 0.1524) (type solid)) (layer "F.CrtYd") (tstamp 10da57c7-4508-49e4-b7af-6116fed24f8e))
  (fp_line (start -1.0287 -1.0287) (end -1.0287 1.0287)
    (stroke (width 0.0254) (type solid)) (layer "F.Fab") (tstamp 30ce7e3e-1402-4f4f-9be9-1188e730bc0b))
  (fp_line (start -1.0287 -0.627126) (end -0.889 -0.627126)
    (stroke (width 0.0254) (type solid)) (layer "F.Fab") (tstamp 79f72252-d52a-4d36-b389-6fe5629d38e3))
  (fp_line (start -1.0287 -0.373126) (end -1.0287 -0.627126)
    (stroke (width 0.0254) (type solid)) (layer "F.Fab") (tstamp a3afee6b-e31a-4cbc-943b-c557ad1e8385))
  (fp_line (start -1.0287 -0.127) (end -0.889 -0.127)
    (stroke (width 0.0254) (type solid)) (layer "F.Fab") (tstamp 5403006d-b4a7-4f85-be9c-e7f3f9ca5f90))
  (fp_line (start -1.0287 0.127) (end -1.0287 -0.127)
    (stroke (width 0.0254) (type solid)) (layer "F.Fab") (tstamp 28026778-e2eb-4e03-b6da-e2284af96e01))
  (fp_line (start -1.0287 0.2413) (end 0.2413 -1.0287)
    (stroke (width 0.0254) (type solid)) (layer "F.Fab") (tstamp c5d70ccb-7251-42f3-b9ec-81ff7d00a1ab))
  (fp_line (start -1.0287 0.373126) (end -0.889 0.373126)
    (stroke (width 0.0254) (type solid)) (layer "F.Fab") (tstamp e356c854-b6fa-476b-8fa9-ab150e5ddba4))
  (fp_line (start -1.0287 0.627126) (end -1.0287 0.373126)
    (stroke (width 0.0254) (type solid)) (layer "F.Fab") (tstamp d3950264-db11-4365-929b-8497a2ce68ed))
  (fp_line (start -1.0287 1.0287) (end 1.0287 1.0287)
    (stroke (width 0.0254) (type solid)) (layer "F.Fab") (tstamp 9725acb5-151a-42b2-a344-9fa9ec5bfa4e))
  (fp_line (start -0.889 -0.627126) (end -0.889 -0.373126)
    (stroke (width 0.0254) (type solid)) (layer "F.Fab") (tstamp 8f763a0e-cd35-4780-9565-ed8d03e51c0c))
  (fp_line (start -0.889 -0.373126) (end -1.0287 -0.373126)
    (stroke (width 0.0254) (type solid)) (layer "F.Fab") (tstamp 63422756-b449-452e-8339-bfc3928bc8a4))
  (fp_line (start -0.889 -0.127) (end -0.889 0.127)
    (stroke (width 0.0254) (type solid)) (layer "F.Fab") (tstamp 0b1a6190-f8a5-42f9-99c3-9ef09233c205))
  (fp_line (start -0.889 0.127) (end -1.0287 0.127)
    (stroke (width 0.0254) (type solid)) (layer "F.Fab") (tstamp 2f2011ec-1cbf-4d26-bcf9-f0ef2fe4308e))
  (fp_line (start -0.889 0.373126) (end -0.889 0.627126)
    (stroke (width 0.0254) (type solid)) (layer "F.Fab") (tstamp f8e52c88-b612-411b-8663-01ecf16e24cf))
  (fp_line (start -0.889 0.627126) (end -1.0287 0.627126)
    (stroke (width 0.0254) (type solid)) (layer "F.Fab") (tstamp d4724f3b-a514-4268-9578-cd52b3e8deae))
  (fp_line (start -0.377063 -1.0287) (end -0.123063 -1.0287)
    (stroke (width 0.0254) (type solid)) (layer "F.Fab") (tstamp 2bd1b3a6-1280-4137-8283-8701d43f0d6e))
  (fp_line (start -0.377063 -0.889) (end -0.377063 -1.0287)
    (stroke (width 0.0254) (type solid)) (layer "F.Fab") (tstamp 6e8d6e8a-5e0c-435c-82b1-c6332fe952f1))
  (fp_line (start -0.377063 0.889) (end -0.123063 0.889)
    (stroke (width 0.0254) (type solid)) (layer "F.Fab") (tstamp 6cad9d28-8282-4af8-8958-8e7d2e15dbaa))
  (fp_line (start -0.377063 1.0287) (end -0.377063 0.889)
    (stroke (width 0.0254) (type solid)) (layer "F.Fab") (tstamp 014394ee-217f-45af-9f2e-d3d2b7d62437))
  (fp_line (start -0.123063 -1.0287) (end -0.123063 -0.889)
    (stroke (width 0.0254) (type solid)) (layer "F.Fab") (tstamp 7274642f-e350-442a-ad8a-540283e8bf21))
  (fp_line (start -0.123063 -0.889) (end -0.377063 -0.889)
    (stroke (width 0.0254) (type solid)) (layer "F.Fab") (tstamp 462057cd-8a36-47af-8392-ec769eb8c402))
  (fp_line (start -0.123063 0.889) (end -0.123063 1.0287)
    (stroke (width 0.0254) (type solid)) (layer "F.Fab") (tstamp 06fc5d36-7c61-4e71-b3e2-28c2d71633cf))
  (fp_line (start -0.123063 1.0287) (end -0.377063 1.0287)
    (stroke (width 0.0254) (type solid)) (layer "F.Fab") (tstamp 99cfe14b-fdea-46e5-9150-f07df1c20c8c))
  (fp_line (start 0.123063 -1.0287) (end 0.377063 -1.0287)
    (stroke (width 0.0254) (type solid)) (layer "F.Fab") (tstamp 234ca2bd-dd4d-46d1-8752-58c68cb891fb))
  (fp_line (start 0.123063 -0.889) (end 0.123063 -1.0287)
    (stroke (width 0.0254) (type solid)) (layer "F.Fab") (tstamp 2af0b7af-dcc6-45ee-834a-34d36141ad42))
  (fp_line (start 0.123063 0.889) (end 0.377063 0.889)
    (stroke (width 0.0254) (type solid)) (layer "F.Fab") (tstamp ba2d7392-e7f7-4bd1-a8e2-0f36e8b7901a))
  (fp_line (start 0.123063 1.0287) (end 0.123063 0.889)
    (stroke (width 0.0254) (type solid)) (layer "F.Fab") (tstamp f9a8497e-e2e1-4f4d-b44a-affccb31e2de))
  (fp_line (start 0.377063 -1.0287) (end 0.377063 -0.889)
    (stroke (width 0.0254) (type solid)) (layer "F.Fab") (tstamp fad7c20e-3805-4fa0-bf9c-41cbd0ddc035))
  (fp_line (start 0.377063 -0.889) (end 0.123063 -0.889)
    (stroke (width 0.0254) (type solid)) (layer "F.Fab") (tstamp f55a10cf-9e14-4982-a3a6-ebfe5d5cdeb3))
  (fp_line (start 0.377063 0.889) (end 0.377063 1.0287)
    (stroke (width 0.0254) (type solid)) (layer "F.Fab") (tstamp 80d4ac90-c893-4f96-bd2f-2ea0c1b06e43))
  (fp_line (start 0.377063 1.0287) (end 0.123063 1.0287)
    (stroke (width 0.0254) (type solid)) (layer "F.Fab") (tstamp e9860d8d-7edd-44e5-b563-e5821985ad9c))
  (fp_line (start 0.889 -0.627126) (end 1.0287 -0.627126)
    (stroke (width 0.0254) (type solid)) (layer "F.Fab") (tstamp 8953fcd3-7c11-424d-8e43-9dbbf19ba4e6))
  (fp_line (start 0.889 -0.373126) (end 0.889 -0.627126)
    (stroke (width 0.0254) (type solid)) (layer "F.Fab") (tstamp 2f9d6ee6-a27c-4eb7-82a7-6cbc449bfc96))
  (fp_line (start 0.889 -0.127) (end 1.0287 -0.127)
    (stroke (width 0.0254) (type solid)) (layer "F.Fab") (tstamp e59f8912-2940-44ba-b0de-16146642f9c1))
  (fp_line (start 0.889 0.127) (end 0.889 -0.127)
    (stroke (width 0.0254) (type solid)) (layer "F.Fab") (tstamp 522fda02-c25f-45bf-bfe9-c8100f0f9fab))
  (fp_line (start 0.889 0.373126) (end 1.0287 0.373126)
    (stroke (width 0.0254) (type solid)) (layer "F.Fab") (tstamp 226cc666-9324-42cc-9ceb-9de46c1a89cf))
  (fp_line (start 0.889 0.627126) (end 0.889 0.373126)
    (stroke (width 0.0254) (type solid)) (layer "F.Fab") (tstamp 74229d6c-69f1-4b4f-9e21-f8bbe1de5d78))
  (fp_line (start 1.0287 -1.0287) (end -1.0287 -1.0287)
    (stroke (width 0.0254) (type solid)) (layer "F.Fab") (tstamp 52eba432-f03f-475b-8d45-84527a68ae37))
  (fp_line (start 1.0287 -0.627126) (end 1.0287 -0.373126)
    (stroke (width 0.0254) (type solid)) (layer "F.Fab") (tstamp f5447e94-ecc6-42af-ab51-d2213e88bcec))
  (fp_line (start 1.0287 -0.373126) (end 0.889 -0.373126)
    (stroke (width 0.0254) (type solid)) (layer "F.Fab") (tstamp 05a743af-bd25-433e-a44a-ef4b0ddb02e9))
  (fp_line (start 1.0287 -0.127) (end 1.0287 0.127)
    (stroke (width 0.0254) (type solid)) (layer "F.Fab") (tstamp f32e8ffc-5103-4ff9-a4fe-979165d44f79))
  (fp_line (start 1.0287 0.127) (end 0.889 0.127)
    (stroke (width 0.0254) (type solid)) (layer "F.Fab") (tstamp 78067e1a-d248-4692-8588-86723cbc7edc))
  (fp_line (start 1.0287 0.373126) (end 1.0287 0.627126)
    (stroke (width 0.0254) (type solid)) (layer "F.Fab") (tstamp 6f0ac527-7e37-4cb2-a6c7-d3679c71d01b))
  (fp_line (start 1.0287 0.627126) (end 0.889 0.627126)
    (stroke (width 0.0254) (type solid)) (layer "F.Fab") (tstamp f8999f94-e7e5-46e0-b5ea-a8f06fa47345))
  (fp_line (start 1.0287 1.0287) (end 1.0287 -1.0287)
    (stroke (width 0.0254) (type solid)) (layer "F.Fab") (tstamp a08881df-5ff6-430a-b100-1d6ecaf631b1))
  (pad "1" smd rect (at 0.250063 -0.7493) (size 0.2032 0.1778) (layers "F.Cu" "F.Paste" "F.Mask") (tstamp 678656c9-d9b8-4f10-b962-1e5325c4d2bb))
  (pad "2" smd rect (at -0.250063 -0.7493) (size 0.2032 0.1778) (layers "F.Cu" "F.Paste" "F.Mask") (tstamp 0d2152bd-fd56-448b-8527-6d3d3ca8f0fe))
  (pad "3" smd rect (at -0.7493 -0.500126 90) (size 0.2032 0.1778) (layers "F.Cu" "F.Paste" "F.Mask") (tstamp 63bf1937-f25f-4a4e-b46f-c26c911eaf26))
  (pad "4" smd rect (at -0.7493 0 90) (size 0.2032 0.1778) (layers "F.Cu" "F.Paste" "F.Mask") (tstamp 6f434d90-810f-4623-96a0-59886854cacb))
  (pad "5" smd rect (at -0.7493 0.500126 90) (size 0.2032 0.1778) (layers "F.Cu" "F.Paste" "F.Mask") (tstamp dccb6904-840a-4d09-99d2-05263b91a081))
  (pad "6" smd rect (at -0.250063 0.7493) (size 0.2032 0.1778) (layers "F.Cu" "F.Paste" "F.Mask") (tstamp 6723ddb4-a8ed-4030-b3ed-1c648d723138))
  (pad "7" smd rect (at 0.250063 0.7493) (size 0.2032 0.1778) (layers "F.Cu" "F.Paste" "F.Mask") (tstamp 6df52354-3365-4f23-b7cc-fbaefa32b2c7))
  (pad "8" smd rect (at 0.7493 0.500126 90) (size 0.2032 0.1778) (layers "F.Cu" "F.Paste" "F.Mask") (tstamp 4f81346d-b4f0-4eb5-99d1-04c4d3d4d1cd))
  (pad "9" smd rect (at 0.7493 0 90) (size 0.2032 0.1778) (layers "F.Cu" "F.Paste" "F.Mask") (tstamp 1b00e1cc-6dbe-454b-9d85-8f1c2a3af682))
  (pad "10" smd rect (at 0.7493 -0.500126 90) (size 0.2032 0.1778) (layers "F.Cu" "F.Paste" "F.Mask") (tstamp b5f51a8d-32b2-4162-b0bd-3b14ebae3866))
)
