{
  "entrypoints": {
    "widgets/addWarningToValve/dist/runtime/widget": {
      "chunks": [
        {
          "id": 178,
          "names": [
            "widgets/addWarningToValve/dist/runtime/widget"
          ],
          "modules": [
            "../node_modules/@microsoft/signalr/dist/esm/AbortController.js",
            "../node_modules/@microsoft/signalr/dist/esm/AccessTokenHttpClient.js",
            "../node_modules/@microsoft/signalr/dist/esm/DefaultHttpClient.js",
            "../node_modules/@microsoft/signalr/dist/esm/DefaultReconnectPolicy.js",
            "../node_modules/@microsoft/signalr/dist/esm/Errors.js",
            "../node_modules/@microsoft/signalr/dist/esm/FetchHttpClient.js",
            "../node_modules/@microsoft/signalr/dist/esm/HandshakeProtocol.js",
            "../node_modules/@microsoft/signalr/dist/esm/HeaderNames.js",
            "../node_modules/@microsoft/signalr/dist/esm/HttpClient.js",
            "../node_modules/@microsoft/signalr/dist/esm/HttpConnection.js",
            "../node_modules/@microsoft/signalr/dist/esm/HubConnection.js",
            "../node_modules/@microsoft/signalr/dist/esm/HubConnectionBuilder.js",
            "../node_modules/@microsoft/signalr/dist/esm/IHubProtocol.js",
            "../node_modules/@microsoft/signalr/dist/esm/ILogger.js",
            "../node_modules/@microsoft/signalr/dist/esm/ITransport.js",
            "../node_modules/@microsoft/signalr/dist/esm/JsonHubProtocol.js",
            "../node_modules/@microsoft/signalr/dist/esm/Loggers.js",
            "../node_modules/@microsoft/signalr/dist/esm/LongPollingTransport.js",
            "../node_modules/@microsoft/signalr/dist/esm/ServerSentEventsTransport.js",
            "../node_modules/@microsoft/signalr/dist/esm/Subject.js",
            "../node_modules/@microsoft/signalr/dist/esm/TextMessageFormat.js",
            "../node_modules/@microsoft/signalr/dist/esm/Utils.js",
            "../node_modules/@microsoft/signalr/dist/esm/WebSocketTransport.js",
            "../node_modules/@microsoft/signalr/dist/esm/XhrHttpClient.js",
            "./jimu-core/lib/set-public-path.ts",
            "./node_modules/ag-grid-community/dist/ag-grid-community.auto.esm.mjs",
            "./node_modules/ag-grid-community/styles/ag-grid.css",
            "./node_modules/ag-grid-community/styles/ag-theme-alpine.css",
            "./node_modules/ag-grid-react/lib/agGridReact.mjs",
            "./node_modules/ag-grid-react/lib/legacy/agGridReactLegacy.mjs",
            "./node_modules/ag-grid-react/lib/legacy/legacyReactComponent.mjs",
            "./node_modules/ag-grid-react/lib/main.mjs",
            "./node_modules/ag-grid-react/lib/reactUi/agGridReactUi.mjs",
            "./node_modules/ag-grid-react/lib/reactUi/beansContext.mjs",
            "./node_modules/ag-grid-react/lib/reactUi/cellRenderer/detailCellRenderer.mjs",
            "./node_modules/ag-grid-react/lib/reactUi/cellRenderer/groupCellRenderer.mjs",
            "./node_modules/ag-grid-react/lib/reactUi/cells/cellComp.mjs",
            "./node_modules/ag-grid-react/lib/reactUi/cells/popupEditorComp.mjs",
            "./node_modules/ag-grid-react/lib/reactUi/cells/showJsRenderer.mjs",
            "./node_modules/ag-grid-react/lib/reactUi/gridBodyComp.mjs",
            "./node_modules/ag-grid-react/lib/reactUi/gridComp.mjs",
            "./node_modules/ag-grid-react/lib/reactUi/header/gridHeaderComp.mjs",
            "./node_modules/ag-grid-react/lib/reactUi/header/headerCellComp.mjs",
            "./node_modules/ag-grid-react/lib/reactUi/header/headerFilterCellComp.mjs",
            "./node_modules/ag-grid-react/lib/reactUi/header/headerGroupCellComp.mjs",
            "./node_modules/ag-grid-react/lib/reactUi/header/headerRowComp.mjs",
            "./node_modules/ag-grid-react/lib/reactUi/header/headerRowContainerComp.mjs",
            "./node_modules/ag-grid-react/lib/reactUi/jsComp.mjs",
            "./node_modules/ag-grid-react/lib/reactUi/reactComment.mjs",
            "./node_modules/ag-grid-react/lib/reactUi/rows/rowComp.mjs",
            "./node_modules/ag-grid-react/lib/reactUi/rows/rowContainerComp.mjs",
            "./node_modules/ag-grid-react/lib/reactUi/tabGuardComp.mjs",
            "./node_modules/ag-grid-react/lib/reactUi/useEffectOnce.mjs",
            "./node_modules/ag-grid-react/lib/reactUi/utils.mjs",
            "./node_modules/ag-grid-react/lib/shared/interfaces.mjs",
            "./node_modules/ag-grid-react/lib/shared/keyGenerator.mjs",
            "./node_modules/ag-grid-react/lib/shared/newReactComponent.mjs",
            "./node_modules/ag-grid-react/lib/shared/portalManager.mjs",
            "./node_modules/ag-grid-react/lib/shared/reactComponent.mjs",
            "./node_modules/ag-grid-react/lib/shared/reactFrameworkOverrides.mjs",
            "./node_modules/css-loader/dist/cjs.js??ruleSet[1].rules[3].use[1]!./node_modules/resolve-url-loader/index.js??ruleSet[1].rules[3].use[2]!./node_modules/sass-loader/dist/cjs.js??ruleSet[1].rules[3].use[3]!./node_modules/ag-grid-community/styles/ag-grid.css",
            "./node_modules/css-loader/dist/cjs.js??ruleSet[1].rules[3].use[1]!./node_modules/resolve-url-loader/index.js??ruleSet[1].rules[3].use[2]!./node_modules/sass-loader/dist/cjs.js??ruleSet[1].rules[3].use[3]!./node_modules/ag-grid-community/styles/ag-theme-alpine.css",
            "./node_modules/css-loader/dist/cjs.js??ruleSet[1].rules[3].use[1]!./node_modules/resolve-url-loader/index.js??ruleSet[1].rules[3].use[2]!./node_modules/sass-loader/dist/cjs.js??ruleSet[1].rules[3].use[3]!./your-extensions/widgets/dataGrid/src/runtime/widget.scss",
            "./node_modules/css-loader/dist/cjs.js??ruleSet[1].rules[3].use[1]!./node_modules/resolve-url-loader/index.js??ruleSet[1].rules[3].use[2]!./node_modules/sass-loader/dist/cjs.js??ruleSet[1].rules[3].use[3]!./your-extensions/widgets/zoomBtnRenderer/src/runtime/widget.scss",
            "./node_modules/css-loader/dist/runtime/api.js",
            "./node_modules/css-loader/dist/runtime/noSourceMaps.js",
            "./node_modules/prop-types/factoryWithThrowingShims.js",
            "./node_modules/prop-types/index.js",
            "./node_modules/prop-types/lib/ReactPropTypesSecret.js",
            "./node_modules/style-loader/dist/runtime/injectStylesIntoStyleTag.js",
            "./node_modules/style-loader/dist/runtime/insertBySelector.js",
            "./node_modules/style-loader/dist/runtime/insertStyleElement.js",
            "./node_modules/style-loader/dist/runtime/setAttributesWithoutAttributes.js",
            "./node_modules/style-loader/dist/runtime/styleDomAPI.js",
            "./node_modules/style-loader/dist/runtime/styleTagTransform.js",
            "./your-extensions/widgets/addWarningToValve/src/runtime/widget.tsx",
            "./your-extensions/widgets/dataGrid/src/runtime/widget.scss",
            "./your-extensions/widgets/dataGrid/src/runtime/widget.tsx",
            "./your-extensions/widgets/zoomBtnRenderer/src/runtime/widget.scss",
            "./your-extensions/widgets/zoomBtnRenderer/src/runtime/widget.tsx",
            "./your-extensions/widgets/zoomBtnRenderer/src/runtime/zoom-icon.svg"
          ]
        }
      ]
    },
    "widgets/addWarningToValve/dist/setting/setting": {
      "chunks": [
        {
          "id": 477,
          "names": [
            "widgets/addWarningToValve/dist/setting/setting"
          ],
          "modules": [
            "./jimu-core/lib/set-public-path.ts",
            "./your-extensions/widgets/addWarningToValve/src/setting/setting.tsx"
          ]
        }
      ]
    },
    "widgets/changeBaseMapOpacity/dist/runtime/widget": {
      "chunks": [
        {
          "id": 169,
          "names": [
            "widgets/changeBaseMapOpacity/dist/runtime/widget"
          ],
          "modules": [
            "./jimu-core/lib/set-public-path.ts",
            "./your-extensions/widgets/changeBaseMapOpacity/src/runtime/widget.tsx"
          ]
        }
      ]
    },
    "widgets/changeBaseMapOpacity/dist/setting/setting": {
      "chunks": [
        {
          "id": 348,
          "names": [
            "widgets/changeBaseMapOpacity/dist/setting/setting"
          ],
          "modules": [
            "./jimu-core/lib/set-public-path.ts",
            "./your-extensions/widgets/changeBaseMapOpacity/src/setting/setting.tsx"
          ]
        }
      ]
    },
    "widgets/dataGrid/dist/runtime/widget": {
      "chunks": [
        {
          "id": 718,
          "names": [
            "widgets/dataGrid/dist/runtime/widget"
          ],
          "modules": [
            "./jimu-core/lib/set-public-path.ts",
            "./node_modules/ag-grid-community/dist/ag-grid-community.auto.esm.mjs",
            "./node_modules/ag-grid-community/styles/ag-grid.css",
            "./node_modules/ag-grid-community/styles/ag-theme-alpine.css",
            "./node_modules/ag-grid-react/lib/agGridReact.mjs",
            "./node_modules/ag-grid-react/lib/legacy/agGridReactLegacy.mjs",
            "./node_modules/ag-grid-react/lib/legacy/legacyReactComponent.mjs",
            "./node_modules/ag-grid-react/lib/main.mjs",
            "./node_modules/ag-grid-react/lib/reactUi/agGridReactUi.mjs",
            "./node_modules/ag-grid-react/lib/reactUi/beansContext.mjs",
            "./node_modules/ag-grid-react/lib/reactUi/cellRenderer/detailCellRenderer.mjs",
            "./node_modules/ag-grid-react/lib/reactUi/cellRenderer/groupCellRenderer.mjs",
            "./node_modules/ag-grid-react/lib/reactUi/cells/cellComp.mjs",
            "./node_modules/ag-grid-react/lib/reactUi/cells/popupEditorComp.mjs",
            "./node_modules/ag-grid-react/lib/reactUi/cells/showJsRenderer.mjs",
            "./node_modules/ag-grid-react/lib/reactUi/gridBodyComp.mjs",
            "./node_modules/ag-grid-react/lib/reactUi/gridComp.mjs",
            "./node_modules/ag-grid-react/lib/reactUi/header/gridHeaderComp.mjs",
            "./node_modules/ag-grid-react/lib/reactUi/header/headerCellComp.mjs",
            "./node_modules/ag-grid-react/lib/reactUi/header/headerFilterCellComp.mjs",
            "./node_modules/ag-grid-react/lib/reactUi/header/headerGroupCellComp.mjs",
            "./node_modules/ag-grid-react/lib/reactUi/header/headerRowComp.mjs",
            "./node_modules/ag-grid-react/lib/reactUi/header/headerRowContainerComp.mjs",
            "./node_modules/ag-grid-react/lib/reactUi/jsComp.mjs",
            "./node_modules/ag-grid-react/lib/reactUi/reactComment.mjs",
            "./node_modules/ag-grid-react/lib/reactUi/rows/rowComp.mjs",
            "./node_modules/ag-grid-react/lib/reactUi/rows/rowContainerComp.mjs",
            "./node_modules/ag-grid-react/lib/reactUi/tabGuardComp.mjs",
            "./node_modules/ag-grid-react/lib/reactUi/useEffectOnce.mjs",
            "./node_modules/ag-grid-react/lib/reactUi/utils.mjs",
            "./node_modules/ag-grid-react/lib/shared/interfaces.mjs",
            "./node_modules/ag-grid-react/lib/shared/keyGenerator.mjs",
            "./node_modules/ag-grid-react/lib/shared/newReactComponent.mjs",
            "./node_modules/ag-grid-react/lib/shared/portalManager.mjs",
            "./node_modules/ag-grid-react/lib/shared/reactComponent.mjs",
            "./node_modules/ag-grid-react/lib/shared/reactFrameworkOverrides.mjs",
            "./node_modules/css-loader/dist/cjs.js??ruleSet[1].rules[3].use[1]!./node_modules/resolve-url-loader/index.js??ruleSet[1].rules[3].use[2]!./node_modules/sass-loader/dist/cjs.js??ruleSet[1].rules[3].use[3]!./node_modules/ag-grid-community/styles/ag-grid.css",
            "./node_modules/css-loader/dist/cjs.js??ruleSet[1].rules[3].use[1]!./node_modules/resolve-url-loader/index.js??ruleSet[1].rules[3].use[2]!./node_modules/sass-loader/dist/cjs.js??ruleSet[1].rules[3].use[3]!./node_modules/ag-grid-community/styles/ag-theme-alpine.css",
            "./node_modules/css-loader/dist/cjs.js??ruleSet[1].rules[3].use[1]!./node_modules/resolve-url-loader/index.js??ruleSet[1].rules[3].use[2]!./node_modules/sass-loader/dist/cjs.js??ruleSet[1].rules[3].use[3]!./your-extensions/widgets/dataGrid/src/runtime/widget.scss",
            "./node_modules/css-loader/dist/cjs.js??ruleSet[1].rules[3].use[1]!./node_modules/resolve-url-loader/index.js??ruleSet[1].rules[3].use[2]!./node_modules/sass-loader/dist/cjs.js??ruleSet[1].rules[3].use[3]!./your-extensions/widgets/zoomBtnRenderer/src/runtime/widget.scss",
            "./node_modules/css-loader/dist/runtime/api.js",
            "./node_modules/css-loader/dist/runtime/noSourceMaps.js",
            "./node_modules/prop-types/factoryWithThrowingShims.js",
            "./node_modules/prop-types/index.js",
            "./node_modules/prop-types/lib/ReactPropTypesSecret.js",
            "./node_modules/style-loader/dist/runtime/injectStylesIntoStyleTag.js",
            "./node_modules/style-loader/dist/runtime/insertBySelector.js",
            "./node_modules/style-loader/dist/runtime/insertStyleElement.js",
            "./node_modules/style-loader/dist/runtime/setAttributesWithoutAttributes.js",
            "./node_modules/style-loader/dist/runtime/styleDomAPI.js",
            "./node_modules/style-loader/dist/runtime/styleTagTransform.js",
            "./your-extensions/widgets/dataGrid/src/runtime/widget.scss",
            "./your-extensions/widgets/dataGrid/src/runtime/widget.tsx",
            "./your-extensions/widgets/zoomBtnRenderer/src/runtime/widget.scss",
            "./your-extensions/widgets/zoomBtnRenderer/src/runtime/widget.tsx",
            "./your-extensions/widgets/zoomBtnRenderer/src/runtime/zoom-icon.svg"
          ]
        }
      ]
    },
    "widgets/simple/dist/runtime/widget": {
      "chunks": [
        {
          "id": 110,
          "names": [
            "widgets/simple/dist/runtime/widget"
          ],
          "modules": [
            "./jimu-core/lib/set-public-path.ts",
            "./your-extensions/widgets/simple/src/runtime/widget.tsx"
          ]
        }
      ]
    },
    "widgets/underGroundNavigation/dist/runtime/widget": {
      "chunks": [
        {
          "id": 16,
          "names": [
            "widgets/underGroundNavigation/dist/runtime/widget"
          ],
          "modules": [
            "./jimu-core/lib/set-public-path.ts",
            "./your-extensions/widgets/underGroundNavigation/src/runtime/widget.tsx"
          ]
        }
      ]
    },
    "widgets/underGroundNavigation/dist/setting/setting": {
      "chunks": [
        {
          "id": 128,
          "names": [
            "widgets/underGroundNavigation/dist/setting/setting"
          ],
          "modules": [
            "./jimu-core/lib/set-public-path.ts",
            "./your-extensions/widgets/underGroundNavigation/src/setting/setting.tsx"
          ]
        }
      ]
    },
    "widgets/zoomBtnRenderer/dist/runtime/widget": {
      "chunks": [
        {
          "id": 665,
          "names": [
            "widgets/zoomBtnRenderer/dist/runtime/widget"
          ],
          "modules": [
            "./jimu-core/lib/set-public-path.ts",
            "./node_modules/css-loader/dist/cjs.js??ruleSet[1].rules[3].use[1]!./node_modules/resolve-url-loader/index.js??ruleSet[1].rules[3].use[2]!./node_modules/sass-loader/dist/cjs.js??ruleSet[1].rules[3].use[3]!./your-extensions/widgets/zoomBtnRenderer/src/runtime/widget.scss",
            "./node_modules/css-loader/dist/runtime/api.js",
            "./node_modules/css-loader/dist/runtime/noSourceMaps.js",
            "./node_modules/style-loader/dist/runtime/injectStylesIntoStyleTag.js",
            "./node_modules/style-loader/dist/runtime/insertBySelector.js",
            "./node_modules/style-loader/dist/runtime/insertStyleElement.js",
            "./node_modules/style-loader/dist/runtime/setAttributesWithoutAttributes.js",
            "./node_modules/style-loader/dist/runtime/styleDomAPI.js",
            "./node_modules/style-loader/dist/runtime/styleTagTransform.js",
            "./your-extensions/widgets/zoomBtnRenderer/src/runtime/widget.scss",
            "./your-extensions/widgets/zoomBtnRenderer/src/runtime/widget.tsx",
            "./your-extensions/widgets/zoomBtnRenderer/src/runtime/zoom-icon.svg"
          ]
        }
      ]
    }
  },
  "errors": [],
  "warnings": [],
  "outputPath": "E:\\GSS\\Training\\Experience Builder\\Dubai-Digital-Twin-Utilities\\client\\dist-prod",
  "publicPath": "",
  "version": "5.75.0"
}