{
  "nodes": [
    {
      "name": "widgets/changeBaseMapOpacity/dist/runtime/widget",
      "size": 2517
    },
    {
      "name": "widgets/changeBaseMapOpacity/dist/setting/setting",
      "size": 1724
    },
    {
      "name": "widgets/simple/dist/runtime/widget",
      "size": 1439
    },
    {
      "name": "widgets/underGroundNavigation/dist/runtime/widget",
      "size": 3820
    }
  ],
  "links": [
    {
      "source": "widgets/changeBaseMapOpacity/dist/runtime/widget",
      "target": "jimu-arcgis/index"
    },
    {
      "source": "widgets/changeBaseMapOpacity/dist/runtime/widget",
      "target": "jimu-core/index"
    },
    {
      "source": "widgets/changeBaseMapOpacity/dist/runtime/widget",
      "target": "jimu-core/react"
    },
    {
      "source": "widgets/changeBaseMapOpacity/dist/runtime/widget",
      "target": "jimu-ui/index"
    },
    {
      "source": "widgets/changeBaseMapOpacity/dist/setting/setting",
      "target": "jimu-core/index"
    },
    {
      "source": "widgets/changeBaseMapOpacity/dist/setting/setting",
      "target": "jimu-ui/advanced/setting-components"
    },
    {
      "source": "widgets/simple/dist/runtime/widget",
      "target": "jimu-core/index"
    },
    {
      "source": "widgets/underGroundNavigation/dist/runtime/widget",
      "target": "jimu-arcgis/index"
    },
    {
      "source": "widgets/underGroundNavigation/dist/runtime/widget",
      "target": "jimu-core/index"
    },
    {
      "source": "widgets/underGroundNavigation/dist/runtime/widget",
      "target": "jimu-core/react"
    }
  ]
}