[
  {
    "portalUrl": "https://productsteam.maps.arcgis.com",
    "clientId": "z7wx2ZGrxS4AqZf4",
    "supportsOAuth": true,
    "isWebTier": false
  },
  {
    "portalUrl": "https://esrinea-isd.maps.arcgis.com",
    "clientId": "jnjgmWdA72KOBVIC",
    "supportsOAuth": true,
    "isWebTier": false
  }
]