{
  "pages": {
    "home": {
      "type": "NORMAL",
      "mode": "FIT_WINDOW",
      "layout": {
        "LARGE": "layout_1",
        "SMALL": "layout_17",
        "MEDIUM": "layout_21"
      },
      "isVisible": true,
      "isDefault": true,
      "id": "home",
      "header": false,
      "label": "Page"
    }
  },
  "layouts": {
    "layout_1": {
      "type": "FIXED",
      "order": [
        "0",
        "1"
      ],
      "content": {
        "0": {
          "type": "WIDGET",
          "bbox": {
            "left": "0px",
            "top": "0px",
            "width": "39.072%",
            "height": "60px",
            "right": "0px"
          },
          "widgetId": "widget_1",
          "setting": {
            "autoProps": {
              "width": "STRETCH"
            }
          }
        },
        "1": {
          "type": "WIDGET",
          "bbox": {
            "left": "0px",
            "top": "60px",
            "width": "78.1441%",
            "height": "52.1173%",
            "right": "0px",
            "bottom": "0px"
          },
          "widgetId": "widget_6",
          "setting": {
            "autoProps": {
              "height": "STRETCH",
              "width": "STRETCH"
            }
          }
        }
      }
    },
    "layout_2": {
      "type": "FIXED",
      "order": [
        "0",
        "1",
        "2",
        "3"
      ],
      "content": {
        "0": {
          "type": "WIDGET",
          "bbox": {
            "left": "14px",
            "top": "50%",
            "width": "36px",
            "height": "36px"
          },
          "setting": {
            "vCenter": true,
            "autoProps": {
              "top": false,
              "bottom": true
            }
          },
          "widgetId": "widget_2"
        },
        "1": {
          "type": "WIDGET",
          "bbox": {
            "left": "82px",
            "top": "50%",
            "width": "291px",
            "height": "42px",
            "bottom": "0px"
          },
          "widgetId": "widget_3",
          "setting": {
            "vCenter": true,
            "hCenter": false,
            "autoProps": {
              "top": false,
              "bottom": true
            }
          }
        },
        "2": {
          "type": "WIDGET",
          "bbox": {
            "left": "380px",
            "top": "50%",
            "width": "207px",
            "height": "32px",
            "bottom": "0px",
            "right": "NaNpx"
          },
          "widgetId": "widget_4",
          "setting": {
            "hCenter": false,
            "vCenter": true,
            "autoProps": {
              "top": false,
              "bottom": true
            }
          }
        },
        "3": {
          "type": "WIDGET",
          "bbox": {
            "left": "728px",
            "top": "0px",
            "width": "200.00px",
            "height": "50px",
            "right": "0px",
            "bottom": "0px"
          },
          "widgetId": "widget_5",
          "setting": {
            "autoProps": {
              "left": true,
              "height": "STRETCH"
            }
          }
        }
      },
      "label": "Default"
    },
    "layout_3": {
      "type": "FIXED",
      "order": [
        "0",
        "1"
      ],
      "content": {
        "0": {
          "type": "WIDGET",
          "bbox": {},
          "widgetId": "widget_14"
        },
        "1": {
          "type": "WIDGET",
          "bbox": {},
          "widgetId": "widget_15"
        }
      },
      "label": "Controller layout"
    },
    "layout_4": {
      "type": "FIXED",
      "order": [
        "0",
        "1"
      ],
      "content": {
        "0": {
          "type": "WIDGET",
          "bbox": {},
          "widgetId": "widget_14"
        },
        "1": {
          "type": "WIDGET",
          "bbox": {},
          "widgetId": "widget_15"
        }
      },
      "label": "Controller layout"
    },
    "layout_5": {
      "content": {
        "0": {
          "type": "WIDGET",
          "widgetId": "widget_15",
          "bbox": {
            "left": 0,
            "top": 0,
            "bottom": 0,
            "right": 0
          }
        }
      },
      "order": [
        "0"
      ],
      "label": "Open widget layout"
    },
    "layout_6": {
      "content": {
        "0": {
          "type": "WIDGET",
          "bbox": {
            "left": 0,
            "top": 0,
            "bottom": 0,
            "right": 0
          }
        }
      },
      "order": [
        "0"
      ],
      "label": "Open widget layout"
    },
    "layout_7": {
      "type": "FIXED",
      "order": [
        "0"
      ],
      "content": {
        "0": {
          "type": "WIDGET",
          "bbox": {
            "left": "0.00%",
            "top": "0.00%",
            "width": "100%",
            "height": "100%",
            "right": "0.00%",
            "bottom": "0.00%"
          },
          "widgetId": "widget_7",
          "setting": {
            "autoProps": {
              "left": false,
              "right": false,
              "width": "STRETCH",
              "top": false,
              "bottom": false,
              "height": "STRETCH"
            },
            "vCenter": false,
            "hCenter": false
          }
        }
      },
      "label": "First"
    },
    "layout_8": {
      "type": "FIXED",
      "content": {
        "0": {
          "type": "WIDGET",
          "bbox": {
            "left": "0px",
            "top": "0px",
            "width": "110px",
            "height": "133px",
            "right": "10px",
            "bottom": "0px"
          },
          "widgetId": "widget_8",
          "setting": {
            "lockParent": true,
            "vCenter": false,
            "hCenter": false,
            "autoProps": {
              "width": "CUSTOM",
              "height": "STRETCH"
            }
          },
          "isPending": false
        },
        "1": {
          "type": "WIDGET",
          "bbox": {
            "left": "125px",
            "top": "10px",
            "width": "465px",
            "height": "29px",
            "right": "20px"
          },
          "widgetId": "widget_9",
          "setting": {
            "lockParent": true,
            "autoProps": {
              "width": "STRETCH"
            },
            "vCenter": false,
            "hCenter": false
          },
          "isPending": false
        },
        "2": {
          "type": "WIDGET",
          "bbox": {
            "left": "125px",
            "top": "34px",
            "width": "253px",
            "height": "46px",
            "right": "20px",
            "bottom": "20px"
          },
          "widgetId": "widget_10",
          "setting": {
            "lockParent": true,
            "hCenter": false,
            "vCenter": false,
            "autoProps": {
              "width": "STRETCH",
              "height": "STRETCH"
            }
          },
          "isPending": false
        }
      },
      "order": [
        "0",
        "1",
        "2"
      ],
      "label": "Regular"
    },
    "layout_9": {
      "type": "FIXED",
      "content": {
        "0": {
          "type": "WIDGET",
          "bbox": {
            "left": "0px",
            "top": "0px",
            "width": "110px",
            "height": "133px",
            "right": "10px",
            "bottom": "0px"
          },
          "widgetId": "widget_8",
          "setting": {
            "lockParent": true,
            "vCenter": false,
            "hCenter": false,
            "autoProps": {
              "width": "CUSTOM",
              "height": "STRETCH"
            }
          },
          "isPending": false
        },
        "1": {
          "type": "WIDGET",
          "bbox": {
            "left": "125px",
            "top": "10px",
            "width": "465px",
            "height": "29px",
            "right": "20px"
          },
          "widgetId": "widget_9",
          "setting": {
            "lockParent": true,
            "autoProps": {
              "width": "STRETCH"
            },
            "vCenter": false,
            "hCenter": false
          },
          "isPending": false
        },
        "2": {
          "type": "WIDGET",
          "bbox": {
            "left": "125px",
            "top": "34px",
            "width": "253px",
            "height": "46px",
            "right": "20px",
            "bottom": "20px"
          },
          "widgetId": "widget_10",
          "setting": {
            "lockParent": true,
            "hCenter": false,
            "vCenter": false,
            "autoProps": {
              "width": "STRETCH",
              "height": "STRETCH"
            }
          },
          "isPending": false
        }
      },
      "order": [
        "0",
        "1",
        "2"
      ],
      "label": "Regular"
    },
    "layout_10": {
      "type": "FIXED",
      "content": {
        "0": {
          "type": "WIDGET",
          "bbox": {
            "left": "0px",
            "top": "0px",
            "width": "110px",
            "height": "133px",
            "right": "10px",
            "bottom": "0px"
          },
          "widgetId": "widget_8",
          "setting": {
            "lockParent": true,
            "vCenter": false,
            "hCenter": false,
            "autoProps": {
              "width": "CUSTOM",
              "height": "STRETCH"
            }
          },
          "isPending": false
        },
        "1": {
          "type": "WIDGET",
          "bbox": {
            "left": "125px",
            "top": "10px",
            "width": "465px",
            "height": "29px",
            "right": "20px"
          },
          "widgetId": "widget_9",
          "setting": {
            "lockParent": true,
            "autoProps": {
              "width": "STRETCH"
            },
            "vCenter": false,
            "hCenter": false
          },
          "isPending": false
        },
        "2": {
          "type": "WIDGET",
          "bbox": {
            "left": "125px",
            "top": "34px",
            "width": "253px",
            "height": "46px",
            "right": "20px",
            "bottom": "20px"
          },
          "widgetId": "widget_10",
          "setting": {
            "lockParent": true,
            "hCenter": false,
            "vCenter": false,
            "autoProps": {
              "width": "STRETCH",
              "height": "STRETCH"
            }
          },
          "isPending": false
        }
      },
      "order": [
        "0",
        "1",
        "2"
      ],
      "label": "Selected"
    },
    "layout_11": {
      "type": "FIXED",
      "content": {
        "0": {
          "type": "WIDGET",
          "bbox": {
            "left": "0px",
            "top": "0px",
            "width": "110px",
            "height": "133px",
            "right": "10px",
            "bottom": "0px"
          },
          "widgetId": "widget_8",
          "setting": {
            "lockParent": true,
            "vCenter": false,
            "hCenter": false,
            "autoProps": {
              "width": "CUSTOM",
              "height": "STRETCH"
            }
          },
          "isPending": false
        },
        "1": {
          "type": "WIDGET",
          "bbox": {
            "left": "125px",
            "top": "10px",
            "width": "465px",
            "height": "29px",
            "right": "20px"
          },
          "widgetId": "widget_9",
          "setting": {
            "lockParent": true,
            "autoProps": {
              "width": "STRETCH"
            },
            "vCenter": false,
            "hCenter": false
          },
          "isPending": false
        },
        "2": {
          "type": "WIDGET",
          "bbox": {
            "left": "125px",
            "top": "34px",
            "width": "253px",
            "height": "46px",
            "right": "20px",
            "bottom": "20px"
          },
          "widgetId": "widget_10",
          "setting": {
            "lockParent": true,
            "hCenter": false,
            "vCenter": false,
            "autoProps": {
              "width": "STRETCH",
              "height": "STRETCH"
            }
          },
          "isPending": false
        }
      },
      "order": [
        "0",
        "1",
        "2"
      ],
      "label": "Selected"
    },
    "layout_12": {
      "type": "FIXED",
      "label": "Hover"
    },
    "layout_13": {
      "type": "FIXED",
      "label": "Hover"
    },
    "layout_14": {
      "type": "FIXED",
      "order": [
        "0",
        "1"
      ],
      "content": {
        "0": {
          "type": "WIDGET",
          "bbox": {
            "left": "519px",
            "top": "0px",
            "width": "759px",
            "height": "738px",
            "right": "0px",
            "bottom": "0px"
          },
          "widgetId": "widget_11",
          "setting": {
            "autoProps": {
              "left": false,
              "right": false,
              "width": "STRETCH",
              "top": false,
              "bottom": false,
              "height": "STRETCH"
            },
            "vCenter": false,
            "hCenter": false
          },
          "isPending": false
        },
        "1": {
          "type": "WIDGET",
          "bbox": {
            "left": "0.0%",
            "right": "49.2%",
            "top": "0.0%",
            "bottom": "0.0%",
            "width": "50.8%",
            "height": "100.0%"
          },
          "widgetId": "widget_22",
          "setting": {
            "autoProps": {
              "left": false,
              "right": true,
              "top": true,
              "bottom": false
            },
            "vCenter": false,
            "hCenter": false
          },
          "isPending": false
        }
      },
      "label": "Second"
    },
    "layout_15": {
      "type": "FIXED",
      "order": [
        "0"
      ],
      "content": {
        "0": {
          "type": "WIDGET",
          "bbox": {
            "left": "51.1%",
            "right": "1.00%",
            "top": "2.00%",
            "bottom": "84.6%",
            "width": "45.5%",
            "height": "4.6%"
          },
          "widgetId": "widget_18",
          "setting": {
            "autoProps": {
              "right": false,
              "left": true,
              "top": false,
              "bottom": true,
              "width": "AUTO",
              "height": "AUTO"
            }
          }
        }
      },
      "label": "Map FixedLayout"
    },
    "layout_16": {
      "type": "FIXED",
      "content": {
        "0": {
          "type": "WIDGET",
          "setting": {
            "style": {},
            "autoProps": {
              "right": false,
              "left": true,
              "top": false,
              "bottom": true,
              "width": "AUTO",
              "height": "AUTO"
            }
          },
          "bbox": {
            "left": "52.5%",
            "right": "1.00%",
            "top": "2.00%",
            "bottom": "71.6%",
            "width": "31.5%",
            "height": "7.7%"
          },
          "widgetId": "widget_20"
        }
      },
      "order": [
        "0"
      ],
      "label": "Map FixedLayout"
    },
    "layout_17": {
      "type": "FIXED",
      "content": {
        "0": {
          "type": "WIDGET",
          "bbox": {
            "left": "0px",
            "top": "0px",
            "width": "39.072%",
            "height": "60px",
            "right": "0px"
          },
          "widgetId": "widget_12",
          "setting": {
            "autoProps": {
              "width": "STRETCH"
            }
          }
        },
        "1": {
          "type": "WIDGET",
          "bbox": {
            "left": "0px",
            "top": "60px",
            "width": "78.1441%",
            "height": "52.1173%",
            "right": "0px",
            "bottom": "0px"
          },
          "widgetId": "widget_13",
          "setting": {
            "autoProps": {
              "height": "STRETCH",
              "width": "STRETCH"
            }
          }
        }
      },
      "order": [
        "0",
        "1"
      ]
    },
    "layout_18": {
      "type": "FIXED",
      "content": {
        "0": {
          "type": "WIDGET",
          "bbox": {
            "left": "14px",
            "top": "50%",
            "width": "36px",
            "height": "36px"
          },
          "setting": {
            "vCenter": true,
            "autoProps": {
              "top": false,
              "bottom": true
            }
          },
          "widgetId": "widget_2"
        },
        "1": {
          "type": "WIDGET",
          "bbox": {
            "left": "82px",
            "top": "2px",
            "width": "291px",
            "height": "50px",
            "bottom": "0px"
          },
          "widgetId": "widget_3",
          "setting": {
            "hCenter": false,
            "autoProps": {
              "height": "STRETCH"
            }
          },
          "isPending": true
        },
        "2": {
          "type": "WIDGET",
          "bbox": {
            "left": "364px",
            "top": "0px",
            "width": "207px",
            "height": "50px",
            "bottom": "0px"
          },
          "widgetId": "widget_4",
          "setting": {
            "hCenter": false,
            "autoProps": {
              "height": "STRETCH"
            }
          },
          "isPending": true
        },
        "3": {
          "type": "WIDGET",
          "bbox": {
            "left": "243px",
            "top": "0px",
            "width": "200px",
            "height": "50px",
            "right": "0px",
            "bottom": "0px"
          },
          "widgetId": "widget_5",
          "setting": {
            "autoProps": {
              "left": true,
              "height": "STRETCH"
            },
            "vCenter": false,
            "hCenter": false
          },
          "isPending": false
        }
      },
      "order": [
        "0",
        "1",
        "2",
        "3"
      ],
      "label": "Default"
    },
    "layout_19": {
      "type": "FIXED",
      "content": {
        "1": {
          "type": "WIDGET",
          "setting": {
            "style": {},
            "autoProps": {
              "left": false,
              "right": false,
              "width": "STRETCH",
              "top": false,
              "bottom": false,
              "height": "STRETCH"
            }
          },
          "bbox": {
            "left": 0,
            "top": 0,
            "width": "356px",
            "height": "298px",
            "right": 0,
            "bottom": 0
          },
          "widgetId": "widget_10",
          "isPending": true
        },
        "2": {
          "type": "WIDGET",
          "bbox": {
            "left": "0",
            "top": "0",
            "right": "0",
            "bottom": "0"
          },
          "widgetId": "widget_11",
          "setting": {
            "autoProps": {
              "width": "STRETCH",
              "height": "STRETCH"
            }
          }
        }
      },
      "order": [
        "1",
        "2"
      ],
      "label": "First"
    },
    "layout_20": {
      "type": "FIXED",
      "content": {
        "0": {
          "type": "WIDGET",
          "setting": {
            "style": {},
            "autoProps": {
              "left": false,
              "right": false,
              "width": "STRETCH",
              "top": false,
              "bottom": false,
              "height": "STRETCH"
            }
          },
          "bbox": {
            "left": 0,
            "top": 0,
            "width": "298px",
            "height": "350px",
            "right": 0,
            "bottom": 0
          },
          "widgetId": "widget_7"
        }
      },
      "order": [
        "0"
      ],
      "label": "Second"
    },
    "layout_21": {
      "type": "FIXED",
      "content": {
        "0": {
          "type": "WIDGET",
          "bbox": {
            "left": "0px",
            "top": "0px",
            "width": "39.072%",
            "height": "60px",
            "right": "0px"
          },
          "widgetId": "widget_16",
          "setting": {
            "autoProps": {
              "width": "STRETCH"
            }
          }
        },
        "1": {
          "type": "WIDGET",
          "bbox": {
            "left": "0px",
            "top": "60px",
            "width": "78.1441%",
            "height": "52.1173%",
            "right": "0px",
            "bottom": "0px"
          },
          "widgetId": "widget_17",
          "setting": {
            "autoProps": {
              "height": "STRETCH",
              "width": "STRETCH"
            }
          }
        }
      },
      "order": [
        "0",
        "1"
      ]
    },
    "layout_22": {
      "type": "FIXED",
      "content": {
        "0": {
          "type": "WIDGET",
          "bbox": {
            "left": "14px",
            "top": "50%",
            "width": "36px",
            "height": "36px"
          },
          "setting": {
            "vCenter": true,
            "autoProps": {
              "top": false,
              "bottom": true
            }
          },
          "widgetId": "widget_2"
        },
        "1": {
          "type": "WIDGET",
          "bbox": {
            "left": "82px",
            "top": "50%",
            "width": "291px",
            "height": "42px",
            "bottom": "0px"
          },
          "widgetId": "widget_3",
          "setting": {
            "vCenter": true,
            "hCenter": false,
            "autoProps": {
              "top": false,
              "bottom": true
            }
          }
        },
        "2": {
          "type": "WIDGET",
          "bbox": {
            "left": "380px",
            "top": "50%",
            "width": "207px",
            "height": "32px",
            "bottom": "0px",
            "right": "NaNpx"
          },
          "widgetId": "widget_4",
          "setting": {
            "hCenter": false,
            "vCenter": true,
            "autoProps": {
              "top": false,
              "bottom": true
            }
          },
          "isPending": true
        },
        "3": {
          "type": "WIDGET",
          "bbox": {
            "left": "370px",
            "top": 0,
            "width": "200.00px",
            "height": "60px",
            "right": 0,
            "bottom": 0
          },
          "widgetId": "widget_5",
          "setting": {
            "autoProps": {
              "left": true,
              "height": "STRETCH"
            }
          }
        }
      },
      "order": [
        "0",
        "1",
        "2",
        "3"
      ],
      "label": "Default"
    },
    "layout_23": {
      "type": "FIXED",
      "content": {
        "0": {
          "type": "WIDGET",
          "bbox": {},
          "widgetId": "widget_14"
        },
        "1": {
          "type": "WIDGET",
          "bbox": {},
          "widgetId": "widget_15"
        }
      },
      "order": [
        "0",
        "1"
      ],
      "label": "Controller layout"
    },
    "layout_24": {
      "content": {
        "0": {
          "type": "WIDGET",
          "widgetId": "widget_14",
          "bbox": {
            "left": 0,
            "top": 0,
            "bottom": 0,
            "right": 0
          }
        }
      },
      "order": [
        "0"
      ],
      "label": "Open widget layout"
    },
    "layout_25": {
      "type": "FIXED",
      "content": {
        "1": {
          "type": "WIDGET",
          "setting": {
            "style": {},
            "autoProps": {
              "right": false,
              "left": false,
              "top": false,
              "bottom": false,
              "height": "STRETCH",
              "width": "STRETCH"
            },
            "vCenter": false,
            "hCenter": false
          },
          "bbox": {
            "left": "0%",
            "right": "0%",
            "top": "0%",
            "bottom": "0%",
            "width": "100%",
            "height": "100%"
          },
          "widgetId": "widget_11",
          "isPending": false
        }
      },
      "order": [
        "1"
      ],
      "label": "First"
    },
    "layout_26": {
      "type": "FIXED",
      "content": {
        "0": {
          "type": "WIDGET",
          "bbox": {
            "left": "0px",
            "top": "0px",
            "width": "110px",
            "height": "133px",
            "right": "10px",
            "bottom": "0px"
          },
          "widgetId": "widget_8",
          "setting": {
            "lockParent": true,
            "vCenter": false,
            "hCenter": false,
            "autoProps": {
              "width": "CUSTOM",
              "height": "STRETCH"
            }
          },
          "isPending": false
        },
        "1": {
          "type": "WIDGET",
          "bbox": {
            "left": "125px",
            "top": "10px",
            "width": "465px",
            "height": "29px",
            "right": "20px"
          },
          "widgetId": "widget_9",
          "setting": {
            "lockParent": true,
            "autoProps": {
              "width": "STRETCH"
            },
            "vCenter": false,
            "hCenter": false
          },
          "isPending": false
        },
        "2": {
          "type": "WIDGET",
          "bbox": {
            "left": "125px",
            "top": "34px",
            "width": "253px",
            "height": "46px",
            "right": "20px",
            "bottom": "20px"
          },
          "widgetId": "widget_10",
          "setting": {
            "lockParent": true,
            "hCenter": false,
            "vCenter": false,
            "autoProps": {
              "width": "STRETCH",
              "height": "STRETCH"
            }
          },
          "isPending": false
        }
      },
      "order": [
        "0",
        "1",
        "2"
      ],
      "label": "Regular"
    },
    "layout_27": {
      "type": "FIXED",
      "content": {
        "0": {
          "type": "WIDGET",
          "bbox": {
            "left": "0px",
            "top": "0px",
            "width": "110px",
            "height": "133px",
            "right": "10px",
            "bottom": "0px"
          },
          "widgetId": "widget_8",
          "setting": {
            "lockParent": true,
            "vCenter": false,
            "hCenter": false,
            "autoProps": {
              "width": "CUSTOM",
              "height": "STRETCH"
            }
          },
          "isPending": false
        },
        "1": {
          "type": "WIDGET",
          "bbox": {
            "left": "125px",
            "top": "10px",
            "width": "465px",
            "height": "29px",
            "right": "20px"
          },
          "widgetId": "widget_9",
          "setting": {
            "lockParent": true,
            "autoProps": {
              "width": "STRETCH"
            },
            "vCenter": false,
            "hCenter": false
          },
          "isPending": false
        },
        "2": {
          "type": "WIDGET",
          "bbox": {
            "left": "125px",
            "top": "34px",
            "width": "253px",
            "height": "46px",
            "right": "20px",
            "bottom": "20px"
          },
          "widgetId": "widget_10",
          "setting": {
            "lockParent": true,
            "hCenter": false,
            "vCenter": false,
            "autoProps": {
              "width": "STRETCH",
              "height": "STRETCH"
            }
          },
          "isPending": false
        }
      },
      "order": [
        "0",
        "1",
        "2"
      ],
      "label": "Selected"
    },
    "layout_28": {
      "type": "FIXED",
      "label": "Hover"
    },
    "layout_29": {
      "type": "FIXED",
      "content": {
        "0": {
          "type": "WIDGET",
          "setting": {
            "style": {},
            "autoProps": {
              "right": false,
              "left": false,
              "top": false,
              "bottom": false,
              "height": "STRETCH",
              "width": "STRETCH"
            },
            "vCenter": false,
            "hCenter": false
          },
          "bbox": {
            "left": "0%",
            "right": "0%",
            "top": "0%",
            "bottom": "0%",
            "width": "100%",
            "height": "100%"
          },
          "widgetId": "widget_7"
        }
      },
      "order": [
        "0"
      ],
      "label": "Second"
    },
    "layout_30": {
      "type": "FIXED",
      "content": {
        "0": {
          "type": "WIDGET",
          "setting": {
            "style": {},
            "autoProps": {
              "right": false,
              "left": true,
              "top": false,
              "bottom": true,
              "width": "AUTO",
              "height": "AUTO"
            }
          },
          "bbox": {
            "left": "76.2%",
            "right": "1.00%",
            "top": "2.00%",
            "bottom": "86.2%",
            "width": "18.9%",
            "height": "6.4%"
          },
          "widgetId": "widget_19"
        }
      },
      "order": [
        "0"
      ],
      "label": "Map FixedLayout"
    },
    "layout_31": {
      "type": "FIXED"
    },
    "layout_32": {
      "type": "FIXED",
      "label": "Map FixedLayout"
    }
  },
  "widgets": {
    "widget_1": {
      "id": "widget_1",
      "uri": "widgets/layout/fixed/",
      "config": {},
      "style": {
        "background": {
          "image": {
            "url": ""
          },
          "color": "var(--primary-600)"
        },
        "boxShadow": {
          "offsetX": {
            "distance": 0,
            "unit": "px"
          },
          "offsetY": {
            "distance": 2,
            "unit": "px"
          },
          "blur": {
            "distance": 4,
            "unit": "px"
          },
          "spread": {
            "distance": 0,
            "unit": "px"
          },
          "color": "rgba(0,0,0,0.5)"
        }
      },
      "layouts": {
        "DEFAULT": {
          "LARGE": "layout_2"
        }
      },
      "version": "1.11.0",
      "label": "Fixed Panel"
    },
    "widget_2": {
      "id": "widget_2",
      "uri": "widgets/common/image/",
      "config": {
        "functionConfig": {
          "altText": "",
          "toolTip": "",
          "linkParam": {},
          "scale": "Fit",
          "imageParam": {
            "cropParam": {
              "cropShape": "circle",
              "svgPath": "M28 14c0 7.732-6.268 14-14 14S0 21.732 0 14 6.268 0 14 0s14 6.268 14 14z",
              "svgViewBox": "0 0 28 28"
            }
          }
        },
        "styleConfig": {}
      },
      "version": "1.11.0",
      "label": "Image"
    },
    "widget_3": {
      "id": "widget_3",
      "uri": "widgets/common/text/",
      "config": {
        "text": "",
        "placeholder": "<p><span style=\"font-size: 24px; color: var(--light);\">Title</span></p>",
        "style": {
          "verticalAlign": "center",
          "wrap": true,
          "overflow": "scroll",
          "padding": "p-1"
        }
      },
      "version": "1.11.0",
      "label": "Text"
    },
    "widget_4": {
      "id": "widget_4",
      "uri": "widgets/common/text/",
      "config": {
        "text": "",
        "placeholder": "<p><span style=\"color: var(--light); font-size: 16px;\">Subtitle</span></p>",
        "style": {
          "verticalAlign": "center",
          "wrap": true,
          "overflow": "scroll",
          "padding": "p-1"
        }
      },
      "version": "1.11.0",
      "label": "Text 2"
    },
    "widget_5": {
      "id": "widget_5",
      "uri": "widgets/common/controller/",
      "config": {
        "behavior": {
          "onlyOpenOne": true,
          "displayType": "STACK",
          "vertical": false,
          "size": {}
        },
        "appearance": {
          "space": 0,
          "advanced": false,
          "card": {
            "showLabel": false,
            "labelGrowth": 10,
            "avatar": {
              "type": "primary",
              "size": "default",
              "shape": "rectangle"
            }
          }
        }
      },
      "layouts": {
        "controller": {
          "LARGE": "layout_3",
          "SMALL": "layout_4",
          "MEDIUM": "layout_23"
        },
        "_openwidget": {
          "LARGE": "layout_5",
          "SMALL": "layout_6",
          "MEDIUM": "layout_24"
        }
      },
      "widgets": [
        "widget_14",
        "widget_15"
      ],
      "version": "1.11.0",
      "label": "Widget Controller"
    },
    "widget_6": {
      "id": "widget_6",
      "uri": "widgets/layout/sidebar/",
      "config": {
        "direction": "HORIZONTAL",
        "collapseSide": "FIRST",
        "overlay": false,
        "size": "271px",
        "divider": {
          "visible": true
        },
        "resizable": true,
        "toggleBtn": {
          "visible": true,
          "icon": "LEFT",
          "offsetX": 15,
          "offsetY": 0,
          "position": "CENTER",
          "iconSize": 14,
          "width": 15,
          "height": 40,
          "color": {
            "normal": {
              "icon": {
                "useTheme": true,
                "color": "var(--dark-800)"
              },
              "bg": {
                "useTheme": false,
                "color": "var(--light-100)",
                "opacity": 0.6
              }
            },
            "hover": {
              "bg": {
                "useTheme": false,
                "color": "var(--light-200)"
              }
            }
          },
          "expandStyle": {
            "style": {
              "borderRadius": "0 4px 4px 0"
            }
          },
          "collapseStyle": {
            "style": {
              "borderRadius": "0 4px 4px 0"
            }
          },
          "template": "rect",
          "border": {
            "type": "solid",
            "color": "var(--light-500)",
            "width": "1px"
          }
        },
        "defaultState": 1
      },
      "layouts": {
        "FIRST": {
          "LARGE": "layout_7"
        },
        "SECOND": {
          "LARGE": "layout_14"
        }
      },
      "version": "1.11.0",
      "label": "Sidebar"
    },
    "widget_7": {
      "id": "widget_7",
      "uri": "widgets/common/list/",
      "config": {
        "maxItems": 100,
        "space": 10,
        "itemsPerPage": 10,
        "pageStyle": "SCROLL",
        "itemStyle": "STYLE4",
        "hoverType": "HOVER0",
        "selectedStyle": "STYLE0",
        "differentOddEven": false,
        "direction": "VERTICAL",
        "verticalSpace": 10,
        "horizontalSpace": 10,
        "layoutType": "ROW",
        "alignType": "CENTER",
        "isInitialed": true,
        "scrollStep": 2,
        "cardConfigs": {
          "REGULAR": {
            "cardSize": {
              "LARGE": {
                "width": 395.984375,
                "height": 110
              },
              "MEDIUM": {
                "width": 395.984375,
                "height": 110
              },
              "SMALL": {
                "width": 356.015625,
                "height": 110
              }
            },
            "enable": true,
            "backgroundStyle": {
              "border": {
                "type": "solid",
                "color": "rgba(0, 0, 0, 1)",
                "width": {
                  "distance": 1,
                  "unit": "px"
                }
              }
            }
          },
          "HOVER": {
            "cardSize": {
              "LARGE": {
                "width": 395.984375,
                "height": 110
              },
              "MEDIUM": {
                "width": 395.984375,
                "height": 110
              },
              "SMALL": {
                "width": 356.015625,
                "height": 110
              }
            },
            "enable": false,
            "backgroundStyle": {
              "border": {
                "type": "solid",
                "color": "rgba(0, 0, 0, 1)",
                "width": {
                  "distance": 1,
                  "unit": "px"
                }
              }
            }
          },
          "SELECTED": {
            "cardSize": {
              "LARGE": {
                "width": 395.984375,
                "height": 110
              },
              "MEDIUM": {
                "width": 395.984375,
                "height": 110
              },
              "SMALL": {
                "width": 356.015625,
                "height": 110
              }
            },
            "backgroundStyle": {
              "border": {
                "type": "solid",
                "color": "var(--primary)",
                "width": {
                  "distance": 1,
                  "unit": "px"
                }
              }
            },
            "selectionMode": "SINGLE"
          }
        },
        "style": {
          "id": "default"
        },
        "isItemStyleConfirm": true
      },
      "layouts": {
        "REGULAR": {
          "LARGE": "layout_8",
          "SMALL": "layout_9",
          "MEDIUM": "layout_26"
        },
        "SELECTED": {
          "LARGE": "layout_10",
          "SMALL": "layout_11",
          "MEDIUM": "layout_27"
        },
        "HOVER": {
          "LARGE": "layout_12",
          "SMALL": "layout_13",
          "MEDIUM": "layout_28"
        }
      },
      "version": "1.11.0",
      "label": "List"
    },
    "widget_8": {
      "id": "widget_8",
      "uri": "widgets/common/image/",
      "config": {
        "functionConfig": {
          "altText": "",
          "toolTip": "",
          "linkParam": {},
          "scale": "Fit",
          "imageParam": {}
        },
        "styleConfig": {}
      },
      "version": "1.11.0",
      "label": "Image 2"
    },
    "widget_9": {
      "id": "widget_9",
      "uri": "widgets/common/text/",
      "config": {
        "text": "",
        "placeholder": "<h5><span style=\"font-size: 16px;\">Double click to edit text</span></h5>",
        "style": {
          "verticalAlign": "start",
          "wrap": true,
          "overflow": "scroll",
          "padding": "p-1"
        }
      },
      "version": "1.11.0",
      "label": "Text 3"
    },
    "widget_10": {
      "id": "widget_10",
      "uri": "widgets/common/text/",
      "config": {
        "text": "",
        "placeholder": "<p style=\"text-align: left;\"><span style=\"font-size: 13px;\">Double click to edit text</span></p>",
        "style": {
          "verticalAlign": "start",
          "wrap": true,
          "overflow": "scroll",
          "padding": "p-1"
        }
      },
      "version": "1.11.0",
      "label": "Text 4"
    },
    "widget_11": {
      "id": "widget_11",
      "uri": "widgets/arcgis/arcgis-map/",
      "config": {
        "toolConfig": {
          "canZoom": true,
          "canHome": true,
          "canSearch": false
        },
        "isUseCustomMapState": true,
        "initialMapState": null
      },
      "layouts": {
        "MapFixedLayout": {
          "LARGE": "layout_15",
          "SMALL": "layout_16",
          "MEDIUM": "layout_30"
        }
      },
      "version": "1.11.0",
      "label": "Map",
      "useDataSources": [
        {
          "dataSourceId": "dataSource_1",
          "mainDataSourceId": "dataSource_1"
        }
      ]
    },
    "widget_12": {
      "id": "widget_12",
      "uri": "widgets/layout/fixed/",
      "config": {},
      "style": {
        "background": {
          "image": {
            "url": ""
          },
          "color": "var(--primary)"
        },
        "boxShadow": {
          "offsetX": {
            "distance": 0,
            "unit": "px"
          },
          "offsetY": {
            "distance": 2,
            "unit": "px"
          },
          "blur": {
            "distance": 4,
            "unit": "px"
          },
          "spread": {
            "distance": 0,
            "unit": "px"
          },
          "color": "rgba(0,0,0,0.5)"
        }
      },
      "layouts": {
        "DEFAULT": {
          "SMALL": "layout_18"
        }
      },
      "version": "1.11.0",
      "label": "Fixed Panel 2"
    },
    "widget_13": {
      "id": "widget_13",
      "uri": "widgets/layout/sidebar/",
      "config": {
        "direction": "VERTICAL",
        "collapseSide": "SECOND",
        "overlay": false,
        "size": "140px",
        "divider": {
          "visible": true
        },
        "resizable": true,
        "toggleBtn": {
          "visible": true,
          "icon": "DOWN",
          "offsetX": 0,
          "offsetY": -15,
          "position": "CENTER",
          "iconSize": 14,
          "width": 40,
          "height": 15,
          "color": {
            "normal": {
              "icon": {
                "useTheme": true,
                "color": "colors.primary"
              },
              "bg": {
                "useTheme": true,
                "color": "var(--light-400)",
                "opacity": 0.6
              }
            },
            "hover": {
              "bg": {
                "useTheme": true,
                "color": "var(--light-400)"
              }
            }
          },
          "expandStyle": {
            "style": {
              "borderRadius": "4px 4px 0 0"
            }
          },
          "collapseStyle": {
            "style": {
              "borderRadius": "4px 4px 0 0"
            }
          },
          "template": "rect"
        },
        "defaultState": 1
      },
      "layouts": {
        "FIRST": {
          "SMALL": "layout_19"
        },
        "SECOND": {
          "SMALL": "layout_20"
        }
      },
      "version": "1.11.0",
      "label": "Sidebar 2"
    },
    "widget_14": {
      "id": "widget_14",
      "uri": "widgets/arcgis/map-layers/",
      "config": {
        "useMapWidget": true
      },
      "useMapWidgetIds": [
        "widget_11"
      ],
      "version": "1.11.0",
      "label": "Map Layers"
    },
    "widget_15": {
      "id": "widget_15",
      "uri": "widgets/arcgis/legend/",
      "config": {},
      "useMapWidgetIds": [
        "widget_11"
      ],
      "version": "1.11.0",
      "label": "Legend"
    },
    "widget_16": {
      "id": "widget_16",
      "uri": "widgets/layout/fixed/",
      "config": {},
      "style": {
        "background": {
          "image": {
            "url": ""
          },
          "color": "var(--primary)"
        },
        "boxShadow": {
          "offsetX": {
            "distance": 0,
            "unit": "px"
          },
          "offsetY": {
            "distance": 2,
            "unit": "px"
          },
          "blur": {
            "distance": 4,
            "unit": "px"
          },
          "spread": {
            "distance": 0,
            "unit": "px"
          },
          "color": "rgba(0,0,0,0.5)"
        }
      },
      "layouts": {
        "DEFAULT": {
          "MEDIUM": "layout_22"
        }
      },
      "version": "1.11.0",
      "label": "Fixed Panel 3"
    },
    "widget_17": {
      "id": "widget_17",
      "uri": "widgets/layout/sidebar/",
      "config": {
        "direction": "VERTICAL",
        "collapseSide": "SECOND",
        "overlay": false,
        "size": "400px",
        "divider": {
          "visible": true
        },
        "resizable": true,
        "toggleBtn": {
          "visible": true,
          "icon": "DOWN",
          "offsetX": 0,
          "offsetY": -15,
          "position": "CENTER",
          "iconSize": 14,
          "width": 40,
          "height": 15,
          "color": {
            "normal": {
              "icon": {
                "useTheme": true,
                "color": "var(--primary)"
              },
              "bg": {
                "useTheme": true,
                "color": "var(--light-400)",
                "opacity": 0.6
              }
            },
            "hover": {
              "bg": {
                "useTheme": true,
                "color": "var(--light-400)"
              }
            }
          },
          "expandStyle": {
            "style": {
              "borderRadius": "4px 4px 0 0"
            }
          },
          "collapseStyle": {
            "style": {
              "borderRadius": "4px 4px 0 0"
            }
          },
          "template": "rect"
        },
        "defaultState": 1
      },
      "layouts": {
        "FIRST": {
          "MEDIUM": "layout_25"
        },
        "SECOND": {
          "MEDIUM": "layout_29"
        }
      },
      "version": "1.11.0",
      "label": "Sidebar 3"
    },
    "widget_18": {
      "uri": "widgets/common/search/",
      "version": "1.11.0",
      "config": {
        "searchResultView": "Result_Panel",
        "arrangementStyle": "Style1",
        "maxSuggestions": 6,
        "recentSearchesMaxNumber": 6,
        "resultMaxNumber": 6
      },
      "id": "widget_18",
      "label": "Search"
    },
    "widget_19": {
      "uri": "widgets/common/search/",
      "version": "1.11.0",
      "config": {
        "searchResultView": "Result_Panel",
        "arrangementStyle": "Style1",
        "maxSuggestions": 6,
        "recentSearchesMaxNumber": 6,
        "resultMaxNumber": 6
      },
      "id": "widget_19",
      "label": "Search 2"
    },
    "widget_20": {
      "uri": "widgets/common/search/",
      "version": "1.11.0",
      "config": {
        "searchResultView": "Result_Panel",
        "arrangementStyle": "Style1",
        "maxSuggestions": 6,
        "recentSearchesMaxNumber": 6,
        "resultMaxNumber": 6
      },
      "id": "widget_20",
      "label": "Search 3"
    },
    "widget_22": {
      "uri": "widgets/arcgis/arcgis-map/",
      "version": "1.11.0",
      "label": "Map 2",
      "config": {
        "toolConfig": {
          "canZoom": true,
          "canHome": true,
          "canSearch": true,
          "canNavigation": true
        },
        "isUseCustomMapState": false
      },
      "id": "widget_22",
      "layouts": {
        "MapFixedLayout": {
          "LARGE": "layout_32"
        }
      }
    }
  },
  "exbVersion": "1.11.0",
  "mainSizeMode": "LARGE",
  "theme": "themes/morandi/",
  "forBuilderAttributes": {
    "lockLayout": false
  },
  "template": "jewelrybox",
  "widgetsManifest": {},
  "views": {},
  "sections": {},
  "dialogs": {},
  "dataSources": {
    "dataSource_1": {
      "id": "dataSource_1",
      "type": "WEB_SCENE",
      "sourceLabel": "Copy of Visualize New Developments by esri_3d",
      "itemId": "8ab22747937947b1bd92a541c6a6243a",
      "portalUrl": "https://productsteam.maps.arcgis.com"
    }
  },
  "messageConfigs": {
    "messageConfig_1": {
      "id": "messageConfig_1",
      "widgetId": "widget_22",
      "messageType": "EXTENT_CHANGE",
      "actions": [
        {
          "actionId": "widget_11-zoomToFeature-1687090354372",
          "widgetId": "widget_11",
          "messageWidgetId": "widget_22",
          "actionName": "zoomToFeature",
          "description": null,
          "version": "1.11.0"
        }
      ]
    },
    "messageConfig_2": {
      "id": "messageConfig_2",
      "widgetId": "widget_11",
      "messageType": "EXTENT_CHANGE",
      "actions": [
        {
          "actionId": "widget_22-zoomToFeature-1687090639724",
          "widgetId": "widget_22",
          "messageWidgetId": "widget_11",
          "actionName": "zoomToFeature",
          "description": null,
          "version": "1.11.0"
        }
      ]
    }
  },
  "pageStructure": [
    {
      "home": []
    }
  ],
  "timestamp": 1687091480290,
  "header": {
    "layout": {
      "LARGE": "layout_31"
    },
    "height": {
      "LARGE": 75
    }
  },
  "originExbVersion": "1.11.0",
  "attributes": {
    "portalUrl": "https://productsteam.maps.arcgis.com"
  },
  "sharedThemeVariables": {
    "header": {},
    "body": {},
    "button": {},
    "logo": {}
  }
}