,,,Codegen,Library;
ABSBLK_f,absblk,zero-crossing parameter is ignored,,DONE;
ABS_VALUE,absolute_value,zero-crossing parameter is ignored,,DONE;
BIGSOM_f,sum,-,,DONE;
CLKINV_f,input,resolved by the frontend,DONE,;
CLKOUTV_f,output,resolved by the frontend,DONE,;
CLKSPLIT_f,split,resolved by the frontend,DONE,;
CLINDUMMY_f,cdummy,-,,DONE;
CLOCK_c,csuper,independent events are re-synchronized to only one master clock,,;
CONST,cstblk4,,,DONE;
CONST_f,cstblk,,,DONE;
CONST_m,cstblk4_m,-,,DONE;
CONVERT,convert,-,,DONE;
DEMUX,multiplex,-,,DONE;
DEMUX_f,demux,-,,DONE;
DERIV,deriv,converted to Laplace discrete ‘z’ notation,,DONE;
DOLLAR_f,dollar,converted to Laplace discrete ‘z’ notation,,DONE;
DOLLAR_m,dollar4,converted to Laplace discrete ‘z’ notation,,DONE;
EXTRACTOR,extractor,-,,DONE;
FROM,from,resolved by the frontend,DONE,;
FROMWSB,csuper,implemented by the user in Scilab,,;
GAINBLK,gainblk,-,,DONE;
GAINBLK_f,gain,-,,DONE;
GOTO,goto,resolved by the frontend,DONE,;
INTRP2BLK_f,intrp2,,,DONE;
INTRPLBLK_f,intrpl,implemented as if / then ,,DONE;
IN_f,input,label propagated as the input variable name of the superblock function,DONE,;
LOGIC,logic,-,,DONE;
LOGICAL_OP,logicalop,-,,DONE;
MATMUL,matmul_m,-,,DONE;
MAXMIN,minmax,-,,DONE;
MUX,multiplex,-,,DONE;
MUX_f,mux,-,,DONE;
M_SWITCH,mswitch,-,,DONE;
NRMSOM_f,junk,-,,;
OUT_f,output,label propagated as the input variable name of the superblock function,DONE,;
POWBLK_f,powblk,-,,DONE;
PRODUCT,product,-,,DONE;
RELATIONALOP,relationalop,-,,DONE;
"SATURATION,satur,""zero-crossing parameter is ignored, it saturates only on the next discrete step"",,DONE";
scifunc_block_m,scifunc,implemented by the user in Scilab,,DONE;
SPLIT_f,lsplit,resolved by the frontend,DONE,;
SINBLK_f,sinblk,-,,DONE;
SQRT,mat_sqrt,-,,DONE;
SUMMATION,summation,-,,DONE;
SUPER_f,super,Produce an independent Scilab macro ; the block label will be the function name and each port labels will be used as inputs and outputs names to mimic a function call.,DONE,
SWITCH2_m,switch2_m,-,,DONE;
TANBLK_f,tanblk,-,,DONE;
TIME_f,timblk,The time will be a double pseudo variable incremented by the computational step.,,DONE;
TOWS_c,tows_c,-,,DONE;
TRASH_f,trash,resolved by the frontend (variable aliases),,DONE;
