[libnames, libpath] = libraryinfo("xcos_code_generatorlib");
path = libpath + "/../tests/unit_tests";
loadXcosLibs();
importXcosDiagram(path + "/satur.zcos");
// generate some code for each superblock on TMPDIR
name = "satur";
ok = xcg_codegenerator(scs_m, TMPDIR, name);
exec(TMPDIR + filesep() + name + ".sci", 1);
function [y1] = satur(t, u1)
    //EMX?: emx_func_file('satur.c')
    // update outputs 
    // -3f469da6:15771cde67d:-7d2f
    // scs_m(list("objs",4,"model","rpar","objs",3))
    // satur/satur
    // satur
    if u1 > 1 then
        tmp2 = 1;
    elseif u1 < -1 then
        tmp2 = -1;
    else
        tmp2 = u1;
    end
    // -3f469da6:15771cde67d:-7ed7
    // scs_m(list("objs",4,"model","rpar","objs",6))
    // satur/satur
    // xcg_output_sim
    y1 = tmp2;
endfunction
emx_codegen(TMPDIR + filesep() + name + "_scenario.sce");
