name = "ports_labeling";
[libnames, libpath] = libraryinfo("xcos_code_generatorlib");
path = libpath + "/../tests/unit_tests";
loadXcosLibs();
importXcosDiagram(path + "/ports_labeling.zcos");
scs_m_selected_path = [];
for i=1:length(scs_m.objs)
    if typeof(scs_m.objs(i)) == "Block" then
        if scs_m.objs(i).model.label == name then
            scs_m_selected_path = i;
            break;
        end
    end
end
// generate some code for the superblock on TMPDIR
ok = xcg_codegenerator(scs_m, TMPDIR, scs_m_selected_path);
// execute and display the generated code
exec(TMPDIR + filesep() + name + ".sci", 1);
function [y1, y2, y3] = ports_labeling(t, u1, u2, u3)
    //EMX?: emx_func_file('ports_labeling.c')
    // update outputs 
    // 265ed92:15b5c597928:-7d81
    // scs_m(list("objs",10,"model","rpar","objs",1))
    // ports_labeling/ports_labeling
    // multiplex
    tmp4 = [ u1 ; u2 ; u3 ];
    // 265ed92:15b5c597928:-7d75
    // scs_m(list("objs",10,"model","rpar","objs",2))
    // ports_labeling/ports_labeling
    // multiplex
    tmp5 = tmp4(1);
    tmp6 = tmp4(2);
    tmp7 = tmp4(3);
    // 265ed92:15b5c597928:-7d2f
    // scs_m(list("objs",10,"model","rpar","objs",18))
    // ports_labeling/ports_labeling
    // xcg_output_sim
    y1 = tmp5;
    // 265ed92:15b5c597928:-7d2b
    // scs_m(list("objs",10,"model","rpar","objs",20))
    // ports_labeling/ports_labeling
    // xcg_output_sim
    y2 = tmp6;
    // 265ed92:15b5c597928:-7d27
    // scs_m(list("objs",10,"model","rpar","objs",22))
    // ports_labeling/ports_labeling
    // xcg_output_sim
    y3 = tmp7;
endfunction
emx_codegen(TMPDIR + filesep() + name + "_scenario.sce");
