[libnames, libpath] = libraryinfo("xcos_code_generatorlib");
path = libpath + "/../tests/unit_tests";
loadXcosLibs();
importXcosDiagram(path + "/deriv.zcos");
// generate some code for each superblock on TMPDIR
name = "deriv";
ok = xcg_codegenerator(scs_m, TMPDIR, name);
exec(TMPDIR + filesep() + name + ".sci", 1);
function [y1] = deriv(t, u1)
    //EMX?: emx_func_file('deriv.c')
    // update outputs 
    // 720776a9:15b3ea06698:-7fae
    // scs_m(list("objs",2,"model","rpar","objs",3))
    // deriv/deriv
    // deriv
    global w2;
    tmp2 = (u1 - w2) ./ 0.1;
    w2 = u1;
    // -14ccf4bd:1592aac8465:-7eec
    // scs_m(list("objs",2,"model","rpar","objs",8))
    // deriv/deriv
    // xcg_output_sim
    y1 = tmp2;
endfunction
emx_codegen(TMPDIR + filesep() + name + "_scenario.sce");
