[libnames, libpath] = libraryinfo("xcos_code_generatorlib");
path = libpath + "/../tests/unit_tests";
loadXcosLibs();
importXcosDiagram(path + "/mux.zcos");
// generate some code for each superblock on TMPDIR
name = "mux";
ok = xcg_codegenerator(scs_m, TMPDIR, name);
exec(TMPDIR + filesep() + name + ".sci", 1);
function [y1] = mux(t, u1, u2, u3)
    //EMX?: emx_func_file('mux.c')
    // update outputs 
    // 5a97f313:15755cf4944:-7c4b
    // scs_m(list("objs",6,"model","rpar","objs",1))
    // mux/mux
    // multiplex
    tmp7 = [ u1 ; u2 ; u3 ];
    // 5a97f313:15755cf4944:-7c14
    // scs_m(list("objs",6,"model","rpar","objs",14))
    // mux/mux
    // xcg_output_sim
    y1 = tmp7;
endfunction
name = "vector_mux_c";
ok = xcg_codegenerator(scs_m, TMPDIR, name);
exec(TMPDIR + filesep() + name + ".sci", 1);
function [y1] = vector_mux_c(t, u1, u2)
    //EMX?: emx_func_file('vector_mux_c.c')
    // update outputs 
    // 5a97f313:15755cf4944:-7bb7
    // scs_m(list("objs",11,"model","rpar","objs",1))
    // mux/vector_mux_c
    // multiplex
    tmp11 = [ u1 ; u2 ];
    // 5a97f313:15755cf4944:-7bac
    // scs_m(list("objs",11,"model","rpar","objs",12))
    // mux/vector_mux_c
    // xcg_output_sim
    y1 = tmp11;
endfunction
emx_codegen(TMPDIR + filesep() + name + "_scenario.sce");
