[libnames, libpath] = libraryinfo("xcos_code_generatorlib");
path = libpath + "/../tests/unit_tests";
loadXcosLibs();
importXcosDiagram(path + "/logicalop.zcos");
// generate some code for each superblock on TMPDIR
name = "logicalop";
ok = xcg_codegenerator(scs_m, TMPDIR, name);
exec(TMPDIR + filesep() + name + ".sci", 1);
function [y1, y2, y3, y4, y5, y6] = logicalop(t, u1, u2)
    //EMX?: emx_func_file('logicalop.c')
    // update outputs 
    // -14ccf4bd:1592aac8465:-7b44
    // scs_m(list("objs",2,"model","rpar","objs",4))
    // logicalop/logicalop
    // logicalop
    tmp3 = double(u1 & u2);
    // -14ccf4bd:1592aac8465:-7b35
    // scs_m(list("objs",2,"model","rpar","objs",5))
    // logicalop/logicalop
    // logicalop
    tmp4 = double(u1 | u2);
    // -14ccf4bd:1592aac8465:-7b2d
    // scs_m(list("objs",2,"model","rpar","objs",6))
    // logicalop/logicalop
    // logicalop
    tmp5 = double(~( u1 & u2 ));
    // -14ccf4bd:1592aac8465:-7b21
    // scs_m(list("objs",2,"model","rpar","objs",7))
    // logicalop/logicalop
    // logicalop
    tmp6 = double(~( u1 | u2 ));
    // -14ccf4bd:1592aac8465:-7b19
    // scs_m(list("objs",2,"model","rpar","objs",8))
    // logicalop/logicalop
    // logicalop
    tmp7 = double(bitxor(u1, u2));
    // -14ccf4bd:1592aac8465:-7b11
    // scs_m(list("objs",2,"model","rpar","objs",9))
    // logicalop/logicalop
    // logicalop
    tmp8 = double(~u1);
    // -14ccf4bd:1592aac8465:-7eec
    // scs_m(list("objs",2,"model","rpar","objs",52))
    // logicalop/logicalop
    // xcg_output_sim
    y1 = tmp3;
    // -14ccf4bd:1592aac8465:-7b04
    // scs_m(list("objs",2,"model","rpar","objs",56))
    // logicalop/logicalop
    // xcg_output_sim
    y2 = tmp4;
    // -14ccf4bd:1592aac8465:-7b01
    // scs_m(list("objs",2,"model","rpar","objs",58))
    // logicalop/logicalop
    // xcg_output_sim
    y3 = tmp5;
    // -14ccf4bd:1592aac8465:-7afe
    // scs_m(list("objs",2,"model","rpar","objs",60))
    // logicalop/logicalop
    // xcg_output_sim
    y4 = tmp6;
    // -14ccf4bd:1592aac8465:-7afb
    // scs_m(list("objs",2,"model","rpar","objs",62))
    // logicalop/logicalop
    // xcg_output_sim
    y5 = tmp7;
    // -14ccf4bd:1592aac8465:-7af8
    // scs_m(list("objs",2,"model","rpar","objs",64))
    // logicalop/logicalop
    // xcg_output_sim
    y6 = tmp8;
endfunction
emx_codegen(TMPDIR + filesep() + name + "_scenario.sce");
