[libnames, libpath] = libraryinfo("xcos_code_generatorlib");
path = libpath + "/../tests/unit_tests";
loadXcosLibs();
importXcosDiagram(path + "/sinblk.zcos");
// generate some code for each superblock on TMPDIR
name = "sinblk";
ok = xcg_codegenerator(scs_m, TMPDIR, name);
exec(TMPDIR + filesep() + name + ".sci", 1);
function [y1] = sinblk(t, u1)
    //EMX?: emx_func_file('sinblk.c')
    // update outputs 
    // -75c601d8:15b340ebd91:-7fb0
    // scs_m(list("objs",2,"model","rpar","objs",3))
    // sinblk/sinblk
    // sinblk
    tmp2 = sin(u1);
    // -14ccf4bd:1592aac8465:-7eec
    // scs_m(list("objs",2,"model","rpar","objs",8))
    // sinblk/sinblk
    // xcg_output_sim
    y1 = tmp2;
endfunction
emx_codegen(TMPDIR + filesep() + name + "_scenario.sce");
