[libnames, libpath] = libraryinfo("xcos_code_generatorlib");
path = libpath + "/../tests/unit_tests";
loadXcosLibs();
importXcosDiagram(path + "/demux.zcos");
// generate some code for each superblock on TMPDIR
name = "demux";
ok = xcg_codegenerator(scs_m, TMPDIR, name);
exec(TMPDIR + filesep() + name + ".sci", 1);
function [y1, y2, y3] = demux(t, u1)
    //EMX?: emx_func_file('demux.c')
    // update outputs 
    // -3cb5d9ff:157564328f4:-7fb2
    // scs_m(list("objs",8,"model","rpar","objs",1))
    // demux/demux
    // multiplex
    tmp6 = u1(1);
    tmp7 = u1(2);
    tmp8 = u1(3);
    // -3cb5d9ff:157564328f4:-7f88
    // scs_m(list("objs",8,"model","rpar","objs",10))
    // demux/demux
    // xcg_output_sim
    y1 = tmp6;
    // -3cb5d9ff:157564328f4:-7f80
    // scs_m(list("objs",8,"model","rpar","objs",14))
    // demux/demux
    // xcg_output_sim
    y2 = tmp7;
    // -3cb5d9ff:157564328f4:-7f7c
    // scs_m(list("objs",8,"model","rpar","objs",16))
    // demux/demux
    // xcg_output_sim
    y3 = tmp8;
endfunction
name = "vector_demux";
ok = xcg_codegenerator(scs_m, TMPDIR, name);
exec(TMPDIR + filesep() + name + ".sci", 1);
function [y1, y2, y3] = vector_demux(t, u1)
    //EMX?: emx_func_file('vector_demux.c')
    // update outputs 
    // -3cb5d9ff:157564328f4:-7f02
    // scs_m(list("objs",16,"model","rpar","objs",1))
    // demux/vector_demux
    // multiplex
    tmp10 = u1(1:7);
    tmp11 = u1(8);
    tmp12 = u1(9);
    // -3cb5d9ff:157564328f4:-7efd
    // scs_m(list("objs",16,"model","rpar","objs",10))
    // demux/vector_demux
    // xcg_output_sim
    y1 = tmp10;
    // -3cb5d9ff:157564328f4:-7ef7
    // scs_m(list("objs",16,"model","rpar","objs",14))
    // demux/vector_demux
    // xcg_output_sim
    y2 = tmp11;
    // -3cb5d9ff:157564328f4:-7ef4
    // scs_m(list("objs",16,"model","rpar","objs",16))
    // demux/vector_demux
    // xcg_output_sim
    y3 = tmp12;
endfunction
emx_codegen(TMPDIR + filesep() + name + "_scenario.sce");
