[libnames, libpath] = libraryinfo("xcos_code_generatorlib");
path = libpath + "/../tests/unit_tests";
loadXcosLibs();
importXcosDiagram(path + "/intrp2.zcos");
// generate some code for each superblock on TMPDIR
name = "intrp2";
ok = xcg_codegenerator(scs_m, TMPDIR, name);
exec(TMPDIR + filesep() + name + ".sci", 1);
function [y1] = intrp2(t, u1, u2)
    //EMX?: emx_func_file('intrp2.c')
    // update outputs 
    // -7c72e811:15a91030dc3:-7f77
    // scs_m(list("objs",1,"model","rpar","objs",4))
    // intrp2/intrp2
    // intrp2
    intrp2_x = [0;1;2;3];
    intrp2_y = [0;1;2;3];
    intrp2_z = [0,1,2,4;1,2,4,8;2,4,8,16;4,8,16,32];
    //EMX?: emx_size(intrp2_i, 1, 1)
    if u1 > intrp2_x($) then
        intrp2_i = size(intrp2_x, 'r');
    else
        intrp2_i = find(u1 <= intrp2_x(2:$), 1) + 1;
    end
    //EMX?: emx_size(intrp2_j, 1, 1)
    if u2 > intrp2_y($) then
        intrp2_j = size(intrp2_y, 'r');
    else
        intrp2_j = find(u2 <= intrp2_y(2:$), 1) + 1;
    end
    intrp2_vx1 = intrp2_x(intrp2_i - 1);
    intrp2_vx2 = intrp2_x(intrp2_i);
    intrp2_vy1 = intrp2_y(intrp2_j - 1);
    intrp2_vy2 = intrp2_y(intrp2_j);
    intrp2_vz1 = intrp2_z(intrp2_j - 1, intrp2_i - 1);
    intrp2_vz4 = intrp2_z(intrp2_j, intrp2_i - 1);
    intrp2_vz2 = intrp2_z(intrp2_j - 1, intrp2_i);
    intrp2_vz3 = intrp2_z(intrp2_j, intrp2_i);
    tmp3 = (1 - (u2 - intrp2_vy1) ./ (intrp2_vy2 - intrp2_vy1)) .* (intrp2_vz1 + (intrp2_vz2 - intrp2_vz1) .* (u1 - intrp2_vx1) ./ (intrp2_vx2 - intrp2_vx1)) + ((u2 - intrp2_vy1) ./ (intrp2_vy2 - intrp2_vy1)) .* (intrp2_vz4 + (intrp2_vz3 - intrp2_vz4) .* (u1 - intrp2_vx1) ./ (intrp2_vx2 - intrp2_vx1));
    // 286d5815:15771f4b296:-7f01
    // scs_m(list("objs",1,"model","rpar","objs",12))
    // intrp2/intrp2
    // xcg_output_sim
    y1 = tmp3;
endfunction
emx_codegen(TMPDIR + filesep() + name + "_scenario.sce");
