[libnames, libpath] = libraryinfo("xcos_code_generatorlib");
path = libpath + "/../tests/unit_tests";
loadXcosLibs();
importXcosDiagram(path + "/scifunc.zcos");
// generate some code for each superblock on TMPDIR
name = "scifunc";
deletefile(TMPDIR + filesep() + name + "_inner1.sci");
ok = xcg_codegenerator(scs_m, TMPDIR, name);
exec(TMPDIR + filesep() +name + ".sci", 1);
function [y1] = scifunc(t, u1)
    //EMX?: emx_func_file('scifunc.c')
    // update outputs 
    // 1ab3c3de:15766ec3779:-7fde
    // scs_m(list("objs",4,"model","rpar","objs",1))
    // scifunc/scifunc
    // scifunc
    [tmp2] = scifunc_inner1(1, u1)
    // 1ab3c3de:15766ec3779:-7fba
    // scs_m(list("objs",4,"model","rpar","objs",8))
    // scifunc/scifunc
    // xcg_output_sim
    y1 = tmp2;
endfunction
exec(TMPDIR + filesep() +name + "_inner1.sci", 1);
function [y1] = scifunc_inner1(flag, u1)
    // 1ab3c3de:15766ec3779:-7fde
    y1 = [];
    if flag == 1 then
        // output
        y1=u1'
    elseif flag == 4 then
        // initialization
         // init
    end
endfunction
emx_codegen(TMPDIR + filesep() + name + "_scenario.sce");
