[libnames, libpath] = libraryinfo("xcos_code_generatorlib");
path = libpath + "/../tests/unit_tests";
loadXcosLibs();
importXcosDiagram(path + "/cstblk.zcos");
// generate some code for each superblock on TMPDIR
name = "scalar_cstblk";
ok = xcg_codegenerator(scs_m, TMPDIR, name);
exec(TMPDIR + filesep() + name + ".sci", 1);
function [y1] = scalar_cstblk(t)
    //EMX?: emx_func_file('scalar_cstblk.c')
    // update outputs 
    // -14ccf4bd:1592aac8465:-7c13
    // scs_m(list("objs",3,"model","rpar","objs",2))
    // cstblk/scalar_cstblk
    // cstblk
    tmp2 = 1;
    // -14ccf4bd:1592aac8465:-7d5f
    // scs_m(list("objs",3,"model","rpar","objs",4))
    // cstblk/scalar_cstblk
    // xcg_output_sim
    y1 = tmp2;
endfunction
name = "vector_cstblk";
ok = xcg_codegenerator(scs_m, TMPDIR, name);
exec(TMPDIR + filesep() + name + ".sci", 1);
function [y1] = vector_cstblk(t)
    //EMX?: emx_func_file('vector_cstblk.c')
    // update outputs 
    // -14ccf4bd:1592aac8465:-7c0d
    // scs_m(list("objs",6,"model","rpar","objs",2))
    // cstblk/vector_cstblk
    // cstblk
    tmp3 = [1;1;1;1];
    // -14ccf4bd:1592aac8465:-7d3a
    // scs_m(list("objs",6,"model","rpar","objs",4))
    // cstblk/vector_cstblk
    // xcg_output_sim
    y1 = tmp3;
endfunction
emx_codegen(TMPDIR + filesep() + name + "_scenario.sce");
