[libnames, libpath] = libraryinfo("xcos_code_generatorlib");
path = libpath + "/../tests/unit_tests";
loadXcosLibs();
importXcosDiagram(path + "/mswitch.zcos");
// generate some code for each superblock on TMPDIR
name = "mswitch";
ok = xcg_codegenerator(scs_m, TMPDIR, name);
exec(TMPDIR + filesep() + name + ".sci", 1);
function [y1, y2, y3] = mswitch(t, u1, u2, u3, u4, u5)
    //EMX?: emx_func_file('mswitch.c')
    // update outputs 
    // -1cf03094:15b3eb00a93:-7f10
    // scs_m(list("objs",2,"model","rpar","objs",7))
    // mswitch/mswitch
    // mswitch
    if floor(u1) < 2 then
        tmp2 = u2;
    elseif floor(u1) < 3 then
        tmp2 = u4;
    elseif floor(u1) < 4 then
        tmp2 = u5;
    else
        tmp2 = u5;
    end
    // -1cf03094:15b3eb00a93:-7f05
    // scs_m(list("objs",2,"model","rpar","objs",8))
    // mswitch/mswitch
    // mswitch
    if floor(u1) < 1 then
        tmp3 = u2;
    elseif floor(u1) < 2 then
        tmp3 = u4;
    elseif floor(u1) < 3 then
        tmp3 = u5;
    else
        tmp3 = u5;
    end
    // -1cf03094:15b3eb00a93:-7efb
    // scs_m(list("objs",2,"model","rpar","objs",9))
    // mswitch/mswitch
    // mswitch
    if int(u1) < 2 then
        tmp4 = u2;
    elseif int(u1) < 3 then
        tmp4 = u4;
    elseif int(u1) < 4 then
        tmp4 = u5;
    else
        tmp4 = u5;
    end
    // -14ccf4bd:1592aac8465:-7eec
    // scs_m(list("objs",2,"model","rpar","objs",52))
    // mswitch/mswitch
    // xcg_output_sim
    y1 = tmp2;
    // 2a3eca40:15b33793cdb:-7f53
    // scs_m(list("objs",2,"model","rpar","objs",58))
    // mswitch/mswitch
    // xcg_output_sim
    y2 = tmp3;
    // 2a3eca40:15b33793cdb:-7f4d
    // scs_m(list("objs",2,"model","rpar","objs",60))
    // mswitch/mswitch
    // xcg_output_sim
    y3 = tmp4;
endfunction
emx_codegen(TMPDIR + filesep() + name + "_scenario.sce");
