FLUXES
;NET;REACTION;ID;FCD;VALUE;STDDEV;RSTDDEV;LB;UB
;;"Fru6P -> Fru6Pmeas";Fru6P_dil1;dependent;0,7695352480328947;0,01005214204399122;0,0130626141813345;;;1-Fru6P_dil2.n
;;"Fru6Pout -> Fru6Pmeas";Fru6P_dil2;free;0,2304647519671053;0,01005214204399122;0,0436168305920637;;;Fru6P_dil2.n
;;"Fru6Pmeas -> ";Fru6Pmeas_out;constraint;1;0;0;;;Fru6Pmeas_out.n
;;"Gluc_1 -> Glc6P";Glucupt_1;free;0,8055953530164982;0,004365114833167614;0,00541849554720336;;;Glucupt_1.n
;;"Gluc_U -> Glc6P";Glucupt_U;dependent;0,1944046469835018;0,004365114833167614;0,0224537576693733;;;1-Glucupt_1.n
;;"Glc6P -> Fru6P";pgi;free;0,8470025512984697;0,0356980441256131;0,0421463242004258;;;pgi.n
;;"Fru6P -> FruBP";pfk;dependent;0,9002341837661565;0,05449048044807095;0,0605292283171346;;;-0.0414333+0.6666667*gnd.n+pgi.n
;;"FruBP -> GA3P+GA3P";ald;dependent;0,9002341837661566;0,05449048044807095;0,0605292283171345;;;-0.0414333+0.6666667*gnd.n+pgi.n
;;"GA3P -> PGA";pgk;dependent;1,813434183766157;0,05449048044807095;0,0300482261423487;;;0.8717667+0.6666667*gnd.n+pgi.n
;;"PGA -> PEP";eno;dependent;1,734334183766157;0,05449048044807095;0,0314186740699208;;;0.7926667+0.6666667*gnd.n+pgi.n
;;"PEP -> Pyr";pyk;dependent;1,544334183766156;0,1411480215904797;0,0913973303668401;;;1.3188+gnd.n-0.5*out_co2.n+pgi.n+maldh.n
;;"Glc6P -> Gnt6P";zwf;dependent;0,1420974487015303;0,0356980441256131;0,251222273530015;;;0.9891-pgi.n
;;"Gnt6P -> CO2+Rib5P";gnd;free;0,1419974487015303;0,03908431153013963;0,275246575819066;;;gnd.n
;;"Gnt6P -> Pyr+GA3P";edd;dependent;9,999999999998899e-05;0,06577110293477646; 6,57711029347837e-08;;;0.9891-gnd.n-pgi.n
;;"GA3P+Sed7P -> Ery4P+Fru6P";ta;dependent;0,03736581623384343;0,01302810384337988;0,348663702723558;;;-0.0099667+0.3333333*gnd.n
;;"Rib5P+Rib5P -> GA3P+Sed7P";tk1;dependent;0,03736581623384343;0,01302810384337988;0,348663702723558;;;-0.0099667+0.3333333*gnd.n
;;"Rib5P+Ery4P -> GA3P+Fru6P";tk2;dependent;0,01966581623384343;0,01302810384337988;0,662474605094675;;;-0.0276667+0.3333333*gnd.n
;;"Pyr -> AcCoA+CO2";pdh;dependent;1,395934183766157;0,01302810384337988;0,00933289262121996;;;1.4432667-0.3333333*gnd.n
;;"AcCoA+OAA -> ICit";citsynth;dependent;1,02643417327536;0,01302848777277186;0,0126929598721347;;;-0.6589333-0.3333333*gnd.n+0.5*out_co2.n
;;"ICit -> AKG+CO2";idh;dependent;1,02643417327536;0,01302848777277186;0,0126929598721347;;;-0.6589333-0.3333333*gnd.n+0.5*out_co2.n
;;"AKG -> Suc+CO2";akgdh;dependent;0,9693341732753602;0,01302848777277187;0,0134406566197381;;;-0.7160333-0.3333333*gnd.n+0.5*out_co2.n
;;"Suc -> Mal";fum_a;dependent;0,48466708663768;0,006514243886385929;0,0134406566197381;;;-0.3580167-0.1666667*gnd.n+0.25*out_co2.n
;;"Suc -> Mal";fum_b;dependent;0,48466708663768;0,006514243886385929;0,0134406566197381;;;-0.3580167-0.1666667*gnd.n+0.25*out_co2.n
;;"Mal -> OAA";maldh;free;0,9692341732753601;0,1886210817073538;0,194608369069305;;;maldh.n
;;"PEP+CO2 -> OAA";ppc;dependent;0,1519000000000003;0,1807236579018848;1,189754166569351;;;-0.5642333-0.3333333*gnd.n+0.5*out_co2.n-maldh.n
;;"Mal -> Pyr+CO2";mae;dependent;9,999999999998899e-05;0,1807236579018848; 1,80723657901905e-07;;;-0.7160333-0.3333333*gnd.n+0.5*out_co2.n-maldh.n
;;"Glc6P -> ";bs_glc6P;constraint;0,0109;0;0;;;bs_glc6P.n
;;"Fru6P -> ";bs_fru6P;constraint;0,0038;0;0;;;bs_fru6P.n
;;"PGA -> BM_PGA";bs_pga;constraint;0,0791;0;0;;;bs_pga.n
;;"BM_PGA -> ";bs_pga_aux;constraint;0,03280000000000002;0;0;;;bs_pga_aux.n
;;"BM_PGA -> Ser";bs_pga1;constraint;0,04629999999999999;0;0;;;bs_pga1.n
;;"Ser -> ";bs_pga1_aux;constraint;0,0109;0;0;;;bs_pga1_aux.n
;;"Ser -> Cys";bs_pga2;constraint;0,0046;0;0;;;bs_pga2.n
;;"Cys -> ";bs_pga2_aux;constraint;0,0046;0;0;;;bs_pga2_aux.n
;;"Ser -> Gly+FTHF";bs_pga3;constraint;0,03080000000000024;0;0;;;bs_pga3.n
;;"Gly -> ";bs_pga3_aux;constraint;0,03080000000000024;0;0;;;bs_pga3_aux.n
;;"GA3P -> ";bs_DHAP;constraint;0,0068;0;0;;;bs_DHAP.n
;;"Pyr -> BM_Pyr";bs_pyr;constraint;0,1501;0;0;;;bs_pyr.n
;;"BM_Pyr -> Ala";bs_pyr1;constraint;0,03019999999999995;0;0;;;bs_pyr1.n
;;"Ala -> ";bs_pyr1_aux;constraint;0,03019999999999995;0;0;;;bs_pyr1_aux.n
;;"BM_Pyr+BM_Pyr -> AKV+CO2";bs_pyr2;constraint;0,04400000000000016;0;0;;;bs_pyr2.n
;;"AKV -> Val";bs_pyr4;constraint;0,0213;0;0;;;bs_pyr4.n
;;"Val -> ";bs_pyr4_aux;constraint;0,0213;0;0;;;bs_pyr4_aux.n
;;"AKV+BM_AcCoA -> Leu+CO2";bs_pyr3;constraint;0,02270000000000016;0;0;;;bs_pyr3.n
;;"Leu -> ";bs_pyr3_aux;constraint;0,0227;0;0;;;bs_pyr3_aux.n
;;"Ery4P -> BM_Ery4P";bs_e4p;constraint;0,0177;0;0;;;bs_e4p.n
;;"Rib5P -> BM_Rib5P";bs_rib5p;constraint;0,0476;0;0;;;bs_rib5p.n
;;"BM_Rib5P+FTHF -> His";bs_rib5p1;constraint;0,004800000000000245;0;0;;;bs_rib5p1.n
;;"His -> ";bs_rib5p1_aux;constraint;0,0048;0;0;;;bs_rib5p1_aux.n
;;"BM_Rib5P -> ";bs_rib5p2;constraint;0,04130000000000001;0;0;;;bs_rib5p2.n
;;"PEP -> BM_PEP";bs_pep;constraint;0,0381;0;0;;;bs_pep.n
;;"BM_PEP+BM_Ery4P -> DAHP";bs_pep1;constraint;0,0177;0;0;;;bs_pep1.n
;;"BM_PEP+DAHP -> Chor";bs_pep2;constraint;0,0177;0;0;;;bs_pep2.n
;;"Chor -> Phe+CO2";bs_pep3a;constraint;0,004650000000000236;0;0;;;bs_pep3a.n
;;"Chor -> Phe+CO2";bs_pep3b;constraint;0,004650000000000236;0;0;;;bs_pep3b.n
;;"Phe -> ";bs_pep3_aux;constraint;0,009299999999999999;0;0;;;bs_pep3_aux.n
;;"Chor -> Tyr+CO2";bs_pep4a;constraint;0,00345000000000009;0;0;;;bs_pep4a.n
;;"Chor -> Tyr+CO2";bs_pep4b;constraint;0,00345000000000009;0;0;;;bs_pep4b.n
;;"Tyr -> ";bs_pep4_aux;constraint;0,0069;0;0;;;bs_pep4_aux.n
;;"BM_PEP -> ";bs_pep5;constraint;0,0027;0;0;;;bs_pep5.n
;;"Chor+BM_Rib5P -> Trp+PyrCO2";bs_pep6;constraint;0,001499999999999748;0;0;;;bs_pep6.n
;;"Trp -> ";bs_pep6_aux;constraint;0,001499999999999994;0;0;;;bs_pep6_aux.n
;;"PyrCO2 -> Pyr+CO2";bs_pep7;constraint;0,001499999999999994;0;0;;;bs_pep7.n
;;"AcCoA -> BM_AcCoA";bs_accoa;constraint;0,1564999999999999;0;0;;;bs_accoa.n
;;"BM_AcCoA -> ";bs_accoa_aux;constraint;0,1337999999999998;0;0;;;bs_accoa_aux.n
;;"AKG -> BM_AKG";bs_akg;constraint;0,05709999999999985;0;0;;;bs_akg.n
;;"BM_AKG -> Glu";bs_akg1;constraint;0,0571;0;0;;;bs_akg1.n
;;"Glu -> ";bs_akg2;constraint;0,0111;0;0;;;bs_akg2.n
;;"Glu -> ";bs_akg3;constraint;0,0132;0;0;;;bs_akg3.n
;;"Glu+CO2 -> Arg";bs_akg4;constraint;0,0328;0;0;;;bs_akg4.n
;;"Arg -> ";bs_akg4_aux;constraint;0,0328;0;0;;;bs_akg4_aux.n
;;"OAA -> BM_OAA";bs_oaa;constraint;0,0946999999999999;0;0;;;bs_oaa.n
;;"BM_OAA -> Asp";bs_oaa1;constraint;0,0121;0;0;;;bs_oaa1.n
;;"Asp -> ";bs_oaa1_aux;constraint;0,0121;0;0;;;bs_oaa1_aux.n
;;"Thr+BM_Pyr -> Ile+CO2";bs_oaa2;constraint;0,0146;0;0;;;bs_oaa2.n
;;"Ile -> ";bs_oaa2_aux;constraint;0,0146;0;0;;;bs_oaa2_aux.n
;;"BM_OAA+BM_Pyr -> Lys+CO2";bs_oaa3a;constraint;0,00864999999999988;0;0;;;bs_oaa3a.n
;;"BM_OAA+BM_Pyr -> Lys+CO2";bs_oaa3b;constraint;0,00864999999999988;0;0;;;bs_oaa3b.n
;;"Lys -> ";bs_oaa3_aux;constraint;0,0173;0;0;;;bs_oaa3_aux.n
;;"BM_OAA -> ";bs_oaa4;constraint;0,01810000000000012;0;0;;;bs_oaa4.n
;;"BM_OAA -> Thr";bs_oaa5;constraint;0,0274;0;0;;;bs_oaa5.n
;;"Thr -> ";bs_oaa5_aux;constraint;0,0128;0;0;;;bs_oaa5_aux.n
;;"BM_OAA+FTHF -> Met";bs_oaa6;constraint;0,007700000000000012;0;0;;;bs_oaa6.n
;;"Met -> ";bs_oaa6_aux;constraint;0,0077;0;0;;;bs_oaa6_aux.n
;;"BM_OAA -> Asn";bs_oaa7;constraint;0,0121;0;0;;;bs_oaa7.n
;;"Asn -> ";bs_oaa7_aux;constraint;0,0121;0;0;;;bs_oaa7_aux.n
;;"CO2 -> ";out_co2;free;3,465399979018407;0,0001999999998822798;0,0000577133955945053;;;out_co2.n
;;"AcCoA -> ";out_Ac;dependent;0,2130000104907959;9,999999994113986e-05;0,000469483544675511;;;1.9457-0.5*out_co2.n
;;"FTHF -> ";out_FTHF;constraint;0,01829999999999998;0;0;;;out_FTHF.n

;XCH;REACTION;ID;FCD;VALUE;STDDEV;RSTDDEV;LB;UB
;;"Fru6P -> Fru6Pmeas";Fru6P_dil1;constraint;0;0;;;;Fru6P_dil1.x
;;"Fru6Pout -> Fru6Pmeas";Fru6P_dil2;constraint;0;0;;;;Fru6P_dil2.x
;;"Fru6Pmeas -> ";Fru6Pmeas_out;constraint;0;0;;;;Fru6Pmeas_out.x
;;"Gluc_1 -> Glc6P";Glucupt_1;constraint;0;0;;;;Glucupt_1.x
;;"Gluc_U -> Glc6P";Glucupt_U;constraint;0;0;;;;Glucupt_U.x
;;"Glc6P -> Fru6P";pgi;constraint;3,038543862624892;0;0;;;pgi.x
;;"Fru6P -> FruBP";pfk;constraint;0;0;;;;pfk.x
;;"FruBP -> GA3P+GA3P";ald;free;0,7095136116003192;0,104671746526115;0,147526058436041;;;ald.x
;;"GA3P -> PGA";pgk;constraint;64,4364611961784;0;0;;;pgk.x
;;"PGA -> PEP";eno;free;999;299083,6455533114;299,383028581893;;;eno.x
;;"PEP -> Pyr";pyk;constraint;0,0110805326655349;0;0;;;pyk.x
;;"Glc6P -> Gnt6P";zwf;constraint;0;0;;;;zwf.x
;;"Gnt6P -> CO2+Rib5P";gnd;constraint;0;0;;;;gnd.x
;;"Gnt6P -> Pyr+GA3P";edd;constraint;0;0;;;;edd.x
;;"GA3P+Sed7P -> Ery4P+Fru6P";ta;free;0,58238642385575;0,04703430449611255;0,0807613340034904;;;ta.x
;;"Rib5P+Rib5P -> GA3P+Sed7P";tk1;free;0,1754137630383417;0,06072287178387437;0,34616936967826;;;tk1.x
;;"Rib5P+Ery4P -> GA3P+Fru6P";tk2;free;0;0,03244500428705745;;;;tk2.x
;;"Pyr -> AcCoA+CO2";pdh;constraint;0,0333508830758309;0;0;;;pdh.x
;;"AcCoA+OAA -> ICit";citsynth;constraint;0;0;;;;citsynth.x
;;"ICit -> AKG+CO2";idh;constraint;0;0;;;;idh.x
;;"AKG -> Suc+CO2";akgdh;constraint;0;0;;;;akgdh.x
;;"Suc -> Mal";fum_a;dependent;0,4443291085138703;0,7416709982880894;1,669192911463142;;;fum_b.x
;;"Suc -> Mal";fum_b;free;0,4443291085138703;0,7416709982880894;1,669192911463142;;;fum_b.x
;;"Mal -> OAA";maldh;constraint;1,833784377346728;0;0;;;maldh.x
;;"PEP+CO2 -> OAA";ppc;free;0,173941419090349;0,08719026473722005;0,501262236408061;;;ppc.x
;;"Mal -> Pyr+CO2";mae;constraint;0;0;;;;mae.x
;;"Glc6P -> ";bs_glc6P;constraint;0;0;;;;bs_glc6P.x
;;"Fru6P -> ";bs_fru6P;constraint;0;0;;;;bs_fru6P.x
;;"PGA -> BM_PGA";bs_pga;constraint;0;0;;;;bs_pga.x
;;"BM_PGA -> ";bs_pga_aux;constraint;0;0;;;;bs_pga_aux.x
;;"BM_PGA -> Ser";bs_pga1;constraint;0;0;;;;bs_pga1.x
;;"Ser -> ";bs_pga1_aux;constraint;0;0;;;;bs_pga1_aux.x
;;"Ser -> Cys";bs_pga2;constraint;0;0;;;;bs_pga2.x
;;"Cys -> ";bs_pga2_aux;constraint;0;0;;;;bs_pga2_aux.x
;;"Ser -> Gly+FTHF";bs_pga3;constraint;0,011939878627931;0;0;;;bs_pga3.x
;;"Gly -> ";bs_pga3_aux;constraint;0;0;;;;bs_pga3_aux.x
;;"GA3P -> ";bs_DHAP;constraint;0;0;;;;bs_DHAP.x
;;"Pyr -> BM_Pyr";bs_pyr;constraint;0;0;;;;bs_pyr.x
;;"BM_Pyr -> Ala";bs_pyr1;constraint;0;0;;;;bs_pyr1.x
;;"Ala -> ";bs_pyr1_aux;constraint;0;0;;;;bs_pyr1_aux.x
;;"BM_Pyr+BM_Pyr -> AKV+CO2";bs_pyr2;constraint;0;0;;;;bs_pyr2.x
;;"AKV -> Val";bs_pyr4;constraint;0;0;;;;bs_pyr4.x
;;"Val -> ";bs_pyr4_aux;constraint;0;0;;;;bs_pyr4_aux.x
;;"AKV+BM_AcCoA -> Leu+CO2";bs_pyr3;constraint;0;0;;;;bs_pyr3.x
;;"Leu -> ";bs_pyr3_aux;constraint;0;0;;;;bs_pyr3_aux.x
;;"Ery4P -> BM_Ery4P";bs_e4p;constraint;0;0;;;;bs_e4p.x
;;"Rib5P -> BM_Rib5P";bs_rib5p;constraint;0;0;;;;bs_rib5p.x
;;"BM_Rib5P+FTHF -> His";bs_rib5p1;constraint;0;0;;;;bs_rib5p1.x
;;"His -> ";bs_rib5p1_aux;constraint;0;0;;;;bs_rib5p1_aux.x
;;"BM_Rib5P -> ";bs_rib5p2;constraint;0;0;;;;bs_rib5p2.x
;;"PEP -> BM_PEP";bs_pep;constraint;0;0;;;;bs_pep.x
;;"BM_PEP+BM_Ery4P -> DAHP";bs_pep1;constraint;0;0;;;;bs_pep1.x
;;"BM_PEP+DAHP -> Chor";bs_pep2;constraint;0;0;;;;bs_pep2.x
;;"Chor -> Phe+CO2";bs_pep3a;constraint;0;0;;;;bs_pep3a.x
;;"Chor -> Phe+CO2";bs_pep3b;constraint;0;0;;;;bs_pep3b.x
;;"Phe -> ";bs_pep3_aux;constraint;0;0;;;;bs_pep3_aux.x
;;"Chor -> Tyr+CO2";bs_pep4a;constraint;0;0;;;;bs_pep4a.x
;;"Chor -> Tyr+CO2";bs_pep4b;constraint;0;0;;;;bs_pep4b.x
;;"Tyr -> ";bs_pep4_aux;constraint;0;0;;;;bs_pep4_aux.x
;;"BM_PEP -> ";bs_pep5;constraint;0;0;;;;bs_pep5.x
;;"Chor+BM_Rib5P -> Trp+PyrCO2";bs_pep6;constraint;0;0;;;;bs_pep6.x
;;"Trp -> ";bs_pep6_aux;constraint;0;0;;;;bs_pep6_aux.x
;;"PyrCO2 -> Pyr+CO2";bs_pep7;constraint;0;0;;;;bs_pep7.x
;;"AcCoA -> BM_AcCoA";bs_accoa;constraint;0;0;;;;bs_accoa.x
;;"BM_AcCoA -> ";bs_accoa_aux;constraint;0;0;;;;bs_accoa_aux.x
;;"AKG -> BM_AKG";bs_akg;constraint;0;0;;;;bs_akg.x
;;"BM_AKG -> Glu";bs_akg1;constraint;0;0;;;;bs_akg1.x
;;"Glu -> ";bs_akg2;constraint;0;0;;;;bs_akg2.x
;;"Glu -> ";bs_akg3;constraint;0;0;;;;bs_akg3.x
;;"Glu+CO2 -> Arg";bs_akg4;constraint;0;0;;;;bs_akg4.x
;;"Arg -> ";bs_akg4_aux;constraint;0;0;;;;bs_akg4_aux.x
;;"OAA -> BM_OAA";bs_oaa;constraint;0;0;;;;bs_oaa.x
;;"BM_OAA -> Asp";bs_oaa1;constraint;0;0;;;;bs_oaa1.x
;;"Asp -> ";bs_oaa1_aux;constraint;0;0;;;;bs_oaa1_aux.x
;;"Thr+BM_Pyr -> Ile+CO2";bs_oaa2;constraint;0;0;;;;bs_oaa2.x
;;"Ile -> ";bs_oaa2_aux;constraint;0;0;;;;bs_oaa2_aux.x
;;"BM_OAA+BM_Pyr -> Lys+CO2";bs_oaa3a;constraint;0;0;;;;bs_oaa3a.x
;;"BM_OAA+BM_Pyr -> Lys+CO2";bs_oaa3b;constraint;0;0;;;;bs_oaa3b.x
;;"Lys -> ";bs_oaa3_aux;constraint;0;0;;;;bs_oaa3_aux.x
;;"BM_OAA -> ";bs_oaa4;constraint;0;0;;;;bs_oaa4.x
;;"BM_OAA -> Thr";bs_oaa5;constraint;0;0;;;;bs_oaa5.x
;;"Thr -> ";bs_oaa5_aux;constraint;0;0;;;;bs_oaa5_aux.x
;;"BM_OAA+FTHF -> Met";bs_oaa6;constraint;0;0;;;;bs_oaa6.x
;;"Met -> ";bs_oaa6_aux;constraint;0;0;;;;bs_oaa6_aux.x
;;"BM_OAA -> Asn";bs_oaa7;constraint;0;0;;;;bs_oaa7.x
;;"Asn -> ";bs_oaa7_aux;constraint;0;0;;;;bs_oaa7_aux.x
;;"CO2 -> ";out_co2;constraint;0;0;;;;out_co2.x
;;"AcCoA -> ";out_Ac;constraint;0;0;;;;out_Ac.x
;;"FTHF -> ";out_FTHF;constraint;0;0;;;;out_FTHF.x
METABOLITE_POOLS
;META_NET;VALUE;STDDEV;RSTDDEV;LB;UB

FLUX_MEASUREMENTS
;NAME;FORMULA;VALUE;MEASUREMENT;STDDEV;;RESIDUAL
;fm_1;"out_Ac";0,2130000104907959;0,213;0,0001;;1,100567980048684e-08

MASS_SPECTROMETRY
;META_NAME;FRAGMENT;TIME;WEIGHT;VALUE;MEASUREMENT;STDDEV;RESIDUAL

;Suc;"1,2,3,4";time=Inf;1;0,3793027302199046;0,371605319;0,01
;;;;2;0,3622614918672502;0,360829749;0,01
;;;;3;0,1930727832608828;0,208425325;0,01
;;;;4;0,04957522387382467;0,059139607;0,01
;;;;;;;;3,884779895618391

;ICit;"1,2,3,4,5,6";time=Inf;0;0,0756446413754811;0,131864539419667;0,02
;;;;1;0,2050389031366446;0,225857638569;0,02
;;;;2;0,268621967337448;0,256421170949333;0,02
;;;;3;0,2273474744917394;0,209230210478667;0,02
;;;;4;0,1263511927572168;0,116863585449667;0,02
;;;;5;0,04518795779654493;0,0457727744643333;0,02
;;;;6;0,00828163156682649;0,0139900806697867;0,02
;;;;;;;;10,4853361576074

;PEP;"1,2,3";time=Inf;0;0,423717142809012;0,421359839367667;0,01
;;;;1;0,3595013604952002;0,358998301162333;0,01
;;;;2;0,03758733936292653;0,0348521859365667;0,01
;;;;3;0,1775671229150082;0,184789673534;0,01
;;;;;;;;0,6545624991658816

;PGA;"1,2,3";time=Inf;0;0,4267366127142873;0,434335785072667;0,01
;;;;1;0,3620335791906508;0,352829683224667;0,01
;;;;2;0,0378159608335957;0,0323479804176;0,01
;;;;3;0,1788310712922461;0,180486551285333;0,01
;;;;;;;;1,750985453222384

;FruBP;"1,2,3,4,5,6";time=Inf;0;0,08861594453035115;0,0738121029259333;0,01
;;;;1;0,4629446547627928;0,454450017158667;0,01
;;;;2;0,1290809955629275;0,160823529969333;0,01
;;;;3;0,1058209105571248;0,0944468077710667;0,01
;;;;4;0,09219162505619806;0,105281338489667;0,01
;;;;5;0,01049551718680574;0,0155016033633;0,01
;;;;6;0,08244758373124145;0,0956846003217333;0,01
;;;;;;;;17,99891403797554

;Glc6P;"1,2,3,4,5,6";time=Inf;0;0,015927225540773;0,0160587173349;0,01
;;;;1;0,6705042614345622;0,673510772480667;0,01
;;;;2;0,084642743305215;0,0930110047641;0,01
;;;;3;0,04170279864950866;0,0280359937297;0,01
;;;;4;0,05170711329329113;0,0397315614067667;0,01
;;;;5;0,006823473040150648;0,0145524520950667;0,01
;;;;6;0,1459897084617802;0,135099498189;0,01
;;;;;;;;5,876133953261765

;Fru6Pmeas;"1,2,3,4,5,6";time=Inf;0;0,2657264262699336;0,265726481873415;0,01
;;;;1;0,5068153323789809;0,5089571999760395;0,01
;;;;2;0,09174579871221317;0,08716504781474381;0,01
;;;;3;0,04520241690226786;0,0429743515537234;0,01
;;;;4;0,05604627429299881;0,0527302668496869;0,01
;;;;5;0,007396085708168562;0,007076058287967423;0,01
;;;;6;0,1051614593753361;0,1015826700151432;0,01
;;;;;;;;0,5444120698688281

;Rib5P;"1,2,3,4,5";time=Inf;0;0,3435224284723542;0,341615670498667;0,01
;;;;1;0,250729539003724;0,25454117519;0,01
;;;;2;0,1686383631147236;0,159027180368333;0,01
;;;;3;0,09097893779984345;0,113789577528667;0,01
;;;;4;0,07643522726173935;0,0615266612553333;0,01
;;;;5;0,06344068435544944;0,0694997351590667;0,01
;;;;;;;;8,898418520176302

;Gnt6P;"1,2,3,4,5,6";time=Inf;0;0,01590283505354767;0,0249552273874;0,01
;;;;1;0,6694774708249307;0,672556163913;0,01
;;;;2;0,08451312388443358;0,0866890773125333;0,01
;;;;3;0,04163893620371967;0,0313987199704333;0,01
;;;;4;0,05162793053274102;0,0314691889898667;0,01
;;;;5;0,006813023773165068;0,0138168327362333;0,01
;;;;6;0,1457661440933292;0,139114789690333;0,01
;;;;;;;;7,006896759000531

LABEL_MEASUREMENTS
;META_NAME;CUM_GROUP;CUM_CONSTRAINTS;VALUE

;;;;;SUM(RESIDUAL);;57.1004393569027