0=-re7-re9_f-re10-re45+re3+re9_b
0=-re7*s2_1-re9_f*s2_1-re10*s2_1-re45*s2_1+re3*s77_1+re9_b*s5_1
0=-re7*s2_2-re9_f*s2_2-re10*s2_2-re45*s2_2+re3*s77_2+re9_b*s5_2
0=-re7*s2_3-re9_f*s2_3-re10*s2_3-re45*s2_3+re3*s77_3+re9_b*s5_3
0=-re7*s2_4-re9_f*s2_4-re10*s2_4-re45*s2_4+re3*s77_4+re9_b*s5_4
0=-re7*s2_5-re9_f*s2_5-re10*s2_5-re45*s2_5+re3*s77_5+re9_b*s5_5
0=-re7*s2_6-re9_f*s2_6-re10*s2_6-re45*s2_6+re3*s77_6+re9_b*s5_6
0=-re16-re28+re6+re7
0=-re16*s4_1-re28*s4_1+re6*s78_1+re7*s2_1
0=-re16*s4_2-re28*s4_2+re6*s78_2+re7*s2_2
0=-re16*s4_3-re28*s4_3+re6*s78_3+re7*s2_3
0=-re16*s4_4-re28*s4_4+re6*s78_4+re7*s2_4
0=-re16*s4_5-re28*s4_5+re6*s78_5+re7*s2_5
0=-re16*s4_6-re28*s4_6+re6*s78_6+re7*s2_6
0=-re9_b-re17_b-re18-re44-re55_b+re9_f+re17_f+re19+re55_f
0=-re9_b*s5_1-re17_b*s5_1-re18*s5_1-re44*s5_1-re55_b*s5_1+re9_f*s2_1+re17_f*s15_1+re19*s28_1+re55_f*s19_1
0=-re9_b*s5_2-re17_b*s5_2-re18*s5_2-re44*s5_2-re55_b*s5_2+re9_f*s2_2+re17_f*s15_2+re19*s28_2+re55_f*s19_2
0=-re9_b*s5_3-re17_b*s5_3-re18*s5_3-re44*s5_3-re55_b*s5_3+re9_f*s2_3+re17_f*s25_1+re19*s28_3+re55_f*s19_3
0=-re9_b*s5_4-re17_b*s5_4-re18*s5_4-re44*s5_4-re55_b*s5_4+re9_f*s2_4+re17_f*s25_2+re19*s28_4+re55_f*s21_1
0=-re9_b*s5_5-re17_b*s5_5-re18*s5_5-re44*s5_5-re55_b*s5_5+re9_f*s2_5+re17_f*s25_3+re19*s28_5+re55_f*s21_2
0=-re9_b*s5_6-re17_b*s5_6-re18*s5_6-re44*s5_6-re55_b*s5_6+re9_f*s2_6+re17_f*s25_4+re19*s28_6+re55_f*s21_3
0=-re11-re12+re10
0=-re11*s11_1-re12*s11_1+re10*s2_1
0=-re11*s11_2-re12*s11_2+re10*s2_2
0=-re11*s11_3-re12*s11_3+re10*s2_3
0=-re11*s11_4-re12*s11_4+re10*s2_4
0=-re11*s11_5-re12*s11_5+re10*s2_5
0=-re11*s11_6-re12*s11_6+re10*s2_6
0=-re13_f-re14_f+re13_b+re14_b+re16
0=-re13_f*s14_1-re14_f*s14_1+re13_b*s15_1+re14_b*s16_1+re16*s4_2
0=-re13_f*s14_2-re14_f*s14_2+re13_b*s15_2+re14_b*s16_2+re16*s4_3
0=-re13_f*s14_3-re14_f*s14_3+re13_b*s15_3+re14_b*s16_3+re16*s4_4
0=-re13_f*s14_4-re14_f*s14_4+re13_b*s15_4+re14_b*s16_4+re16*s4_5
0=-re13_f*s14_5-re14_f*s14_5+re13_b*s15_5+re14_b*s16_5+re16*s4_6
0=-re13_b-re15_f-re17_f+re13_f+re15_b+re17_b
0=-re13_b*s15_1-re15_f*s15_1-re17_f*s15_1+re13_f*s14_1+re15_b*s19_1+re17_b*s5_1
0=-re13_b*s15_2-re15_f*s15_2-re17_f*s15_2+re13_f*s14_2+re15_b*s19_2+re17_b*s5_2
0=-re13_b*s15_3-re15_f*s15_3-re17_f*s15_3+re13_f*s14_3+re15_b*s21_1+re17_b*s21_1
0=-re13_b*s15_4-re15_f*s15_4-re17_f*s15_4+re13_f*s14_4+re15_b*s21_2+re17_b*s21_2
0=-re13_b*s15_5-re15_f*s15_5-re17_f*s15_5+re13_f*s14_5+re15_b*s21_3+re17_b*s21_3
0=-re14_b-re15_f-re46+re14_f+re15_b
0=-re14_b*s16_1-re15_f*s16_1-re46*s16_1+re14_f*s14_1+re15_b*s19_3
0=-re14_b*s16_2-re15_f*s16_2-re46*s16_2+re14_f*s14_2+re15_b*s19_4
0=-re14_b*s16_3-re15_f*s16_3-re46*s16_3+re14_f*s14_3+re15_b*s19_5
0=-re14_b*s16_4-re15_f*s16_4-re46*s16_4+re14_f*s14_4+re15_b*s19_6
0=-re14_b*s16_5-re15_f*s16_5-re46*s16_5+re14_f*s14_5+re15_b*s19_7
0=-re15_b-re55_f+re15_f+re55_b
0=-re15_b*s19_1-re55_f*s19_1+re15_f*s15_1+re55_b*s5_1
0=-re15_b*s19_2-re55_f*s19_2+re15_f*s15_2+re55_b*s5_2
0=-re15_b*s19_3-re55_f*s19_3+re15_f*s16_1+re55_b*s5_3
0=-re15_b*s19_4-re55_f*s19_4+re15_f*s16_2+re55_b*s25_1
0=-re15_b*s19_5-re55_f*s19_5+re15_f*s16_3+re55_b*s25_2
0=-re15_b*s19_6-re55_f*s19_6+re15_f*s16_4+re55_b*s25_3
0=-re15_b*s19_7-re55_f*s19_7+re15_f*s16_5+re55_b*s25_4
0=-re15_b-re17_b-re20_b-re21_b-re22_f-re29_b-re48-re55_f+re15_f+re17_f+re20_f+re21_f+re22_b+re29_f+re55_b
0=-re15_b*s21_1-re17_b*s21_1-re20_b*s21_1-re21_b*s21_1-re22_f*s21_1-re29_b*s21_1-re48*s21_1-re55_f*s21_1+re15_f*s15_3+re17_f*s15_3+re20_f*s28_4+re21_f*s31_3+re22_b*s34_1+re29_f*s46_4+re55_b*s5_4
0=-re15_b*s21_2-re17_b*s21_2-re20_b*s21_2-re21_b*s21_2-re22_f*s21_2-re29_b*s21_2-re48*s21_2-re55_f*s21_2+re15_f*s15_4+re17_f*s15_4+re20_f*s28_5+re21_f*s31_2+re22_b*s34_2+re29_f*s46_5+re55_b*s5_5
0=-re15_b*s21_3-re17_b*s21_3-re20_b*s21_3-re21_b*s21_3-re22_f*s21_3-re29_b*s21_3-re48*s21_3-re55_f*s21_3+re15_f*s15_5+re17_f*s15_5+re20_f*s28_6+re21_f*s31_1+re22_b*s34_3+re29_f*s46_6+re55_b*s5_6
0=-re17_f-re47-re55_b+re17_b+re55_f
0=-re17_f*s25_1-re47*s25_1-re55_b*s25_1+re17_b*s5_3+re55_f*s19_4
0=-re17_f*s25_2-re47*s25_2-re55_b*s25_2+re17_b*s5_4+re55_f*s19_5
0=-re17_f*s25_3-re47*s25_3-re55_b*s25_3+re17_b*s5_5+re55_f*s19_6
0=-re17_f*s25_4-re47*s25_4-re55_b*s25_4+re17_b*s5_6+re55_f*s19_7
0=-re19-re20_f+re18+re20_b
0=-re19*s28_1-re20_f*s28_1+re18*s5_1+re20_b*s31_1
0=-re19*s28_2-re20_f*s28_2+re18*s5_2+re20_b*s31_2
0=-re19*s28_3-re20_f*s28_3+re18*s5_3+re20_b*s31_3
0=-re19*s28_4-re20_f*s28_4+re18*s5_4+re20_b*s21_1
0=-re19*s28_5-re20_f*s28_5+re18*s5_5+re20_b*s21_2
0=-re19*s28_6-re20_f*s28_6+re18*s5_6+re20_b*s21_3
0=-re20_b-re21_f+re20_f+re21_b
0=-re20_b*s31_1-re21_f*s31_1+re20_f*s28_1+re21_b*s21_3
0=-re20_b*s31_2-re21_f*s31_2+re20_f*s28_2+re21_b*s21_2
0=-re20_b*s31_3-re21_f*s31_3+re20_f*s28_3+re21_b*s21_1
0=-re22_b-re23_f+re22_f+re23_b
0=-re22_b*s34_1-re23_f*s34_1+re22_f*s21_1+re23_b*s35_1
0=-re22_b*s34_2-re23_f*s34_2+re22_f*s21_2+re23_b*s35_2
0=-re22_b*s34_3-re23_f*s34_3+re22_f*s21_3+re23_b*s35_3
0=-re23_b-re24_f-re49+re23_f+re24_b
0=-re23_b*s35_1-re24_f*s35_1-re49*s35_1+re23_f*s34_1+re24_b*s36_1
0=-re23_b*s35_2-re24_f*s35_2-re49*s35_2+re23_f*s34_2+re24_b*s36_2
0=-re23_b*s35_3-re24_f*s35_3-re49*s35_3+re23_f*s34_3+re24_b*s36_3
0=-re24_b-re25_f+re24_f+re25_b
0=-re24_b*s36_1-re25_f*s36_1+re24_f*s35_1+re25_b*s37_1
0=-re24_b*s36_2-re25_f*s36_2+re24_f*s35_2+re25_b*s37_2
0=-re24_b*s36_3-re25_f*s36_3+re24_f*s35_3+re25_b*s37_3
0=-re25_b-re26-re50+re25_f
0=-re25_b*s37_1-re26*s37_1-re50*s37_1+re25_f*s36_1
0=-re25_b*s37_2-re26*s37_2-re50*s37_2+re25_f*s36_2
0=-re25_b*s37_3-re26*s37_3-re50*s37_3+re25_f*s36_3
0=-re29_b-re30-re40_f-re41_b-re42_b-re51+re26+re29_f+re40_b+re41_f+re42_f
0=-re29_b*s38_1-re30*s38_1-re40_f*s38_1-re41_b*s38_1-re42_b*s38_1-re51*s38_1+re26*s37_1+re29_f*s46_1+re40_b*s57_1+re41_f*s56_1+re42_f*s56_1
0=-re29_b*s38_2-re30*s38_2-re40_f*s38_2-re41_b*s38_2-re42_b*s38_2-re51*s38_2+re26*s37_2+re29_f*s46_2+re40_b*s57_2+re41_f*s56_2+re42_f*s56_2
0=-re29_b*s38_3-re30*s38_3-re40_f*s38_3-re41_b*s38_3-re42_b*s38_3-re51*s38_3+re26*s37_3+re29_f*s46_3+re40_b*s57_3+re41_f*s56_3+re42_f*s56_3
0=-re29_f+re28+re29_b
0=-re29_f*s46_1+re28*s4_1+re29_b*s38_1
0=-re29_f*s46_2+re28*s4_2+re29_b*s38_2
0=-re29_f*s46_3+re28*s4_3+re29_b*s38_3
0=-re29_f*s46_4+re28*s4_4+re29_b*s21_1
0=-re29_f*s46_5+re28*s4_5+re29_b*s21_2
0=-re29_f*s46_6+re28*s4_6+re29_b*s21_3
0=-0.5*re31-re39-re52+re30
0=-re31*(s47_1)^2-re39*s47_1-re52*s47_1+re30*s38_2
0=-re31*(s47_2)^2-re39*s47_2-re52*s47_2+re30*s38_3
0=-re32_f+re32_b+re39
0=-re32_f*s50_1+re32_b*s51_1+re39*s57_4
0=-re32_f*s50_2+re32_b*s51_2+re39*s57_3
0=-re32_f*s50_3+re32_b*s51_3+re39*s57_2
0=-re32_f*s50_4+re32_b*s51_4+re39*s57_1
0=-re32_f*s50_5+re32_b*s51_5+re39*s47_2
0=-re32_f*s50_6+re32_b*s51_6+re39*s47_1
0=-re32_b-re33_f+re32_f+re33_b
0=-re32_b*s51_1-re33_f*s51_1+re32_f*s50_1+re33_b*s52_1
0=-re32_b*s51_2-re33_f*s51_2+re32_f*s50_2+re33_b*s52_2
0=-re32_b*s51_3-re33_f*s51_3+re32_f*s50_3+re33_b*s52_3
0=-re32_b*s51_4-re33_f*s51_4+re32_f*s50_4+re33_b*s79_1
0=-re32_b*s51_5-re33_f*s51_5+re32_f*s50_5+re33_b*s52_4
0=-re32_b*s51_6-re33_f*s51_6+re32_f*s50_6+re33_b*s52_5
0=-re33_b-re34-re54+re33_f
0=-re33_b*s52_1-re34*s52_1-re54*s52_1+re33_f*s51_1
0=-re33_b*s52_2-re34*s52_2-re54*s52_2+re33_f*s51_2
0=-re33_b*s52_3-re34*s52_3-re54*s52_3+re33_f*s51_3
0=-re33_b*s52_4-re34*s52_4-re54*s52_4+re33_f*s51_5
0=-re33_b*s52_5-re34*s52_5-re54*s52_5+re33_f*s51_6
0=-re35_f+re34+re35_b
0=-re35_f*s53_1+re34*s52_2+re35_b*s54_1
0=-re35_f*s53_2+re34*s52_3+re35_b*s54_2
0=-re35_f*s53_3+re34*s52_4+re35_b*s54_3
0=-re35_f*s53_4+re34*s52_5+re35_b*s54_4
0=-re35_b-re36_f+re35_f+re36_b
0=-re35_b*s54_1-re36_f*s54_1+re35_f*s53_1+re36_b*s55_1
0=-re35_b*s54_2-re36_f*s54_2+re35_f*s53_2+re36_b*s55_2
0=-re35_b*s54_3-re36_f*s54_3+re35_f*s53_3+re36_b*s55_3
0=-re35_b*s54_4-re36_f*s54_4+re35_f*s53_4+re36_b*s55_4
0=-re36_b-re37_f+re36_f+re37_b
0=-re36_b*s55_1-re37_f*s55_1+re36_f*s54_1+re37_b*s56_1
0=-re36_b*s55_2-re37_f*s55_2+re36_f*s54_2+re37_b*s56_2
0=-re36_b*s55_3-re37_f*s55_3+re36_f*s54_3+re37_b*s56_3
0=-re36_b*s55_4-re37_f*s55_4+re36_f*s54_4+re37_b*s56_4
0=-re37_b-re38_f-re41_f-re42_f+re37_f+re38_b+re41_b+re42_b
0=-re37_b*s56_1-re38_f*s56_1-re41_f*s56_1-re42_f*s56_1+re37_f*s55_1+re38_b*s57_1+re41_b*s38_1+re42_b*s38_1
0=-re37_b*s56_2-re38_f*s56_2-re41_f*s56_2-re42_f*s56_2+re37_f*s55_2+re38_b*s57_2+re41_b*s38_2+re42_b*s38_2
0=-re37_b*s56_3-re38_f*s56_3-re41_f*s56_3-re42_f*s56_3+re37_f*s55_3+re38_b*s57_3+re41_b*s38_3+re42_b*s38_3
0=-re37_b*s56_4-re38_f*s56_4-re41_f*s56_4-re42_f*s56_4+re37_f*s55_4+re38_b*s57_4+re41_b*s79_1+re42_b*s79_1
0=-re38_b-re39-re40_b-re53+re38_f+re40_f
0=-re38_b*s57_1-re39*s57_1-re40_b*s57_1-re53*s57_1+re38_f*s56_1+re40_f*s38_1
0=-re38_b*s57_2-re39*s57_2-re40_b*s57_2-re53*s57_2+re38_f*s56_2+re40_f*s38_2
0=-re38_b*s57_3-re39*s57_3-re40_b*s57_3-re53*s57_3+re38_f*s56_3+re40_f*s38_3
0=-re38_b*s57_4-re39*s57_4-re40_b*s57_4-re53*s57_4+re38_f*s56_4+re40_f*s79_1
0=-re2-re8+re1
0=-re2*s72_1-re8*s72_1+re1_1
0=-re2*s72_2-re8*s72_2+re1_2
0=-re2*s72_3-re8*s72_3+re1_3
0=-re2*s72_4-re8*s72_4+re1_4
0=-re2*s72_5-re8*s72_5+re1_5
0=-re2*s72_6-re8*s72_6+re1_6
0=-re4-re5+re8
0=-re4*s73_1-re5*s73_1+re8*s72_1
0=-re4*s73_2-re5*s73_2+re8*s72_2
0=-re4*s73_3-re5*s73_3+re8*s72_3
0=-re4*s73_4-re5*s73_4+re8*s72_4
0=-re4*s73_5-re5*s73_5+re8*s72_5
0=-re4*s73_6-re5*s73_6+re8*s72_6
0=-re3+re2
0=-re3*s77_1+re2*s72_1
0=-re3*s77_2+re2*s72_2
0=-re3*s77_3+re2*s72_3
0=-re3*s77_4+re2*s72_4
0=-re3*s77_5+re2*s72_5
0=-re3*s77_6+re2*s72_6
0=-re6+re4
0=-re6*s78_1+re4*s73_1
0=-re6*s78_2+re4*s73_2
0=-re6*s78_3+re4*s73_3
0=-re6*s78_4+re4*s73_4
0=-re6*s78_5+re4*s73_5
0=-re6*s78_6+re4*s73_6
0=-re33_b-re40_f-re41_b-re42_b+re16+re30+re33_f+re34+re40_b+re41_f+re42_f
0=-re33_b*s79_1-re40_f*s79_1-re41_b*s79_1-re42_b*s79_1+re16*s4_1+re30*s38_1+re33_f*s51_4+re34*s52_1+re40_b*s57_4+re41_f*s56_4+re42_f*s56_4
