// Copyright (C) 2010 - DIGITEO - Michael Baudin
//
// This file must be used under the terms of the CeCILL.
// This source file is licensed as described in the file COPYING, which
// you should have received as part of this distribution.  The terms
// are also available at
// http://www.cecill.info/licences/Licence_CeCILL_V2-en.txt
// <-- JVM NOT MANDATORY -->
// <-- ENGLISH IMPOSED -->
X = [
0 0 0   0 0 0   0 0 0
0 0 0   0 0 0   5 3 0
9 0 0   0 3 7   0 0 0
0 0 2   3 0 1   0 9 6
0 4 7   6 9 0   1 8 0
0 0 6   7 8 5   0 0 0
0 5 0   0 2 0   9 0 3
0 3 0   9 0 0   6 0 8
8 0 0   0 1 0   4 7 0
];
[S, totalsol, score, depth] = sudoku_solvefast( X );
E = [6,7,3,1,5,8,2,4,9;  
4,1,8,2,6,9,5,3,7;   
9,2,5,4,3,7,8,6,1;   
5,8,2,3,4,1,7,9,6;   
3,4,7,6,9,2,1,8,5;   
1,9,6,7,8,5,3,2,4;   
7,5,4,8,2,6,9,1,3;   
2,3,1,9,7,4,6,5,8;   
8,6,9,5,1,3,4,7,2];
assert_checkequal(S,E);
assert_checkequal(totalsol,1);
assert_checkequal(score,49);
assert_checkequal(depth,1);
//
//
//
X = [
0 0 0   0 0 0   0 0 0
9 0 0   0 0 4   0 3 6
0 0 0   0 7 2   0 0 9
3 0 0   0 0 0   0 0 5
0 1 4   0 0 0   8 0 0
0 2 5   0 1 0   0 0 0
0 0 6   1 0 0   0 0 3
0 0 0   0 0 6   0 4 0
0 0 2   4 8 9   0 0 0
];
[S, totalsol, score, depth] = sudoku_solvefast( X );
E = [2,5,3,9,6,1,4,7,8;  
9,7,1,8,5,4,2,3,6;   
4,6,8,3,7,2,1,5,9;   
3,9,7,2,4,8,6,1,5;   
6,1,4,5,9,3,8,2,7;   
8,2,5,6,1,7,3,9,4;   
7,4,6,1,2,5,9,8,3;   
1,8,9,7,3,6,5,4,2;   
5,3,2,4,8,9,7,6,1];   
assert_checkequal(S,E);
assert_checkequal(totalsol,1);
assert_checkequal(score,152);
assert_checkequal(depth,1);
//
// An impossible sudoku
//
X = [
1 2 0    0 3 0    0 4 0
6 0 0    0 0 0    0 0 3
3 0 4    0 0 0    5 0 0
2 0 0    8 0 6    0 0 0
8 0 0    0 1 0    0 0 6
0 0 0    7 0 5    0 0 0
0 0 7    0 0 0    6 0 0
4 0 0    0 0 0    0 0 8
0 3 0    0 4 0    0 2 0
];
[S, totalsol, score, depth] = sudoku_solvefast( X );
assert_checkequal(S,[]);
assert_checkequal(totalsol,0);
//
// A difficult sudoku
//
X = [
0 2 0   0 3 0   0 4 0
6 0 0   0 0 0   0 0 3
0 0 4   0 0 0   5 0 0
0 0 0   8 0 6   0 0 0
8 0 0   0 1 0   0 0 6
0 0 0   7 0 5   0 0 0
0 0 7   0 0 0   6 0 0
4 0 0   0 0 0   0 0 8
0 3 0   0 4 0   0 2 0
];
[S, totalsol, score, depth] = sudoku_solvefast( X );
E = [9,2,5,6,3,1,8,4,7;  
6,1,8,5,7,4,2,9,3;   
3,7,4,9,8,2,5,6,1;   
7,4,9,8,2,6,1,3,5;   
8,5,2,4,1,3,9,7,6;   
1,6,3,7,9,5,4,8,2;   
2,8,7,3,5,9,6,1,4;   
4,9,1,2,6,7,3,5,8;   
5,3,6,1,4,8,7,2,9];   
assert_checkequal(S,E);
assert_checkequal(totalsol,1);
assert_checkequal(score,1694);
assert_checkequal(depth,2);
//
//
//
// A sudoku without solution
X = [
8 0 0   0 0 0   0 0 0
8 0 0   3 0 5   0 0 2
0 0 6   0 0 0   9 0 0
0 4 0   5 0 6   0 8 0
7 0 1   0 0 0   4 0 9
0 0 0   9 0 1   0 0 0
9 7 0   0 6 0   0 3 5
0 0 3   0 0 0   1 0 0
0 0 4   0 2 0   7 0 0
];
[S, totalsol, score, depth] = sudoku_solvefast( X );
assert_checkequal(S,[]);
assert_checkequal(totalsol,0);
//
//
//
// An extremely difficult sudoku
X = [
1 0 0   0 0 7   0 9 0
0 3 0   0 2 0   0 0 8
0 0 9   6 0 0   5 0 0
0 0 5   3 0 0   9 0 0
0 1 0   0 8 0   0 0 2
6 0 0   0 0 4   0 0 0
3 0 0   0 0 0   0 1 0
0 4 0   0 0 0   0 0 7
0 0 7   0 0 0   3 0 0
];
[S, totalsol, score, depth] = sudoku_solvefast( X );
E = [1,6,2,8,5,7,4,9,3;  
5,3,4,1,2,9,6,7,8;   
7,8,9,6,4,3,5,2,1;   
4,7,5,3,1,2,9,8,6;   
9,1,3,5,8,6,7,4,2;   
6,2,8,7,9,4,1,3,5;   
3,5,6,4,7,8,2,1,9;   
2,4,1,9,3,5,8,6,7;   
8,9,7,2,6,1,3,5,4];
assert_checkequal(S,E);
assert_checkequal(totalsol,1);
assert_checkequal(score,871727);
assert_checkequal(depth,10);
//
//
//
// A sudoku with 155 different solutions
X = [
0 0 0   0 0 7   0 9 0
0 3 0   0 2 0   0 0 8
0 0 9   6 0 0   5 0 0
0 0 5   3 0 0   9 0 0
0 1 0   0 8 0   0 0 2
6 0 0   0 0 4   0 0 0
3 0 0   0 0 0   0 1 0
0 4 0   0 0 0   0 0 7
0 0 7   0 0 0   3 0 0
];
[S, totalsol, score, depth] = sudoku_solvefast( X );
assert_checkequal(totalsol,155);
