// ====================================================================
// Copyright (C) 2011 - Digiteo - Michael Baudin
// 
// This file must be used under the terms of the CeCILL.
// This source file is licensed as described in the file COPYING, which
// you should have received as part of this distribution.  The terms
// are also available at    
// http://www.cecill.info/licences/Licence_CeCILL_V2-en.txt
// ====================================================================
// <-- JVM NOT MANDATORY -->
name = spilu_iluhubparname("ilud",1) // alpha
 name  =
 
 alpha   
name = spilu_iluhubparname("ilud",2) // drop
 name  =
 
 drop   
