<?xml version="1.0" encoding="UTF-8"?>
<!DOCTYPE svg PUBLIC '-//W3C//DTD SVG 1.0//EN'
          'http://www.w3.org/TR/2001/REC-SVG-20010904/DTD/svg10.dtd'>
<svg xmlns:xlink="http://www.w3.org/1999/xlink" style="fill-opacity:1; color-rendering:auto; color-interpolation:auto; text-rendering:auto; stroke:black; stroke-linecap:square; stroke-miterlimit:10; shape-rendering:auto; stroke-opacity:1; fill:black; stroke-dasharray:none; font-weight:normal; stroke-width:1; font-family:'Dialog'; font-style:normal; stroke-linejoin:miter; font-size:12px; stroke-dashoffset:0; image-rendering:auto;" width="611" height="444" xmlns="http://www.w3.org/2000/svg"
><!--Generated by Scilab with Batik SVG Generator--><defs id="genericDefs"
  /><g
  ><defs id="defs1"
    ><clipPath clipPathUnits="userSpaceOnUse" id="clipPath1"
      ><path d="M73.3154 82.1387 L537.6846 82.1387 L537.6846 210.9013 L73.3154 210.9013 L73.3154 82.1387 Z"
      /></clipPath
      ><clipPath clipPathUnits="userSpaceOnUse" id="clipPath2"
      ><path d="M73.3154 233.0987 L537.6846 233.0987 L537.6846 361.8613 L73.3154 361.8613 L73.3154 233.0987 Z"
      /></clipPath
      ><font horiz-adv-x="44.0" id="font1"
      ><font-face ascent="104.78516" descent="27.09961" units-per-em="100" style="font-style:normal; font-family:sans-serif; font-weight:normal;"
        /><missing-glyph horiz-adv-x="44.0" d="M39.4531 0 L4.8906 0 L4.8906 71.0938 L39.4531 71.0938 L39.4531 0 ZM36.8125 4.1094 L36.8125 66.9375 L23.4375 35.5469 L36.8125 4.1094 ZM7.5156 66.3594 L7.5156 4.6875 L20.6094 35.5469 L7.5156 66.3594 ZM9.4688 2.6406 L34.625 2.6406 L22.0156 32.2344 L9.4688 2.6406 ZM22.0156 38.875 L34.625 68.4531 L9.4688 68.4531 L22.0156 38.875 Z"
        /><glyph unicode="0" horiz-adv-x="56.0" d="M50.4844 30.3281 Q50.4844 14.4531 45.0703 6.7344 Q39.6562 -0.9844 28.125 -0.9844 Q16.75 -0.9844 11.2812 6.5625 Q5.8125 14.1094 5.6094 29.1094 L5.6094 41.1562 Q5.6094 56.8438 11.0312 64.4609 Q16.4531 72.0781 28.0312 72.0781 Q39.5 72.0781 44.9219 64.7266 Q50.3438 57.375 50.4844 42.0469 L50.4844 30.3281 ZM41.4531 42.6719 Q41.4531 54.1562 38.2344 59.4062 Q35.0156 64.6562 28.0312 64.6562 Q21.0938 64.6562 17.9219 59.4297 Q14.75 54.2031 14.6562 43.3594 L14.6562 28.9062 Q14.6562 17.3906 18 11.8906 Q21.3438 6.3906 28.125 6.3906 Q34.8125 6.3906 38.0625 11.5703 Q41.3125 16.75 41.4531 27.875 L41.4531 42.6719 Z"
        /><glyph unicode="2" horiz-adv-x="56.0" d="M52.4844 0 L5.9062 0 L5.9062 6.5 L30.5156 33.8438 Q35.9844 40.0469 38.0625 43.9219 Q40.1406 47.7969 40.1406 51.9531 Q40.1406 57.5156 36.7734 61.0859 Q33.4062 64.6562 27.7812 64.6562 Q21.0469 64.6562 17.3125 60.8203 Q13.5781 56.9844 13.5781 50.1406 L4.5469 50.1406 Q4.5469 59.9688 10.8672 66.0234 Q17.1875 72.0781 27.7812 72.0781 Q37.7031 72.0781 43.4609 66.875 Q49.2188 61.6719 49.2188 53.0312 Q49.2188 42.5312 35.8438 28.0312 L16.7969 7.375 L52.4844 7.375 L52.4844 0 Z"
        /><glyph unicode="-" horiz-adv-x="28.0" d="M25.6406 26.5156 L1.8125 26.5156 L1.8125 33.8906 L25.6406 33.8906 L25.6406 26.5156 Z"
        /><glyph unicode="1" horiz-adv-x="56.0" d="M35.5938 0 L26.5156 0 L26.5156 60.2031 L8.2969 53.5156 L8.2969 61.7188 L34.1875 71.4375 L35.5938 71.4375 L35.5938 0 Z"
        /><glyph unicode=")" horiz-adv-x="35.0" d="M27.6875 28.375 Q27.6875 17.4844 24.8281 7.5 Q21.9688 -2.4844 16.0859 -10.9375 Q10.2031 -19.3906 3.7656 -22.9531 L1.8594 -17.4375 Q9.375 -11.6719 13.9375 0.4609 Q18.5 12.5938 18.6094 27.3906 L18.6094 28.9531 Q18.6094 39.2031 16.4609 48.0234 Q14.3125 56.8438 10.4766 63.8203 Q6.6406 70.7969 1.8594 74.7031 L3.7656 80.2188 Q10.2031 76.6562 16.0391 68.3125 Q21.875 59.9688 24.7812 49.9062 Q27.6875 39.8438 27.6875 28.375 Z"
        /><glyph unicode="B" horiz-adv-x="62.0" d="M8.25 0 L8.25 71.0938 L31.5 71.0938 Q43.0625 71.0938 48.8984 66.3125 Q54.7344 61.5312 54.7344 52.1562 Q54.7344 47.1719 51.9062 43.3359 Q49.0781 39.5 44.1875 37.4062 Q49.9531 35.7969 53.2969 31.2812 Q56.6406 26.7656 56.6406 20.5156 Q56.6406 10.9375 50.4375 5.4688 Q44.2344 0 32.9062 0 L8.25 0 ZM17.625 33.25 L17.625 7.6719 L33.1094 7.6719 Q39.6562 7.6719 43.4375 11.0625 Q47.2188 14.4531 47.2188 20.4062 Q47.2188 33.25 33.25 33.25 L17.625 33.25 ZM17.625 40.7656 L31.7812 40.7656 Q37.9375 40.7656 41.625 43.8438 Q45.3125 46.9219 45.3125 52.2031 Q45.3125 58.0625 41.8984 60.7188 Q38.4844 63.375 31.5 63.375 L17.625 63.375 L17.625 40.7656 Z"
        /><glyph unicode="(" horiz-adv-x="34.0" d="M6.5 28.8594 Q6.5 39.8906 9.4531 50.0469 Q12.4062 60.2031 18.2656 68.5078 Q24.125 76.8125 30.4219 80.2188 L32.2812 74.2656 Q25.1406 68.7969 20.5781 57.5703 Q16.0156 46.3438 15.5781 32.4219 L15.5312 28.2656 Q15.5312 9.4219 22.4062 -4.4375 Q26.5625 -12.75 32.2812 -17.4375 L30.4219 -22.9531 Q23.9219 -19.3438 18.0156 -10.8438 Q6.5 5.7656 6.5 28.8594 Z"
        /><glyph unicode=" " horiz-adv-x="25.0" d=""
        /><glyph unicode="e" horiz-adv-x="53.0" d="M28.7656 -0.9844 Q18.0156 -0.9844 11.2812 6.0781 Q4.5469 13.1406 4.5469 24.9531 L4.5469 26.6094 Q4.5469 34.4688 7.5469 40.6484 Q10.5469 46.8281 15.9453 50.3203 Q21.3438 53.8125 27.6406 53.8125 Q37.9375 53.8125 43.6484 47.0234 Q49.3594 40.2344 49.3594 27.5938 L49.3594 23.8281 L13.5781 23.8281 Q13.7656 16.0156 18.1406 11.2031 Q22.5156 6.3906 29.25 6.3906 Q34.0312 6.3906 37.3516 8.3438 Q40.6719 10.2969 43.1719 13.5312 L48.6875 9.2344 Q42.0469 -0.9844 28.7656 -0.9844 ZM27.6406 46.3906 Q22.1719 46.3906 18.4609 42.4062 Q14.75 38.4219 13.875 31.25 L40.3281 31.25 L40.3281 31.9375 Q39.9375 38.8125 36.6172 42.6016 Q33.2969 46.3906 27.6406 46.3906 Z"
        /><glyph unicode="d" horiz-adv-x="56.0" d="M4.6406 26.8594 Q4.6406 39.0156 10.3984 46.4141 Q16.1562 53.8125 25.4844 53.8125 Q34.7656 53.8125 40.1875 47.4688 L40.1875 75 L49.2188 75 L49.2188 0 L40.9219 0 L40.4844 5.6719 Q35.0625 -0.9844 25.3906 -0.9844 Q16.2188 -0.9844 10.4297 6.5391 Q4.6406 14.0625 4.6406 26.1719 L4.6406 26.8594 ZM13.6719 25.8281 Q13.6719 16.8438 17.3828 11.7656 Q21.0938 6.6875 27.6406 6.6875 Q36.2344 6.6875 40.1875 14.4062 L40.1875 38.6719 Q36.1406 46.1406 27.7344 46.1406 Q21.0938 46.1406 17.3828 41.0156 Q13.6719 35.8906 13.6719 25.8281 Z"
        /><glyph unicode="u" horiz-adv-x="55.0" d="M39.4531 5.2188 Q34.1875 -0.9844 23.9688 -0.9844 Q15.5312 -0.9844 11.1094 3.9297 Q6.6875 8.8438 6.6406 18.4531 L6.6406 52.8281 L15.6719 52.8281 L15.6719 18.7031 Q15.6719 6.6875 25.4375 6.6875 Q35.7969 6.6875 39.2031 14.4062 L39.2031 52.8281 L48.25 52.8281 L48.25 0 L39.6562 0 L39.4531 5.2188 Z"
        /><glyph unicode="t" horiz-adv-x="33.0" d="M19.0938 65.625 L19.0938 52.8281 L28.9531 52.8281 L28.9531 45.8438 L19.0938 45.8438 L19.0938 13.0938 Q19.0938 9.9062 20.4141 8.3203 Q21.7344 6.7344 24.9062 6.7344 Q26.4688 6.7344 29.2031 7.3281 L29.2031 0 Q25.6406 -0.9844 22.2656 -0.9844 Q16.2188 -0.9844 13.1406 2.6797 Q10.0625 6.3438 10.0625 13.0938 L10.0625 45.8438 L0.4375 45.8438 L0.4375 52.8281 L10.0625 52.8281 L10.0625 65.625 L19.0938 65.625 Z"
        /><glyph unicode="i" horiz-adv-x="24.0" d="M16.6562 0 L7.625 0 L7.625 52.8281 L16.6562 52.8281 L16.6562 0 ZM6.8906 66.8438 Q6.8906 69.0469 8.2344 70.5625 Q9.5781 72.0781 12.2109 72.0781 Q14.8438 72.0781 16.2109 70.5625 Q17.5781 69.0469 17.5781 66.8516 Q17.5781 64.6562 16.2109 63.1875 Q14.8438 61.7188 12.2109 61.7188 Q9.5781 61.7188 8.2344 63.1875 Q6.8906 64.6562 6.8906 66.8438 Z"
        /><glyph unicode="n" horiz-adv-x="55.0" d="M15.375 52.8281 L15.6719 46.1875 Q21.7344 53.8125 31.5 53.8125 Q48.25 53.8125 48.3906 34.9062 L48.3906 0 L39.3594 0 L39.3594 34.9688 Q39.3125 40.6719 36.75 43.4062 Q34.1875 46.1406 28.7656 46.1406 Q24.3594 46.1406 21.0391 43.7969 Q17.7188 41.4531 15.875 37.6406 L15.875 0 L6.8438 0 L6.8438 52.8281 L15.375 52.8281 Z"
        /><glyph unicode="g" horiz-adv-x="56.0" d="M4.6875 26.8594 Q4.6875 39.2031 10.3984 46.5078 Q16.1094 53.8125 25.5312 53.8125 Q35.2031 53.8125 40.625 46.9688 L41.0625 52.8281 L49.3125 52.8281 L49.3125 1.2656 Q49.3125 -8.9844 43.2344 -14.8906 Q37.1562 -20.7969 26.9062 -20.7969 Q21.1875 -20.7969 15.7188 -18.3594 Q10.25 -15.9219 7.375 -11.6719 L12.0625 -6.25 Q17.875 -13.4219 26.2656 -13.4219 Q32.8594 -13.4219 36.5469 -9.7109 Q40.2344 -6 40.2344 0.7344 L40.2344 5.2812 Q34.8125 -0.9844 25.4375 -0.9844 Q16.1562 -0.9844 10.4219 6.4922 Q4.6875 13.9688 4.6875 26.8594 ZM13.7656 25.8281 Q13.7656 16.8906 17.4297 11.7891 Q21.0938 6.6875 27.6875 6.6875 Q36.2344 6.6875 40.2344 14.4531 L40.2344 38.5781 Q36.0781 46.1406 27.7812 46.1406 Q21.1875 46.1406 17.4766 41.0156 Q13.7656 35.8906 13.7656 25.8281 Z"
        /><glyph unicode="a" horiz-adv-x="54.0" d="M39.4531 0 Q38.6719 1.5625 38.1875 5.5625 Q31.8906 -0.9844 23.1406 -0.9844 Q15.3281 -0.9844 10.3281 3.4375 Q5.3281 7.8594 5.3281 14.6562 Q5.3281 22.9062 11.6016 27.4688 Q17.875 32.0312 29.25 32.0312 L38.0312 32.0312 L38.0312 36.1875 Q38.0312 40.9219 35.2031 43.7266 Q32.375 46.5312 26.8594 46.5312 Q22.0156 46.5312 18.75 44.0938 Q15.4844 41.6562 15.4844 38.1875 L6.3906 38.1875 Q6.3906 42.1406 9.2031 45.8281 Q12.0156 49.5156 16.8203 51.6641 Q21.625 53.8125 27.3906 53.8125 Q36.5312 53.8125 41.7031 49.2422 Q46.875 44.6719 47.0781 36.6719 L47.0781 12.3594 Q47.0781 5.0781 48.9219 0.7812 L48.9219 0 L39.4531 0 ZM24.4688 6.8906 Q28.7188 6.8906 32.5234 9.0859 Q36.3281 11.2812 38.0312 14.7969 L38.0312 25.6406 L30.9531 25.6406 Q14.3594 25.6406 14.3594 15.9219 Q14.3594 11.6719 17.1875 9.2812 Q20.0156 6.8906 24.4688 6.8906 Z"
        /><glyph unicode="M" horiz-adv-x="87.0" d="M20.3594 71.0938 L43.6094 13.0938 L66.8438 71.0938 L79 71.0938 L79 0 L69.625 0 L69.625 27.6875 L70.5156 57.5625 L47.1719 0 L39.9844 0 L16.7031 57.4219 L17.625 27.6875 L17.625 0 L8.25 0 L8.25 71.0938 L20.3594 71.0938 Z"
        /><glyph unicode="y" horiz-adv-x="47.0" d="M24.125 13.2344 L36.4219 52.8281 L46.0938 52.8281 L24.8594 -8.1562 Q19.9219 -21.3438 9.1875 -21.3438 L7.4688 -21.1875 L4.1094 -20.5625 L4.1094 -13.2344 L6.5469 -13.4219 Q11.1406 -13.4219 13.7031 -11.5703 Q16.2656 -9.7188 17.9219 -4.7812 L19.9219 0.5938 L1.0781 52.8281 L10.9375 52.8281 L24.125 13.2344 Z"
        /><glyph unicode="r" horiz-adv-x="34.0" d="M32.375 44.7344 Q30.3281 45.0625 27.9375 45.0625 Q19.0469 45.0625 15.875 37.5 L15.875 0 L6.8438 0 L6.8438 52.8281 L15.625 52.8281 L15.7656 46.7344 Q20.2188 53.8125 28.375 53.8125 Q31 53.8125 32.375 53.125 L32.375 44.7344 Z"
        /><glyph unicode="p" horiz-adv-x="56.0" d="M51.4688 25.8281 Q51.4688 13.7656 45.9531 6.3906 Q40.4375 -0.9844 31 -0.9844 Q21.3906 -0.9844 15.875 5.125 L15.875 -20.3125 L6.8438 -20.3125 L6.8438 52.8281 L15.0938 52.8281 L15.5312 46.9688 Q21.0469 53.8125 30.8594 53.8125 Q40.375 53.8125 45.9219 46.6328 Q51.4688 39.4531 51.4688 26.6562 L51.4688 25.8281 ZM42.4375 26.8594 Q42.4375 35.7969 38.625 40.9688 Q34.8125 46.1406 28.1719 46.1406 Q19.9688 46.1406 15.875 38.875 L15.875 13.625 Q19.9219 6.3906 28.2656 6.3906 Q34.7656 6.3906 38.6016 11.5469 Q42.4375 16.7031 42.4375 26.8594 Z"
        /><glyph unicode="s" horiz-adv-x="52.0" d="M37.5938 14.0156 Q37.5938 17.6719 34.8359 19.7031 Q32.0781 21.7344 25.2188 23.1953 Q18.3594 24.6562 14.3281 26.7109 Q10.2969 28.7656 8.375 31.5938 Q6.4531 34.4219 6.4531 38.3281 Q6.4531 44.8281 11.9453 49.3203 Q17.4375 53.8125 25.9844 53.8125 Q34.9688 53.8125 40.5547 49.1719 Q46.1406 44.5312 46.1406 37.3125 L37.0625 37.3125 Q37.0625 41.0156 33.9141 43.7031 Q30.7656 46.3906 25.9844 46.3906 Q21.0469 46.3906 18.2656 44.2422 Q15.4844 42.0938 15.4844 38.625 Q15.4844 35.3594 18.0703 33.6953 Q20.6562 32.0312 27.4219 30.5156 Q34.1875 29 38.3828 26.9062 Q42.5781 24.8125 44.6016 21.8516 Q46.625 18.8906 46.625 14.6562 Q46.625 7.5625 40.9609 3.2891 Q35.2969 -0.9844 26.2656 -0.9844 Q19.9219 -0.9844 15.0391 1.2656 Q10.1562 3.5156 7.3984 7.5469 Q4.6406 11.5781 4.6406 16.2656 L13.6719 16.2656 Q13.9219 11.7188 17.3125 9.0547 Q20.7031 6.3906 26.2656 6.3906 Q31.3906 6.3906 34.4922 8.4688 Q37.5938 10.5469 37.5938 14.0156 Z"
        /><glyph unicode="o" horiz-adv-x="57.0" d="M4.4375 26.9062 Q4.4375 34.6719 7.4922 40.875 Q10.5469 47.0781 15.9922 50.4453 Q21.4375 53.8125 28.4219 53.8125 Q39.2031 53.8125 45.875 46.3438 Q52.5469 38.875 52.5469 26.4688 L52.5469 25.8281 Q52.5469 18.1094 49.5859 11.9844 Q46.625 5.8594 41.1328 2.4375 Q35.6406 -0.9844 28.5156 -0.9844 Q17.7812 -0.9844 11.1094 6.4922 Q4.4375 13.9688 4.4375 26.2656 L4.4375 26.9062 ZM13.5312 25.8281 Q13.5312 17.0469 17.6094 11.7188 Q21.6875 6.3906 28.5156 6.3906 Q35.4062 6.3906 39.4531 11.7891 Q43.5 17.1875 43.5 26.9062 Q43.5 35.5938 39.375 40.9922 Q35.25 46.3906 28.4219 46.3906 Q21.7344 46.3906 17.6328 41.0703 Q13.5312 35.75 13.5312 25.8281 Z"
        /><glyph unicode="l" horiz-adv-x="24.0" d="M16.6562 0 L7.625 0 L7.625 75 L16.6562 75 L16.6562 0 Z"
        /><glyph unicode="C" horiz-adv-x="65.0" d="M60.5469 22.5625 Q59.2344 11.2812 52.2266 5.1484 Q45.2188 -0.9844 33.5938 -0.9844 Q21 -0.9844 13.4062 8.0547 Q5.8125 17.0938 5.8125 32.2344 L5.8125 39.0625 Q5.8125 48.9688 9.3516 56.4922 Q12.8906 64.0156 19.3828 68.0469 Q25.875 72.0781 34.4219 72.0781 Q45.75 72.0781 52.5859 65.75 Q59.4219 59.4219 60.5469 48.25 L51.125 48.25 Q49.9062 56.7344 45.8281 60.5469 Q41.75 64.3594 34.4219 64.3594 Q25.4375 64.3594 20.3359 57.7188 Q15.2344 51.0781 15.2344 38.8125 L15.2344 31.9375 Q15.2344 20.3594 20.0703 13.5234 Q24.9062 6.6875 33.5938 6.6875 Q41.4062 6.6875 45.5781 10.2266 Q49.75 13.7656 51.125 22.5625 L60.5469 22.5625 Z"
        /><glyph unicode="z" horiz-adv-x="50.0" d="M15.3281 7.375 L46.2344 7.375 L46.2344 0 L4.2969 0 L4.2969 6.6406 L33.4531 45.3594 L4.7344 45.3594 L4.7344 52.8281 L44.7812 52.8281 L44.7812 46.4375 L15.3281 7.375 Z"
        /><glyph unicode="H" horiz-adv-x="71.0" d="M62.8906 0 L53.4688 0 L53.4688 32.8594 L17.625 32.8594 L17.625 0 L8.25 0 L8.25 71.0938 L17.625 71.0938 L17.625 40.5312 L53.4688 40.5312 L53.4688 71.0938 L62.8906 71.0938 L62.8906 0 Z"
        /><glyph unicode="3" horiz-adv-x="56.0" d="M19.0469 39.9375 L25.8281 39.9375 Q32.2344 40.0469 35.8906 43.3125 Q39.5469 46.5781 39.5469 52.1562 Q39.5469 64.6562 27.0938 64.6562 Q21.2344 64.6562 17.75 61.3047 Q14.2656 57.9531 14.2656 52.4375 L5.2188 52.4375 Q5.2188 60.8906 11.3984 66.4844 Q17.5781 72.0781 27.0938 72.0781 Q37.1562 72.0781 42.8672 66.75 Q48.5781 61.4219 48.5781 51.9531 Q48.5781 47.3125 45.5781 42.9688 Q42.5781 38.625 37.4062 36.4688 Q43.2656 34.625 46.4609 30.3281 Q49.6562 26.0312 49.6562 19.8281 Q49.6562 10.25 43.4062 4.6328 Q37.1562 -0.9844 27.1484 -0.9844 Q17.1406 -0.9844 10.8672 4.4375 Q4.5938 9.8594 4.5938 18.75 L13.6719 18.75 Q13.6719 13.1406 17.3359 9.7656 Q21 6.3906 27.1562 6.3906 Q33.6875 6.3906 37.1562 9.8125 Q40.625 13.2344 40.625 19.625 Q40.625 25.8281 36.8203 29.1484 Q33.0156 32.4688 25.8281 32.5625 L19.0469 32.5625 L19.0469 39.9375 Z"
        /><glyph unicode="9" horiz-adv-x="56.0" d="M40.5312 31.25 Q37.7031 27.875 33.7656 25.8281 Q29.8281 23.7812 25.1406 23.7812 Q19 23.7812 14.4297 26.8047 Q9.8594 29.8281 7.375 35.3281 Q4.8906 40.8281 4.8906 47.4688 Q4.8906 54.5938 7.5938 60.3047 Q10.2969 66.0156 15.2812 69.0469 Q20.2656 72.0781 26.9062 72.0781 Q37.4531 72.0781 43.5312 64.1875 Q49.6094 56.2969 49.6094 42.6719 L49.6094 40.0469 Q49.6094 19.2812 41.4062 9.7422 Q33.2031 0.2031 16.6562 -0.0469 L14.8906 -0.0469 L14.8906 7.5625 L16.7969 7.5625 Q27.9844 7.7656 33.9844 13.4062 Q39.9844 19.0469 40.5312 31.25 ZM26.6094 31.25 Q31.1562 31.25 34.9844 34.0312 Q38.8125 36.8125 40.5781 40.9219 L40.5781 44.5312 Q40.5781 53.4219 36.7188 58.9844 Q32.8594 64.5469 26.9531 64.5469 Q21 64.5469 17.3828 59.9844 Q13.7656 55.4219 13.7656 47.9531 Q13.7656 40.6719 17.2578 35.9609 Q20.75 31.25 26.6094 31.25 Z"
        /><glyph unicode="8" horiz-adv-x="56.0" d="M49.0312 52.5469 Q49.0312 47.2188 46.2188 43.0703 Q43.4062 38.9219 38.625 36.5781 Q44.1875 34.1875 47.4375 29.5938 Q50.6875 25 50.6875 19.1875 Q50.6875 9.9688 44.4609 4.4922 Q38.2344 -0.9844 28.0781 -0.9844 Q17.8281 -0.9844 11.6484 4.5156 Q5.4688 10.0156 5.4688 19.1875 Q5.4688 24.9531 8.6172 29.5938 Q11.7656 34.2344 17.3281 36.625 Q12.5938 38.9688 9.8594 43.1172 Q7.125 47.2656 7.125 52.5469 Q7.125 61.5312 12.8906 66.8047 Q18.6562 72.0781 28.0781 72.0781 Q37.4531 72.0781 43.2422 66.8047 Q49.0312 61.5312 49.0312 52.5469 ZM41.6562 19.3906 Q41.6562 25.3438 37.8672 29.1016 Q34.0781 32.8594 27.9766 32.8594 Q21.875 32.8594 18.1875 29.1484 Q14.5 25.4375 14.5 19.3828 Q14.5 13.3281 18.0938 9.8594 Q21.6875 6.3906 28.0781 6.3906 Q34.4219 6.3906 38.0391 9.8828 Q41.6562 13.375 41.6562 19.3906 ZM28.0781 64.6562 Q22.75 64.6562 19.4531 61.3594 Q16.1562 58.0625 16.1562 52.3906 Q16.1562 46.9688 19.4062 43.625 Q22.6562 40.2812 28.0781 40.2812 Q33.5 40.2812 36.7422 43.625 Q39.9844 46.9688 39.9844 52.3906 Q39.9844 57.8125 36.6172 61.2344 Q33.25 64.6562 28.0781 64.6562 Z"
        /><glyph unicode="." horiz-adv-x="26.0" d="M7.0312 4.7344 Q7.0312 7.0781 8.4219 8.6406 Q9.8125 10.2031 12.5938 10.2031 Q15.375 10.2031 16.8203 8.6406 Q18.2656 7.0781 18.2656 4.7344 Q18.2656 2.4844 16.8203 0.9766 Q15.375 -0.5312 12.5938 -0.5312 Q9.8125 -0.5312 8.4219 0.9766 Q7.0312 2.4844 7.0312 4.7344 Z"
        /><glyph unicode=":" horiz-adv-x="24.0" d="M7.0312 4.7344 Q7.0312 7.0781 8.4219 8.6406 Q9.8125 10.2031 12.5938 10.2031 Q15.375 10.2031 16.8203 8.6406 Q18.2656 7.0781 18.2656 4.7344 Q18.2656 2.4844 16.8203 0.9766 Q15.375 -0.5312 12.5938 -0.5312 Q9.8125 -0.5312 8.4219 0.9766 Q7.0312 2.4844 7.0312 4.7344 ZM7.0312 47.7344 Q7.0312 50.0781 8.4219 51.6406 Q9.8125 53.2031 12.5938 53.2031 Q15.375 53.2031 16.8203 51.6406 Q18.2656 50.0781 18.2656 47.7344 Q18.2656 45.4844 16.8203 43.9766 Q15.375 42.4688 12.5938 42.4688 Q9.8125 42.4688 8.4219 43.9766 Q7.0312 45.4844 7.0312 47.7344 Z"
        /><glyph unicode="c" horiz-adv-x="52.0" d="M28.0312 6.3906 Q32.8594 6.3906 36.4766 9.3203 Q40.0938 12.25 40.4844 16.6562 L49.0312 16.6562 Q48.7812 12.1094 45.8984 8.0078 Q43.0156 3.9062 38.2109 1.4609 Q33.4062 -0.9844 28.0312 -0.9844 Q17.2344 -0.9844 10.8672 6.2188 Q4.5 13.4219 4.5 25.9219 L4.5 27.4375 Q4.5 35.1562 7.3281 41.1641 Q10.1562 47.1719 15.4531 50.4922 Q20.75 53.8125 27.9844 53.8125 Q36.8594 53.8125 42.75 48.4922 Q48.6406 43.1719 49.0312 34.6719 L40.4844 34.6719 Q40.0938 39.7969 36.6016 43.0938 Q33.1094 46.3906 27.9844 46.3906 Q21.0938 46.3906 17.3125 41.4297 Q13.5312 36.4688 13.5312 27.0938 L13.5312 25.3906 Q13.5312 16.2656 17.2891 11.3281 Q21.0469 6.3906 28.0312 6.3906 Z"
        /><glyph unicode="q" horiz-adv-x="57.0" d="M4.6406 26.8594 Q4.6406 39.3125 10.3516 46.5625 Q16.0625 53.8125 25.6875 53.8125 Q35.0625 53.8125 40.4844 47.5156 L40.875 52.8281 L49.1719 52.8281 L49.1719 -20.3125 L40.1406 -20.3125 L40.1406 4.8906 Q34.6719 -0.9844 25.5938 -0.9844 Q16.0156 -0.9844 10.3281 6.4688 Q4.6406 13.9219 4.6406 26.2188 L4.6406 26.8594 ZM13.6719 25.8281 Q13.6719 16.75 17.5078 11.5703 Q21.3438 6.3906 27.8281 6.3906 Q35.8906 6.3906 40.1406 13.5312 L40.1406 39.4062 Q35.8438 46.3906 27.9375 46.3906 Q21.3906 46.3906 17.5312 41.1875 Q13.6719 35.9844 13.6719 25.8281 Z"
        /><glyph unicode="F" horiz-adv-x="55.0" d="M47.4688 31.3906 L17.625 31.3906 L17.625 0 L8.25 0 L8.25 71.0938 L52.2969 71.0938 L52.2969 63.375 L17.625 63.375 L17.625 39.0625 L47.4688 39.0625 L47.4688 31.3906 Z"
        /><glyph unicode="4" horiz-adv-x="56.0" d="M44.0469 23.875 L53.9062 23.875 L53.9062 16.5 L44.0469 16.5 L44.0469 0 L34.9688 0 L34.9688 16.5 L2.5938 16.5 L2.5938 21.8281 L34.4219 71.0938 L44.0469 71.0938 L44.0469 23.875 ZM12.8438 23.875 L34.9688 23.875 L34.9688 58.7344 L33.8906 56.7812 L12.8438 23.875 Z"
        /><glyph unicode="G" horiz-adv-x="68.0" d="M60.75 9.3281 Q57.125 4.1562 50.6562 1.5859 Q44.1875 -0.9844 35.5938 -0.9844 Q26.9062 -0.9844 20.1641 3.0938 Q13.4219 7.1719 9.7422 14.6953 Q6.0625 22.2188 5.9531 32.125 L5.9531 38.3281 Q5.9531 54.3906 13.4531 63.2344 Q20.9531 72.0781 34.5156 72.0781 Q45.6562 72.0781 52.4453 66.3828 Q59.2344 60.6875 60.75 50.25 L51.375 50.25 Q48.7344 64.3594 34.5781 64.3594 Q25.1406 64.3594 20.2891 57.7422 Q15.4375 51.125 15.375 38.5781 L15.375 32.7656 Q15.375 20.7969 20.8438 13.7422 Q26.3125 6.6875 35.6406 6.6875 Q40.9219 6.6875 44.875 7.8594 Q48.8281 9.0312 51.4219 11.8125 L51.4219 27.7812 L34.9688 27.7812 L34.9688 35.4062 L60.75 35.4062 L60.75 9.3281 Z"
        /><glyph unicode="b" horiz-adv-x="56.0" d="M51.5625 25.8281 Q51.5625 13.7188 46 6.3672 Q40.4375 -0.9844 31.0625 -0.9844 Q21.0469 -0.9844 15.5781 6.1094 L15.1406 0 L6.8438 0 L6.8438 75 L15.875 75 L15.875 47.0156 Q21.3438 53.8125 30.9609 53.8125 Q40.5781 53.8125 46.0703 46.5391 Q51.5625 39.2656 51.5625 26.6094 L51.5625 25.8281 ZM42.5312 26.8594 Q42.5312 36.0781 38.9688 41.1094 Q35.4062 46.1406 28.7188 46.1406 Q19.7812 46.1406 15.875 37.8438 L15.875 14.9844 Q20.0156 6.6875 28.8125 6.6875 Q35.2969 6.6875 38.9141 11.7188 Q42.5312 16.75 42.5312 26.8594 Z"
        /><glyph unicode="," horiz-adv-x="20.0" d="M6.5469 -14.1562 L1.4219 -10.6406 Q6 -4.25 6.2031 2.5469 L6.2031 10.6875 L15.0469 10.6875 L15.0469 3.6094 Q15.0469 -1.3125 12.625 -6.25 Q10.2031 -11.1875 6.5469 -14.1562 Z"
        /><glyph unicode="m" horiz-adv-x="88.0" d="M15.3281 52.8281 L15.5781 46.9688 Q21.3906 53.8125 31.25 53.8125 Q42.3281 53.8125 46.3438 45.3125 Q48.9688 49.125 53.1953 51.4688 Q57.4219 53.8125 63.1875 53.8125 Q80.5625 53.8125 80.8594 35.4062 L80.8594 0 L71.8281 0 L71.8281 34.8594 Q71.8281 40.5312 69.2422 43.3359 Q66.6562 46.1406 60.5469 46.1406 Q55.5156 46.1406 52.1953 43.1406 Q48.875 40.1406 48.3438 35.0625 L48.3438 0 L39.2656 0 L39.2656 34.625 Q39.2656 46.1406 27.9844 46.1406 Q19.0938 46.1406 15.8281 38.5781 L15.8281 0 L6.7812 0 L6.7812 52.8281 L15.3281 52.8281 Z"
        /><glyph unicode="f" horiz-adv-x="35.0" d="M11.2812 0 L11.2812 45.8438 L2.9375 45.8438 L2.9375 52.8281 L11.2812 52.8281 L11.2812 58.25 Q11.2812 66.75 15.8203 71.3906 Q20.3594 76.0312 28.6562 76.0312 Q31.7812 76.0312 34.8594 75.2031 L34.375 67.875 Q32.0781 68.3125 29.5 68.3125 Q25.0938 68.3125 22.7031 65.75 Q20.3125 63.1875 20.3125 58.4062 L20.3125 52.8281 L31.5938 52.8281 L31.5938 45.8438 L20.3125 45.8438 L20.3125 0 L11.2812 0 Z"
        /><glyph unicode="6" horiz-adv-x="56.0" d="M41.3594 71.1406 L41.3594 63.4844 L39.7031 63.4844 Q29.1562 63.2812 22.9062 57.2266 Q16.6562 51.1719 15.6719 40.1875 Q21.2969 46.625 31 46.625 Q40.2812 46.625 45.8281 40.0859 Q51.375 33.5469 51.375 23.1875 Q51.375 12.2031 45.3906 5.6094 Q39.4062 -0.9844 29.3438 -0.9844 Q19.1406 -0.9844 12.7969 6.8594 Q6.4531 14.7031 6.4531 27.0469 L6.4531 30.5156 Q6.4531 50.1406 14.8203 60.5234 Q23.1875 70.9062 39.75 71.1406 L41.3594 71.1406 ZM29.5 39.1094 Q24.8594 39.1094 20.9531 36.3281 Q17.0469 33.5469 15.5312 29.3438 L15.5312 26.0312 Q15.5312 17.2344 19.4844 11.8672 Q23.4375 6.5 29.3438 6.5 Q35.4531 6.5 38.9453 10.9922 Q42.4375 15.4844 42.4375 22.75 Q42.4375 30.0781 38.8984 34.5938 Q35.3594 39.1094 29.5 39.1094 Z"
        /><glyph unicode="7" horiz-adv-x="56.0" d="M51.8125 66.0156 L22.3594 0 L12.8906 0 L42.2344 63.6719 L3.7656 63.6719 L3.7656 71.0938 L51.8125 71.0938 L51.8125 66.0156 Z"
        /><glyph unicode="h" horiz-adv-x="55.0" d="M15.875 46.4375 Q21.875 53.8125 31.5 53.8125 Q48.25 53.8125 48.3906 34.9062 L48.3906 0 L39.3594 0 L39.3594 34.9688 Q39.3125 40.6719 36.75 43.4062 Q34.1875 46.1406 28.7656 46.1406 Q24.3594 46.1406 21.0391 43.7969 Q17.7188 41.4531 15.875 37.6406 L15.875 0 L6.8438 0 L6.8438 75 L15.875 75 L15.875 46.4375 Z"
        /><glyph unicode="P" horiz-adv-x="63.0" d="M17.625 27.8281 L17.625 0 L8.25 0 L8.25 71.0938 L34.4688 71.0938 Q46.1406 71.0938 52.7578 65.1406 Q59.375 59.1875 59.375 49.3594 Q59.375 39.0156 52.9062 33.4219 Q46.4375 27.8281 34.375 27.8281 L17.625 27.8281 ZM17.625 35.5 L34.4688 35.5 Q42 35.5 46 39.0391 Q50 42.5781 50 49.2656 Q50 55.6094 46 59.4219 Q42 63.2344 35.0156 63.375 L17.625 63.375 L17.625 35.5 Z"
      /></font
    ></defs
    ><g style="fill:rgb(211,211,211); text-rendering:optimizeLegibility; stroke:rgb(211,211,211);"
    ><rect x="0" width="611" height="444" y="0" style="stroke:none;"
    /></g
    ><g style="stroke-linecap:butt; fill:white; text-rendering:geometricPrecision; stroke-linejoin:bevel; shape-rendering:crispEdges; stroke:white; stroke-width:0;"
    ><path style="stroke:none;" d="M537.68 82.14 L537.68 210.9 L73.32 82.14 Z"
      /><path style="stroke:none;" d="M537.68 210.9 L73.32 210.9 L73.32 82.14 Z"
      /><path style="stroke:none;" d="M537.68 82.14 L537.68 210.9 L537.68 210.9 Z"
      /><path style="stroke:none;" d="M73.32 82.14 L73.32 210.9 L73.32 210.9 Z"
      /><path style="stroke:none;" d="M537.68 82.14 L537.68 210.9 L73.32 82.14 Z"
      /><path style="stroke:none;" d="M537.68 210.9 L73.32 210.9 L73.32 82.14 Z"
      /><path style="stroke:none;" d="M537.68 82.14 L537.68 82.14 L537.68 210.9 Z"
      /><path style="stroke:none;" d="M73.32 82.14 L73.32 82.14 L73.32 210.9 Z"
      /><path style="stroke:none;" d="M537.68 82.14 L73.32 82.14 L537.68 82.14 Z"
      /><path style="stroke:none;" d="M73.32 82.14 L73.32 82.14 L537.68 82.14 Z"
      /><path style="stroke:none;" d="M537.68 210.9 L73.32 210.9 L537.68 210.9 Z"
      /><path style="stroke:none;" d="M73.32 210.9 L73.32 210.9 L537.68 210.9 Z"
      /><path style="stroke:none;" d="M537.68 233.1 L537.68 361.86 L73.32 233.1 Z"
      /><path style="stroke:none;" d="M537.68 361.86 L73.32 361.86 L73.32 233.1 Z"
      /><path style="stroke:none;" d="M537.68 233.1 L537.68 361.86 L537.68 361.86 Z"
      /><path style="stroke:none;" d="M73.32 233.1 L73.32 361.86 L73.32 361.86 Z"
    /></g
    ><g style="stroke-linecap:butt; text-rendering:geometricPrecision; shape-rendering:crispEdges;"
    ><path style="fill:none;" d="M73.32 210.9 L73.32 216.9"
      /><path style="fill:none;" d="M139.6572 210.9 L139.6572 216.9"
      /><path style="fill:none;" d="M205.9943 210.9 L205.9943 216.9"
      /><path style="fill:none;" d="M272.3314 210.9 L272.3314 216.9"
      /><path style="fill:none;" d="M338.6686 210.9 L338.6686 216.9"
      /><path style="fill:none;" d="M405.0057 210.9 L405.0057 216.9"
      /><path style="fill:none;" d="M471.3429 210.9 L471.3429 216.9"
      /><path style="fill:none;" d="M73.32 210.9 L73.32 213.9"
      /><path style="fill:none;" d="M122.4335 210.9 L122.4335 213.9"
      /><path style="fill:none;" d="M139.6572 210.9 L139.6572 213.9"
      /><path style="fill:none;" d="M188.7707 210.9 L188.7707 213.9"
      /><path style="fill:none;" d="M205.9943 210.9 L205.9943 213.9"
      /><path style="fill:none;" d="M255.1078 210.9 L255.1078 213.9"
      /><path style="fill:none;" d="M272.3314 210.9 L272.3314 213.9"
      /><path style="fill:none;" d="M321.445 210.9 L321.445 213.9"
      /><path style="fill:none;" d="M338.6686 210.9 L338.6686 213.9"
      /><path style="fill:none;" d="M387.7821 210.9 L387.7821 213.9"
      /><path style="fill:none;" d="M405.0057 210.9 L405.0057 213.9"
      /><path style="fill:none;" d="M454.1193 210.9 L454.1193 213.9"
      /><path style="fill:none;" d="M471.3429 210.9 L471.3429 213.9"
      /><path style="fill:none;" d="M537.68 210.9 L73.32 210.9"
    /></g
    ><g transform="translate(57.32,74.64)" style="font-size:10px; stroke-linecap:butt; text-rendering:geometricPrecision; font-family:sans-serif; stroke-linejoin:bevel; stroke-width:0;"
    ><text x="-0.5625" xml:space="preserve" y="10.4785" style="stroke:none;"
      >0</text
    ></g
    ><g transform="translate(42.32,176.9249)" style="font-size:10px; stroke-linecap:butt; text-rendering:geometricPrecision; font-family:sans-serif; stroke-linejoin:bevel; stroke-width:0;"
    ><text x="-0.1875" xml:space="preserve" y="10.4785" style="stroke:none;"
      >-200</text
    ></g
    ><g transform="translate(42.32,125.7824)" style="font-size:10px; stroke-linecap:butt; text-rendering:geometricPrecision; font-family:sans-serif; stroke-linejoin:bevel; stroke-width:0;"
    ><text x="-0.1875" xml:space="preserve" y="10.4785" style="stroke:none;"
      >-100</text
    ></g
    ><g style="text-rendering:geometricPrecision; font-size:10px; shape-rendering:crispEdges; font-family:sans-serif; stroke-linecap:butt;"
    ><path style="fill:none;" d="M73.32 184.4249 L67.32 184.4249"
      /><path style="fill:none;" d="M73.32 133.2824 L67.32 133.2824"
      /><path style="fill:none;" d="M73.32 82.14 L67.32 82.14"
      /><path style="fill:none;" d="M73.32 209.9961 L70.32 209.9961"
      /><path style="fill:none;" d="M73.32 184.4249 L70.32 184.4249"
      /><path style="fill:none;" d="M73.32 158.8537 L70.32 158.8537"
      /><path style="fill:none;" d="M73.32 133.2824 L70.32 133.2824"
      /><path style="fill:none;" d="M73.32 107.7112 L70.32 107.7112"
      /><path style="fill:none;" d="M73.32 82.14 L70.32 82.14"
      /><path style="fill:none;" d="M73.32 82.14 L73.32 210.9"
      /><text x="1.1719" y="12.4785" transform="translate(39.32,146.52) rotate(270) translate(-36.5,-19)" style="stroke-linejoin:bevel; shape-rendering:auto; stroke:none; stroke-width:0;" xml:space="preserve"
      >Magnitude (dB)</text
    ></g
    ><g style="stroke-linecap:butt; font-size:10px; fill:rgb(0,208,0); text-rendering:geometricPrecision; font-family:sans-serif; shape-rendering:crispEdges; stroke:rgb(0,208,0);"
    ><path d="M73.32 82.14 L78.0105 82.14 L85.5801 82.14 L96.5247 82.14 L110.6381 82.14 L127.1628 82.14 L145.242 82.14 L156.2646 82.14 L164.2177 82.14 L170.4435 82.14 L175.56 82.14 L179.9035 82.14 L183.6771 82.14 L187.0132 82.14 L190.0027 82.14 L192.711 82.14 L195.1864 82.14 L197.4659 82.14 L201.5461 82.14 L205.1194 82.14 L208.298 82.14 L211.1606 82.14 L213.7642 82.14 L216.1519 82.14 L218.3568 82.14 L220.4049 82.1401 L222.317 82.1401 L224.11 82.1401 L225.798 82.1401 L226.6063 82.1401 L227.3925 82.1401 L228.1578 82.1401 L228.9034 82.1401 L229.6301 82.1401 L230.3389 82.1401 L231.0308 82.1401 L231.7064 82.1401 L232.3665 82.1401 L233.0118 82.1401 L233.643 82.1401 L234.2607 82.1401 L234.8654 82.1401 L235.4576 82.1401 L236.0379 82.1402 L236.6068 82.1402 L237.1647 82.1402 L237.7119 82.1402 L238.249 82.1402 L238.7762 82.1402 L239.294 82.1402 L239.8026 82.1402 L240.3024 82.1402 L241.2767 82.1402 L242.2191 82.1402 L243.1317 82.1402 L244.0162 82.1403 L244.8744 82.1403 L245.7078 82.1403 L246.5177 82.1403 L247.3055 82.1403 L248.0723 82.1403 L248.8193 82.1404 L249.5473 82.1404 L250.2574 82.1404 L250.9505 82.1404 L251.6272 82.1404 L252.2884 82.1405 L252.9348 82.1405 L253.567 82.1405 L254.1856 82.1405 L254.7913 82.1405 L255.3844 82.1406 L255.9656 82.1406 L256.5353 82.1406 L257.0939 82.1406 L257.6419 82.1407 L258.1797 82.1407 L258.7077 82.1407 L259.2261 82.1407 L259.7354 82.1408 L260.2358 82.1408 L260.7277 82.1408 L261.2113 82.1409 L261.6869 82.1409 L262.6152 82.1409 L263.5146 82.141 L264.3867 82.1411 L265.2332 82.1411 L266.0556 82.1412 L266.8551 82.1413 L267.633 82.1413 L268.3905 82.1414 L269.1286 82.1415 L269.8482 82.1416 L270.5503 82.1416 L271.2357 82.1417 L272.5594 82.1419 L273.825 82.1421 L275.0373 82.1422 L276.2006 82.1424 L277.3188 82.1426 L278.3952 82.1428 L279.4328 82.143 L280.4343 82.1432 L282.3387 82.1437 L284.1249 82.1442 L285.8068 82.1447 L287.3959 82.1453 L288.9019 82.1458 L290.3331 82.1465 L292.9984 82.1478 L295.4379 82.1492 L297.6868 82.1508 L299.7728 82.1525 L303.5399 82.1562 L306.871 82.1604 L312.5615 82.1704 L317.3112 82.1823 L321.3876 82.1963 L324.9581 82.2124 L328.1345 82.2306 L330.9951 82.2509 L333.5973 82.2735 L335.9837 82.2983 L338.1875 82.3254 L340.2346 82.3549 L342.1459 82.3869 L343.9382 82.4214 L345.6255 82.4585 L347.2194 82.4983 L348.7298 82.5409 L350.1649 82.5864 L351.5319 82.6348 L352.8369 82.6864 L354.0854 82.7412 L355.2821 82.7994 L356.431 82.861 L357.5358 82.9263 L358.5999 82.9953 L359.626 83.0683 L360.6168 83.1454 L361.5747 83.2268 L362.5017 83.3127 L363.3999 83.4033 L364.2709 83.4987 L365.1164 83.5993 L365.9377 83.7052 L366.7362 83.8167 L367.5133 83.9342 L368.2699 84.0579 L369.0071 84.1881 L369.726 84.3252 L370.4274 84.4695 L371.1121 84.6216 L371.7809 84.7818 L372.4345 84.9507 L373.0736 85.1288 L373.6989 85.3168 L374.3108 85.5154 L374.91 85.7254 L375.4971 85.9478 L376.0724 86.1835 L376.6364 86.434 L377.1896 86.7005 L377.7324 86.9849 L378.2652 87.2892 L378.7882 87.6159 L379.302 87.9679 L379.8067 88.3491 L380.3028 88.7641 L380.7904 89.219 L381.27 89.7215 L381.7417 90.282 L382.2058 90.9146 L382.6625 91.6389 L383.1121 92.4825 L383.5548 93.4836 L383.9908 94.6865 L384.4203 96.0847 L384.8435 97.2997 L385.2606 97.2383 L385.6717 96.0191 L386.077 94.7008 L386.4767 93.5867 L387.2598 91.9043 L388.0222 90.6923 L388.765 89.7634 L389.4891 89.0196 L390.1955 88.4053 L390.8849 87.8866 L391.5582 87.4411 L392.2162 87.0534 L392.8594 86.7123 L393.4886 86.4098 L394.1044 86.1394 L394.7072 85.8963 L395.2978 85.6766 L395.8764 85.477 L396.4437 85.295 L397 85.1285 L397.5457 84.9756 L398.0813 84.8348 L398.6072 84.7047 L399.1236 84.5843 L399.6309 84.4726 L400.1295 84.3687 L400.6195 84.2719 L401.5753 84.097 L402.5004 83.9435 L403.3968 83.808 L404.266 83.6877 L405.1099 83.5804 L405.9297 83.4842 L406.7268 83.3976 L407.5024 83.3193 L408.2578 83.2484 L408.9938 83.1838 L409.7115 83.1249 L410.4117 83.0709 L411.0953 83.0214 L411.7631 82.9759 L412.4157 82.9338 L413.0539 82.895 L413.6783 82.8589 L414.8878 82.7944 L416.0486 82.7384 L417.1645 82.6894 L418.2387 82.6463 L419.2743 82.6082 L420.274 82.5743 L421.2401 82.544 L422.1749 82.5168 L423.0803 82.4923 L423.9581 82.4702 L425.6374 82.4318 L427.2241 82.3999 L428.728 82.373 L430.1573 82.3501 L431.519 82.3304 L432.8192 82.3134 L434.0633 82.2986 L435.2558 82.2856 L437.5024 82.2641 L439.5863 82.247 L441.5297 82.2333 L443.3502 82.222 L445.0624 82.2127 L446.6786 82.2049 L448.2089 82.1982 L449.662 82.1926 L452.3653 82.1835 L454.8365 82.1766 L457.1124 82.1712 L459.2216 82.1669 L461.1868 82.1635 L463.0265 82.1607 L466.3871 82.1563 L469.3963 82.1533 L472.1207 82.151 L474.6096 82.1492 L476.9004 82.1479 L480.9988 82.1459 L484.5862 82.1446 L487.7759 82.1437 L490.6474 82.143 L495.6524 82.1421 L499.9153 82.1416 L503.6279 82.1412 L509.8675 82.1408 L514.9933 82.1406 L523.1221 82.1403 L529.4548 82.1402 L534.6433 82.1401 L537.68 82.1401" style="fill:none; clip-path:url(#clipPath1);"
      /><path d="M73.32 82.14 L78.0105 82.14 L85.5801 82.14 L96.5247 82.1401 L110.6381 82.1402 L127.1628 82.1405 L145.242 82.1419 L156.2646 82.144 L164.2177 82.1469 L170.4435 82.1506 L175.56 82.1551 L179.9035 82.1604 L183.6771 82.1663 L187.0132 82.173 L190.0027 82.1804 L192.711 82.1885 L195.1864 82.1972 L197.4659 82.2066 L201.5461 82.2271 L205.1194 82.2499 L208.298 82.2749 L211.1606 82.3019 L213.7642 82.3309 L216.1519 82.3618 L218.3568 82.3948 L220.4049 82.4298 L222.317 82.467 L224.11 82.5064 L225.798 82.5483 L226.6063 82.5703 L227.3925 82.5929 L228.1578 82.6163 L228.9034 82.6404 L229.6301 82.6653 L230.3389 82.691 L231.0308 82.7176 L231.7064 82.745 L232.3665 82.7733 L233.0118 82.8026 L233.643 82.8328 L234.2607 82.8639 L234.8654 82.8961 L235.4576 82.9293 L236.0379 82.9635 L236.6068 82.9988 L237.1647 83.0352 L237.7119 83.0727 L238.249 83.1112 L238.7762 83.1509 L239.294 83.1917 L239.8026 83.2337 L240.3024 83.2768 L241.2767 83.3663 L242.2191 83.4604 L243.1317 83.5589 L244.0162 83.6617 L244.8744 83.7686 L245.7078 83.8796 L246.5177 83.9944 L247.3055 84.1127 L248.0723 84.2344 L248.8193 84.3592 L249.5473 84.4868 L250.2574 84.6169 L250.9505 84.7494 L251.6272 84.8838 L252.2884 85.0201 L252.9348 85.1578 L253.567 85.2969 L254.1856 85.4371 L254.7913 85.578 L255.3844 85.7197 L255.9656 85.8618 L256.5353 86.0043 L257.0939 86.1469 L257.6419 86.2895 L258.1797 86.432 L258.7077 86.5743 L259.2261 86.7162 L259.7354 86.8577 L260.2358 86.9986 L260.7277 87.139 L261.2113 87.2787 L261.6869 87.4177 L262.6152 87.6933 L263.5146 87.9656 L264.3867 88.2342 L265.2332 88.499 L266.0556 88.7599 L266.8551 89.0169 L267.633 89.2698 L268.3905 89.5188 L269.1286 89.7639 L269.8482 90.005 L270.5503 90.2424 L271.2357 90.4759 L272.5594 90.9321 L273.825 91.3743 L275.0373 91.8031 L276.2006 92.2193 L277.3188 92.6236 L278.3952 93.0166 L279.4328 93.3989 L280.4343 93.7711 L282.3387 94.4872 L284.1249 95.1689 L285.8068 95.8193 L287.3959 96.4413 L288.9019 97.0373 L290.3331 97.6094 L292.9984 98.6894 L295.4379 99.6936 L297.6868 100.632 L299.7728 101.5125 L303.5399 103.1253 L306.871 104.5734 L312.5615 107.0876 L317.3112 109.2189 L321.3876 111.0681 L324.9581 112.7012 L328.1345 114.164 L330.9951 115.4895 L333.5973 116.702 L335.9837 117.82 L338.1875 118.8581 L340.2346 119.8278 L342.1459 120.7383 L343.9382 121.5973 L345.6255 122.411 L347.2194 123.1849 L348.7298 123.9234 L350.1649 124.6304 L351.5319 125.3091 L352.8369 125.9626 L354.0854 126.5933 L355.2821 127.2037 L356.431 127.7955 L357.5358 128.3708 L358.5999 128.9311 L359.626 129.4778 L360.6168 130.0125 L361.5747 130.5363 L362.5017 131.0503 L363.3999 131.5558 L364.2709 132.0536 L365.1164 132.5447 L365.9377 133.0301 L366.7362 133.5107 L367.5133 133.9872 L368.2699 134.4605 L369.0071 134.9314 L369.726 135.4007 L370.4274 135.8692 L371.1121 136.3377 L371.7809 136.8071 L372.4345 137.2781 L373.0736 137.7516 L373.6989 138.2286 L374.3108 138.7101 L374.91 139.1971 L375.4971 139.6909 L376.0724 140.1926 L376.6364 140.7038 L377.1896 141.2261 L377.7324 141.7615 L378.2652 142.3121 L378.7882 142.8806 L379.302 143.4702 L379.8067 144.0847 L380.3028 144.7291 L380.7904 145.4094 L381.27 146.1337 L381.7417 146.9123 L382.2058 147.7595 L382.6625 148.695 L383.1121 149.7465 L383.5548 150.9523 L383.9908 152.3568 L384.4203 153.9536 L384.8435 155.3643 L385.2606 155.4958 L385.6717 154.4667 L386.077 153.3358 L386.4767 152.4065 L387.2598 151.0863 L388.0222 150.2269 L388.765 149.6415 L389.4891 149.2325 L390.1955 148.9449 L390.8849 148.7451 L391.5582 148.6109 L392.2162 148.5275 L392.8594 148.484 L393.4886 148.4724 L394.1044 148.4868 L394.7072 148.5226 L395.2978 148.5759 L395.8764 148.644 L396.4437 148.7244 L397 148.8151 L397.5457 148.9146 L398.0813 149.0215 L398.6072 149.1347 L399.1236 149.2531 L399.6309 149.3761 L400.1295 149.5027 L400.6195 149.6326 L401.5753 149.8998 L402.5004 150.1742 L403.3968 150.4532 L404.266 150.735 L405.1099 151.018 L405.9297 151.301 L406.7268 151.5831 L407.5024 151.8636 L408.2578 152.142 L408.9938 152.4179 L409.7115 152.6909 L410.4117 152.9609 L411.0953 153.2276 L411.7631 153.4909 L412.4157 153.7507 L413.0539 154.007 L413.6783 154.2598 L414.8878 154.7548 L416.0486 155.2357 L417.1645 155.7028 L418.2387 156.1566 L419.2743 156.5975 L420.274 157.026 L421.2401 157.4426 L422.1749 157.8478 L423.0803 158.2422 L423.9581 158.6261 L425.6374 159.3645 L427.2241 160.0665 L428.728 160.7352 L430.1573 161.3734 L431.519 161.9836 L432.8192 162.5681 L434.0633 163.1287 L435.2558 163.6674 L437.5024 164.685 L439.5863 165.6319 L441.5297 166.5171 L443.3502 167.3479 L445.0624 168.1306 L446.6786 168.8704 L448.2089 169.5717 L449.662 170.2382 L452.3653 171.4795 L454.8365 172.6157 L457.1124 173.6631 L459.2216 174.6344 L461.1868 175.5401 L463.0265 176.3882 L466.3871 177.9384 L469.3963 179.3273 L472.1207 180.5852 L474.6096 181.7347 L476.9004 182.793 L480.9988 184.6869 L484.5862 186.345 L487.7759 187.8195 L490.6474 189.1471 L495.6524 191.4614 L499.9153 193.4327 L503.6279 195.1497 L509.8675 198.0355 L514.9933 200.4063 L523.1221 204.1662 L529.4548 207.0954 L534.6433 209.4953 L537.68 210.9" style="fill:none; clip-path:url(#clipPath1); stroke:fuchsia;"
    /></g
    ><g transform="translate(269.0804,89.7477)" style="stroke-linecap:butt; font-size:10px; fill:white; text-rendering:geometricPrecision; font-family:sans-serif; stroke-linejoin:bevel; stroke:white; stroke-width:0;"
    ><polygon style="stroke:none;" points=" -4 -4 4 -4 4 4 -4 4"
    /></g
    ><g transform="translate(269.0804,89.7477)" style="font-size:10px; stroke-linecap:butt; fill:fuchsia; text-rendering:geometricPrecision; font-family:sans-serif; stroke:fuchsia;"
    ><path style="fill:none;" d="M-4 -4 L4 -4 L4 4 L-4 4 L-4 -4"
    /></g
    ><g transform="translate(272.0804,92.7477)" style="stroke-linecap:butt; font-size:10px; fill:white; text-rendering:geometricPrecision; font-family:sans-serif; stroke-linejoin:bevel; stroke:white; stroke-width:0;"
    ><rect x="0" width="95" height="53" y="0" style="stroke:none;"
      /><text x="8.4219" xml:space="preserve" y="13.4785" style="fill:black; stroke:none;"
      >Closed loop r to y</text
      ><text x="2.1719" xml:space="preserve" y="30.4785" style="fill:black; stroke:none;"
      >Frequency: 0.893Hz</text
      ><text x="16.4062" xml:space="preserve" y="47.4785" style="fill:black; stroke:none;"
      >Gain: -14.9dB</text
    ></g
    ><g style="text-rendering:geometricPrecision; font-size:10px; font-family:sans-serif; stroke-linecap:butt;" transform="translate(272.0804,92.7477)"
    ><path style="fill:none;" d="M0 0 L94 0 L94 52 L0 52 L0 0"
    /></g
    ><g transform="translate(385.0362,97.4827)" style="stroke-linecap:butt; font-size:10px; fill:white; text-rendering:geometricPrecision; font-family:sans-serif; stroke-linejoin:bevel; stroke:white; stroke-width:0;"
    ><circle r="3.5" style="stroke:none;" cx="0" cy="0"
    /></g
    ><g transform="translate(385.0362,97.4827)" style="stroke-linecap:butt; font-size:10px; fill:red; text-rendering:geometricPrecision; font-family:sans-serif; stroke:red; stroke-width:2;"
    ><circle r="3.5" style="fill:none;" cx="0" cy="0"
    /></g
    ><g transform="translate(385.0362,97.4827)" style="stroke-linecap:butt; font-size:10px; fill:red; text-rendering:geometricPrecision; font-family:sans-serif; stroke:red; stroke-width:2;"
    ><path style="fill:none;" d="M-4 -4 L4 4"
      /><path style="fill:none;" d="M-4 4 L4 -4"
    /></g
    ><g style="stroke-linecap:butt; font-size:10px; fill:white; text-rendering:geometricPrecision; font-family:sans-serif; stroke-linejoin:bevel; shape-rendering:crispEdges; stroke:white; stroke-width:0;"
    ><path style="stroke:none;" d="M537.68 233.1 L537.68 361.86 L73.32 233.1 Z"
      /><path style="stroke:none;" d="M537.68 361.86 L73.32 361.86 L73.32 233.1 Z"
      /><path style="stroke:none;" d="M537.68 233.1 L537.68 233.1 L537.68 361.86 Z"
      /><path style="stroke:none;" d="M73.32 233.1 L73.32 233.1 L73.32 361.86 Z"
      /><path style="stroke:none;" d="M537.68 233.1 L73.32 233.1 L537.68 233.1 Z"
      /><path style="stroke:none;" d="M73.32 233.1 L73.32 233.1 L537.68 233.1 Z"
      /><path style="stroke:none;" d="M537.68 361.86 L73.32 361.86 L537.68 361.86 Z"
      /><path style="stroke:none;" d="M73.32 361.86 L73.32 361.86 L537.68 361.86 Z"
      /><text x="1.1719" y="12.4785" transform="translate(198.5,56)" style="fill:black; shape-rendering:auto; stroke:none;" xml:space="preserve"
      >Bode editor for closed loop from r to y, tunable:F</text
    ></g
    ><g transform="translate(62.32,370.86)" style="font-size:10px; stroke-linecap:butt; text-rendering:geometricPrecision; font-family:sans-serif; stroke-linejoin:bevel; stroke-width:0;"
    ><text x="-0.8281" xml:space="preserve" y="16.4785" style="stroke:none;"
      >10</text
      ><text x="12.8438" xml:space="preserve" y="9.4307" style="font-size:8.8px; stroke:none;"
      >-3</text
    ></g
    ><g transform="translate(128.6571,370.86)" style="font-size:10px; stroke-linecap:butt; text-rendering:geometricPrecision; font-family:sans-serif; stroke-linejoin:bevel; stroke-width:0;"
    ><text x="-0.8281" xml:space="preserve" y="16.4785" style="stroke:none;"
      >10</text
      ><text x="12.8438" xml:space="preserve" y="9.4307" style="font-size:8.8px; stroke:none;"
      >-2</text
    ></g
    ><g transform="translate(195.4943,370.86)" style="font-size:10px; stroke-linecap:butt; text-rendering:geometricPrecision; font-family:sans-serif; stroke-linejoin:bevel; stroke-width:0;"
    ><text x="-0.8281" xml:space="preserve" y="16.4785" style="stroke:none;"
      >10</text
      ><text x="12.8438" xml:space="preserve" y="9.4307" style="font-size:8.8px; stroke:none;"
      >-1</text
    ></g
    ><g transform="translate(262.3314,370.86)" style="font-size:10px; stroke-linecap:butt; text-rendering:geometricPrecision; font-family:sans-serif; stroke-linejoin:bevel; stroke-width:0;"
    ><text x="-0.8281" xml:space="preserve" y="16.4785" style="stroke:none;"
      >10</text
      ><text x="12.5" xml:space="preserve" y="9.4307" style="font-size:8.8px; stroke:none;"
      >0</text
    ></g
    ><g transform="translate(329.6686,370.86)" style="font-size:10px; stroke-linecap:butt; text-rendering:geometricPrecision; font-family:sans-serif; stroke-linejoin:bevel; stroke-width:0;"
    ><text x="-0.8281" xml:space="preserve" y="16.4785" style="stroke:none;"
      >10</text
      ><text x="12.25" xml:space="preserve" y="9.4307" style="font-size:8.8px; stroke:none;"
      >1</text
    ></g
    ><g transform="translate(395.0057,370.86)" style="font-size:10px; stroke-linecap:butt; text-rendering:geometricPrecision; font-family:sans-serif; stroke-linejoin:bevel; stroke-width:0;"
    ><text x="-0.8281" xml:space="preserve" y="16.4785" style="stroke:none;"
      >10</text
      ><text x="12.5938" xml:space="preserve" y="9.4307" style="font-size:8.8px; stroke:none;"
      >2</text
    ></g
    ><g transform="translate(461.3429,370.86)" style="font-size:10px; stroke-linecap:butt; text-rendering:geometricPrecision; font-family:sans-serif; stroke-linejoin:bevel; stroke-width:0;"
    ><text x="-0.8281" xml:space="preserve" y="16.4785" style="stroke:none;"
      >10</text
      ><text x="12.5938" xml:space="preserve" y="9.4307" style="font-size:8.8px; stroke:none;"
      >3</text
    ></g
    ><g transform="translate(527.68,370.86)" style="font-size:10px; stroke-linecap:butt; text-rendering:geometricPrecision; font-family:sans-serif; stroke-linejoin:bevel; stroke-width:0;"
    ><text x="-0.8281" xml:space="preserve" y="16.4785" style="stroke:none;"
      >10</text
      ><text x="12.7656" xml:space="preserve" y="9.4307" style="font-size:8.8px; stroke:none;"
      >4</text
    ></g
    ><g style="text-rendering:geometricPrecision; font-size:8.8px; shape-rendering:crispEdges; font-family:sans-serif; stroke-linecap:butt;"
    ><path style="fill:none;" d="M73.32 361.86 L73.32 367.86"
      /><path style="fill:none;" d="M139.6572 361.86 L139.6572 367.86"
      /><path style="fill:none;" d="M205.9943 361.86 L205.9943 367.86"
      /><path style="fill:none;" d="M272.3314 361.86 L272.3314 367.86"
      /><path style="fill:none;" d="M338.6686 361.86 L338.6686 367.86"
      /><path style="fill:none;" d="M405.0057 361.86 L405.0057 367.86"
      /><path style="fill:none;" d="M471.3429 361.86 L471.3429 367.86"
      /><path style="fill:none;" d="M537.68 361.86 L537.68 367.86"
      /><path style="fill:none;" d="M119.6877 361.86 L119.6877 364.86"
      /><path style="fill:none;" d="M186.0248 361.86 L186.0248 364.86"
      /><path style="fill:none;" d="M252.362 361.86 L252.362 364.86"
      /><path style="fill:none;" d="M318.6991 361.86 L318.6991 364.86"
      /><path style="fill:none;" d="M385.0363 361.86 L385.0363 364.86"
      /><path style="fill:none;" d="M451.3734 361.86 L451.3734 364.86"
      /><path style="fill:none;" d="M517.7105 361.86 L517.7105 364.86"
      /><path style="fill:none;" d="M73.32 361.86 L73.32 364.86"
      /><path style="fill:none;" d="M139.6572 361.86 L139.6572 364.86"
      /><path style="fill:none;" d="M205.9943 361.86 L205.9943 364.86"
      /><path style="fill:none;" d="M272.3314 361.86 L272.3314 364.86"
      /><path style="fill:none;" d="M338.6686 361.86 L338.6686 364.86"
      /><path style="fill:none;" d="M405.0057 361.86 L405.0057 364.86"
      /><path style="fill:none;" d="M471.3429 361.86 L471.3429 364.86"
      /><path style="fill:none;" d="M537.68 361.86 L537.68 364.86"
      /><path style="fill:none;" d="M537.68 361.86 L73.32 361.86"
    /></g
    ><g transform="translate(42.32,344.0592)" style="font-size:10px; stroke-linecap:butt; text-rendering:geometricPrecision; font-family:sans-serif; stroke-linejoin:bevel; stroke-width:0;"
    ><text x="-0.1875" xml:space="preserve" y="10.4785" style="stroke:none;"
      >-360</text
    ></g
    ><g transform="translate(42.32,320.8824)" style="font-size:10px; stroke-linecap:butt; text-rendering:geometricPrecision; font-family:sans-serif; stroke-linejoin:bevel; stroke-width:0;"
    ><text x="-0.1875" xml:space="preserve" y="10.4785" style="stroke:none;"
      >-270</text
    ></g
    ><g transform="translate(42.32,297.7056)" style="font-size:10px; stroke-linecap:butt; text-rendering:geometricPrecision; font-family:sans-serif; stroke-linejoin:bevel; stroke-width:0;"
    ><text x="-0.1875" xml:space="preserve" y="10.4785" style="stroke:none;"
      >-180</text
    ></g
    ><g transform="translate(48.32,274.5288)" style="font-size:10px; stroke-linecap:butt; text-rendering:geometricPrecision; font-family:sans-serif; stroke-linejoin:bevel; stroke-width:0;"
    ><text x="-0.1875" xml:space="preserve" y="10.4785" style="stroke:none;"
      >-90</text
    ></g
    ><g transform="translate(57.32,251.352)" style="font-size:10px; stroke-linecap:butt; text-rendering:geometricPrecision; font-family:sans-serif; stroke-linejoin:bevel; stroke-width:0;"
    ><text x="-0.5625" xml:space="preserve" y="10.4785" style="stroke:none;"
      >0</text
    ></g
    ><g transform="translate(51.32,228.1752)" style="font-size:10px; stroke-linecap:butt; text-rendering:geometricPrecision; font-family:sans-serif; stroke-linejoin:bevel; stroke-width:0;"
    ><text x="-0.4844" xml:space="preserve" y="10.4785" style="stroke:none;"
      >90</text
    ></g
    ><g style="text-rendering:geometricPrecision; font-size:10px; shape-rendering:crispEdges; font-family:sans-serif; stroke-linecap:butt;"
    ><path style="fill:none;" d="M73.32 351.5592 L67.32 351.5592"
      /><path style="fill:none;" d="M73.32 328.3824 L67.32 328.3824"
      /><path style="fill:none;" d="M73.32 305.2056 L67.32 305.2056"
      /><path style="fill:none;" d="M73.32 282.0288 L67.32 282.0288"
      /><path style="fill:none;" d="M73.32 258.852 L67.32 258.852"
      /><path style="fill:none;" d="M73.32 235.6752 L67.32 235.6752"
      /><path style="fill:none;" d="M73.32 233.1 L73.32 361.86"
      /><text x="1.1719" y="12.4785" transform="translate(269.5,394.86)" style="stroke-linejoin:bevel; shape-rendering:auto; stroke:none; stroke-width:0;" xml:space="preserve"
      >Frequency (Hz)</text
    ></g
    ><g transform="translate(39.32,297.48) rotate(270) translate(-37.5,-19)" style="font-size:10px; stroke-linecap:butt; text-rendering:geometricPrecision; font-family:sans-serif; stroke-linejoin:bevel; stroke-width:0;"
    ><text x="1.1719" xml:space="preserve" y="12.4785" style="stroke:none;"
      >Phase (degrees)</text
    ></g
    ><g style="stroke-linecap:butt; font-size:10px; fill:rgb(0,208,0); text-rendering:geometricPrecision; font-family:sans-serif; shape-rendering:crispEdges; stroke:rgb(0,208,0);"
    ><path d="M73.32 258.8516 L78.0105 258.8515 L85.5801 258.8514 L96.5247 258.8511 L110.6381 258.8505 L127.1628 258.8493 L145.242 258.847 L156.2646 258.8447 L164.2177 258.8423 L170.4435 258.84 L175.56 258.8377 L179.9035 258.8353 L183.6771 258.833 L187.0132 258.8307 L190.0027 258.8283 L192.711 258.826 L195.1864 258.8237 L197.4659 258.8213 L201.5461 258.8167 L205.1194 258.812 L208.298 258.8073 L211.1606 258.8027 L213.7642 258.798 L216.1519 258.7933 L218.3568 258.7887 L220.4049 258.784 L222.317 258.7793 L224.11 258.7747 L225.798 258.77 L226.6063 258.7677 L227.3925 258.7653 L228.1578 258.763 L228.9034 258.7607 L229.6301 258.7583 L230.3389 258.756 L231.0308 258.7537 L231.7064 258.7513 L232.3665 258.749 L233.0118 258.7467 L233.643 258.7443 L234.2607 258.742 L234.8654 258.7397 L235.4576 258.7373 L236.0379 258.735 L236.6068 258.7327 L237.1647 258.7303 L237.7119 258.728 L238.249 258.7257 L238.7762 258.7233 L239.294 258.721 L239.8026 258.7187 L240.3024 258.7163 L241.2767 258.7117 L242.2191 258.707 L243.1317 258.7023 L244.0162 258.6977 L244.8744 258.693 L245.7078 258.6883 L246.5177 258.6837 L247.3055 258.679 L248.0723 258.6743 L248.8193 258.6697 L249.5473 258.665 L250.2574 258.6603 L250.9505 258.6557 L251.6272 258.651 L252.2884 258.6463 L252.9348 258.6417 L253.567 258.637 L254.1856 258.6323 L254.7913 258.6277 L255.3844 258.623 L255.9656 258.6183 L256.5353 258.6137 L257.0939 258.609 L257.6419 258.6043 L258.1797 258.5997 L258.7077 258.595 L259.2261 258.5903 L259.7354 258.5857 L260.2358 258.581 L260.7277 258.5763 L261.2113 258.5717 L261.6869 258.567 L262.6152 258.5577 L263.5146 258.5483 L264.3867 258.539 L265.2332 258.5297 L266.0556 258.5203 L266.8551 258.511 L267.633 258.5016 L268.3905 258.4923 L269.1286 258.483 L269.8482 258.4737 L270.5503 258.4643 L271.2357 258.455 L272.5594 258.4363 L273.825 258.4176 L275.0373 258.399 L276.2006 258.3803 L277.3188 258.3616 L278.3952 258.343 L279.4328 258.3243 L280.4343 258.3056 L282.3387 258.2682 L284.1249 258.2309 L285.8068 258.1935 L287.3959 258.1562 L288.9019 258.1188 L290.3331 258.0814 L292.9984 258.0067 L295.4379 257.9319 L297.6868 257.8571 L299.7728 257.7823 L303.5399 257.6326 L306.871 257.4827 L312.5615 257.1827 L317.3112 256.8821 L321.3876 256.5809 L324.9581 256.2788 L328.1345 255.9759 L330.9951 255.672 L333.5973 255.3671 L335.9837 255.061 L338.1875 254.7538 L340.2346 254.4453 L342.1459 254.1354 L343.9382 253.8242 L345.6255 253.5115 L347.2194 253.1973 L348.7298 252.8817 L350.1649 252.5645 L351.5319 252.2457 L352.8369 251.9254 L354.0854 251.6036 L355.2821 251.2802 L356.431 250.9554 L357.5358 250.6291 L358.5999 250.3014 L359.626 249.9725 L360.6168 249.6423 L361.5747 249.3111 L362.5017 248.9789 L363.3999 248.6459 L364.2709 248.3122 L365.1164 247.9781 L365.9377 247.6437 L366.7362 247.3093 L367.5133 246.9751 L368.2699 246.6415 L369.0071 246.3087 L369.726 245.9771 L370.4274 245.647 L371.1121 245.3188 L371.7809 244.9931 L372.4345 244.6703 L373.0736 244.351 L373.6989 244.0358 L374.3108 243.7255 L374.91 243.4207 L375.4971 243.1226 L376.0724 242.8321 L376.6364 242.5505 L377.1896 242.2794 L377.7324 242.0207 L378.2652 241.7766 L378.7882 241.55 L379.302 241.3448 L379.8067 241.1659 L380.3028 241.0201 L380.7904 240.9168 L381.27 240.8697 L381.7417 240.899 L382.2058 241.0369 L382.6625 241.3364 L383.1121 241.892 L383.5548 242.8848 L383.9908 244.6972 L384.4203 248.1796 L384.8435 254.7802 L385.2606 263.545 L385.6717 269.7401 L386.077 272.9802 L386.4767 274.6932 L387.2598 276.2179 L388.0222 276.7284 L388.765 276.8351 L389.4891 276.7491 L390.1955 276.5608 L390.8849 276.3153 L391.5582 276.0372 L392.2162 275.7411 L392.8594 275.4359 L393.4886 275.1274 L394.1044 274.8195 L394.7072 274.5146 L395.2978 274.2144 L395.8764 273.9203 L396.4437 273.6328 L397 273.3524 L397.5457 273.0796 L398.0813 272.8143 L398.6072 272.5566 L399.1236 272.3065 L399.6309 272.0638 L400.1295 271.8284 L400.6195 271.6002 L401.5753 271.1643 L402.5004 270.7545 L403.3968 270.369 L404.266 270.0062 L405.1099 269.6644 L405.9297 269.3421 L406.7268 269.0377 L407.5024 268.7501 L408.2578 268.4778 L408.9938 268.2199 L409.7115 267.9753 L410.4117 267.7429 L411.0953 267.522 L411.7631 267.3118 L412.4157 267.1115 L413.0539 266.9204 L413.6783 266.738 L414.8878 266.3969 L416.0486 266.0842 L417.1645 265.7965 L418.2387 265.531 L419.2743 265.2852 L420.274 265.0569 L421.2401 264.8445 L422.1749 264.6462 L423.0803 264.4607 L423.9581 264.2869 L425.6374 263.9699 L427.2241 263.6881 L428.728 263.436 L430.1573 263.209 L431.519 263.0037 L432.8192 262.8169 L434.0633 262.6464 L435.2558 262.49 L437.5024 262.2131 L439.5863 261.9756 L441.5297 261.7696 L443.3502 261.5892 L445.0624 261.4299 L446.6786 261.2881 L448.2089 261.1612 L449.662 261.0469 L452.3653 260.8493 L454.8365 260.6843 L457.1124 260.5446 L459.2216 260.4247 L461.1868 260.3207 L463.0265 260.2296 L466.3871 260.0776 L469.3963 259.9559 L472.1207 259.8561 L474.6096 259.7729 L476.9004 259.7025 L480.9988 259.5896 L484.5862 259.5032 L487.7759 259.4349 L490.6474 259.3796 L495.6524 259.2954 L499.9153 259.2344 L503.6279 259.1882 L509.8675 259.1227 L514.9933 259.0786 L523.1221 259.0229 L529.4548 258.9892 L534.6433 258.9666 L537.68 258.9551" style="fill:none; clip-path:url(#clipPath2);"
    /></g
    ><g transform="translate(438.1204,262.1445)" style="stroke-linecap:butt; font-size:10px; fill:white; text-rendering:geometricPrecision; font-family:sans-serif; stroke-linejoin:bevel; stroke:white; stroke-width:0;"
    ><polygon style="stroke:none;" points=" -4 -4 4 -4 4 4 -4 4"
    /></g
    ><g transform="translate(438.1204,262.1445)" style="font-size:10px; stroke-linecap:butt; fill:rgb(0,208,0); text-rendering:geometricPrecision; font-family:sans-serif; stroke:rgb(0,208,0);"
    ><path style="fill:none;" d="M-4 -4 L4 -4 L4 4 L-4 4 L-4 -4"
    /></g
    ><g transform="translate(441.1204,265.1445)" style="stroke-linecap:butt; font-size:10px; fill:white; text-rendering:geometricPrecision; font-family:sans-serif; stroke-linejoin:bevel; stroke:white; stroke-width:0;"
    ><rect x="0" width="95" height="53" y="0" style="stroke:none;"
      /><text x="44.1719" xml:space="preserve" y="13.4785" style="fill:black; stroke:none;"
      >F</text
      ><text x="6.1719" xml:space="preserve" y="30.4785" style="fill:black; stroke:none;"
      >Frequency: 316Hz</text
      ><text x="2.1719" xml:space="preserve" y="47.4785" style="fill:black; stroke:none;"
      >Phase: -12.8degrees</text
    ></g
    ><g style="text-rendering:geometricPrecision; font-size:10px; font-family:sans-serif; stroke-linecap:butt;" transform="translate(441.1204,265.1445)"
    ><path style="fill:none;" d="M0 0 L94 0 L94 52 L0 52 L0 0"
    /></g
    ><g style="stroke-linecap:butt; font-size:10px; fill:fuchsia; text-rendering:geometricPrecision; font-family:sans-serif; shape-rendering:crispEdges; stroke:fuchsia;"
    ><path d="M73.32 258.9176 L78.0105 258.9293 L85.5801 258.9525 L96.5247 258.9989 L110.6381 259.0917 L127.1628 259.2774 L145.242 259.6487 L156.2646 260.0198 L164.2177 260.3907 L170.4435 260.7612 L175.56 261.1313 L179.9035 261.5009 L183.6771 261.8701 L187.0132 262.2386 L190.0027 262.6066 L192.711 262.974 L195.1864 263.3407 L197.4659 263.7068 L201.5461 264.4371 L205.1194 265.1649 L208.298 265.8906 L211.1606 266.6145 L213.7642 267.3372 L216.1519 268.059 L218.3568 268.7806 L220.4049 269.5024 L222.317 270.225 L224.11 270.9485 L225.798 271.6735 L226.6063 272.0366 L227.3925 272.4 L228.1578 272.7639 L228.9034 273.1281 L229.6301 273.4927 L230.3389 273.8576 L231.0308 274.2229 L231.7064 274.5884 L232.3665 274.9541 L233.0118 275.32 L233.643 275.686 L234.2607 276.052 L234.8654 276.418 L235.4576 276.7837 L236.0379 277.1492 L236.6068 277.5143 L237.1647 277.879 L237.7119 278.2431 L238.249 278.6064 L238.7762 278.9689 L239.294 279.3305 L239.8026 279.6909 L240.3024 280.0502 L241.2767 280.7645 L242.2191 281.4723 L243.1317 282.1725 L244.0162 282.8643 L244.8744 283.5466 L245.7078 284.2186 L246.5177 284.8794 L247.3055 285.5284 L248.0723 286.1649 L248.8193 286.7884 L249.5473 287.3985 L250.2574 287.9949 L250.9505 288.5774 L251.6272 289.1457 L252.2884 289.7 L252.9348 290.2401 L253.567 290.7662 L254.1856 291.2784 L254.7913 291.7769 L255.3844 292.2619 L255.9656 292.7338 L256.5353 293.1927 L257.0939 293.6391 L257.6419 294.0732 L258.1797 294.4954 L258.7077 294.9061 L259.2261 295.3057 L259.7354 295.6944 L260.2358 296.0727 L260.7277 296.4409 L261.2113 296.7993 L261.6869 297.1484 L262.6152 297.8198 L263.5146 298.4575 L264.3867 299.0641 L265.2332 299.6417 L266.0556 300.1926 L266.8551 300.7185 L267.633 301.2213 L268.3905 301.7026 L269.1286 302.1639 L269.8482 302.6065 L270.5503 303.0317 L271.2357 303.4405 L272.5594 304.2133 L273.825 304.9322 L275.0373 305.6032 L276.2006 306.2315 L277.3188 306.8216 L278.3952 307.3771 L279.4328 307.9013 L280.4343 308.3969 L282.3387 309.3121 L284.1249 310.1387 L285.8068 310.8894 L287.3959 311.5743 L288.9019 312.2016 L290.3331 312.7781 L292.9984 313.8006 L295.4379 314.6778 L297.6868 315.4366 L299.7728 316.0973 L303.5399 317.1853 L306.871 318.0349 L312.5615 319.2451 L317.3112 320.028 L321.3876 320.5398 L324.9581 320.8694 L328.1345 321.0707 L330.9951 321.1785 L333.5973 321.2158 L335.9837 321.1986 L338.1875 321.1384 L340.2346 321.0436 L342.1459 320.9203 L343.9382 320.7735 L345.6255 320.6067 L347.2194 320.4228 L348.7298 320.2242 L350.1649 320.0128 L351.5319 319.7901 L352.8369 319.5574 L354.0854 319.3158 L355.2821 319.0661 L356.431 318.8093 L357.5358 318.5459 L358.5999 318.2766 L359.626 318.0019 L360.6168 317.7224 L361.5747 317.4385 L362.5017 317.1506 L363.3999 316.8592 L364.2709 316.5647 L365.1164 316.2675 L365.9377 315.9679 L366.7362 315.6664 L367.5133 315.3635 L368.2699 315.0594 L369.0071 314.7546 L369.726 314.4497 L370.4274 314.145 L371.1121 313.8411 L371.7809 313.5385 L372.4345 313.2378 L373.0736 312.9396 L373.6989 312.6446 L374.3108 312.3536 L374.91 312.0674 L375.4971 311.7871 L376.0724 311.5137 L376.6364 311.2486 L377.1896 310.9933 L377.7324 310.7498 L378.2652 310.5203 L378.7882 310.3079 L379.302 310.1163 L379.8067 309.9506 L380.3028 309.8176 L380.7904 309.7266 L381.27 309.6913 L381.7417 309.7321 L382.2058 309.8811 L382.6625 310.1915 L383.1121 310.7574 L383.5548 311.7605 L383.9908 313.5827 L384.4203 317.0746 L384.8435 323.6844 L385.2606 332.4583 L385.6717 338.662 L386.077 341.9107 L386.4767 343.6319 L387.2598 345.1725 L388.0222 345.6981 L388.765 345.8191 L389.4891 345.7465 L390.1955 345.5712 L390.8849 345.338 L391.5582 345.0716 L392.2162 344.7867 L392.8594 344.4922 L393.4886 344.194 L394.1044 343.8958 L394.7072 343.6003 L395.2978 343.3092 L395.8764 343.0237 L396.4437 342.7445 L397 342.4722 L397.5457 342.207 L398.0813 341.9492 L398.6072 341.6986 L399.1236 341.4554 L399.6309 341.2194 L400.1295 340.9904 L400.6195 340.7684 L401.5753 340.3443 L402.5004 339.9456 L403.3968 339.5705 L404.266 339.2175 L405.1099 338.8849 L405.9297 338.5713 L406.7268 338.2751 L407.5024 337.9952 L408.2578 337.7304 L408.9938 337.4795 L409.7115 337.2415 L410.4117 337.0155 L411.0953 336.8007 L411.7631 336.5962 L412.4157 336.4014 L413.0539 336.2156 L413.6783 336.0382 L414.8878 335.7066 L416.0486 335.4026 L417.1645 335.123 L418.2387 334.8649 L419.2743 334.626 L420.274 334.4042 L421.2401 334.1978 L422.1749 334.0052 L423.0803 333.825 L423.9581 333.6562 L425.6374 333.3483 L427.2241 333.0747 L428.728 332.8299 L430.1573 332.6095 L431.519 332.4102 L432.8192 332.2289 L434.0633 332.0633 L435.2558 331.9115 L437.5024 331.6428 L439.5863 331.4124 L441.5297 331.2125 L443.3502 331.0374 L445.0624 330.8828 L446.6786 330.7453 L448.2089 330.6222 L449.662 330.5113 L452.3653 330.3195 L454.8365 330.1596 L457.1124 330.024 L459.2216 329.9077 L461.1868 329.8069 L463.0265 329.7185 L466.3871 329.5711 L469.3963 329.453 L472.1207 329.3562 L474.6096 329.2755 L476.9004 329.2072 L480.9988 329.0977 L484.5862 329.0139 L487.7759 328.9477 L490.6474 328.8941 L495.6524 328.8124 L499.9153 328.7533 L503.6279 328.7084 L509.8675 328.6449 L514.9933 328.6021 L523.1221 328.5481 L529.4548 328.5154 L534.6433 328.4935 L537.68 328.4824" style="fill:none; clip-path:url(#clipPath2);"
    /></g
    ><g transform="translate(385.0362,258.852)" style="stroke-linecap:butt; font-size:10px; fill:white; text-rendering:geometricPrecision; font-family:sans-serif; stroke-linejoin:bevel; stroke:white; stroke-width:0;"
    ><circle r="3.5" style="stroke:none;" cx="0" cy="0"
    /></g
    ><g transform="translate(385.0362,258.852)" style="stroke-linecap:butt; font-size:10px; fill:red; text-rendering:geometricPrecision; font-family:sans-serif; stroke:red; stroke-width:2;"
    ><circle r="3.5" style="fill:none;" cx="0" cy="0"
    /></g
    ><g transform="translate(385.0362,258.852)" style="stroke-linecap:butt; font-size:10px; fill:red; text-rendering:geometricPrecision; font-family:sans-serif; stroke:red; stroke-width:2;"
    ><path style="fill:none;" d="M-4 -4 L4 4"
      /><path style="fill:none;" d="M-4 4 L4 -4"
    /></g
  ></g
></svg
>
