<?xml version="1.0" encoding="UTF-8"?>
<!DOCTYPE svg PUBLIC '-//W3C//DTD SVG 1.0//EN'
          'http://www.w3.org/TR/2001/REC-SVG-20010904/DTD/svg10.dtd'>
<svg xmlns:xlink="http://www.w3.org/1999/xlink" style="fill-opacity:1; color-rendering:auto; color-interpolation:auto; text-rendering:auto; stroke:black; stroke-linecap:square; stroke-miterlimit:10; shape-rendering:auto; stroke-opacity:1; fill:black; stroke-dasharray:none; font-weight:normal; stroke-width:1; font-family:'Dialog'; font-style:normal; stroke-linejoin:miter; font-size:12px; stroke-dashoffset:0; image-rendering:auto;" width="611" height="282" xmlns="http://www.w3.org/2000/svg"
><!--Generated by Scilab with Batik SVG Generator--><defs id="genericDefs"
  /><g
  ><defs id="defs1"
    ><clipPath clipPathUnits="userSpaceOnUse" id="clipPath1"
      ><path d="M73.3154 33.8379 L537.6846 33.8379 L537.6846 248.1621 L73.3154 248.1621 L73.3154 33.8379 Z"
      /></clipPath
      ><font horiz-adv-x="44.0" id="font1"
      ><font-face ascent="104.78516" descent="27.09961" units-per-em="100" style="font-style:normal; font-family:sans-serif; font-weight:normal;"
        /><missing-glyph horiz-adv-x="44.0" d="M39.4531 0 L4.8906 0 L4.8906 71.0938 L39.4531 71.0938 L39.4531 0 ZM36.8125 4.1094 L36.8125 66.9375 L23.4375 35.5469 L36.8125 4.1094 ZM7.5156 66.3594 L7.5156 4.6875 L20.6094 35.5469 L7.5156 66.3594 ZM9.4688 2.6406 L34.625 2.6406 L22.0156 32.2344 L9.4688 2.6406 ZM22.0156 38.875 L34.625 68.4531 L9.4688 68.4531 L22.0156 38.875 Z"
        /><glyph unicode="0" horiz-adv-x="56.0" d="M50.4844 30.3281 Q50.4844 14.4531 45.0703 6.7344 Q39.6562 -0.9844 28.125 -0.9844 Q16.75 -0.9844 11.2812 6.5625 Q5.8125 14.1094 5.6094 29.1094 L5.6094 41.1562 Q5.6094 56.8438 11.0312 64.4609 Q16.4531 72.0781 28.0312 72.0781 Q39.5 72.0781 44.9219 64.7266 Q50.3438 57.375 50.4844 42.0469 L50.4844 30.3281 ZM41.4531 42.6719 Q41.4531 54.1562 38.2344 59.4062 Q35.0156 64.6562 28.0312 64.6562 Q21.0938 64.6562 17.9219 59.4297 Q14.75 54.2031 14.6562 43.3594 L14.6562 28.9062 Q14.6562 17.3906 18 11.8906 Q21.3438 6.3906 28.125 6.3906 Q34.8125 6.3906 38.0625 11.5703 Q41.3125 16.75 41.4531 27.875 L41.4531 42.6719 Z"
        /><glyph unicode="2" horiz-adv-x="56.0" d="M52.4844 0 L5.9062 0 L5.9062 6.5 L30.5156 33.8438 Q35.9844 40.0469 38.0625 43.9219 Q40.1406 47.7969 40.1406 51.9531 Q40.1406 57.5156 36.7734 61.0859 Q33.4062 64.6562 27.7812 64.6562 Q21.0469 64.6562 17.3125 60.8203 Q13.5781 56.9844 13.5781 50.1406 L4.5469 50.1406 Q4.5469 59.9688 10.8672 66.0234 Q17.1875 72.0781 27.7812 72.0781 Q37.7031 72.0781 43.4609 66.875 Q49.2188 61.6719 49.2188 53.0312 Q49.2188 42.5312 35.8438 28.0312 L16.7969 7.375 L52.4844 7.375 L52.4844 0 Z"
        /><glyph unicode="4" horiz-adv-x="56.0" d="M44.0469 23.875 L53.9062 23.875 L53.9062 16.5 L44.0469 16.5 L44.0469 0 L34.9688 0 L34.9688 16.5 L2.5938 16.5 L2.5938 21.8281 L34.4219 71.0938 L44.0469 71.0938 L44.0469 23.875 ZM12.8438 23.875 L34.9688 23.875 L34.9688 58.7344 L33.8906 56.7812 L12.8438 23.875 Z"
        /><glyph unicode="6" horiz-adv-x="56.0" d="M41.3594 71.1406 L41.3594 63.4844 L39.7031 63.4844 Q29.1562 63.2812 22.9062 57.2266 Q16.6562 51.1719 15.6719 40.1875 Q21.2969 46.625 31 46.625 Q40.2812 46.625 45.8281 40.0859 Q51.375 33.5469 51.375 23.1875 Q51.375 12.2031 45.3906 5.6094 Q39.4062 -0.9844 29.3438 -0.9844 Q19.1406 -0.9844 12.7969 6.8594 Q6.4531 14.7031 6.4531 27.0469 L6.4531 30.5156 Q6.4531 50.1406 14.8203 60.5234 Q23.1875 70.9062 39.75 71.1406 L41.3594 71.1406 ZM29.5 39.1094 Q24.8594 39.1094 20.9531 36.3281 Q17.0469 33.5469 15.5312 29.3438 L15.5312 26.0312 Q15.5312 17.2344 19.4844 11.8672 Q23.4375 6.5 29.3438 6.5 Q35.4531 6.5 38.9453 10.9922 Q42.4375 15.4844 42.4375 22.75 Q42.4375 30.0781 38.8984 34.5938 Q35.3594 39.1094 29.5 39.1094 Z"
        /><glyph unicode="8" horiz-adv-x="56.0" d="M49.0312 52.5469 Q49.0312 47.2188 46.2188 43.0703 Q43.4062 38.9219 38.625 36.5781 Q44.1875 34.1875 47.4375 29.5938 Q50.6875 25 50.6875 19.1875 Q50.6875 9.9688 44.4609 4.4922 Q38.2344 -0.9844 28.0781 -0.9844 Q17.8281 -0.9844 11.6484 4.5156 Q5.4688 10.0156 5.4688 19.1875 Q5.4688 24.9531 8.6172 29.5938 Q11.7656 34.2344 17.3281 36.625 Q12.5938 38.9688 9.8594 43.1172 Q7.125 47.2656 7.125 52.5469 Q7.125 61.5312 12.8906 66.8047 Q18.6562 72.0781 28.0781 72.0781 Q37.4531 72.0781 43.2422 66.8047 Q49.0312 61.5312 49.0312 52.5469 ZM41.6562 19.3906 Q41.6562 25.3438 37.8672 29.1016 Q34.0781 32.8594 27.9766 32.8594 Q21.875 32.8594 18.1875 29.1484 Q14.5 25.4375 14.5 19.3828 Q14.5 13.3281 18.0938 9.8594 Q21.6875 6.3906 28.0781 6.3906 Q34.4219 6.3906 38.0391 9.8828 Q41.6562 13.375 41.6562 19.3906 ZM28.0781 64.6562 Q22.75 64.6562 19.4531 61.3594 Q16.1562 58.0625 16.1562 52.3906 Q16.1562 46.9688 19.4062 43.625 Q22.6562 40.2812 28.0781 40.2812 Q33.5 40.2812 36.7422 43.625 Q39.9844 46.9688 39.9844 52.3906 Q39.9844 57.8125 36.6172 61.2344 Q33.25 64.6562 28.0781 64.6562 Z"
        /><glyph unicode="1" horiz-adv-x="56.0" d="M35.5938 0 L26.5156 0 L26.5156 60.2031 L8.2969 53.5156 L8.2969 61.7188 L34.1875 71.4375 L35.5938 71.4375 L35.5938 0 Z"
        /><glyph unicode="3" horiz-adv-x="56.0" d="M19.0469 39.9375 L25.8281 39.9375 Q32.2344 40.0469 35.8906 43.3125 Q39.5469 46.5781 39.5469 52.1562 Q39.5469 64.6562 27.0938 64.6562 Q21.2344 64.6562 17.75 61.3047 Q14.2656 57.9531 14.2656 52.4375 L5.2188 52.4375 Q5.2188 60.8906 11.3984 66.4844 Q17.5781 72.0781 27.0938 72.0781 Q37.1562 72.0781 42.8672 66.75 Q48.5781 61.4219 48.5781 51.9531 Q48.5781 47.3125 45.5781 42.9688 Q42.5781 38.625 37.4062 36.4688 Q43.2656 34.625 46.4609 30.3281 Q49.6562 26.0312 49.6562 19.8281 Q49.6562 10.25 43.4062 4.6328 Q37.1562 -0.9844 27.1484 -0.9844 Q17.1406 -0.9844 10.8672 4.4375 Q4.5938 9.8594 4.5938 18.75 L13.6719 18.75 Q13.6719 13.1406 17.3359 9.7656 Q21 6.3906 27.1562 6.3906 Q33.6875 6.3906 37.1562 9.8125 Q40.625 13.2344 40.625 19.625 Q40.625 25.8281 36.8203 29.1484 Q33.0156 32.4688 25.8281 32.5625 L19.0469 32.5625 L19.0469 39.9375 Z"
        /><glyph unicode="5" horiz-adv-x="56.0" d="M10.0625 35.6406 L13.6719 71.0938 L50.0938 71.0938 L50.0938 62.75 L21.3438 62.75 L19.1875 43.3594 Q24.4219 46.4375 31.0625 46.4375 Q40.7656 46.4375 46.4844 40.0156 Q52.2031 33.5938 52.2031 22.6562 Q52.2031 11.6719 46.2656 5.3438 Q40.3281 -0.9844 29.6875 -0.9844 Q20.2656 -0.9844 14.3047 4.2422 Q8.3438 9.4688 7.5156 18.7031 L16.0625 18.7031 Q16.8906 12.5938 20.4062 9.4922 Q23.9219 6.3906 29.6875 6.3906 Q35.9844 6.3906 39.5781 10.6875 Q43.1719 14.9844 43.1719 22.5625 Q43.1719 29.6875 39.2891 34.0078 Q35.4062 38.3281 28.9531 38.3281 Q23.0469 38.3281 19.6719 35.75 L17.2812 33.7969 L10.0625 35.6406 Z"
        /><glyph unicode="7" horiz-adv-x="56.0" d="M51.8125 66.0156 L22.3594 0 L12.8906 0 L42.2344 63.6719 L3.7656 63.6719 L3.7656 71.0938 L51.8125 71.0938 L51.8125 66.0156 Z"
        /><glyph unicode="." horiz-adv-x="26.0" d="M7.0312 4.7344 Q7.0312 7.0781 8.4219 8.6406 Q9.8125 10.2031 12.5938 10.2031 Q15.375 10.2031 16.8203 8.6406 Q18.2656 7.0781 18.2656 4.7344 Q18.2656 2.4844 16.8203 0.9766 Q15.375 -0.5312 12.5938 -0.5312 Q9.8125 -0.5312 8.4219 0.9766 Q7.0312 2.4844 7.0312 4.7344 Z"
        /><glyph unicode=")" horiz-adv-x="35.0" d="M27.6875 28.375 Q27.6875 17.4844 24.8281 7.5 Q21.9688 -2.4844 16.0859 -10.9375 Q10.2031 -19.3906 3.7656 -22.9531 L1.8594 -17.4375 Q9.375 -11.6719 13.9375 0.4609 Q18.5 12.5938 18.6094 27.3906 L18.6094 28.9531 Q18.6094 39.2031 16.4609 48.0234 Q14.3125 56.8438 10.4766 63.8203 Q6.6406 70.7969 1.8594 74.7031 L3.7656 80.2188 Q10.2031 76.6562 16.0391 68.3125 Q21.875 59.9688 24.7812 49.9062 Q27.6875 39.8438 27.6875 28.375 Z"
        /><glyph unicode="s" horiz-adv-x="52.0" d="M37.5938 14.0156 Q37.5938 17.6719 34.8359 19.7031 Q32.0781 21.7344 25.2188 23.1953 Q18.3594 24.6562 14.3281 26.7109 Q10.2969 28.7656 8.375 31.5938 Q6.4531 34.4219 6.4531 38.3281 Q6.4531 44.8281 11.9453 49.3203 Q17.4375 53.8125 25.9844 53.8125 Q34.9688 53.8125 40.5547 49.1719 Q46.1406 44.5312 46.1406 37.3125 L37.0625 37.3125 Q37.0625 41.0156 33.9141 43.7031 Q30.7656 46.3906 25.9844 46.3906 Q21.0469 46.3906 18.2656 44.2422 Q15.4844 42.0938 15.4844 38.625 Q15.4844 35.3594 18.0703 33.6953 Q20.6562 32.0312 27.4219 30.5156 Q34.1875 29 38.3828 26.9062 Q42.5781 24.8125 44.6016 21.8516 Q46.625 18.8906 46.625 14.6562 Q46.625 7.5625 40.9609 3.2891 Q35.2969 -0.9844 26.2656 -0.9844 Q19.9219 -0.9844 15.0391 1.2656 Q10.1562 3.5156 7.3984 7.5469 Q4.6406 11.5781 4.6406 16.2656 L13.6719 16.2656 Q13.9219 11.7188 17.3125 9.0547 Q20.7031 6.3906 26.2656 6.3906 Q31.3906 6.3906 34.4922 8.4688 Q37.5938 10.5469 37.5938 14.0156 Z"
        /><glyph unicode="(" horiz-adv-x="34.0" d="M6.5 28.8594 Q6.5 39.8906 9.4531 50.0469 Q12.4062 60.2031 18.2656 68.5078 Q24.125 76.8125 30.4219 80.2188 L32.2812 74.2656 Q25.1406 68.7969 20.5781 57.5703 Q16.0156 46.3438 15.5781 32.4219 L15.5312 28.2656 Q15.5312 9.4219 22.4062 -4.4375 Q26.5625 -12.75 32.2812 -17.4375 L30.4219 -22.9531 Q23.9219 -19.3438 18.0156 -10.8438 Q6.5 5.7656 6.5 28.8594 Z"
        /><glyph unicode=" " horiz-adv-x="25.0" d=""
        /><glyph unicode="e" horiz-adv-x="53.0" d="M28.7656 -0.9844 Q18.0156 -0.9844 11.2812 6.0781 Q4.5469 13.1406 4.5469 24.9531 L4.5469 26.6094 Q4.5469 34.4688 7.5469 40.6484 Q10.5469 46.8281 15.9453 50.3203 Q21.3438 53.8125 27.6406 53.8125 Q37.9375 53.8125 43.6484 47.0234 Q49.3594 40.2344 49.3594 27.5938 L49.3594 23.8281 L13.5781 23.8281 Q13.7656 16.0156 18.1406 11.2031 Q22.5156 6.3906 29.25 6.3906 Q34.0312 6.3906 37.3516 8.3438 Q40.6719 10.2969 43.1719 13.5312 L48.6875 9.2344 Q42.0469 -0.9844 28.7656 -0.9844 ZM27.6406 46.3906 Q22.1719 46.3906 18.4609 42.4062 Q14.75 38.4219 13.875 31.25 L40.3281 31.25 L40.3281 31.9375 Q39.9375 38.8125 36.6172 42.6016 Q33.2969 46.3906 27.6406 46.3906 Z"
        /><glyph unicode="m" horiz-adv-x="88.0" d="M15.3281 52.8281 L15.5781 46.9688 Q21.3906 53.8125 31.25 53.8125 Q42.3281 53.8125 46.3438 45.3125 Q48.9688 49.125 53.1953 51.4688 Q57.4219 53.8125 63.1875 53.8125 Q80.5625 53.8125 80.8594 35.4062 L80.8594 0 L71.8281 0 L71.8281 34.8594 Q71.8281 40.5312 69.2422 43.3359 Q66.6562 46.1406 60.5469 46.1406 Q55.5156 46.1406 52.1953 43.1406 Q48.875 40.1406 48.3438 35.0625 L48.3438 0 L39.2656 0 L39.2656 34.625 Q39.2656 46.1406 27.9844 46.1406 Q19.0938 46.1406 15.8281 38.5781 L15.8281 0 L6.7812 0 L6.7812 52.8281 L15.3281 52.8281 Z"
        /><glyph unicode="i" horiz-adv-x="24.0" d="M16.6562 0 L7.625 0 L7.625 52.8281 L16.6562 52.8281 L16.6562 0 ZM6.8906 66.8438 Q6.8906 69.0469 8.2344 70.5625 Q9.5781 72.0781 12.2109 72.0781 Q14.8438 72.0781 16.2109 70.5625 Q17.5781 69.0469 17.5781 66.8516 Q17.5781 64.6562 16.2109 63.1875 Q14.8438 61.7188 12.2109 61.7188 Q9.5781 61.7188 8.2344 63.1875 Q6.8906 64.6562 6.8906 66.8438 Z"
        /><glyph unicode="T" horiz-adv-x="60.0" d="M57.375 63.375 L34.5156 63.375 L34.5156 0 L25.2031 0 L25.2031 63.375 L2.3906 63.375 L2.3906 71.0938 L57.375 71.0938 L57.375 63.375 Z"
        /><glyph unicode="d" horiz-adv-x="56.0" d="M4.6406 26.8594 Q4.6406 39.0156 10.3984 46.4141 Q16.1562 53.8125 25.4844 53.8125 Q34.7656 53.8125 40.1875 47.4688 L40.1875 75 L49.2188 75 L49.2188 0 L40.9219 0 L40.4844 5.6719 Q35.0625 -0.9844 25.3906 -0.9844 Q16.2188 -0.9844 10.4297 6.5391 Q4.6406 14.0625 4.6406 26.1719 L4.6406 26.8594 ZM13.6719 25.8281 Q13.6719 16.8438 17.3828 11.7656 Q21.0938 6.6875 27.6406 6.6875 Q36.2344 6.6875 40.1875 14.4062 L40.1875 38.6719 Q36.1406 46.1406 27.7344 46.1406 Q21.0938 46.1406 17.3828 41.0156 Q13.6719 35.8906 13.6719 25.8281 Z"
        /><glyph unicode="u" horiz-adv-x="55.0" d="M39.4531 5.2188 Q34.1875 -0.9844 23.9688 -0.9844 Q15.5312 -0.9844 11.1094 3.9297 Q6.6875 8.8438 6.6406 18.4531 L6.6406 52.8281 L15.6719 52.8281 L15.6719 18.7031 Q15.6719 6.6875 25.4375 6.6875 Q35.7969 6.6875 39.2031 14.4062 L39.2031 52.8281 L48.25 52.8281 L48.25 0 L39.6562 0 L39.4531 5.2188 Z"
        /><glyph unicode="t" horiz-adv-x="33.0" d="M19.0938 65.625 L19.0938 52.8281 L28.9531 52.8281 L28.9531 45.8438 L19.0938 45.8438 L19.0938 13.0938 Q19.0938 9.9062 20.4141 8.3203 Q21.7344 6.7344 24.9062 6.7344 Q26.4688 6.7344 29.2031 7.3281 L29.2031 0 Q25.6406 -0.9844 22.2656 -0.9844 Q16.2188 -0.9844 13.1406 2.6797 Q10.0625 6.3438 10.0625 13.0938 L10.0625 45.8438 L0.4375 45.8438 L0.4375 52.8281 L10.0625 52.8281 L10.0625 65.625 L19.0938 65.625 Z"
        /><glyph unicode="l" horiz-adv-x="24.0" d="M16.6562 0 L7.625 0 L7.625 75 L16.6562 75 L16.6562 0 Z"
        /><glyph unicode="p" horiz-adv-x="56.0" d="M51.4688 25.8281 Q51.4688 13.7656 45.9531 6.3906 Q40.4375 -0.9844 31 -0.9844 Q21.3906 -0.9844 15.875 5.125 L15.875 -20.3125 L6.8438 -20.3125 L6.8438 52.8281 L15.0938 52.8281 L15.5312 46.9688 Q21.0469 53.8125 30.8594 53.8125 Q40.375 53.8125 45.9219 46.6328 Q51.4688 39.4531 51.4688 26.6562 L51.4688 25.8281 ZM42.4375 26.8594 Q42.4375 35.7969 38.625 40.9688 Q34.8125 46.1406 28.1719 46.1406 Q19.9688 46.1406 15.875 38.875 L15.875 13.625 Q19.9219 6.3906 28.2656 6.3906 Q34.7656 6.3906 38.6016 11.5469 Q42.4375 16.7031 42.4375 26.8594 Z"
        /><glyph unicode="A" horiz-adv-x="65.0" d="M47.5156 18.5625 L17.7188 18.5625 L11.0312 0 L1.375 0 L28.5156 71.0938 L36.7188 71.0938 L63.9219 0 L54.2969 0 L47.5156 18.5625 ZM20.5625 26.2656 L44.7344 26.2656 L32.625 59.5156 L20.5625 26.2656 Z"
        /><glyph unicode="n" horiz-adv-x="55.0" d="M15.375 52.8281 L15.6719 46.1875 Q21.7344 53.8125 31.5 53.8125 Q48.25 53.8125 48.3906 34.9062 L48.3906 0 L39.3594 0 L39.3594 34.9688 Q39.3125 40.6719 36.75 43.4062 Q34.1875 46.1406 28.7656 46.1406 Q24.3594 46.1406 21.0391 43.7969 Q17.7188 41.4531 15.875 37.6406 L15.875 0 L6.8438 0 L6.8438 52.8281 L15.375 52.8281 Z"
        /><glyph unicode="o" horiz-adv-x="57.0" d="M4.4375 26.9062 Q4.4375 34.6719 7.4922 40.875 Q10.5469 47.0781 15.9922 50.4453 Q21.4375 53.8125 28.4219 53.8125 Q39.2031 53.8125 45.875 46.3438 Q52.5469 38.875 52.5469 26.4688 L52.5469 25.8281 Q52.5469 18.1094 49.5859 11.9844 Q46.625 5.8594 41.1328 2.4375 Q35.6406 -0.9844 28.5156 -0.9844 Q17.7812 -0.9844 11.1094 6.4922 Q4.4375 13.9688 4.4375 26.2656 L4.4375 26.9062 ZM13.5312 25.8281 Q13.5312 17.0469 17.6094 11.7188 Q21.6875 6.3906 28.5156 6.3906 Q35.4062 6.3906 39.4531 11.7891 Q43.5 17.1875 43.5 26.9062 Q43.5 35.5938 39.375 40.9922 Q35.25 46.3906 28.4219 46.3906 Q21.7344 46.3906 17.6328 41.0703 Q13.5312 35.75 13.5312 25.8281 Z"
        /><glyph unicode="r" horiz-adv-x="34.0" d="M32.375 44.7344 Q30.3281 45.0625 27.9375 45.0625 Q19.0469 45.0625 15.875 37.5 L15.875 0 L6.8438 0 L6.8438 52.8281 L15.625 52.8281 L15.7656 46.7344 Q20.2188 53.8125 28.375 53.8125 Q31 53.8125 32.375 53.125 L32.375 44.7344 Z"
        /><glyph unicode="I" horiz-adv-x="27.0" d="M18.3125 0 L8.9375 0 L8.9375 71.0938 L18.3125 71.0938 L18.3125 0 Z"
      /></font
    ></defs
    ><g style="fill:rgb(204,204,204); text-rendering:optimizeLegibility; stroke:rgb(204,204,204);"
    ><rect x="0" width="611" height="282" y="0" style="stroke:none;"
    /></g
    ><g style="stroke-linecap:butt; fill:white; text-rendering:geometricPrecision; stroke-linejoin:bevel; shape-rendering:crispEdges; stroke:white; stroke-width:0;"
    ><path style="stroke:none;" d="M537.68 33.84 L537.68 248.16 L73.32 33.84 Z"
      /><path style="stroke:none;" d="M537.68 248.16 L73.32 248.16 L73.32 33.84 Z"
      /><path style="stroke:none;" d="M537.68 33.84 L537.68 248.16 L537.68 248.16 Z"
      /><path style="stroke:none;" d="M73.32 33.84 L73.32 248.16 L73.32 248.16 Z"
      /><path style="stroke:none;" d="M537.68 33.84 L537.68 248.16 L73.32 33.84 Z"
      /><path style="stroke:none;" d="M537.68 248.16 L73.32 248.16 L73.32 33.84 Z"
      /><path style="stroke:none;" d="M537.68 33.84 L537.68 33.84 L537.68 248.16 Z"
      /><path style="stroke:none;" d="M73.32 33.84 L73.32 33.84 L73.32 248.16 Z"
      /><path style="stroke:none;" d="M537.68 33.84 L73.32 33.84 L537.68 33.84 Z"
      /><path style="stroke:none;" d="M73.32 33.84 L73.32 33.84 L537.68 33.84 Z"
      /><path style="stroke:none;" d="M537.68 248.16 L73.32 248.16 L537.68 248.16 Z"
      /><path style="stroke:none;" d="M73.32 248.16 L73.32 248.16 L537.68 248.16 Z"
    /></g
    ><g style="fill:rgb(190,190,190); text-rendering:geometricPrecision; stroke-dasharray:4,4; shape-rendering:crispEdges; stroke-linecap:butt; stroke:rgb(190,190,190);"
    ><path style="fill:none;" d="M73.32 248.16 L73.32 33.84"
      /><path style="fill:none;" d="M73.32 248.16 L73.32 248.16"
      /><path style="fill:none;" d="M102.3425 248.16 L102.3425 33.84"
      /><path style="fill:none;" d="M102.3425 248.16 L102.3425 248.16"
      /><path style="fill:none;" d="M131.365 248.16 L131.365 33.84"
      /><path style="fill:none;" d="M131.365 248.16 L131.365 248.16"
      /><path style="fill:none;" d="M160.3875 248.16 L160.3875 33.84"
      /><path style="fill:none;" d="M160.3875 248.16 L160.3875 248.16"
      /><path style="fill:none;" d="M189.41 248.16 L189.41 33.84"
      /><path style="fill:none;" d="M189.41 248.16 L189.41 248.16"
      /><path style="fill:none;" d="M218.4325 248.16 L218.4325 33.84"
      /><path style="fill:none;" d="M218.4325 248.16 L218.4325 248.16"
      /><path style="fill:none;" d="M247.455 248.16 L247.455 33.84"
      /><path style="fill:none;" d="M247.455 248.16 L247.455 248.16"
      /><path style="fill:none;" d="M276.4775 248.16 L276.4775 33.84"
      /><path style="fill:none;" d="M276.4775 248.16 L276.4775 248.16"
      /><path style="fill:none;" d="M305.5 248.16 L305.5 33.84"
      /><path style="fill:none;" d="M305.5 248.16 L305.5 248.16"
      /><path style="fill:none;" d="M334.5225 248.16 L334.5225 33.84"
      /><path style="fill:none;" d="M334.5225 248.16 L334.5225 248.16"
      /><path style="fill:none;" d="M363.545 248.16 L363.545 33.84"
      /><path style="fill:none;" d="M363.545 248.16 L363.545 248.16"
      /><path style="fill:none;" d="M392.5675 248.16 L392.5675 33.84"
      /><path style="fill:none;" d="M392.5675 248.16 L392.5675 248.16"
      /><path style="fill:none;" d="M421.59 248.16 L421.59 33.84"
      /><path style="fill:none;" d="M421.59 248.16 L421.59 248.16"
      /><path style="fill:none;" d="M450.6125 248.16 L450.6125 33.84"
      /><path style="fill:none;" d="M450.6125 248.16 L450.6125 248.16"
      /><path style="fill:none;" d="M479.635 248.16 L479.635 33.84"
      /><path style="fill:none;" d="M479.635 248.16 L479.635 248.16"
      /><path style="fill:none;" d="M508.6575 248.16 L508.6575 33.84"
      /><path style="fill:none;" d="M508.6575 248.16 L508.6575 248.16"
      /><path style="fill:none;" d="M537.68 248.16 L537.68 33.84"
      /><path style="fill:none;" d="M537.68 248.16 L537.68 248.16"
      /><path style="fill:none;" d="M73.32 200.5333 L537.68 200.5333"
      /><path style="fill:none;" d="M73.32 200.5333 L73.32 200.5333"
      /><path style="fill:none;" d="M73.32 141 L537.68 141"
      /><path style="fill:none;" d="M73.32 141 L73.32 141"
      /><path style="fill:none;" d="M73.32 81.4667 L537.68 81.4667"
      /><path style="fill:none;" d="M73.32 81.4667 L73.32 81.4667"
    /></g
    ><g transform="translate(69.82,257.16)" style="font-size:10px; stroke-linecap:butt; text-rendering:geometricPrecision; font-family:sans-serif; stroke-linejoin:bevel; stroke-width:0;"
    ><text x="-0.5625" xml:space="preserve" y="10.4785" style="stroke:none;"
      >0</text
    ></g
    ><g transform="translate(185.91,257.16)" style="font-size:10px; stroke-linecap:butt; text-rendering:geometricPrecision; font-family:sans-serif; stroke-linejoin:bevel; stroke-width:0;"
    ><text x="-0.4531" xml:space="preserve" y="10.4785" style="stroke:none;"
      >2</text
    ></g
    ><g transform="translate(301.5,257.16)" style="font-size:10px; stroke-linecap:butt; text-rendering:geometricPrecision; font-family:sans-serif; stroke-linejoin:bevel; stroke-width:0;"
    ><text x="-0.2656" xml:space="preserve" y="10.4785" style="stroke:none;"
      >4</text
    ></g
    ><g transform="translate(418.09,257.16)" style="font-size:10px; stroke-linecap:butt; text-rendering:geometricPrecision; font-family:sans-serif; stroke-linejoin:bevel; stroke-width:0;"
    ><text x="-0.6406" xml:space="preserve" y="10.4785" style="stroke:none;"
      >6</text
    ></g
    ><g transform="translate(534.18,257.16)" style="font-size:10px; stroke-linecap:butt; text-rendering:geometricPrecision; font-family:sans-serif; stroke-linejoin:bevel; stroke-width:0;"
    ><text x="-0.5469" xml:space="preserve" y="10.4785" style="stroke:none;"
      >8</text
    ></g
    ><g transform="translate(128.865,257.16)" style="font-size:10px; stroke-linecap:butt; text-rendering:geometricPrecision; font-family:sans-serif; stroke-linejoin:bevel; stroke-width:0;"
    ><text x="-0.8281" xml:space="preserve" y="10.4785" style="stroke:none;"
      >1</text
    ></g
    ><g transform="translate(243.955,257.16)" style="font-size:10px; stroke-linecap:butt; text-rendering:geometricPrecision; font-family:sans-serif; stroke-linejoin:bevel; stroke-width:0;"
    ><text x="-0.4531" xml:space="preserve" y="10.4785" style="stroke:none;"
      >3</text
    ></g
    ><g transform="translate(360.045,257.16)" style="font-size:10px; stroke-linecap:butt; text-rendering:geometricPrecision; font-family:sans-serif; stroke-linejoin:bevel; stroke-width:0;"
    ><text x="-0.75" xml:space="preserve" y="10.4785" style="stroke:none;"
      >5</text
    ></g
    ><g transform="translate(476.135,257.16)" style="font-size:10px; stroke-linecap:butt; text-rendering:geometricPrecision; font-family:sans-serif; stroke-linejoin:bevel; stroke-width:0;"
    ><text x="-0.375" xml:space="preserve" y="10.4785" style="stroke:none;"
      >7</text
    ></g
    ><g transform="translate(94.3425,257.16)" style="font-size:10px; stroke-linecap:butt; text-rendering:geometricPrecision; font-family:sans-serif; stroke-linejoin:bevel; stroke-width:0;"
    ><text x="-0.5625" xml:space="preserve" y="10.4785" style="stroke:none;"
      >0.5</text
    ></g
    ><g transform="translate(152.3875,257.16)" style="font-size:10px; stroke-linecap:butt; text-rendering:geometricPrecision; font-family:sans-serif; stroke-linejoin:bevel; stroke-width:0;"
    ><text x="-0.8281" xml:space="preserve" y="10.4785" style="stroke:none;"
      >1.5</text
    ></g
    ><g transform="translate(210.4325,257.16)" style="font-size:10px; stroke-linecap:butt; text-rendering:geometricPrecision; font-family:sans-serif; stroke-linejoin:bevel; stroke-width:0;"
    ><text x="-0.4531" xml:space="preserve" y="10.4785" style="stroke:none;"
      >2.5</text
    ></g
    ><g transform="translate(268.4775,257.16)" style="font-size:10px; stroke-linecap:butt; text-rendering:geometricPrecision; font-family:sans-serif; stroke-linejoin:bevel; stroke-width:0;"
    ><text x="-0.4531" xml:space="preserve" y="10.4785" style="stroke:none;"
      >3.5</text
    ></g
    ><g transform="translate(326.5225,257.16)" style="font-size:10px; stroke-linecap:butt; text-rendering:geometricPrecision; font-family:sans-serif; stroke-linejoin:bevel; stroke-width:0;"
    ><text x="-0.2656" xml:space="preserve" y="10.4785" style="stroke:none;"
      >4.5</text
    ></g
    ><g transform="translate(384.5675,257.16)" style="font-size:10px; stroke-linecap:butt; text-rendering:geometricPrecision; font-family:sans-serif; stroke-linejoin:bevel; stroke-width:0;"
    ><text x="-0.75" xml:space="preserve" y="10.4785" style="stroke:none;"
      >5.5</text
    ></g
    ><g transform="translate(442.6125,257.16)" style="font-size:10px; stroke-linecap:butt; text-rendering:geometricPrecision; font-family:sans-serif; stroke-linejoin:bevel; stroke-width:0;"
    ><text x="-0.6406" xml:space="preserve" y="10.4785" style="stroke:none;"
      >6.5</text
    ></g
    ><g transform="translate(500.6575,257.16)" style="font-size:10px; stroke-linecap:butt; text-rendering:geometricPrecision; font-family:sans-serif; stroke-linejoin:bevel; stroke-width:0;"
    ><text x="-0.375" xml:space="preserve" y="10.4785" style="stroke:none;"
      >7.5</text
    ></g
    ><g style="text-rendering:geometricPrecision; font-size:10px; shape-rendering:crispEdges; font-family:sans-serif; stroke-linecap:butt;"
    ><path style="fill:none;" d="M73.32 248.16 L73.32 254.16"
      /><path style="fill:none;" d="M102.3425 248.16 L102.3425 254.16"
      /><path style="fill:none;" d="M131.365 248.16 L131.365 254.16"
      /><path style="fill:none;" d="M160.3875 248.16 L160.3875 254.16"
      /><path style="fill:none;" d="M189.41 248.16 L189.41 254.16"
      /><path style="fill:none;" d="M218.4325 248.16 L218.4325 254.16"
      /><path style="fill:none;" d="M247.455 248.16 L247.455 254.16"
      /><path style="fill:none;" d="M276.4775 248.16 L276.4775 254.16"
      /><path style="fill:none;" d="M305.5 248.16 L305.5 254.16"
      /><path style="fill:none;" d="M334.5225 248.16 L334.5225 254.16"
      /><path style="fill:none;" d="M363.545 248.16 L363.545 254.16"
      /><path style="fill:none;" d="M392.5675 248.16 L392.5675 254.16"
      /><path style="fill:none;" d="M421.59 248.16 L421.59 254.16"
      /><path style="fill:none;" d="M450.6125 248.16 L450.6125 254.16"
      /><path style="fill:none;" d="M479.635 248.16 L479.635 254.16"
      /><path style="fill:none;" d="M508.6575 248.16 L508.6575 254.16"
      /><path style="fill:none;" d="M537.68 248.16 L537.68 254.16"
      /><path style="fill:none;" d="M537.68 248.16 L73.32 248.16"
      /><text x="-0.5625" y="10.4785" transform="translate(57.32,193.0333)" style="stroke-linejoin:bevel; shape-rendering:auto; stroke:none; stroke-width:0;" xml:space="preserve"
      >0</text
    ></g
    ><g transform="translate(59.32,73.9667)" style="font-size:10px; stroke-linecap:butt; text-rendering:geometricPrecision; font-family:sans-serif; stroke-linejoin:bevel; stroke-width:0;"
    ><text x="-0.8281" xml:space="preserve" y="10.4785" style="stroke:none;"
      >1</text
    ></g
    ><g transform="translate(48.32,133.5)" style="font-size:10px; stroke-linecap:butt; text-rendering:geometricPrecision; font-family:sans-serif; stroke-linejoin:bevel; stroke-width:0;"
    ><text x="-0.5625" xml:space="preserve" y="10.4785" style="stroke:none;"
      >0.5</text
    ></g
    ><g style="text-rendering:geometricPrecision; font-size:10px; shape-rendering:crispEdges; font-family:sans-serif; stroke-linecap:butt;"
    ><path style="fill:none;" d="M73.32 200.5333 L67.32 200.5333"
      /><path style="fill:none;" d="M73.32 141 L67.32 141"
      /><path style="fill:none;" d="M73.32 81.4667 L67.32 81.4667"
      /><path style="fill:none;" d="M73.32 248.16 L70.32 248.16"
      /><path style="fill:none;" d="M73.32 236.2533 L70.32 236.2533"
      /><path style="fill:none;" d="M73.32 224.3467 L70.32 224.3467"
      /><path style="fill:none;" d="M73.32 212.44 L70.32 212.44"
      /><path style="fill:none;" d="M73.32 200.5333 L70.32 200.5333"
      /><path style="fill:none;" d="M73.32 188.6267 L70.32 188.6267"
      /><path style="fill:none;" d="M73.32 176.72 L70.32 176.72"
      /><path style="fill:none;" d="M73.32 164.8133 L70.32 164.8133"
      /><path style="fill:none;" d="M73.32 152.9067 L70.32 152.9067"
      /><path style="fill:none;" d="M73.32 141 L70.32 141"
      /><path style="fill:none;" d="M73.32 129.0933 L70.32 129.0933"
      /><path style="fill:none;" d="M73.32 117.1867 L70.32 117.1867"
      /><path style="fill:none;" d="M73.32 105.28 L70.32 105.28"
      /><path style="fill:none;" d="M73.32 93.3733 L70.32 93.3733"
      /><path style="fill:none;" d="M73.32 81.4667 L70.32 81.4667"
      /><path style="fill:none;" d="M73.32 69.56 L70.32 69.56"
      /><path style="fill:none;" d="M73.32 57.6533 L70.32 57.6533"
      /><path style="fill:none;" d="M73.32 45.7467 L70.32 45.7467"
      /><path style="fill:none;" d="M73.32 33.84 L70.32 33.84"
      /><path style="fill:none;" d="M73.32 33.84 L73.32 248.16"
      /><text x="1.7656" y="12.4785" transform="translate(285,275.16)" style="stroke-linejoin:bevel; shape-rendering:auto; stroke:none; stroke-width:0;" xml:space="preserve"
      >Time (s)</text
    ></g
    ><g transform="translate(45.32,141) rotate(270) translate(-26,-19)" style="font-size:10px; stroke-linecap:butt; text-rendering:geometricPrecision; font-family:sans-serif; stroke-linejoin:bevel; stroke-width:0;"
    ><text x="1.8594" xml:space="preserve" y="12.4785" style="stroke:none;"
      >Amplitude</text
    ></g
    ><g style="text-rendering:geometricPrecision; font-size:10px; stroke-dasharray:1,4,7,4; shape-rendering:crispEdges; font-family:sans-serif; stroke-linecap:butt;"
    ><path style="fill:none;" d="M73.3154 200.5333 L537.6846 200.5333"
      /><path d="M73.32 200.5333 L80.2787 198.9667 L87.2374 191.508 L94.1961 178.471 L101.1549 162.4477 L108.1136 146.0932 L115.0723 131.4007 L122.031 119.6043 L128.9897 111.302 L135.9484 106.6276 L142.9071 105.4035 L149.8658 107.2605 L156.8246 111.7228 L163.7833 118.269 L170.742 126.3728 L177.7007 135.5306 L184.6594 145.2798 L191.6181 155.2105 L198.5768 164.9717 L205.5356 174.2741 L212.4943 182.8903 L219.453 190.652 L226.4117 197.4464 L233.3704 203.2105 L240.3291 207.9256 L247.2878 211.6102 L254.2466 214.3137 L261.2053 216.1094 L268.164 217.0885 L275.1227 217.3539 L282.0814 217.0152 L289.0401 216.1837 L295.9988 214.9686 L302.9576 213.4738 L309.9163 211.7951 L316.875 210.0186 L323.8337 208.2197 L330.7924 206.4616 L337.7511 204.7961 L344.7098 203.2632 L351.6685 201.8918 L358.6273 200.701 L365.586 199.7004 L372.5447 198.8919 L379.5034 198.2707 L386.4621 197.8266 L393.4208 197.545 L400.3795 197.4087 L407.3383 197.3982 L414.297 197.4931 L421.2557 197.673 L428.2144 197.918 L435.1731 198.2091 L442.1318 198.5292 L449.0905 198.8629 L456.0492 199.1969 L463.0079 199.5201 L469.9667 199.8237 L476.9254 200.1007 L483.8841 200.3464 L490.8428 200.5578 L497.8015 200.7336 L504.7602 200.8737 L511.719 200.9796 L518.6777 201.0532 L525.6364 201.0974 L532.5951 201.1157" style="fill:none; stroke-dasharray:none; clip-path:url(#clipPath1); stroke:blue;"
      /><path style="fill:none;" d="M73.3154 200.5333 L537.6846 200.5333"
      /><path d="M73.32 81.4667 L80.2787 83.0333 L87.2374 90.492 L94.1961 103.529 L101.1549 119.5523 L108.1136 135.9068 L115.0723 150.5993 L122.031 162.3957 L128.9897 170.698 L135.9484 175.3724 L142.9071 176.5965 L149.8658 174.7395 L156.8246 170.2772 L163.7833 163.731 L170.742 155.6272 L177.7007 146.4694 L184.6594 136.7202 L191.6181 126.7895 L198.5768 117.0283 L205.5356 107.7259 L212.4943 99.1097 L219.453 91.348 L226.4117 84.5536 L233.3704 78.7895 L240.3291 74.0744 L247.2878 70.3898 L254.2466 67.6863 L261.2053 65.8906 L268.164 64.9115 L275.1227 64.6461 L282.0814 64.9848 L289.0401 65.8163 L295.9988 67.0314 L302.9576 68.5262 L309.9163 70.2049 L316.875 71.9813 L323.8337 73.7803 L330.7924 75.5384 L337.7511 77.2039 L344.7098 78.7368 L351.6685 80.1082 L358.6273 81.299 L365.586 82.2996 L372.5447 83.1081 L379.5034 83.7293 L386.4621 84.1734 L393.4208 84.4549 L400.3795 84.5913 L407.3383 84.6018 L414.297 84.5069 L421.2557 84.327 L428.2144 84.082 L435.1731 83.7909 L442.1318 83.4708 L449.0905 83.1371 L456.0492 82.8031 L463.0079 82.4799 L469.9667 82.1763 L476.9254 81.8993 L483.8841 81.6536 L490.8428 81.4422 L497.8015 81.2664 L504.7602 81.1263 L511.719 81.0204 L518.6777 80.9468 L525.6364 80.9026 L532.5951 80.8843" style="fill:none; stroke-dasharray:none; clip-path:url(#clipPath1); stroke:green;"
      /><path d="M142.9071 105.4035 L142.9071 248.1621" style="fill:none; stroke-dasharray:11,5; stroke:blue;"
      /><path d="M73.3154 105.4035 L142.9071 105.4035" style="fill:none; stroke-dasharray:11,5; stroke:blue;"
    /></g
    ><g transform="translate(142.9071,105.4035)" style="stroke-linecap:butt; font-size:10px; fill:blue; text-rendering:geometricPrecision; font-family:sans-serif; stroke-linejoin:bevel; stroke:blue; stroke-width:0;"
    ><circle r="5.5" style="stroke:none;" cx="0" cy="0"
    /></g
    ><g style="stroke-linecap:butt; font-size:10px; fill:green; text-rendering:geometricPrecision; font-family:sans-serif; shape-rendering:crispEdges; stroke-dasharray:11,5; stroke:green;"
    ><path style="fill:none;" d="M275.1227 64.6461 L275.1227 248.1621"
      /><path style="fill:none;" d="M73.3154 64.6461 L275.1227 64.6461"
    /></g
    ><g transform="translate(275.1227,64.6461)" style="stroke-linecap:butt; font-size:10px; fill:green; text-rendering:geometricPrecision; font-family:sans-serif; stroke-linejoin:bevel; stroke:green; stroke-width:0;"
    ><circle r="5.5" style="stroke:none;" cx="0" cy="0"
    /></g
    ><g transform="translate(260.5,7)" style="font-size:10px; stroke-linecap:butt; text-rendering:geometricPrecision; font-family:sans-serif; stroke-linejoin:bevel; stroke-width:0;"
    ><text x="1.1094" xml:space="preserve" y="12.4785" style="stroke:none;"
      >Impulse responses</text
    ></g
  ></g
></svg
>
