<?xml version="1.0" encoding="UTF-8"?>
<!DOCTYPE svg PUBLIC '-//W3C//DTD SVG 1.0//EN'
          'http://www.w3.org/TR/2001/REC-SVG-20010904/DTD/svg10.dtd'>
<svg xmlns:xlink="http://www.w3.org/1999/xlink" style="fill-opacity:1; color-rendering:auto; color-interpolation:auto; text-rendering:auto; stroke:black; stroke-linecap:square; stroke-miterlimit:10; shape-rendering:auto; stroke-opacity:1; fill:black; stroke-dasharray:none; font-weight:normal; stroke-width:1; font-family:'Dialog'; font-style:normal; stroke-linejoin:miter; font-size:12px; stroke-dashoffset:0; image-rendering:auto;" width="611" height="444" xmlns="http://www.w3.org/2000/svg"
><!--Generated by Scilab with Batik SVG Generator--><defs id="genericDefs"
  /><g
  ><defs id="defs1"
    ><clipPath clipPathUnits="userSpaceOnUse" id="clipPath1"
      ><path d="M73.3154 53.2766 L537.6846 53.2766 L537.6846 390.7234 L73.3154 390.7234 L73.3154 53.2766 Z"
      /></clipPath
      ><font horiz-adv-x="44.0" id="font1"
      ><font-face ascent="104.78516" descent="27.09961" units-per-em="100" style="font-style:normal; font-family:sans-serif; font-weight:normal;"
        /><missing-glyph horiz-adv-x="44.0" d="M39.4531 0 L4.8906 0 L4.8906 71.0938 L39.4531 71.0938 L39.4531 0 ZM36.8125 4.1094 L36.8125 66.9375 L23.4375 35.5469 L36.8125 4.1094 ZM7.5156 66.3594 L7.5156 4.6875 L20.6094 35.5469 L7.5156 66.3594 ZM9.4688 2.6406 L34.625 2.6406 L22.0156 32.2344 L9.4688 2.6406 ZM22.0156 38.875 L34.625 68.4531 L9.4688 68.4531 L22.0156 38.875 Z"
        /><glyph unicode="0" horiz-adv-x="56.0" d="M50.4844 30.3281 Q50.4844 14.4531 45.0703 6.7344 Q39.6562 -0.9844 28.125 -0.9844 Q16.75 -0.9844 11.2812 6.5625 Q5.8125 14.1094 5.6094 29.1094 L5.6094 41.1562 Q5.6094 56.8438 11.0312 64.4609 Q16.4531 72.0781 28.0312 72.0781 Q39.5 72.0781 44.9219 64.7266 Q50.3438 57.375 50.4844 42.0469 L50.4844 30.3281 ZM41.4531 42.6719 Q41.4531 54.1562 38.2344 59.4062 Q35.0156 64.6562 28.0312 64.6562 Q21.0938 64.6562 17.9219 59.4297 Q14.75 54.2031 14.6562 43.3594 L14.6562 28.9062 Q14.6562 17.3906 18 11.8906 Q21.3438 6.3906 28.125 6.3906 Q34.8125 6.3906 38.0625 11.5703 Q41.3125 16.75 41.4531 27.875 L41.4531 42.6719 Z"
        /><glyph unicode="1" horiz-adv-x="56.0" d="M35.5938 0 L26.5156 0 L26.5156 60.2031 L8.2969 53.5156 L8.2969 61.7188 L34.1875 71.4375 L35.5938 71.4375 L35.5938 0 Z"
        /><glyph unicode="-" horiz-adv-x="28.0" d="M25.6406 26.5156 L1.8125 26.5156 L1.8125 33.8906 L25.6406 33.8906 L25.6406 26.5156 Z"
        /><glyph unicode="8" horiz-adv-x="56.0" d="M49.0312 52.5469 Q49.0312 47.2188 46.2188 43.0703 Q43.4062 38.9219 38.625 36.5781 Q44.1875 34.1875 47.4375 29.5938 Q50.6875 25 50.6875 19.1875 Q50.6875 9.9688 44.4609 4.4922 Q38.2344 -0.9844 28.0781 -0.9844 Q17.8281 -0.9844 11.6484 4.5156 Q5.4688 10.0156 5.4688 19.1875 Q5.4688 24.9531 8.6172 29.5938 Q11.7656 34.2344 17.3281 36.625 Q12.5938 38.9688 9.8594 43.1172 Q7.125 47.2656 7.125 52.5469 Q7.125 61.5312 12.8906 66.8047 Q18.6562 72.0781 28.0781 72.0781 Q37.4531 72.0781 43.2422 66.8047 Q49.0312 61.5312 49.0312 52.5469 ZM41.6562 19.3906 Q41.6562 25.3438 37.8672 29.1016 Q34.0781 32.8594 27.9766 32.8594 Q21.875 32.8594 18.1875 29.1484 Q14.5 25.4375 14.5 19.3828 Q14.5 13.3281 18.0938 9.8594 Q21.6875 6.3906 28.0781 6.3906 Q34.4219 6.3906 38.0391 9.8828 Q41.6562 13.375 41.6562 19.3906 ZM28.0781 64.6562 Q22.75 64.6562 19.4531 61.3594 Q16.1562 58.0625 16.1562 52.3906 Q16.1562 46.9688 19.4062 43.625 Q22.6562 40.2812 28.0781 40.2812 Q33.5 40.2812 36.7422 43.625 Q39.9844 46.9688 39.9844 52.3906 Q39.9844 57.8125 36.6172 61.2344 Q33.25 64.6562 28.0781 64.6562 Z"
        /><glyph unicode="." horiz-adv-x="26.0" d="M7.0312 4.7344 Q7.0312 7.0781 8.4219 8.6406 Q9.8125 10.2031 12.5938 10.2031 Q15.375 10.2031 16.8203 8.6406 Q18.2656 7.0781 18.2656 4.7344 Q18.2656 2.4844 16.8203 0.9766 Q15.375 -0.5312 12.5938 -0.5312 Q9.8125 -0.5312 8.4219 0.9766 Q7.0312 2.4844 7.0312 4.7344 Z"
        /><glyph unicode="6" horiz-adv-x="56.0" d="M41.3594 71.1406 L41.3594 63.4844 L39.7031 63.4844 Q29.1562 63.2812 22.9062 57.2266 Q16.6562 51.1719 15.6719 40.1875 Q21.2969 46.625 31 46.625 Q40.2812 46.625 45.8281 40.0859 Q51.375 33.5469 51.375 23.1875 Q51.375 12.2031 45.3906 5.6094 Q39.4062 -0.9844 29.3438 -0.9844 Q19.1406 -0.9844 12.7969 6.8594 Q6.4531 14.7031 6.4531 27.0469 L6.4531 30.5156 Q6.4531 50.1406 14.8203 60.5234 Q23.1875 70.9062 39.75 71.1406 L41.3594 71.1406 ZM29.5 39.1094 Q24.8594 39.1094 20.9531 36.3281 Q17.0469 33.5469 15.5312 29.3438 L15.5312 26.0312 Q15.5312 17.2344 19.4844 11.8672 Q23.4375 6.5 29.3438 6.5 Q35.4531 6.5 38.9453 10.9922 Q42.4375 15.4844 42.4375 22.75 Q42.4375 30.0781 38.8984 34.5938 Q35.3594 39.1094 29.5 39.1094 Z"
        /><glyph unicode="4" horiz-adv-x="56.0" d="M44.0469 23.875 L53.9062 23.875 L53.9062 16.5 L44.0469 16.5 L44.0469 0 L34.9688 0 L34.9688 16.5 L2.5938 16.5 L2.5938 21.8281 L34.4219 71.0938 L44.0469 71.0938 L44.0469 23.875 ZM12.8438 23.875 L34.9688 23.875 L34.9688 58.7344 L33.8906 56.7812 L12.8438 23.875 Z"
        /><glyph unicode="2" horiz-adv-x="56.0" d="M52.4844 0 L5.9062 0 L5.9062 6.5 L30.5156 33.8438 Q35.9844 40.0469 38.0625 43.9219 Q40.1406 47.7969 40.1406 51.9531 Q40.1406 57.5156 36.7734 61.0859 Q33.4062 64.6562 27.7812 64.6562 Q21.0469 64.6562 17.3125 60.8203 Q13.5781 56.9844 13.5781 50.1406 L4.5469 50.1406 Q4.5469 59.9688 10.8672 66.0234 Q17.1875 72.0781 27.7812 72.0781 Q37.7031 72.0781 43.4609 66.875 Q49.2188 61.6719 49.2188 53.0312 Q49.2188 42.5312 35.8438 28.0312 L16.7969 7.375 L52.4844 7.375 L52.4844 0 Z"
        /><glyph unicode="t" horiz-adv-x="33.0" d="M19.0938 65.625 L19.0938 52.8281 L28.9531 52.8281 L28.9531 45.8438 L19.0938 45.8438 L19.0938 13.0938 Q19.0938 9.9062 20.4141 8.3203 Q21.7344 6.7344 24.9062 6.7344 Q26.4688 6.7344 29.2031 7.3281 L29.2031 0 Q25.6406 -0.9844 22.2656 -0.9844 Q16.2188 -0.9844 13.1406 2.6797 Q10.0625 6.3438 10.0625 13.0938 L10.0625 45.8438 L0.4375 45.8438 L0.4375 52.8281 L10.0625 52.8281 L10.0625 65.625 L19.0938 65.625 Z"
        /><glyph unicode="r" horiz-adv-x="34.0" d="M32.375 44.7344 Q30.3281 45.0625 27.9375 45.0625 Q19.0469 45.0625 15.875 37.5 L15.875 0 L6.8438 0 L6.8438 52.8281 L15.625 52.8281 L15.7656 46.7344 Q20.2188 53.8125 28.375 53.8125 Q31 53.8125 32.375 53.125 L32.375 44.7344 Z"
        /><glyph unicode="p" horiz-adv-x="56.0" d="M51.4688 25.8281 Q51.4688 13.7656 45.9531 6.3906 Q40.4375 -0.9844 31 -0.9844 Q21.3906 -0.9844 15.875 5.125 L15.875 -20.3125 L6.8438 -20.3125 L6.8438 52.8281 L15.0938 52.8281 L15.5312 46.9688 Q21.0469 53.8125 30.8594 53.8125 Q40.375 53.8125 45.9219 46.6328 Q51.4688 39.4531 51.4688 26.6562 L51.4688 25.8281 ZM42.4375 26.8594 Q42.4375 35.7969 38.625 40.9688 Q34.8125 46.1406 28.1719 46.1406 Q19.9688 46.1406 15.875 38.875 L15.875 13.625 Q19.9219 6.3906 28.2656 6.3906 Q34.7656 6.3906 38.6016 11.5469 Q42.4375 16.7031 42.4375 26.8594 Z"
        /><glyph unicode=" " horiz-adv-x="25.0" d=""
        /><glyph unicode="l" horiz-adv-x="24.0" d="M16.6562 0 L7.625 0 L7.625 75 L16.6562 75 L16.6562 0 Z"
        /><glyph unicode="a" horiz-adv-x="54.0" d="M39.4531 0 Q38.6719 1.5625 38.1875 5.5625 Q31.8906 -0.9844 23.1406 -0.9844 Q15.3281 -0.9844 10.3281 3.4375 Q5.3281 7.8594 5.3281 14.6562 Q5.3281 22.9062 11.6016 27.4688 Q17.875 32.0312 29.25 32.0312 L38.0312 32.0312 L38.0312 36.1875 Q38.0312 40.9219 35.2031 43.7266 Q32.375 46.5312 26.8594 46.5312 Q22.0156 46.5312 18.75 44.0938 Q15.4844 41.6562 15.4844 38.1875 L6.3906 38.1875 Q6.3906 42.1406 9.2031 45.8281 Q12.0156 49.5156 16.8203 51.6641 Q21.625 53.8125 27.3906 53.8125 Q36.5312 53.8125 41.7031 49.2422 Q46.875 44.6719 47.0781 36.6719 L47.0781 12.3594 Q47.0781 5.0781 48.9219 0.7812 L48.9219 0 L39.4531 0 ZM24.4688 6.8906 Q28.7188 6.8906 32.5234 9.0859 Q36.3281 11.2812 38.0312 14.7969 L38.0312 25.6406 L30.9531 25.6406 Q14.3594 25.6406 14.3594 15.9219 Q14.3594 11.6719 17.1875 9.2812 Q20.0156 6.8906 24.4688 6.8906 Z"
        /><glyph unicode="e" horiz-adv-x="53.0" d="M28.7656 -0.9844 Q18.0156 -0.9844 11.2812 6.0781 Q4.5469 13.1406 4.5469 24.9531 L4.5469 26.6094 Q4.5469 34.4688 7.5469 40.6484 Q10.5469 46.8281 15.9453 50.3203 Q21.3438 53.8125 27.6406 53.8125 Q37.9375 53.8125 43.6484 47.0234 Q49.3594 40.2344 49.3594 27.5938 L49.3594 23.8281 L13.5781 23.8281 Q13.7656 16.0156 18.1406 11.2031 Q22.5156 6.3906 29.25 6.3906 Q34.0312 6.3906 37.3516 8.3438 Q40.6719 10.2969 43.1719 13.5312 L48.6875 9.2344 Q42.0469 -0.9844 28.7656 -0.9844 ZM27.6406 46.3906 Q22.1719 46.3906 18.4609 42.4062 Q14.75 38.4219 13.875 31.25 L40.3281 31.25 L40.3281 31.9375 Q39.9375 38.8125 36.6172 42.6016 Q33.2969 46.3906 27.6406 46.3906 Z"
        /><glyph unicode="R" horiz-adv-x="62.0" d="M34.3281 28.7656 L17.625 28.7656 L17.625 0 L8.2031 0 L8.2031 71.0938 L31.7344 71.0938 Q43.75 71.0938 50.2188 65.625 Q56.6875 60.1562 56.6875 49.7031 Q56.6875 43.0625 53.1016 38.1328 Q49.5156 33.2031 43.1094 30.7656 L59.8125 0.5938 L59.8125 0 L49.75 0 L34.3281 28.7656 ZM17.625 36.4219 L32.0312 36.4219 Q39.0156 36.4219 43.1406 40.0391 Q47.2656 43.6562 47.2656 49.7031 Q47.2656 56.2969 43.3359 59.8125 Q39.4062 63.3281 31.9844 63.375 L17.625 63.375 L17.625 36.4219 Z"
        /><glyph unicode="y" horiz-adv-x="47.0" d="M24.125 13.2344 L36.4219 52.8281 L46.0938 52.8281 L24.8594 -8.1562 Q19.9219 -21.3438 9.1875 -21.3438 L7.4688 -21.1875 L4.1094 -20.5625 L4.1094 -13.2344 L6.5469 -13.4219 Q11.1406 -13.4219 13.7031 -11.5703 Q16.2656 -9.7188 17.9219 -4.7812 L19.9219 0.5938 L1.0781 52.8281 L10.9375 52.8281 L24.125 13.2344 Z"
        /><glyph unicode="n" horiz-adv-x="55.0" d="M15.375 52.8281 L15.6719 46.1875 Q21.7344 53.8125 31.5 53.8125 Q48.25 53.8125 48.3906 34.9062 L48.3906 0 L39.3594 0 L39.3594 34.9688 Q39.3125 40.6719 36.75 43.4062 Q34.1875 46.1406 28.7656 46.1406 Q24.3594 46.1406 21.0391 43.7969 Q17.7188 41.4531 15.875 37.6406 L15.875 0 L6.8438 0 L6.8438 52.8281 L15.375 52.8281 Z"
        /><glyph unicode="i" horiz-adv-x="24.0" d="M16.6562 0 L7.625 0 L7.625 52.8281 L16.6562 52.8281 L16.6562 0 ZM6.8906 66.8438 Q6.8906 69.0469 8.2344 70.5625 Q9.5781 72.0781 12.2109 72.0781 Q14.8438 72.0781 16.2109 70.5625 Q17.5781 69.0469 17.5781 66.8516 Q17.5781 64.6562 16.2109 63.1875 Q14.8438 61.7188 12.2109 61.7188 Q9.5781 61.7188 8.2344 63.1875 Q6.8906 64.6562 6.8906 66.8438 Z"
        /><glyph unicode="g" horiz-adv-x="56.0" d="M4.6875 26.8594 Q4.6875 39.2031 10.3984 46.5078 Q16.1094 53.8125 25.5312 53.8125 Q35.2031 53.8125 40.625 46.9688 L41.0625 52.8281 L49.3125 52.8281 L49.3125 1.2656 Q49.3125 -8.9844 43.2344 -14.8906 Q37.1562 -20.7969 26.9062 -20.7969 Q21.1875 -20.7969 15.7188 -18.3594 Q10.25 -15.9219 7.375 -11.6719 L12.0625 -6.25 Q17.875 -13.4219 26.2656 -13.4219 Q32.8594 -13.4219 36.5469 -9.7109 Q40.2344 -6 40.2344 0.7344 L40.2344 5.2812 Q34.8125 -0.9844 25.4375 -0.9844 Q16.1562 -0.9844 10.4219 6.4922 Q4.6875 13.9688 4.6875 26.8594 ZM13.7656 25.8281 Q13.7656 16.8906 17.4297 11.7891 Q21.0938 6.6875 27.6875 6.6875 Q36.2344 6.6875 40.2344 14.4531 L40.2344 38.5781 Q36.0781 46.1406 27.7812 46.1406 Q21.1875 46.1406 17.4766 41.0156 Q13.7656 35.8906 13.7656 25.8281 Z"
        /><glyph unicode="m" horiz-adv-x="88.0" d="M15.3281 52.8281 L15.5781 46.9688 Q21.3906 53.8125 31.25 53.8125 Q42.3281 53.8125 46.3438 45.3125 Q48.9688 49.125 53.1953 51.4688 Q57.4219 53.8125 63.1875 53.8125 Q80.5625 53.8125 80.8594 35.4062 L80.8594 0 L71.8281 0 L71.8281 34.8594 Q71.8281 40.5312 69.2422 43.3359 Q66.6562 46.1406 60.5469 46.1406 Q55.5156 46.1406 52.1953 43.1406 Q48.875 40.1406 48.3438 35.0625 L48.3438 0 L39.2656 0 L39.2656 34.625 Q39.2656 46.1406 27.9844 46.1406 Q19.0938 46.1406 15.8281 38.5781 L15.8281 0 L6.7812 0 L6.7812 52.8281 L15.3281 52.8281 Z"
        /><glyph unicode="I" horiz-adv-x="27.0" d="M18.3125 0 L8.9375 0 L8.9375 71.0938 L18.3125 71.0938 L18.3125 0 Z"
        /><glyph unicode="d" horiz-adv-x="56.0" d="M4.6406 26.8594 Q4.6406 39.0156 10.3984 46.4141 Q16.1562 53.8125 25.4844 53.8125 Q34.7656 53.8125 40.1875 47.4688 L40.1875 75 L49.2188 75 L49.2188 0 L40.9219 0 L40.4844 5.6719 Q35.0625 -0.9844 25.3906 -0.9844 Q16.2188 -0.9844 10.4297 6.5391 Q4.6406 14.0625 4.6406 26.1719 L4.6406 26.8594 ZM13.6719 25.8281 Q13.6719 16.8438 17.3828 11.7656 Q21.0938 6.6875 27.6406 6.6875 Q36.2344 6.6875 40.1875 14.4062 L40.1875 38.6719 Q36.1406 46.1406 27.7344 46.1406 Q21.0938 46.1406 17.3828 41.0156 Q13.6719 35.8906 13.6719 25.8281 Z"
        /><glyph unicode="s" horiz-adv-x="52.0" d="M37.5938 14.0156 Q37.5938 17.6719 34.8359 19.7031 Q32.0781 21.7344 25.2188 23.1953 Q18.3594 24.6562 14.3281 26.7109 Q10.2969 28.7656 8.375 31.5938 Q6.4531 34.4219 6.4531 38.3281 Q6.4531 44.8281 11.9453 49.3203 Q17.4375 53.8125 25.9844 53.8125 Q34.9688 53.8125 40.5547 49.1719 Q46.1406 44.5312 46.1406 37.3125 L37.0625 37.3125 Q37.0625 41.0156 33.9141 43.7031 Q30.7656 46.3906 25.9844 46.3906 Q21.0469 46.3906 18.2656 44.2422 Q15.4844 42.0938 15.4844 38.625 Q15.4844 35.3594 18.0703 33.6953 Q20.6562 32.0312 27.4219 30.5156 Q34.1875 29 38.3828 26.9062 Q42.5781 24.8125 44.6016 21.8516 Q46.625 18.8906 46.625 14.6562 Q46.625 7.5625 40.9609 3.2891 Q35.2969 -0.9844 26.2656 -0.9844 Q19.9219 -0.9844 15.0391 1.2656 Q10.1562 3.5156 7.3984 7.5469 Q4.6406 11.5781 4.6406 16.2656 L13.6719 16.2656 Q13.9219 11.7188 17.3125 9.0547 Q20.7031 6.3906 26.2656 6.3906 Q31.3906 6.3906 34.4922 8.4688 Q37.5938 10.5469 37.5938 14.0156 Z"
        /><glyph unicode="u" horiz-adv-x="55.0" d="M39.4531 5.2188 Q34.1875 -0.9844 23.9688 -0.9844 Q15.5312 -0.9844 11.1094 3.9297 Q6.6875 8.8438 6.6406 18.4531 L6.6406 52.8281 L15.6719 52.8281 L15.6719 18.7031 Q15.6719 6.6875 25.4375 6.6875 Q35.7969 6.6875 39.2031 14.4062 L39.2031 52.8281 L48.25 52.8281 L48.25 0 L39.6562 0 L39.4531 5.2188 Z"
        /><glyph unicode="q" horiz-adv-x="57.0" d="M4.6406 26.8594 Q4.6406 39.3125 10.3516 46.5625 Q16.0625 53.8125 25.6875 53.8125 Q35.0625 53.8125 40.4844 47.5156 L40.875 52.8281 L49.1719 52.8281 L49.1719 -20.3125 L40.1406 -20.3125 L40.1406 4.8906 Q34.6719 -0.9844 25.5938 -0.9844 Q16.0156 -0.9844 10.3281 6.4688 Q4.6406 13.9219 4.6406 26.2188 L4.6406 26.8594 ZM13.6719 25.8281 Q13.6719 16.75 17.5078 11.5703 Q21.3438 6.3906 27.8281 6.3906 Q35.8906 6.3906 40.1406 13.5312 L40.1406 39.4062 Q35.8438 46.3906 27.9375 46.3906 Q21.3906 46.3906 17.5312 41.1875 Q13.6719 35.9844 13.6719 25.8281 Z"
        /><glyph unicode="N" horiz-adv-x="71.0" d="M62.8906 0 L53.4688 0 L17.6719 54.7812 L17.6719 0 L8.25 0 L8.25 71.0938 L17.6719 71.0938 L53.5625 16.0625 L53.5625 71.0938 L62.8906 71.0938 L62.8906 0 Z"
      /></font
    ></defs
    ><g style="fill:rgb(204,204,204); text-rendering:optimizeLegibility; stroke:rgb(204,204,204);"
    ><rect x="0" width="611" height="444" y="0" style="stroke:none;"
    /></g
    ><g style="stroke-linecap:butt; fill:white; text-rendering:geometricPrecision; stroke-linejoin:bevel; shape-rendering:crispEdges; stroke:white; stroke-width:0;"
    ><path style="stroke:none;" d="M537.68 53.28 L537.68 390.72 L73.32 53.28 Z"
      /><path style="stroke:none;" d="M537.68 390.72 L73.32 390.72 L73.32 53.28 Z"
      /><path style="stroke:none;" d="M537.68 53.28 L537.68 390.72 L537.68 390.72 Z"
      /><path style="stroke:none;" d="M73.32 53.28 L73.32 390.72 L73.32 390.72 Z"
      /><path style="stroke:none;" d="M537.68 53.28 L537.68 390.72 L73.32 53.28 Z"
      /><path style="stroke:none;" d="M537.68 390.72 L73.32 390.72 L73.32 53.28 Z"
      /><path style="stroke:none;" d="M537.68 53.28 L537.68 53.28 L537.68 390.72 Z"
      /><path style="stroke:none;" d="M73.32 53.28 L73.32 53.28 L73.32 390.72 Z"
      /><path style="stroke:none;" d="M537.68 53.28 L73.32 53.28 L537.68 53.28 Z"
      /><path style="stroke:none;" d="M73.32 53.28 L73.32 53.28 L537.68 53.28 Z"
      /><path style="stroke:none;" d="M537.68 390.72 L73.32 390.72 L537.68 390.72 Z"
      /><path style="stroke:none;" d="M73.32 390.72 L73.32 390.72 L537.68 390.72 Z"
    /></g
    ><g transform="translate(280.8927,399.72)" style="font-size:10px; stroke-linecap:butt; text-rendering:geometricPrecision; font-family:sans-serif; stroke-linejoin:bevel; stroke-width:0;"
    ><text x="-0.5625" xml:space="preserve" y="10.4785" style="stroke:none;"
      >0</text
    ></g
    ><g transform="translate(68.82,399.72)" style="font-size:10px; stroke-linecap:butt; text-rendering:geometricPrecision; font-family:sans-serif; stroke-linejoin:bevel; stroke-width:0;"
    ><text x="-0.1875" xml:space="preserve" y="10.4785" style="stroke:none;"
      >-1</text
    ></g
    ><g transform="translate(492.9655,399.72)" style="font-size:10px; stroke-linecap:butt; text-rendering:geometricPrecision; font-family:sans-serif; stroke-linejoin:bevel; stroke-width:0;"
    ><text x="-0.8281" xml:space="preserve" y="10.4785" style="stroke:none;"
      >1</text
    ></g
    ><g transform="translate(106.0345,399.72)" style="font-size:10px; stroke-linecap:butt; text-rendering:geometricPrecision; font-family:sans-serif; stroke-linejoin:bevel; stroke-width:0;"
    ><text x="-0.1875" xml:space="preserve" y="10.4785" style="stroke:none;"
      >-0.8</text
    ></g
    ><g transform="translate(148.2491,399.72)" style="font-size:10px; stroke-linecap:butt; text-rendering:geometricPrecision; font-family:sans-serif; stroke-linejoin:bevel; stroke-width:0;"
    ><text x="-0.1875" xml:space="preserve" y="10.4785" style="stroke:none;"
      >-0.6</text
    ></g
    ><g transform="translate(189.9636,399.72)" style="font-size:10px; stroke-linecap:butt; text-rendering:geometricPrecision; font-family:sans-serif; stroke-linejoin:bevel; stroke-width:0;"
    ><text x="-0.1875" xml:space="preserve" y="10.4785" style="stroke:none;"
      >-0.4</text
    ></g
    ><g transform="translate(232.1782,399.72)" style="font-size:10px; stroke-linecap:butt; text-rendering:geometricPrecision; font-family:sans-serif; stroke-linejoin:bevel; stroke-width:0;"
    ><text x="-0.1875" xml:space="preserve" y="10.4785" style="stroke:none;"
      >-0.2</text
    ></g
    ><g transform="translate(318.6073,399.72)" style="font-size:10px; stroke-linecap:butt; text-rendering:geometricPrecision; font-family:sans-serif; stroke-linejoin:bevel; stroke-width:0;"
    ><text x="-0.5625" xml:space="preserve" y="10.4785" style="stroke:none;"
      >0.2</text
    ></g
    ><g transform="translate(360.8218,399.72)" style="font-size:10px; stroke-linecap:butt; text-rendering:geometricPrecision; font-family:sans-serif; stroke-linejoin:bevel; stroke-width:0;"
    ><text x="-0.5625" xml:space="preserve" y="10.4785" style="stroke:none;"
      >0.4</text
    ></g
    ><g transform="translate(403.0364,399.72)" style="font-size:10px; stroke-linecap:butt; text-rendering:geometricPrecision; font-family:sans-serif; stroke-linejoin:bevel; stroke-width:0;"
    ><text x="-0.5625" xml:space="preserve" y="10.4785" style="stroke:none;"
      >0.6</text
    ></g
    ><g transform="translate(445.2509,399.72)" style="font-size:10px; stroke-linecap:butt; text-rendering:geometricPrecision; font-family:sans-serif; stroke-linejoin:bevel; stroke-width:0;"
    ><text x="-0.5625" xml:space="preserve" y="10.4785" style="stroke:none;"
      >0.8</text
    ></g
    ><g transform="translate(529.68,399.72)" style="font-size:10px; stroke-linecap:butt; text-rendering:geometricPrecision; font-family:sans-serif; stroke-linejoin:bevel; stroke-width:0;"
    ><text x="-0.8281" xml:space="preserve" y="10.4785" style="stroke:none;"
      >1.2</text
    ></g
    ><g style="text-rendering:geometricPrecision; font-size:10px; shape-rendering:crispEdges; font-family:sans-serif; stroke-linecap:butt;"
    ><path style="fill:none;" d="M73.32 390.72 L73.32 396.72"
      /><path style="fill:none;" d="M115.5345 390.72 L115.5345 396.72"
      /><path style="fill:none;" d="M157.7491 390.72 L157.7491 396.72"
      /><path style="fill:none;" d="M199.9636 390.72 L199.9636 396.72"
      /><path style="fill:none;" d="M242.1782 390.72 L242.1782 396.72"
      /><path style="fill:none;" d="M284.3927 390.72 L284.3927 396.72"
      /><path style="fill:none;" d="M326.6073 390.72 L326.6073 396.72"
      /><path style="fill:none;" d="M368.8218 390.72 L368.8218 396.72"
      /><path style="fill:none;" d="M411.0364 390.72 L411.0364 396.72"
      /><path style="fill:none;" d="M453.2509 390.72 L453.2509 396.72"
      /><path style="fill:none;" d="M495.4655 390.72 L495.4655 396.72"
      /><path style="fill:none;" d="M537.68 390.72 L537.68 396.72"
      /><path style="fill:none;" d="M73.32 390.72 L73.32 393.72"
      /><path style="fill:none;" d="M94.4273 390.72 L94.4273 393.72"
      /><path style="fill:none;" d="M115.5345 390.72 L115.5345 393.72"
      /><path style="fill:none;" d="M136.6418 390.72 L136.6418 393.72"
      /><path style="fill:none;" d="M157.7491 390.72 L157.7491 393.72"
      /><path style="fill:none;" d="M178.8564 390.72 L178.8564 393.72"
      /><path style="fill:none;" d="M199.9636 390.72 L199.9636 393.72"
      /><path style="fill:none;" d="M221.0709 390.72 L221.0709 393.72"
      /><path style="fill:none;" d="M242.1782 390.72 L242.1782 393.72"
      /><path style="fill:none;" d="M263.2855 390.72 L263.2855 393.72"
      /><path style="fill:none;" d="M284.3927 390.72 L284.3927 393.72"
      /><path style="fill:none;" d="M305.5 390.72 L305.5 393.72"
      /><path style="fill:none;" d="M326.6073 390.72 L326.6073 393.72"
      /><path style="fill:none;" d="M347.7145 390.72 L347.7145 393.72"
      /><path style="fill:none;" d="M368.8218 390.72 L368.8218 393.72"
      /><path style="fill:none;" d="M389.9291 390.72 L389.9291 393.72"
      /><path style="fill:none;" d="M411.0364 390.72 L411.0364 393.72"
      /><path style="fill:none;" d="M432.1436 390.72 L432.1436 393.72"
      /><path style="fill:none;" d="M453.2509 390.72 L453.2509 393.72"
      /><path style="fill:none;" d="M474.3582 390.72 L474.3582 393.72"
      /><path style="fill:none;" d="M495.4655 390.72 L495.4655 393.72"
      /><path style="fill:none;" d="M516.5728 390.72 L516.5728 393.72"
      /><path style="fill:none;" d="M537.68 390.72 L537.68 393.72"
      /><path style="fill:none;" d="M537.68 390.72 L73.32 390.72"
      /><text x="-0.5625" y="10.4785" transform="translate(57.32,214.5)" style="stroke-linejoin:bevel; shape-rendering:auto; stroke:none; stroke-width:0;" xml:space="preserve"
      >0</text
    ></g
    ><g transform="translate(55.32,383.22)" style="font-size:10px; stroke-linecap:butt; text-rendering:geometricPrecision; font-family:sans-serif; stroke-linejoin:bevel; stroke-width:0;"
    ><text x="-0.1875" xml:space="preserve" y="10.4785" style="stroke:none;"
      >-1</text
    ></g
    ><g transform="translate(59.32,45.78)" style="font-size:10px; stroke-linecap:butt; text-rendering:geometricPrecision; font-family:sans-serif; stroke-linejoin:bevel; stroke-width:0;"
    ><text x="-0.8281" xml:space="preserve" y="10.4785" style="stroke:none;"
      >1</text
    ></g
    ><g transform="translate(45.32,349.476)" style="font-size:10px; stroke-linecap:butt; text-rendering:geometricPrecision; font-family:sans-serif; stroke-linejoin:bevel; stroke-width:0;"
    ><text x="-0.1875" xml:space="preserve" y="10.4785" style="stroke:none;"
      >-0.8</text
    ></g
    ><g transform="translate(45.32,315.732)" style="font-size:10px; stroke-linecap:butt; text-rendering:geometricPrecision; font-family:sans-serif; stroke-linejoin:bevel; stroke-width:0;"
    ><text x="-0.1875" xml:space="preserve" y="10.4785" style="stroke:none;"
      >-0.6</text
    ></g
    ><g transform="translate(44.32,281.988)" style="font-size:10px; stroke-linecap:butt; text-rendering:geometricPrecision; font-family:sans-serif; stroke-linejoin:bevel; stroke-width:0;"
    ><text x="-0.1875" xml:space="preserve" y="10.4785" style="stroke:none;"
      >-0.4</text
    ></g
    ><g transform="translate(44.32,248.244)" style="font-size:10px; stroke-linecap:butt; text-rendering:geometricPrecision; font-family:sans-serif; stroke-linejoin:bevel; stroke-width:0;"
    ><text x="-0.1875" xml:space="preserve" y="10.4785" style="stroke:none;"
      >-0.2</text
    ></g
    ><g transform="translate(48.32,180.756)" style="font-size:10px; stroke-linecap:butt; text-rendering:geometricPrecision; font-family:sans-serif; stroke-linejoin:bevel; stroke-width:0;"
    ><text x="-0.5625" xml:space="preserve" y="10.4785" style="stroke:none;"
      >0.2</text
    ></g
    ><g transform="translate(48.32,147.012)" style="font-size:10px; stroke-linecap:butt; text-rendering:geometricPrecision; font-family:sans-serif; stroke-linejoin:bevel; stroke-width:0;"
    ><text x="-0.5625" xml:space="preserve" y="10.4785" style="stroke:none;"
      >0.4</text
    ></g
    ><g transform="translate(48.32,113.268)" style="font-size:10px; stroke-linecap:butt; text-rendering:geometricPrecision; font-family:sans-serif; stroke-linejoin:bevel; stroke-width:0;"
    ><text x="-0.5625" xml:space="preserve" y="10.4785" style="stroke:none;"
      >0.6</text
    ></g
    ><g transform="translate(48.32,79.524)" style="font-size:10px; stroke-linecap:butt; text-rendering:geometricPrecision; font-family:sans-serif; stroke-linejoin:bevel; stroke-width:0;"
    ><text x="-0.5625" xml:space="preserve" y="10.4785" style="stroke:none;"
      >0.8</text
    ></g
    ><g style="text-rendering:geometricPrecision; font-size:10px; shape-rendering:crispEdges; font-family:sans-serif; stroke-linecap:butt;"
    ><path style="fill:none;" d="M73.32 390.72 L67.32 390.72"
      /><path style="fill:none;" d="M73.32 356.976 L67.32 356.976"
      /><path style="fill:none;" d="M73.32 323.232 L67.32 323.232"
      /><path style="fill:none;" d="M73.32 289.488 L67.32 289.488"
      /><path style="fill:none;" d="M73.32 255.744 L67.32 255.744"
      /><path style="fill:none;" d="M73.32 222 L67.32 222"
      /><path style="fill:none;" d="M73.32 188.256 L67.32 188.256"
      /><path style="fill:none;" d="M73.32 154.512 L67.32 154.512"
      /><path style="fill:none;" d="M73.32 120.768 L67.32 120.768"
      /><path style="fill:none;" d="M73.32 87.024 L67.32 87.024"
      /><path style="fill:none;" d="M73.32 53.28 L67.32 53.28"
      /><path style="fill:none;" d="M73.32 390.72 L70.32 390.72"
      /><path style="fill:none;" d="M73.32 373.848 L70.32 373.848"
      /><path style="fill:none;" d="M73.32 356.976 L70.32 356.976"
      /><path style="fill:none;" d="M73.32 340.104 L70.32 340.104"
      /><path style="fill:none;" d="M73.32 323.232 L70.32 323.232"
      /><path style="fill:none;" d="M73.32 306.36 L70.32 306.36"
      /><path style="fill:none;" d="M73.32 289.488 L70.32 289.488"
      /><path style="fill:none;" d="M73.32 272.616 L70.32 272.616"
      /><path style="fill:none;" d="M73.32 255.744 L70.32 255.744"
      /><path style="fill:none;" d="M73.32 238.872 L70.32 238.872"
      /><path style="fill:none;" d="M73.32 222 L70.32 222"
      /><path style="fill:none;" d="M73.32 205.128 L70.32 205.128"
      /><path style="fill:none;" d="M73.32 188.256 L70.32 188.256"
      /><path style="fill:none;" d="M73.32 171.384 L70.32 171.384"
      /><path style="fill:none;" d="M73.32 154.512 L70.32 154.512"
      /><path style="fill:none;" d="M73.32 137.64 L70.32 137.64"
      /><path style="fill:none;" d="M73.32 120.768 L70.32 120.768"
      /><path style="fill:none;" d="M73.32 103.896 L70.32 103.896"
      /><path style="fill:none;" d="M73.32 87.024 L70.32 87.024"
      /><path style="fill:none;" d="M73.32 70.152 L70.32 70.152"
      /><path style="fill:none;" d="M73.32 53.28 L70.32 53.28"
      /><path style="fill:none;" d="M73.32 53.28 L73.32 390.72"
      /><text x="1.1719" y="12.4785" transform="translate(284,417.72)" style="stroke-linejoin:bevel; shape-rendering:auto; stroke:none; stroke-width:0;" xml:space="preserve"
      >Real part</text
    ></g
    ><g transform="translate(41.32,222) rotate(270) translate(-34.5,-19)" style="font-size:10px; stroke-linecap:butt; text-rendering:geometricPrecision; font-family:sans-serif; stroke-linejoin:bevel; stroke-width:0;"
    ><text x="1.1094" xml:space="preserve" y="12.4785" style="stroke:none;"
      >Imaginary part</text
    ></g
    ><g style="text-rendering:geometricPrecision; font-size:10px; stroke-dasharray:1,4,7,4; shape-rendering:crispEdges; font-family:sans-serif; stroke-linecap:butt;"
    ><path style="fill:none;" d="M73.3154 222 L537.6846 222"
      /><path style="fill:none;" d="M284.3927 390.7234 L284.3927 53.2766"
    /></g
    ><g transform="translate(73.32,222)" style="stroke-linecap:butt; font-size:10px; fill:rgb(191,0,191); text-rendering:geometricPrecision; font-family:sans-serif; stroke:rgb(191,0,191); stroke-width:2;"
    ><path style="fill:none;" d="M-5 0 L5 0"
      /><path style="fill:none;" d="M0 -5 L0 5"
    /></g
    ><g style="stroke-linecap:butt; font-size:10px; fill:blue; text-rendering:geometricPrecision; font-family:sans-serif; shape-rendering:crispEdges; stroke:blue;"
    ><path d="M284.3927 222 L284.3927 222 L284.3927 222 L284.3927 222 L284.3927 222 L284.3928 222 L284.3936 222.0001 L284.3992 222.0015 L284.4219 222.01 L284.4732 222.0377 L284.54 222.0854 L284.684 222.2249 L284.8118 222.3927 L284.9935 222.7289 L285.1004 223.0192 L285.2009 223.4527 L285.2523 224.1118 L285.2309 224.5651 L285.1487 225.1305 L284.9686 225.837 L284.6324 226.7197 L284.0503 227.8195 L283.0832 229.1787 L282.3922 229.9672 L281.5169 230.8316 L280.4128 231.7712 L279.0252 232.7802 L277.2881 233.8453 L275.122 234.9423 L272.4332 236.0308 L270.8596 236.553 L269.1138 237.047 L267.1804 237.4997 L265.0437 237.8952 L262.6879 238.2146 L260.0973 238.4352 L257.2575 238.5302 L254.1556 238.4684 L250.7816 238.213 L247.1296 237.7219 L243.199 236.9469 L241.1313 236.4363 L238.9974 235.8339 L236.7998 235.1319 L234.5417 234.3222 L232.2275 233.3965 L229.862 232.3459 L227.4516 231.1614 L225.0036 229.8339 L222.5266 228.3539 L220.0308 226.7121 L217.5276 224.8989 L215.0302 222.9053 L212.5534 220.7221 L210.1138 218.3407 L207.7299 215.7533 L205.4218 212.9524 L203.2119 209.9319 L201.1242 206.6866 L199.1848 203.2128 L197.4213 199.5083 L195.8632 195.573 L194.5415 191.4088 L193.4884 187.02 L192.7373 182.4134 L192.3221 177.599 L192.2772 172.5895 L192.6369 167.4009 L193.4348 162.0527 L194.7037 156.5677 L196.4746 150.9723 L198.7762 145.296 L201.6347 139.5722 L205.0726 133.8369 L209.1086 128.1296 L213.7569 122.4919 L219.0267 116.9681 L224.9214 111.6041 L231.4391 106.447 L238.5714 101.545 L246.3037 96.9463 L250.3885 94.7756 L254.6149 92.6987 L258.9792 90.7212 L263.4775 88.849 L268.1053 87.0876 L272.8578 85.4424 L277.7299 83.9189 L282.7159 82.522 L287.8101 81.2568 L293.0062 80.1279 L298.2976 79.1399 L303.6775 78.2971 L309.1388 77.6034 L314.6741 77.0626 L320.2756 76.6783 L325.9355 76.4535 L331.6455 76.3913 L337.3976 76.4942 L343.183 76.7645 L348.9932 77.2041 L354.8193 77.8148 L360.6525 78.5978 L366.4838 79.5541 L372.3041 80.6845 L378.1043 81.9891 L383.8753 83.4681 L389.6079 85.121 L395.293 86.9472 L400.9214 88.9456 L406.4843 91.1149 L411.9725 93.4534 L417.3773 95.9592 L422.6898 98.6299 L427.9014 101.4629 L433.0037 104.4553 L437.9883 107.6038 L442.847 110.905 L447.5721 114.355 L452.1556 117.9498 L456.5901 121.685 L460.8684 125.556 L464.9834 129.5581 L468.9283 133.686 L472.6968 137.9345 L476.2826 142.2981 L479.6798 146.7711 L482.8829 151.3475 L485.8865 156.0212 L488.6859 160.7859 L491.2763 165.6352 L493.6536 170.5625 L495.8138 175.561 L497.7534 180.624 L499.4692 185.7444 L500.9584 190.9152 L502.2185 196.1292 L503.2476 201.3793 L504.0439 206.658 L504.606 211.9581 L504.799 214.6139 L504.8735 215.9428 L504.9052 216.6074 L504.9052 227.3926 L504.8735 228.0572 L504.799 229.3861 L504.606 232.0419 L504.0439 237.342 L503.2476 242.6207 L502.2185 247.8708 L500.9584 253.0848 L499.4692 258.2556 L497.7534 263.376 L495.8138 268.439 L493.6536 273.4375 L491.2763 278.3648 L488.6859 283.2141 L485.8865 287.9789 L482.8829 292.6525 L479.6798 297.2289 L476.2826 301.7018 L472.6968 306.0655 L468.9283 310.314 L464.9834 314.4419 L460.8684 318.444 L456.5901 322.315 L452.1556 326.0502 L447.5721 329.645 L442.847 333.095 L437.9883 336.3962 L433.0037 339.5447 L427.9014 342.5371 L422.6898 345.3701 L417.3773 348.0408 L411.9725 350.5466 L406.4843 352.8851 L400.9214 355.0544 L395.293 357.0529 L389.6079 358.879 L383.8753 360.5319 L378.1043 362.0109 L372.3041 363.3155 L366.4838 364.4459 L360.6525 365.4022 L354.8193 366.1852 L348.9932 366.7959 L343.183 367.2355 L337.3976 367.5058 L331.6455 367.6087 L325.9355 367.5465 L320.2756 367.3217 L314.6741 366.9374 L309.1388 366.3966 L303.6775 365.7029 L298.2976 364.8601 L293.0062 363.8721 L287.8101 362.7432 L282.7159 361.478 L277.7299 360.0811 L272.8578 358.5576 L268.1053 356.9124 L263.4775 355.151 L258.9792 353.2788 L254.6149 351.3013 L250.3885 349.2244 L246.3037 347.0537 L238.5714 342.455 L231.4391 337.553 L224.9214 332.3959 L219.0267 327.0319 L213.7569 321.5081 L209.1086 315.8704 L205.0726 310.1631 L201.6347 304.4278 L198.7762 298.704 L196.4746 293.0277 L194.7037 287.4323 L193.4348 281.9473 L192.6369 276.5991 L192.2772 271.4105 L192.3221 266.401 L192.7373 261.5865 L193.4884 256.98 L194.5415 252.5912 L195.8632 248.427 L197.4213 244.4917 L199.1848 240.7872 L201.1242 237.3134 L203.2119 234.0681 L205.4218 231.0476 L207.7299 228.2467 L210.1138 225.6593 L212.5534 223.2779 L215.0302 221.0947 L217.5276 219.1011 L220.0308 217.2879 L222.5266 215.6461 L225.0036 214.1661 L227.4516 212.8386 L229.862 211.6541 L232.2275 210.6035 L234.5417 209.6778 L236.7998 208.8681 L238.9974 208.1661 L241.1313 207.5637 L243.199 207.0531 L247.1296 206.2781 L250.7816 205.787 L254.1556 205.5316 L257.2575 205.4698 L260.0973 205.5648 L262.6879 205.7854 L265.0437 206.1048 L267.1804 206.5003 L269.1138 206.953 L270.8596 207.447 L272.4332 207.9692 L275.122 209.0577 L277.2881 210.1547 L279.0252 211.2198 L280.4128 212.2288 L281.5169 213.1684 L282.3922 214.0328 L283.0832 214.8213 L284.0503 216.1805 L284.6324 217.2803 L284.9686 218.163 L285.1487 218.8695 L285.2309 219.4349 L285.2523 219.8882 L285.2009 220.5473 L285.1004 220.9808 L284.9935 221.2711 L284.8118 221.6073 L284.684 221.7751 L284.54 221.9146 L284.4732 221.9623 L284.4219 221.99 L284.3992 221.9985 L284.3936 221.9999 L284.3928 222 L284.3927 222 L284.3927 222 L284.3927 222 L284.3927 222 L284.3927 222" style="fill:none; clip-path:url(#clipPath1);"
      /><path d="M215.0302 222 L73.32 222" style="fill:none; stroke-width:2; clip-path:url(#clipPath1);"
      /><path d="M442.847 110.905 L284.3927 222" style="fill:none; stroke-width:2; clip-path:url(#clipPath1);"
      /><path d="M284.3927 53.28 L293.2908 53.43 L302.1731 53.8797 L311.0237 54.6283 L319.8271 55.6745 L328.5674 57.0164 L337.2292 58.6517 L345.797 60.5773 L354.2556 62.79 L362.5901 65.2858 L370.7855 68.0601 L378.8273 71.1082 L386.7012 74.4246 L394.3932 78.0033 L401.8896 81.8381 L409.1772 85.9221 L416.2428 90.248 L423.074 94.8081 L429.6587 99.5944 L435.9851 104.5984 L442.042 109.811 L447.8185 115.2232 L453.3045 120.8252 L458.4902 126.607 L463.3664 132.5585 L467.9243 138.669 L472.1559 144.9277 L476.0537 151.3233 L479.6107 157.8447 L482.8206 164.4801 L485.6778 171.2178 L488.177 178.0458 L490.314 184.9519 L492.0848 191.9239 L493.4863 198.9494 L494.5161 206.0158 L495.1723 213.1107 L495.4537 220.2213 L495.3599 227.3352 L494.891 234.4395 L494.0478 241.5218 L492.8319 248.5693 L491.2453 255.5696 L489.291 262.5102 L486.9724 269.3788 L484.2936 276.1631 L481.2594 282.8511 L477.8752 289.431 L474.147 295.8909 L470.0814 302.2195 L465.6856 308.4055 L460.9675 314.4378 L455.9355 320.3058 L450.5984 325.999 L444.9659 331.5072 L439.0479 336.8208 L432.8549 341.9303 L426.3979 346.8265 L419.6885 351.5007 L412.7385 355.9448 L405.5603 360.1506 L398.1667 364.1109 L390.5708 367.8185 L382.7861 371.2668 L374.8265 374.4497 L366.7061 377.3616 L358.4393 379.9972 L350.0409 382.352 L341.5258 384.4216 L332.9091 386.2025 L324.2061 387.6914 L315.4323 388.8857 L306.6034 389.7833 L297.7349 390.3826 L288.8428 390.6825 L279.9427 390.6825 L271.0505 390.3826 L262.1821 389.7833 L253.3531 388.8857 L244.5794 387.6914 L235.8764 386.2025 L227.2597 384.4216 L218.7446 382.352 L210.3461 379.9972 L202.0794 377.3616 L193.959 374.4497 L185.9993 371.2668 L178.2147 367.8185 L170.6188 364.1109 L163.2251 360.1506 L156.047 355.9448 L149.097 351.5007 L142.3875 346.8265 L135.9306 341.9303 L129.7376 336.8208 L123.8195 331.5072 L118.187 325.999 L112.85 320.3058 L107.8179 314.4378 L103.0999 308.4055 L98.7041 302.2195 L94.6385 295.8909 L90.9102 289.431 L87.526 282.8511 L84.4918 276.1631 L81.813 269.3788 L79.4944 262.5102 L77.5401 255.5696 L75.9536 248.5693 L74.7376 241.5218 L73.8945 234.4395 L73.4256 227.3352 L73.3317 220.2213 L73.6132 213.1107 L74.2694 206.0158 L75.2991 198.9494 L76.7007 191.9239 L78.4715 184.9519 L80.6084 178.0458 L83.1077 171.2178 L85.9648 164.4801 L89.1747 157.8447 L92.7318 151.3233 L96.6295 144.9277 L100.8612 138.669 L105.4191 132.5585 L110.2952 126.607 L115.4809 120.8252 L120.9669 115.2232 L126.7435 109.811 L132.8004 104.5984 L139.1268 99.5944 L145.7114 94.8081 L152.5426 90.248 L159.6083 85.9221 L166.8958 81.8381 L174.3923 78.0033 L182.0843 74.4246 L189.9582 71.1082 L198 68.0601 L206.1954 65.2858 L214.5298 62.79 L222.9885 60.5773 L231.5563 58.6517 L240.2181 57.0164 L248.9584 55.6745 L257.7617 54.6283 L266.6124 53.8797 L275.4946 53.43 L284.3927 53.28" style="fill:none; stroke-dasharray:1,4,7,4; clip-path:url(#clipPath1); stroke:black;"
      /><circle transform="translate(215.0302,222)" style="stroke-linejoin:bevel; shape-rendering:auto; stroke:none; stroke-width:0;" r="5.5" cx="0" cy="0"
    /></g
    ><g transform="translate(442.8471,110.905)" style="stroke-linecap:butt; font-size:10px; fill:blue; text-rendering:geometricPrecision; font-family:sans-serif; stroke-linejoin:bevel; stroke:blue; stroke-width:0;"
    ><polygon style="stroke:none;" points=" -5 0 0 -5 5 0 0 5"
    /></g
    ><g transform="translate(266.5,27)" style="font-size:10px; stroke-linecap:butt; text-rendering:geometricPrecision; font-family:sans-serif; stroke-linejoin:bevel; stroke-width:0;"
    ><text x="1.1719" xml:space="preserve" y="12.4785" style="stroke:none;"
      >Nyquist diagram</text
    ></g
  ></g
></svg
>
