<?xml version="1.0" encoding="UTF-8"?>
<!DOCTYPE svg PUBLIC '-//W3C//DTD SVG 1.0//EN'
          'http://www.w3.org/TR/2001/REC-SVG-20010904/DTD/svg10.dtd'>
<svg xmlns:xlink="http://www.w3.org/1999/xlink" style="fill-opacity:1; color-rendering:auto; color-interpolation:auto; text-rendering:auto; stroke:black; stroke-linecap:square; stroke-miterlimit:10; shape-rendering:auto; stroke-opacity:1; fill:black; stroke-dasharray:none; font-weight:normal; stroke-width:1; font-family:'Dialog'; font-style:normal; stroke-linejoin:miter; font-size:12px; stroke-dashoffset:0; image-rendering:auto;" width="611" height="444" xmlns="http://www.w3.org/2000/svg"
><!--Generated by Scilab with Batik SVG Generator--><defs id="genericDefs"
  /><g
  ><defs id="defs1"
    ><clipPath clipPathUnits="userSpaceOnUse" id="clipPath1"
      ><path d="M73.3154 53.2766 L537.6846 53.2766 L537.6846 390.7234 L73.3154 390.7234 L73.3154 53.2766 Z"
      /></clipPath
      ><font horiz-adv-x="44.0" id="font1"
      ><font-face ascent="104.78516" descent="27.09961" units-per-em="100" style="font-style:normal; font-family:sans-serif; font-weight:normal;"
        /><missing-glyph horiz-adv-x="44.0" d="M39.4531 0 L4.8906 0 L4.8906 71.0938 L39.4531 71.0938 L39.4531 0 ZM36.8125 4.1094 L36.8125 66.9375 L23.4375 35.5469 L36.8125 4.1094 ZM7.5156 66.3594 L7.5156 4.6875 L20.6094 35.5469 L7.5156 66.3594 ZM9.4688 2.6406 L34.625 2.6406 L22.0156 32.2344 L9.4688 2.6406 ZM22.0156 38.875 L34.625 68.4531 L9.4688 68.4531 L22.0156 38.875 Z"
        /><glyph unicode="0" horiz-adv-x="56.0" d="M50.4844 30.3281 Q50.4844 14.4531 45.0703 6.7344 Q39.6562 -0.9844 28.125 -0.9844 Q16.75 -0.9844 11.2812 6.5625 Q5.8125 14.1094 5.6094 29.1094 L5.6094 41.1562 Q5.6094 56.8438 11.0312 64.4609 Q16.4531 72.0781 28.0312 72.0781 Q39.5 72.0781 44.9219 64.7266 Q50.3438 57.375 50.4844 42.0469 L50.4844 30.3281 ZM41.4531 42.6719 Q41.4531 54.1562 38.2344 59.4062 Q35.0156 64.6562 28.0312 64.6562 Q21.0938 64.6562 17.9219 59.4297 Q14.75 54.2031 14.6562 43.3594 L14.6562 28.9062 Q14.6562 17.3906 18 11.8906 Q21.3438 6.3906 28.125 6.3906 Q34.8125 6.3906 38.0625 11.5703 Q41.3125 16.75 41.4531 27.875 L41.4531 42.6719 Z"
        /><glyph unicode="6" horiz-adv-x="56.0" d="M41.3594 71.1406 L41.3594 63.4844 L39.7031 63.4844 Q29.1562 63.2812 22.9062 57.2266 Q16.6562 51.1719 15.6719 40.1875 Q21.2969 46.625 31 46.625 Q40.2812 46.625 45.8281 40.0859 Q51.375 33.5469 51.375 23.1875 Q51.375 12.2031 45.3906 5.6094 Q39.4062 -0.9844 29.3438 -0.9844 Q19.1406 -0.9844 12.7969 6.8594 Q6.4531 14.7031 6.4531 27.0469 L6.4531 30.5156 Q6.4531 50.1406 14.8203 60.5234 Q23.1875 70.9062 39.75 71.1406 L41.3594 71.1406 ZM29.5 39.1094 Q24.8594 39.1094 20.9531 36.3281 Q17.0469 33.5469 15.5312 29.3438 L15.5312 26.0312 Q15.5312 17.2344 19.4844 11.8672 Q23.4375 6.5 29.3438 6.5 Q35.4531 6.5 38.9453 10.9922 Q42.4375 15.4844 42.4375 22.75 Q42.4375 30.0781 38.8984 34.5938 Q35.3594 39.1094 29.5 39.1094 Z"
        /><glyph unicode="3" horiz-adv-x="56.0" d="M19.0469 39.9375 L25.8281 39.9375 Q32.2344 40.0469 35.8906 43.3125 Q39.5469 46.5781 39.5469 52.1562 Q39.5469 64.6562 27.0938 64.6562 Q21.2344 64.6562 17.75 61.3047 Q14.2656 57.9531 14.2656 52.4375 L5.2188 52.4375 Q5.2188 60.8906 11.3984 66.4844 Q17.5781 72.0781 27.0938 72.0781 Q37.1562 72.0781 42.8672 66.75 Q48.5781 61.4219 48.5781 51.9531 Q48.5781 47.3125 45.5781 42.9688 Q42.5781 38.625 37.4062 36.4688 Q43.2656 34.625 46.4609 30.3281 Q49.6562 26.0312 49.6562 19.8281 Q49.6562 10.25 43.4062 4.6328 Q37.1562 -0.9844 27.1484 -0.9844 Q17.1406 -0.9844 10.8672 4.4375 Q4.5938 9.8594 4.5938 18.75 L13.6719 18.75 Q13.6719 13.1406 17.3359 9.7656 Q21 6.3906 27.1562 6.3906 Q33.6875 6.3906 37.1562 9.8125 Q40.625 13.2344 40.625 19.625 Q40.625 25.8281 36.8203 29.1484 Q33.0156 32.4688 25.8281 32.5625 L19.0469 32.5625 L19.0469 39.9375 Z"
        /><glyph unicode="-" horiz-adv-x="28.0" d="M25.6406 26.5156 L1.8125 26.5156 L1.8125 33.8906 L25.6406 33.8906 L25.6406 26.5156 Z"
        /><glyph unicode="7" horiz-adv-x="56.0" d="M51.8125 66.0156 L22.3594 0 L12.8906 0 L42.2344 63.6719 L3.7656 63.6719 L3.7656 71.0938 L51.8125 71.0938 L51.8125 66.0156 Z"
        /><glyph unicode="2" horiz-adv-x="56.0" d="M52.4844 0 L5.9062 0 L5.9062 6.5 L30.5156 33.8438 Q35.9844 40.0469 38.0625 43.9219 Q40.1406 47.7969 40.1406 51.9531 Q40.1406 57.5156 36.7734 61.0859 Q33.4062 64.6562 27.7812 64.6562 Q21.0469 64.6562 17.3125 60.8203 Q13.5781 56.9844 13.5781 50.1406 L4.5469 50.1406 Q4.5469 59.9688 10.8672 66.0234 Q17.1875 72.0781 27.7812 72.0781 Q37.7031 72.0781 43.4609 66.875 Q49.2188 61.6719 49.2188 53.0312 Q49.2188 42.5312 35.8438 28.0312 L16.7969 7.375 L52.4844 7.375 L52.4844 0 Z"
        /><glyph unicode="8" horiz-adv-x="56.0" d="M49.0312 52.5469 Q49.0312 47.2188 46.2188 43.0703 Q43.4062 38.9219 38.625 36.5781 Q44.1875 34.1875 47.4375 29.5938 Q50.6875 25 50.6875 19.1875 Q50.6875 9.9688 44.4609 4.4922 Q38.2344 -0.9844 28.0781 -0.9844 Q17.8281 -0.9844 11.6484 4.5156 Q5.4688 10.0156 5.4688 19.1875 Q5.4688 24.9531 8.6172 29.5938 Q11.7656 34.2344 17.3281 36.625 Q12.5938 38.9688 9.8594 43.1172 Q7.125 47.2656 7.125 52.5469 Q7.125 61.5312 12.8906 66.8047 Q18.6562 72.0781 28.0781 72.0781 Q37.4531 72.0781 43.2422 66.8047 Q49.0312 61.5312 49.0312 52.5469 ZM41.6562 19.3906 Q41.6562 25.3438 37.8672 29.1016 Q34.0781 32.8594 27.9766 32.8594 Q21.875 32.8594 18.1875 29.1484 Q14.5 25.4375 14.5 19.3828 Q14.5 13.3281 18.0938 9.8594 Q21.6875 6.3906 28.0781 6.3906 Q34.4219 6.3906 38.0391 9.8828 Q41.6562 13.375 41.6562 19.3906 ZM28.0781 64.6562 Q22.75 64.6562 19.4531 61.3594 Q16.1562 58.0625 16.1562 52.3906 Q16.1562 46.9688 19.4062 43.625 Q22.6562 40.2812 28.0781 40.2812 Q33.5 40.2812 36.7422 43.625 Q39.9844 46.9688 39.9844 52.3906 Q39.9844 57.8125 36.6172 61.2344 Q33.25 64.6562 28.0781 64.6562 Z"
        /><glyph unicode="1" horiz-adv-x="56.0" d="M35.5938 0 L26.5156 0 L26.5156 60.2031 L8.2969 53.5156 L8.2969 61.7188 L34.1875 71.4375 L35.5938 71.4375 L35.5938 0 Z"
        /><glyph unicode="9" horiz-adv-x="56.0" d="M40.5312 31.25 Q37.7031 27.875 33.7656 25.8281 Q29.8281 23.7812 25.1406 23.7812 Q19 23.7812 14.4297 26.8047 Q9.8594 29.8281 7.375 35.3281 Q4.8906 40.8281 4.8906 47.4688 Q4.8906 54.5938 7.5938 60.3047 Q10.2969 66.0156 15.2812 69.0469 Q20.2656 72.0781 26.9062 72.0781 Q37.4531 72.0781 43.5312 64.1875 Q49.6094 56.2969 49.6094 42.6719 L49.6094 40.0469 Q49.6094 19.2812 41.4062 9.7422 Q33.2031 0.2031 16.6562 -0.0469 L14.8906 -0.0469 L14.8906 7.5625 L16.7969 7.5625 Q27.9844 7.7656 33.9844 13.4062 Q39.9844 19.0469 40.5312 31.25 ZM26.6094 31.25 Q31.1562 31.25 34.9844 34.0312 Q38.8125 36.8125 40.5781 40.9219 L40.5781 44.5312 Q40.5781 53.4219 36.7188 58.9844 Q32.8594 64.5469 26.9531 64.5469 Q21 64.5469 17.3828 59.9844 Q13.7656 55.4219 13.7656 47.9531 Q13.7656 40.6719 17.2578 35.9609 Q20.75 31.25 26.6094 31.25 Z"
        /><glyph unicode="5" horiz-adv-x="56.0" d="M10.0625 35.6406 L13.6719 71.0938 L50.0938 71.0938 L50.0938 62.75 L21.3438 62.75 L19.1875 43.3594 Q24.4219 46.4375 31.0625 46.4375 Q40.7656 46.4375 46.4844 40.0156 Q52.2031 33.5938 52.2031 22.6562 Q52.2031 11.6719 46.2656 5.3438 Q40.3281 -0.9844 29.6875 -0.9844 Q20.2656 -0.9844 14.3047 4.2422 Q8.3438 9.4688 7.5156 18.7031 L16.0625 18.7031 Q16.8906 12.5938 20.4062 9.4922 Q23.9219 6.3906 29.6875 6.3906 Q35.9844 6.3906 39.5781 10.6875 Q43.1719 14.9844 43.1719 22.5625 Q43.1719 29.6875 39.2891 34.0078 Q35.4062 38.3281 28.9531 38.3281 Q23.0469 38.3281 19.6719 35.75 L17.2812 33.7969 L10.0625 35.6406 Z"
        /><glyph unicode=")" horiz-adv-x="35.0" d="M27.6875 28.375 Q27.6875 17.4844 24.8281 7.5 Q21.9688 -2.4844 16.0859 -10.9375 Q10.2031 -19.3906 3.7656 -22.9531 L1.8594 -17.4375 Q9.375 -11.6719 13.9375 0.4609 Q18.5 12.5938 18.6094 27.3906 L18.6094 28.9531 Q18.6094 39.2031 16.4609 48.0234 Q14.3125 56.8438 10.4766 63.8203 Q6.6406 70.7969 1.8594 74.7031 L3.7656 80.2188 Q10.2031 76.6562 16.0391 68.3125 Q21.875 59.9688 24.7812 49.9062 Q27.6875 39.8438 27.6875 28.375 Z"
        /><glyph unicode="r" horiz-adv-x="34.0" d="M32.375 44.7344 Q30.3281 45.0625 27.9375 45.0625 Q19.0469 45.0625 15.875 37.5 L15.875 0 L6.8438 0 L6.8438 52.8281 L15.625 52.8281 L15.7656 46.7344 Q20.2188 53.8125 28.375 53.8125 Q31 53.8125 32.375 53.125 L32.375 44.7344 Z"
        /><glyph unicode="g" horiz-adv-x="56.0" d="M4.6875 26.8594 Q4.6875 39.2031 10.3984 46.5078 Q16.1094 53.8125 25.5312 53.8125 Q35.2031 53.8125 40.625 46.9688 L41.0625 52.8281 L49.3125 52.8281 L49.3125 1.2656 Q49.3125 -8.9844 43.2344 -14.8906 Q37.1562 -20.7969 26.9062 -20.7969 Q21.1875 -20.7969 15.7188 -18.3594 Q10.25 -15.9219 7.375 -11.6719 L12.0625 -6.25 Q17.875 -13.4219 26.2656 -13.4219 Q32.8594 -13.4219 36.5469 -9.7109 Q40.2344 -6 40.2344 0.7344 L40.2344 5.2812 Q34.8125 -0.9844 25.4375 -0.9844 Q16.1562 -0.9844 10.4219 6.4922 Q4.6875 13.9688 4.6875 26.8594 ZM13.7656 25.8281 Q13.7656 16.8906 17.4297 11.7891 Q21.0938 6.6875 27.6875 6.6875 Q36.2344 6.6875 40.2344 14.4531 L40.2344 38.5781 Q36.0781 46.1406 27.7812 46.1406 Q21.1875 46.1406 17.4766 41.0156 Q13.7656 35.8906 13.7656 25.8281 Z"
        /><glyph unicode="d" horiz-adv-x="56.0" d="M4.6406 26.8594 Q4.6406 39.0156 10.3984 46.4141 Q16.1562 53.8125 25.4844 53.8125 Q34.7656 53.8125 40.1875 47.4688 L40.1875 75 L49.2188 75 L49.2188 0 L40.9219 0 L40.4844 5.6719 Q35.0625 -0.9844 25.3906 -0.9844 Q16.2188 -0.9844 10.4297 6.5391 Q4.6406 14.0625 4.6406 26.1719 L4.6406 26.8594 ZM13.6719 25.8281 Q13.6719 16.8438 17.3828 11.7656 Q21.0938 6.6875 27.6406 6.6875 Q36.2344 6.6875 40.1875 14.4062 L40.1875 38.6719 Q36.1406 46.1406 27.7344 46.1406 Q21.0938 46.1406 17.3828 41.0156 Q13.6719 35.8906 13.6719 25.8281 Z"
        /><glyph unicode="(" horiz-adv-x="34.0" d="M6.5 28.8594 Q6.5 39.8906 9.4531 50.0469 Q12.4062 60.2031 18.2656 68.5078 Q24.125 76.8125 30.4219 80.2188 L32.2812 74.2656 Q25.1406 68.7969 20.5781 57.5703 Q16.0156 46.3438 15.5781 32.4219 L15.5312 28.2656 Q15.5312 9.4219 22.4062 -4.4375 Q26.5625 -12.75 32.2812 -17.4375 L30.4219 -22.9531 Q23.9219 -19.3438 18.0156 -10.8438 Q6.5 5.7656 6.5 28.8594 Z"
        /><glyph unicode=" " horiz-adv-x="25.0" d=""
        /><glyph unicode="e" horiz-adv-x="53.0" d="M28.7656 -0.9844 Q18.0156 -0.9844 11.2812 6.0781 Q4.5469 13.1406 4.5469 24.9531 L4.5469 26.6094 Q4.5469 34.4688 7.5469 40.6484 Q10.5469 46.8281 15.9453 50.3203 Q21.3438 53.8125 27.6406 53.8125 Q37.9375 53.8125 43.6484 47.0234 Q49.3594 40.2344 49.3594 27.5938 L49.3594 23.8281 L13.5781 23.8281 Q13.7656 16.0156 18.1406 11.2031 Q22.5156 6.3906 29.25 6.3906 Q34.0312 6.3906 37.3516 8.3438 Q40.6719 10.2969 43.1719 13.5312 L48.6875 9.2344 Q42.0469 -0.9844 28.7656 -0.9844 ZM27.6406 46.3906 Q22.1719 46.3906 18.4609 42.4062 Q14.75 38.4219 13.875 31.25 L40.3281 31.25 L40.3281 31.9375 Q39.9375 38.8125 36.6172 42.6016 Q33.2969 46.3906 27.6406 46.3906 Z"
        /><glyph unicode="s" horiz-adv-x="52.0" d="M37.5938 14.0156 Q37.5938 17.6719 34.8359 19.7031 Q32.0781 21.7344 25.2188 23.1953 Q18.3594 24.6562 14.3281 26.7109 Q10.2969 28.7656 8.375 31.5938 Q6.4531 34.4219 6.4531 38.3281 Q6.4531 44.8281 11.9453 49.3203 Q17.4375 53.8125 25.9844 53.8125 Q34.9688 53.8125 40.5547 49.1719 Q46.1406 44.5312 46.1406 37.3125 L37.0625 37.3125 Q37.0625 41.0156 33.9141 43.7031 Q30.7656 46.3906 25.9844 46.3906 Q21.0469 46.3906 18.2656 44.2422 Q15.4844 42.0938 15.4844 38.625 Q15.4844 35.3594 18.0703 33.6953 Q20.6562 32.0312 27.4219 30.5156 Q34.1875 29 38.3828 26.9062 Q42.5781 24.8125 44.6016 21.8516 Q46.625 18.8906 46.625 14.6562 Q46.625 7.5625 40.9609 3.2891 Q35.2969 -0.9844 26.2656 -0.9844 Q19.9219 -0.9844 15.0391 1.2656 Q10.1562 3.5156 7.3984 7.5469 Q4.6406 11.5781 4.6406 16.2656 L13.6719 16.2656 Q13.9219 11.7188 17.3125 9.0547 Q20.7031 6.3906 26.2656 6.3906 Q31.3906 6.3906 34.4922 8.4688 Q37.5938 10.5469 37.5938 14.0156 Z"
        /><glyph unicode="a" horiz-adv-x="54.0" d="M39.4531 0 Q38.6719 1.5625 38.1875 5.5625 Q31.8906 -0.9844 23.1406 -0.9844 Q15.3281 -0.9844 10.3281 3.4375 Q5.3281 7.8594 5.3281 14.6562 Q5.3281 22.9062 11.6016 27.4688 Q17.875 32.0312 29.25 32.0312 L38.0312 32.0312 L38.0312 36.1875 Q38.0312 40.9219 35.2031 43.7266 Q32.375 46.5312 26.8594 46.5312 Q22.0156 46.5312 18.75 44.0938 Q15.4844 41.6562 15.4844 38.1875 L6.3906 38.1875 Q6.3906 42.1406 9.2031 45.8281 Q12.0156 49.5156 16.8203 51.6641 Q21.625 53.8125 27.3906 53.8125 Q36.5312 53.8125 41.7031 49.2422 Q46.875 44.6719 47.0781 36.6719 L47.0781 12.3594 Q47.0781 5.0781 48.9219 0.7812 L48.9219 0 L39.4531 0 ZM24.4688 6.8906 Q28.7188 6.8906 32.5234 9.0859 Q36.3281 11.2812 38.0312 14.7969 L38.0312 25.6406 L30.9531 25.6406 Q14.3594 25.6406 14.3594 15.9219 Q14.3594 11.6719 17.1875 9.2812 Q20.0156 6.8906 24.4688 6.8906 Z"
        /><glyph unicode="h" horiz-adv-x="55.0" d="M15.875 46.4375 Q21.875 53.8125 31.5 53.8125 Q48.25 53.8125 48.3906 34.9062 L48.3906 0 L39.3594 0 L39.3594 34.9688 Q39.3125 40.6719 36.75 43.4062 Q34.1875 46.1406 28.7656 46.1406 Q24.3594 46.1406 21.0391 43.7969 Q17.7188 41.4531 15.875 37.6406 L15.875 0 L6.8438 0 L6.8438 75 L15.875 75 L15.875 46.4375 Z"
        /><glyph unicode="P" horiz-adv-x="63.0" d="M17.625 27.8281 L17.625 0 L8.25 0 L8.25 71.0938 L34.4688 71.0938 Q46.1406 71.0938 52.7578 65.1406 Q59.375 59.1875 59.375 49.3594 Q59.375 39.0156 52.9062 33.4219 Q46.4375 27.8281 34.375 27.8281 L17.625 27.8281 ZM17.625 35.5 L34.4688 35.5 Q42 35.5 46 39.0391 Q50 42.5781 50 49.2656 Q50 55.6094 46 59.4219 Q42 63.2344 35.0156 63.375 L17.625 63.375 L17.625 35.5 Z"
        /><glyph unicode="B" horiz-adv-x="62.0" d="M8.25 0 L8.25 71.0938 L31.5 71.0938 Q43.0625 71.0938 48.8984 66.3125 Q54.7344 61.5312 54.7344 52.1562 Q54.7344 47.1719 51.9062 43.3359 Q49.0781 39.5 44.1875 37.4062 Q49.9531 35.7969 53.2969 31.2812 Q56.6406 26.7656 56.6406 20.5156 Q56.6406 10.9375 50.4375 5.4688 Q44.2344 0 32.9062 0 L8.25 0 ZM17.625 33.25 L17.625 7.6719 L33.1094 7.6719 Q39.6562 7.6719 43.4375 11.0625 Q47.2188 14.4531 47.2188 20.4062 Q47.2188 33.25 33.25 33.25 L17.625 33.25 ZM17.625 40.7656 L31.7812 40.7656 Q37.9375 40.7656 41.625 43.8438 Q45.3125 46.9219 45.3125 52.2031 Q45.3125 58.0625 41.8984 60.7188 Q38.4844 63.375 31.5 63.375 L17.625 63.375 L17.625 40.7656 Z"
        /><glyph unicode="u" horiz-adv-x="55.0" d="M39.4531 5.2188 Q34.1875 -0.9844 23.9688 -0.9844 Q15.5312 -0.9844 11.1094 3.9297 Q6.6875 8.8438 6.6406 18.4531 L6.6406 52.8281 L15.6719 52.8281 L15.6719 18.7031 Q15.6719 6.6875 25.4375 6.6875 Q35.7969 6.6875 39.2031 14.4062 L39.2031 52.8281 L48.25 52.8281 L48.25 0 L39.6562 0 L39.4531 5.2188 Z"
        /><glyph unicode="t" horiz-adv-x="33.0" d="M19.0938 65.625 L19.0938 52.8281 L28.9531 52.8281 L28.9531 45.8438 L19.0938 45.8438 L19.0938 13.0938 Q19.0938 9.9062 20.4141 8.3203 Q21.7344 6.7344 24.9062 6.7344 Q26.4688 6.7344 29.2031 7.3281 L29.2031 0 Q25.6406 -0.9844 22.2656 -0.9844 Q16.2188 -0.9844 13.1406 2.6797 Q10.0625 6.3438 10.0625 13.0938 L10.0625 45.8438 L0.4375 45.8438 L0.4375 52.8281 L10.0625 52.8281 L10.0625 65.625 L19.0938 65.625 Z"
        /><glyph unicode="i" horiz-adv-x="24.0" d="M16.6562 0 L7.625 0 L7.625 52.8281 L16.6562 52.8281 L16.6562 0 ZM6.8906 66.8438 Q6.8906 69.0469 8.2344 70.5625 Q9.5781 72.0781 12.2109 72.0781 Q14.8438 72.0781 16.2109 70.5625 Q17.5781 69.0469 17.5781 66.8516 Q17.5781 64.6562 16.2109 63.1875 Q14.8438 61.7188 12.2109 61.7188 Q9.5781 61.7188 8.2344 63.1875 Q6.8906 64.6562 6.8906 66.8438 Z"
        /><glyph unicode="n" horiz-adv-x="55.0" d="M15.375 52.8281 L15.6719 46.1875 Q21.7344 53.8125 31.5 53.8125 Q48.25 53.8125 48.3906 34.9062 L48.3906 0 L39.3594 0 L39.3594 34.9688 Q39.3125 40.6719 36.75 43.4062 Q34.1875 46.1406 28.7656 46.1406 Q24.3594 46.1406 21.0391 43.7969 Q17.7188 41.4531 15.875 37.6406 L15.875 0 L6.8438 0 L6.8438 52.8281 L15.375 52.8281 Z"
        /><glyph unicode="M" horiz-adv-x="87.0" d="M20.3594 71.0938 L43.6094 13.0938 L66.8438 71.0938 L79 71.0938 L79 0 L69.625 0 L69.625 27.6875 L70.5156 57.5625 L47.1719 0 L39.9844 0 L16.7031 57.4219 L17.625 27.6875 L17.625 0 L8.25 0 L8.25 71.0938 L20.3594 71.0938 Z"
        /><glyph unicode="l" horiz-adv-x="24.0" d="M16.6562 0 L7.625 0 L7.625 75 L16.6562 75 L16.6562 0 Z"
        /><glyph unicode="o" horiz-adv-x="57.0" d="M4.4375 26.9062 Q4.4375 34.6719 7.4922 40.875 Q10.5469 47.0781 15.9922 50.4453 Q21.4375 53.8125 28.4219 53.8125 Q39.2031 53.8125 45.875 46.3438 Q52.5469 38.875 52.5469 26.4688 L52.5469 25.8281 Q52.5469 18.1094 49.5859 11.9844 Q46.625 5.8594 41.1328 2.4375 Q35.6406 -0.9844 28.5156 -0.9844 Q17.7812 -0.9844 11.1094 6.4922 Q4.4375 13.9688 4.4375 26.2656 L4.4375 26.9062 ZM13.5312 25.8281 Q13.5312 17.0469 17.6094 11.7188 Q21.6875 6.3906 28.5156 6.3906 Q35.4062 6.3906 39.4531 11.7891 Q43.5 17.1875 43.5 26.9062 Q43.5 35.5938 39.375 40.9922 Q35.25 46.3906 28.4219 46.3906 Q21.7344 46.3906 17.6328 41.0703 Q13.5312 35.75 13.5312 25.8281 Z"
        /><glyph unicode="c" horiz-adv-x="52.0" d="M28.0312 6.3906 Q32.8594 6.3906 36.4766 9.3203 Q40.0938 12.25 40.4844 16.6562 L49.0312 16.6562 Q48.7812 12.1094 45.8984 8.0078 Q43.0156 3.9062 38.2109 1.4609 Q33.4062 -0.9844 28.0312 -0.9844 Q17.2344 -0.9844 10.8672 6.2188 Q4.5 13.4219 4.5 25.9219 L4.5 27.4375 Q4.5 35.1562 7.3281 41.1641 Q10.1562 47.1719 15.4531 50.4922 Q20.75 53.8125 27.9844 53.8125 Q36.8594 53.8125 42.75 48.4922 Q48.6406 43.1719 49.0312 34.6719 L40.4844 34.6719 Q40.0938 39.7969 36.6016 43.0938 Q33.1094 46.3906 27.9844 46.3906 Q21.0938 46.3906 17.3125 41.4297 Q13.5312 36.4688 13.5312 27.0938 L13.5312 25.3906 Q13.5312 16.2656 17.2891 11.3281 Q21.0469 6.3906 28.0312 6.3906 Z"
        /><glyph unicode="N" horiz-adv-x="71.0" d="M62.8906 0 L53.4688 0 L17.6719 54.7812 L17.6719 0 L8.25 0 L8.25 71.0938 L17.6719 71.0938 L53.5625 16.0625 L53.5625 71.0938 L62.8906 71.0938 L62.8906 0 Z"
      /></font
    ></defs
    ><g style="fill:rgb(204,204,204); text-rendering:optimizeLegibility; stroke:rgb(204,204,204);"
    ><rect x="0" width="611" height="444" y="0" style="stroke:none;"
    /></g
    ><g style="stroke-linecap:butt; fill:white; text-rendering:geometricPrecision; stroke-linejoin:bevel; shape-rendering:crispEdges; stroke:white; stroke-width:0;"
    ><path style="stroke:none;" d="M537.68 53.28 L537.68 390.72 L73.32 53.28 Z"
      /><path style="stroke:none;" d="M537.68 390.72 L73.32 390.72 L73.32 53.28 Z"
      /><path style="stroke:none;" d="M537.68 53.28 L537.68 390.72 L537.68 390.72 Z"
      /><path style="stroke:none;" d="M73.32 53.28 L73.32 390.72 L73.32 390.72 Z"
      /><path style="stroke:none;" d="M537.68 53.28 L537.68 390.72 L73.32 53.28 Z"
      /><path style="stroke:none;" d="M537.68 390.72 L73.32 390.72 L73.32 53.28 Z"
      /><path style="stroke:none;" d="M537.68 53.28 L537.68 53.28 L537.68 390.72 Z"
      /><path style="stroke:none;" d="M73.32 53.28 L73.32 53.28 L73.32 390.72 Z"
      /><path style="stroke:none;" d="M537.68 53.28 L73.32 53.28 L537.68 53.28 Z"
      /><path style="stroke:none;" d="M73.32 53.28 L73.32 53.28 L537.68 53.28 Z"
      /><path style="stroke:none;" d="M537.68 390.72 L73.32 390.72 L537.68 390.72 Z"
      /><path style="stroke:none;" d="M73.32 390.72 L73.32 390.72 L537.68 390.72 Z"
    /></g
    ><g transform="translate(108.756,399.72)" style="font-size:10px; stroke-linecap:butt; text-rendering:geometricPrecision; font-family:sans-serif; stroke-linejoin:bevel; stroke-width:0;"
    ><text x="-0.1875" xml:space="preserve" y="10.4785" style="stroke:none;"
      >-360</text
    ></g
    ><g transform="translate(213.237,399.72)" style="font-size:10px; stroke-linecap:butt; text-rendering:geometricPrecision; font-family:sans-serif; stroke-linejoin:bevel; stroke-width:0;"
    ><text x="-0.1875" xml:space="preserve" y="10.4785" style="stroke:none;"
      >-270</text
    ></g
    ><g transform="translate(317.718,399.72)" style="font-size:10px; stroke-linecap:butt; text-rendering:geometricPrecision; font-family:sans-serif; stroke-linejoin:bevel; stroke-width:0;"
    ><text x="-0.1875" xml:space="preserve" y="10.4785" style="stroke:none;"
      >-180</text
    ></g
    ><g transform="translate(425.199,399.72)" style="font-size:10px; stroke-linecap:butt; text-rendering:geometricPrecision; font-family:sans-serif; stroke-linejoin:bevel; stroke-width:0;"
    ><text x="-0.1875" xml:space="preserve" y="10.4785" style="stroke:none;"
      >-90</text
    ></g
    ><g transform="translate(534.18,399.72)" style="font-size:10px; stroke-linecap:butt; text-rendering:geometricPrecision; font-family:sans-serif; stroke-linejoin:bevel; stroke-width:0;"
    ><text x="-0.5625" xml:space="preserve" y="10.4785" style="stroke:none;"
      >0</text
    ></g
    ><g style="text-rendering:geometricPrecision; font-size:10px; shape-rendering:crispEdges; font-family:sans-serif; stroke-linecap:butt;"
    ><path style="fill:none;" d="M119.756 390.72 L119.756 396.72"
      /><path style="fill:none;" d="M224.237 390.72 L224.237 396.72"
      /><path style="fill:none;" d="M328.718 390.72 L328.718 396.72"
      /><path style="fill:none;" d="M433.199 390.72 L433.199 396.72"
      /><path style="fill:none;" d="M537.68 390.72 L537.68 396.72"
      /><path style="fill:none;" d="M119.756 390.72 L119.756 393.72"
      /><path style="fill:none;" d="M171.9965 390.72 L171.9965 393.72"
      /><path style="fill:none;" d="M224.237 390.72 L224.237 393.72"
      /><path style="fill:none;" d="M276.4775 390.72 L276.4775 393.72"
      /><path style="fill:none;" d="M328.718 390.72 L328.718 393.72"
      /><path style="fill:none;" d="M380.9585 390.72 L380.9585 393.72"
      /><path style="fill:none;" d="M433.199 390.72 L433.199 393.72"
      /><path style="fill:none;" d="M485.4395 390.72 L485.4395 393.72"
      /><path style="fill:none;" d="M537.68 390.72 L537.68 393.72"
      /><path style="fill:none;" d="M537.68 390.72 L73.32 390.72"
      /><text x="-0.5625" y="10.4785" transform="translate(57.32,71.7369)" style="stroke-linejoin:bevel; shape-rendering:auto; stroke:none; stroke-width:0;" xml:space="preserve"
      >0</text
    ></g
    ><g transform="translate(42.32,331.3062)" style="font-size:10px; stroke-linecap:butt; text-rendering:geometricPrecision; font-family:sans-serif; stroke-linejoin:bevel; stroke-width:0;"
    ><text x="-0.1875" xml:space="preserve" y="10.4785" style="stroke:none;"
      >-200</text
    ></g
    ><g transform="translate(42.32,201.5215)" style="font-size:10px; stroke-linecap:butt; text-rendering:geometricPrecision; font-family:sans-serif; stroke-linejoin:bevel; stroke-width:0;"
    ><text x="-0.1875" xml:space="preserve" y="10.4785" style="stroke:none;"
      >-100</text
    ></g
    ><g transform="translate(42.32,266.4138)" style="font-size:10px; stroke-linecap:butt; text-rendering:geometricPrecision; font-family:sans-serif; stroke-linejoin:bevel; stroke-width:0;"
    ><text x="-0.1875" xml:space="preserve" y="10.4785" style="stroke:none;"
      >-150</text
    ></g
    ><g transform="translate(48.32,136.6292)" style="font-size:10px; stroke-linecap:butt; text-rendering:geometricPrecision; font-family:sans-serif; stroke-linejoin:bevel; stroke-width:0;"
    ><text x="-0.1875" xml:space="preserve" y="10.4785" style="stroke:none;"
      >-50</text
    ></g
    ><g style="text-rendering:geometricPrecision; font-size:10px; shape-rendering:crispEdges; font-family:sans-serif; stroke-linecap:butt;"
    ><path style="fill:none;" d="M73.32 338.8062 L67.32 338.8062"
      /><path style="fill:none;" d="M73.32 273.9138 L67.32 273.9138"
      /><path style="fill:none;" d="M73.32 209.0215 L67.32 209.0215"
      /><path style="fill:none;" d="M73.32 144.1292 L67.32 144.1292"
      /><path style="fill:none;" d="M73.32 79.2369 L67.32 79.2369"
      /><path style="fill:none;" d="M73.32 390.72 L70.32 390.72"
      /><path style="fill:none;" d="M73.32 377.7415 L70.32 377.7415"
      /><path style="fill:none;" d="M73.32 364.7631 L70.32 364.7631"
      /><path style="fill:none;" d="M73.32 351.7846 L70.32 351.7846"
      /><path style="fill:none;" d="M73.32 338.8062 L70.32 338.8062"
      /><path style="fill:none;" d="M73.32 325.8277 L70.32 325.8277"
      /><path style="fill:none;" d="M73.32 312.8492 L70.32 312.8492"
      /><path style="fill:none;" d="M73.32 299.8708 L70.32 299.8708"
      /><path style="fill:none;" d="M73.32 286.8923 L70.32 286.8923"
      /><path style="fill:none;" d="M73.32 273.9138 L70.32 273.9138"
      /><path style="fill:none;" d="M73.32 260.9354 L70.32 260.9354"
      /><path style="fill:none;" d="M73.32 247.9569 L70.32 247.9569"
      /><path style="fill:none;" d="M73.32 234.9785 L70.32 234.9785"
      /><path style="fill:none;" d="M73.32 222 L70.32 222"
      /><path style="fill:none;" d="M73.32 209.0215 L70.32 209.0215"
      /><path style="fill:none;" d="M73.32 196.0431 L70.32 196.0431"
      /><path style="fill:none;" d="M73.32 183.0646 L70.32 183.0646"
      /><path style="fill:none;" d="M73.32 170.0862 L70.32 170.0862"
      /><path style="fill:none;" d="M73.32 157.1077 L70.32 157.1077"
      /><path style="fill:none;" d="M73.32 144.1292 L70.32 144.1292"
      /><path style="fill:none;" d="M73.32 131.1508 L70.32 131.1508"
      /><path style="fill:none;" d="M73.32 118.1723 L70.32 118.1723"
      /><path style="fill:none;" d="M73.32 105.1938 L70.32 105.1938"
      /><path style="fill:none;" d="M73.32 92.2154 L70.32 92.2154"
      /><path style="fill:none;" d="M73.32 79.2369 L70.32 79.2369"
      /><path style="fill:none;" d="M73.32 66.2585 L70.32 66.2585"
      /><path style="fill:none;" d="M73.32 53.28 L70.32 53.28"
      /><path style="fill:none;" d="M73.32 53.28 L73.32 390.72"
      /><text x="1.1719" y="12.4785" transform="translate(268,417.72)" style="stroke-linejoin:bevel; shape-rendering:auto; stroke:none; stroke-width:0;" xml:space="preserve"
      >Phase (degrees)</text
    ></g
    ><g transform="translate(39.32,222) rotate(270) translate(-36.5,-19)" style="font-size:10px; stroke-linecap:butt; text-rendering:geometricPrecision; font-family:sans-serif; stroke-linejoin:bevel; stroke-width:0;"
    ><text x="1.1719" xml:space="preserve" y="12.4785" style="stroke:none;"
      >Magnitude (dB)</text
    ></g
    ><g style="text-rendering:geometricPrecision; font-size:10px; stroke-dasharray:1,4,7,4; shape-rendering:crispEdges; font-family:sans-serif; stroke-linecap:butt;"
    ><path style="fill:none;" d="M73.3154 79.2369 L537.6846 79.2369"
      /><path style="fill:none;" d="M328.718 390.7234 L328.718 53.2766"
    /></g
    ><g transform="translate(328.718,79.2369)" style="stroke-linecap:butt; font-size:10px; fill:rgb(191,0,191); text-rendering:geometricPrecision; font-family:sans-serif; stroke:rgb(191,0,191); stroke-width:2;"
    ><path style="fill:none;" d="M-5 0 L5 0"
      /><path style="fill:none;" d="M0 -5 L0 5"
    /></g
    ><g style="stroke-linecap:butt; font-size:10px; fill:blue; text-rendering:geometricPrecision; font-family:sans-serif; shape-rendering:crispEdges; stroke:blue;"
    ><path d="M535.6457 78.7384 L535.3948 78.7387 L534.8931 78.7392 L533.8896 78.7407 L531.8826 78.745 L529.8757 78.751 L527.8689 78.7588 L525.8622 78.7684 L523.8555 78.7798 L521.8491 78.793 L519.8427 78.808 L517.8366 78.8248 L515.8306 78.8434 L513.825 78.8639 L511.8195 78.8861 L509.8143 78.9102 L507.8095 78.9361 L505.8051 78.9638 L503.801 78.9934 L501.7974 79.0248 L499.7943 79.0582 L497.7917 79.0934 L495.7897 79.1304 L493.7883 79.1694 L491.7876 79.2103 L489.7877 79.2531 L487.7886 79.2978 L485.7904 79.3445 L483.7931 79.3932 L481.7969 79.4437 L479.8018 79.4963 L477.8079 79.5509 L475.8153 79.6074 L473.8241 79.666 L471.8344 79.7266 L469.8463 79.7893 L467.8599 79.854 L465.8754 79.9207 L463.8928 79.9896 L461.9123 80.0605 L459.934 80.1335 L457.9581 80.2087 L455.9846 80.2859 L454.0139 80.3653 L452.046 80.4469 L450.081 80.5306 L448.1192 80.6164 L446.1607 80.7045 L444.2057 80.7947 L442.2544 80.8871 L440.3069 80.9817 L438.3636 81.0784 L436.4244 81.1774 L434.4898 81.2786 L432.5598 81.382 L430.6347 81.4876 L428.7147 81.5955 L426.8 81.7055 L424.8909 81.8177 L422.9875 81.9321 L421.09 82.0487 L419.1988 82.1676 L417.314 82.2886 L413.5646 82.5371 L409.8437 82.7942 L406.153 83.0597 L402.4945 83.3337 L398.8698 83.6158 L395.2806 83.906 L391.7287 84.204 L388.2156 84.5096 L384.7429 84.8225 L381.3119 85.1426 L377.924 85.4695 L374.5803 85.803 L371.282 86.1428 L368.03 86.4885 L364.8252 86.8399 L361.6684 87.1966 L358.56 87.5584 L355.5007 87.9249 L352.4907 88.2957 L349.5304 88.6707 L346.6198 89.0494 L343.7592 89.4315 L340.9482 89.8168 L338.1869 90.205 L335.475 90.5957 L332.8121 90.9888 L330.198 91.3838 L327.6321 91.7806 L325.1139 92.1789 L322.6429 92.5785 L320.2184 92.9791 L317.8398 93.3806 L315.5064 93.7827 L313.2174 94.1852 L310.9723 94.588 L308.7701 94.9909 L306.61 95.3937 L304.4914 95.7962 L302.4133 96.1984 L300.375 96.6 L296.4146 97.4012 L292.6034 98.1989 L288.9352 98.9923 L285.4037 99.7808 L282.0026 100.5638 L278.7261 101.3407 L275.5684 102.1112 L272.524 102.875 L269.5876 103.6317 L266.7543 104.3812 L264.0192 105.1233 L258.8256 106.5846 L253.9731 108.0152 L249.4314 109.4147 L245.1732 110.7834 L241.1742 112.1215 L237.4123 113.4296 L233.868 114.7084 L227.3632 117.1808 L221.5386 119.5452 L216.2955 121.8083 L211.5529 123.9764 L207.244 126.0561 L203.3129 128.0531 L196.4047 131.8209 L190.534 135.3189 L185.4862 138.5805 L177.2588 144.5019 L170.8444 149.7618 L161.5024 158.7777 L155.0347 166.317 L146.6759 178.4576 L138.0096 195.9364 L130.8549 218.3493 L125.9761 244.4519 L123.0657 272.8983 L121.4657 302.6829 L120.6252 333.1849 L120.1943 364.059 L120.0418 383.3378" style="fill:none; clip-path:url(#clipPath1);"
      /><circle transform="translate(328.718,91.3838)" style="stroke-linejoin:bevel; shape-rendering:auto; stroke:none; stroke-width:0;" r="5.5" cx="0" cy="0"
    /></g
    ><g style="stroke-linecap:butt; font-size:10px; fill:blue; text-rendering:geometricPrecision; font-family:sans-serif; shape-rendering:crispEdges; stroke:blue; stroke-width:2;"
    ><path d="M328.718 91.3838 L328.718 79.2369" style="fill:none; clip-path:url(#clipPath1);"
      /><polygon points=" -5 0 0 -5 5 0 0 5" transform="translate(491.7876,79.2103)" style="stroke-width:0; shape-rendering:auto; stroke:none; stroke-linejoin:bevel;"
    /></g
    ><g style="text-rendering:geometricPrecision; font-size:10px; font-family:sans-serif; stroke-linecap:butt;" transform="translate(491.7876,79.2103)"
    ><path style="fill:none;" d="M-5 0 L0 -5 L5 0 L0 5 L-5 0"
    /></g
    ><g style="stroke-linecap:butt; font-size:10px; fill:blue; text-rendering:geometricPrecision; font-family:sans-serif; shape-rendering:crispEdges; stroke:blue; stroke-width:2;"
    ><path d="M491.7876 79.2369 L328.718 79.2369" style="fill:none; clip-path:url(#clipPath1);"
    /></g
    ><g style="text-rendering:geometricPrecision; font-size:10px; stroke-dasharray:1,4,7,4; shape-rendering:crispEdges; font-family:sans-serif; stroke-linecap:butt;"
    ><path style="fill:none;" d="M537.68 77.9391 L537.6846 77.9392"
      /><path style="fill:none;" d="M537.6846 80.5345 L537.6555 80.5345 L537.6066 80.5322 L537.5579 80.5276 L537.5093 80.5207 L537.461 80.5115 L537.4131 80.5 L537.3658 80.4863 L537.319 80.4704 L537.2728 80.4523 L537.2273 80.432 L537.1826 80.4096 L537.1389 80.3851 L537.096 80.3586 L537.0543 80.3301 L537.0136 80.2996 L536.9741 80.2673 L536.9359 80.2331 L536.899 80.1971 L536.8635 80.1595 L536.8294 80.1202 L536.7969 80.0793 L536.7659 80.0369 L536.7365 79.9931 L536.7089 79.948 L536.6829 79.9016 L536.6587 79.854 L536.6364 79.8053 L536.6158 79.7556 L536.5972 79.705 L536.5806 79.6536 L536.5658 79.6014 L536.553 79.5485 L536.5423 79.4952 L536.5336 79.4413 L536.5269 79.3871 L536.5223 79.3326 L536.5197 79.278 L536.5192 79.2232 L536.5207 79.1685 L536.5243 79.114 L536.53 79.0596 L536.5377 79.0056 L536.5474 78.9519 L536.5592 78.8988 L536.5729 78.8463 L536.5886 78.7945 L536.6063 78.7434 L536.6259 78.6933 L536.6473 78.6441 L536.6706 78.5959 L536.6956 78.5489 L536.7225 78.5031 L536.751 78.4587 L536.7811 78.4156 L536.8129 78.3739 L536.8463 78.3338 L536.881 78.2953 L536.9172 78.2585 L536.9548 78.2234 L536.9937 78.1902 L537.0338 78.1588 L537.075 78.1293 L537.1173 78.1017 L537.1606 78.0762 L537.2048 78.0528 L537.2499 78.0314 L537.2958 78.0122 L537.3423 77.9952 L537.3894 77.9804 L537.4371 77.9678 L537.4851 77.9575 L537.5335 77.9494 L537.5822 77.9437 L537.631 77.9402 L537.68 77.9391"
    /></g
    ><g transform="translate(273.5,27)" style="font-size:10px; stroke-linecap:butt; text-rendering:geometricPrecision; font-family:sans-serif; stroke-linejoin:bevel; stroke-width:0;"
    ><text x="1.1719" xml:space="preserve" y="12.4785" style="stroke:none;"
      >Nichols chart</text
    ></g
  ></g
></svg
>
