<?xml version="1.0" encoding="UTF-8"?>
<!DOCTYPE svg PUBLIC '-//W3C//DTD SVG 1.0//EN'
          'http://www.w3.org/TR/2001/REC-SVG-20010904/DTD/svg10.dtd'>
<svg xmlns:xlink="http://www.w3.org/1999/xlink" style="fill-opacity:1; color-rendering:auto; color-interpolation:auto; stroke:black; text-rendering:auto; stroke-linecap:square; stroke-miterlimit:10; stroke-opacity:1; shape-rendering:auto; fill:black; stroke-dasharray:none; font-weight:normal; stroke-width:1; font-family:&apos;Dialog&apos;; font-style:normal; stroke-linejoin:miter; font-size:12; stroke-dashoffset:0; image-rendering:auto;" xmlns="http://www.w3.org/2000/svg"
><!--Generated with Batik SVG Generator--><defs id="genericDefs"
  /><g
  ><defs id="defs1"
    ><linearGradient x1="180" gradientUnits="userSpaceOnUse" x2="180" y1="40" y2="80" id="linearGradient1" spreadMethod="reflect"
      ><stop style="stop-opacity:1; stop-color:rgb(205,205,205);" offset="0%"
        /><stop style="stop-opacity:1; stop-color:white;" offset="100%"
      /></linearGradient
      ><linearGradient x1="60" gradientUnits="userSpaceOnUse" x2="60" y1="50" y2="90" id="linearGradient2" spreadMethod="reflect"
      ><stop style="stop-opacity:1; stop-color:rgb(205,205,205);" offset="0%"
        /><stop style="stop-opacity:1; stop-color:white;" offset="100%"
      /></linearGradient
      ><linearGradient x1="270" gradientUnits="userSpaceOnUse" x2="270" y1="20" y2="80" id="linearGradient3" spreadMethod="reflect"
      ><stop style="stop-opacity:1; stop-color:rgb(205,205,205);" offset="0%"
        /><stop style="stop-opacity:1; stop-color:white;" offset="100%"
      /></linearGradient
      ><linearGradient x1="110" gradientUnits="userSpaceOnUse" x2="110" y1="10" y2="30" id="linearGradient4" spreadMethod="reflect"
      ><stop style="stop-opacity:1; stop-color:rgb(200,200,200);" offset="0%"
        /><stop style="stop-opacity:1; stop-color:white;" offset="100%"
      /></linearGradient
      ><linearGradient x1="330" gradientUnits="userSpaceOnUse" x2="330" y1="40" y2="60" id="linearGradient5" spreadMethod="reflect"
      ><stop style="stop-opacity:1; stop-color:rgb(200,200,200);" offset="0%"
        /><stop style="stop-opacity:1; stop-color:white;" offset="100%"
      /></linearGradient
      ><linearGradient x1="210" gradientUnits="userSpaceOnUse" x2="210" y1="10" y2="30" id="linearGradient6" spreadMethod="reflect"
      ><stop style="stop-opacity:1; stop-color:rgb(200,200,200);" offset="0%"
        /><stop style="stop-opacity:1; stop-color:white;" offset="100%"
      /></linearGradient
      ><clipPath clipPathUnits="userSpaceOnUse" id="clipPath1"
      ><path d="M0 0 L12 0 L12 20 L0 20 L0 0 Z"
      /></clipPath
      ><clipPath clipPathUnits="userSpaceOnUse" id="clipPath2"
      ><path d="M0 0 L13 0 L13 20 L0 20 L0 0 Z"
      /></clipPath
      ><clipPath clipPathUnits="userSpaceOnUse" id="clipPath3"
      ><path d="M0 -0 L64 -0 L64 64 L0 64 L0 -0 Z"
      /></clipPath
    ></defs
    ><g style="fill:url(#linearGradient1); stroke:url(#linearGradient1);" transform="translate(-24,-10)"
    ><rect x="180" y="40" width="40" style="stroke:none;" rx="3" ry="3" height="40"
      /><rect x="180" y="40" width="40" style="fill:none; stroke:black; stroke-width:0.5;" rx="3" ry="3" height="40"
    /></g
    ><g style="text-rendering:geometricPrecision; font-size:11; font-family:&apos;Arial&apos;;" transform="translate(173,43)"
    ><path d="M0.8438 11 L0.8438 3.125 L3.8125 3.125 Q4.6094 3.125 5.0156 3.2031 Q5.5938 3.2969 5.9844 3.5703 Q6.375 3.8438 6.6172 4.3281 Q6.8594 4.8125 6.8594 5.4062 Q6.8594 6.4062 6.2188 7.1016 Q5.5781 7.7969 3.9062 7.7969 L1.8906 7.7969 L1.8906 11 L0.8438 11 ZM1.8906 6.875 L3.9219 6.875 Q4.9375 6.875 5.3594 6.5 Q5.7812 6.125 5.7812 5.4375 Q5.7812 4.9375 5.5312 4.5859 Q5.2812 4.2344 4.875 4.125 Q4.6094 4.0625 3.9062 4.0625 L1.8906 4.0625 L1.8906 6.875 Z" style="clip-path:url(#clipPath1); stroke:none;"
    /></g
    ><g transform="translate(-24,-10)"
    ><polygon style="stroke:none;" points=" 172 46 180 50 172 54"
      /><polygon style="fill:none; stroke-width:0.5;" points=" 172 46 180 50 172 54"
    /></g
    ><g transform="translate(-24,-10)"
    ><polygon style="stroke:none;" points=" 172 66 180 70 172 74"
      /><polygon style="fill:none; stroke-width:0.5;" points=" 172 66 180 70 172 74"
    /></g
    ><g transform="translate(-24,-10)"
    ><polygon style="stroke:none;" points=" 220 56 228 60 220 64"
      /><polygon style="fill:none; stroke-width:0.5;" points=" 220 56 228 60 220 64"
    /></g
    ><g style="fill:url(#linearGradient2); stroke:url(#linearGradient2);" transform="translate(-24,-10)"
    ><rect x="60" y="50" width="40" style="stroke:none;" rx="3" ry="3" height="40"
      /><rect x="60" y="50" width="40" style="fill:none; stroke:black; stroke-width:0.5;" rx="3" ry="3" height="40"
    /></g
    ><g style="text-rendering:geometricPrecision; font-size:11; font-family:&apos;Arial&apos;;" transform="translate(53,53)"
    ><path d="M0.8125 11 L0.8125 3.125 L1.8438 3.125 L1.8438 7.0312 L5.7656 3.125 L7.1719 3.125 L3.875 6.3125 L7.3125 11 L5.9375 11 L3.1406 7.0156 L1.8438 8.2656 L1.8438 11 L0.8125 11 Z" style="clip-path:url(#clipPath2); stroke:none;"
    /></g
    ><g transform="translate(-24,-10)"
    ><polygon style="stroke:none;" points=" 52 66 60 70 52 74"
      /><polygon style="fill:none; stroke-width:0.5;" points=" 52 66 60 70 52 74"
    /></g
    ><g transform="translate(-24,-10)"
    ><polygon style="stroke:none;" points=" 100 66 108 70 100 74"
      /><polygon style="fill:none; stroke-width:0.5;" points=" 100 66 108 70 100 74"
    /></g
    ><g style="fill:blue; stroke:blue;" transform="translate(-24,-10)"
    ><path style="fill:none;" d="M108.5 70 L171.5 70"
    /></g
    ><g transform="translate(-24,-10) scale(16,16) translate(8,5.2431)" style="font-size:1; text-rendering:geometricPrecision; color-rendering:optimizeQuality; image-rendering:optimizeQuality; font-family:&apos;jlm_cmmi10&apos;; color-interpolation:linearRGB;"
    ><path style="stroke:none;" d="M0.3438 -0.0625 L0.3438 -0.0625 Q0.2969 0.0156 0.2344 0.0156 Q0.1562 0.0156 0.125 -0.0469 Q0.1094 -0.0781 0.1094 -0.1094 Q0.1094 -0.1562 0.1562 -0.3125 Q0.1562 -0.3125 0.1719 -0.3125 Q0.1875 -0.3594 0.1875 -0.3906 Q0.1875 -0.4219 0.1562 -0.4219 Q0.1094 -0.4219 0.0625 -0.3281 Q0.0625 -0.3281 0.0625 -0.3281 L0.0625 -0.3281 Q0.0625 -0.3125 0.0625 -0.2969 Q0.0469 -0.2812 0.0469 -0.2812 Q0.0312 -0.2812 0.0312 -0.2812 Q0.0312 -0.3125 0.0469 -0.3438 Q0.0938 -0.4375 0.1562 -0.4375 Q0.2188 -0.4375 0.2344 -0.3906 Q0.25 -0.375 0.25 -0.3594 Q0.25 -0.3438 0.2188 -0.2969 Q0.1719 -0.1562 0.1719 -0.0938 Q0.1719 -0.0156 0.2344 -0.0156 Q0.2969 -0.0156 0.3438 -0.0781 Q0.3438 -0.0938 0.3438 -0.0938 Q0.375 -0.1875 0.4219 -0.3906 Q0.4375 -0.4375 0.4688 -0.4375 Q0.4844 -0.4219 0.4844 -0.4062 Q0.4844 -0.4062 0.4688 -0.3438 Q0.4688 -0.2812 0.4531 -0.2656 L0.4375 -0.1562 Q0.4062 -0.0781 0.4062 -0.0625 Q0.4062 -0.0156 0.4375 -0.0156 Q0.4844 -0.0156 0.5156 -0.1094 Q0.5156 -0.125 0.5156 -0.1406 Q0.5312 -0.1562 0.5312 -0.1562 Q0.5469 -0.1562 0.5469 -0.1406 Q0.5469 -0.125 0.5312 -0.0781 Q0.5156 -0.0625 0.5156 -0.0469 Q0.4844 0.0156 0.4375 0.0156 Q0.375 0.0156 0.3594 -0.0312 Q0.3594 -0.0469 0.3438 -0.0625 Z"
    /></g
    ><g style="fill:url(#linearGradient3); stroke:url(#linearGradient3);" transform="translate(-24,-10)"
    ><rect x="270" y="20" width="20" style="stroke:none;" rx="4.5" ry="4.5" height="60"
      /><rect x="270" y="20" width="20" style="fill:none; stroke:black; stroke-width:0.5;" rx="4.5" ry="4.5" height="60"
    /></g
    ><g style="text-rendering:optimizeLegibility; stroke-width:0.5; image-rendering:optimizeSpeed;" transform="translate(247,31) scale(0.2812,0.2812)"
    ><path d="M22.9937 48 L22.9937 44.5312 L38.3375 31.5625 L23.8531 15.4688 L23.8531 13.3125 L50.4625 13.3125 L50.4625 19.375 L47.8531 19.375 L47.8375 18.9375 L47.7125 16.9688 Q47.7125 15.8438 47.4078 15.5234 Q47.1031 15.2031 46.0094 15.2031 L43.5719 15.1875 L30.4156 15.1875 L43.3063 29.7344 L25.8062 44.5312 L43.3844 44.5312 L46.6813 44.3906 Q47.65 44.3906 48.1656 43.9766 Q48.6813 43.5625 48.7438 42.75 L48.8219 40.6094 L48.8375 40.1875 L51.4469 40.1875 L51.4469 48 L22.9937 48 Z" style="clip-path:url(#clipPath3); stroke:none;"
    /></g
    ><g transform="translate(-24,-10)"
    ><polygon style="stroke:none;" points=" 262 36 270 40 262 44"
      /><polygon style="fill:none; stroke-width:0.5;" points=" 262 36 270 40 262 44"
    /></g
    ><g transform="translate(-24,-10)"
    ><polygon style="stroke:none;" points=" 262 56 270 60 262 64"
      /><polygon style="fill:none; stroke-width:0.5;" points=" 262 56 270 60 262 64"
    /></g
    ><g transform="translate(-24,-10)"
    ><polygon style="stroke:none;" points=" 290 46 298 50 290 54"
      /><polygon style="fill:none; stroke-width:0.5;" points=" 290 46 298 50 290 54"
    /></g
    ><g style="fill:blue; stroke:blue;" transform="translate(-24,-10)"
    ><path style="fill:none;" d="M228.5 60 L261.5 60"
    /></g
    ><g style="fill:url(#linearGradient4); stroke:url(#linearGradient4);" transform="translate(-24,-10)"
    ><polygon style="stroke:none;" points=" 115 10 125 10 130 20 125 30 115 30 110 20"
      /><polygon style="fill:none; stroke-width:0.5; stroke:black;" points=" 115 10 125 10 130 20 125 30 115 30 110 20"
    /></g
    ><g transform="translate(-24,-10) scale(16,16) translate(7.3125,1.6181)" style="font-size:1; text-rendering:geometricPrecision; color-rendering:optimizeQuality; image-rendering:optimizeQuality; font-family:&apos;jlm_cmmi10&apos;; color-interpolation:linearRGB;"
    ><path style="stroke:none;" d="M0.4688 -0.3438 L0.4219 -0.1719 Q0.4062 -0.125 0.4062 -0.0938 Q0.4219 -0.0156 0.4844 -0.0156 Q0.5469 -0.0156 0.5938 -0.0938 Q0.625 -0.1719 0.6406 -0.25 Q0.6406 -0.2656 0.6406 -0.2812 Q0.6406 -0.3281 0.6094 -0.3594 Q0.5938 -0.375 0.5938 -0.3906 Q0.5938 -0.4219 0.625 -0.4375 Q0.6406 -0.4375 0.6406 -0.4375 Q0.6719 -0.4375 0.6875 -0.4062 Q0.6875 -0.3906 0.6875 -0.375 Q0.6875 -0.3125 0.6562 -0.1875 Q0.6406 -0.1406 0.625 -0.1094 Q0.5781 0.0156 0.4844 0.0156 Q0.3906 0.0156 0.3594 -0.0625 Q0.3125 0.0156 0.25 0.0156 Q0.1562 0.0156 0.125 -0.0625 Q0.1094 -0.0781 0.1094 -0.1094 Q0.1094 -0.1719 0.1562 -0.3125 Q0.1562 -0.3125 0.1719 -0.3125 Q0.1875 -0.3594 0.1875 -0.3906 Q0.1875 -0.4219 0.1562 -0.4219 Q0.0938 -0.4219 0.0625 -0.3125 Q0.0625 -0.2969 0.0625 -0.2969 Q0.0469 -0.2812 0.0469 -0.2812 Q0.0312 -0.2812 0.0312 -0.2812 Q0.0312 -0.3125 0.0469 -0.3438 Q0.0938 -0.4375 0.1562 -0.4375 Q0.2188 -0.4375 0.2344 -0.3906 Q0.25 -0.375 0.25 -0.3594 Q0.25 -0.3438 0.2188 -0.2969 Q0.1719 -0.1562 0.1719 -0.1094 Q0.1719 -0.0156 0.25 -0.0156 Q0.3125 -0.0156 0.3438 -0.0938 Q0.3438 -0.0938 0.3438 -0.1094 Q0.3438 -0.1406 0.3594 -0.1719 L0.4062 -0.4062 Q0.4219 -0.4219 0.4531 -0.4375 Q0.4688 -0.4219 0.4844 -0.4062 Q0.4844 -0.4062 0.4688 -0.3438 Z"
    /></g
    ><g style="fill:rgb(200,200,200); stroke:rgb(200,200,200);" transform="translate(-24,-10)"
    ><polygon style="stroke:none;" points=" 130 16 138 20 130 24"
      /><polygon style="fill:none; stroke-width:0.5;" points=" 130 16 138 20 130 24"
    /></g
    ><g style="fill:blue; stroke:blue;" transform="translate(-24,-10)"
    ><path style="fill:none;" d="M138.5 20 L160 20 L160 50 L171.5 50"
    /></g
    ><g style="fill:url(#linearGradient5); stroke:url(#linearGradient5);" transform="translate(-24,-10)"
    ><polygon style="stroke:none;" points=" 335 40 345 40 350 50 345 60 335 60 330 50"
      /><polygon style="fill:none; stroke-width:0.5; stroke:black;" points=" 335 40 345 40 350 50 345 60 335 60 330 50"
    /></g
    ><g transform="translate(-24,-10) scale(16,16) translate(21.1875,3.3681)" style="font-size:1; text-rendering:geometricPrecision; color-rendering:optimizeQuality; image-rendering:optimizeQuality; font-family:&apos;jlm_cmmi10&apos;; color-interpolation:linearRGB;"
    ><path style="stroke:none;" d="M0.4844 -0.375 L0.3906 0 Q0.3594 0.0938 0.2812 0.1562 Q0.2188 0.2031 0.1562 0.2031 Q0.0938 0.2031 0.0625 0.1562 Q0.0469 0.1406 0.0469 0.125 Q0.0469 0.0625 0.0938 0.0625 Q0.0938 0.0469 0.1094 0.0469 Q0.1406 0.0469 0.1406 0.0781 Q0.1406 0.0781 0.1406 0.0938 Q0.1406 0.1094 0.125 0.125 Q0.1094 0.1406 0.0781 0.1406 Q0.0938 0.1875 0.1562 0.1875 Q0.2188 0.1875 0.2656 0.125 Q0.3125 0.0625 0.3281 -0.0156 Q0.3281 -0.0312 0.3281 -0.0312 Q0.2812 0.0156 0.2344 0.0156 Q0.1562 0.0156 0.125 -0.0469 Q0.1094 -0.0781 0.1094 -0.1094 Q0.1094 -0.1562 0.1562 -0.3125 Q0.1562 -0.3125 0.1719 -0.3125 Q0.1875 -0.3594 0.1875 -0.3906 Q0.1875 -0.4219 0.1562 -0.4219 Q0.1094 -0.4219 0.0625 -0.3281 L0.0625 -0.3281 Q0.0625 -0.3125 0.0625 -0.2969 Q0.0469 -0.2812 0.0469 -0.2812 Q0.0312 -0.2812 0.0312 -0.2812 Q0.0312 -0.3125 0.0469 -0.3438 Q0.0938 -0.4375 0.1562 -0.4375 Q0.2188 -0.4375 0.2344 -0.3906 Q0.25 -0.375 0.25 -0.3594 Q0.25 -0.3438 0.2188 -0.2812 Q0.1719 -0.1562 0.1719 -0.0938 Q0.1719 -0.0156 0.2344 -0.0156 Q0.2969 -0.0156 0.3281 -0.0781 Q0.3438 -0.0938 0.3438 -0.0938 L0.3906 -0.2812 Q0.4062 -0.3125 0.4062 -0.3594 Q0.4219 -0.4062 0.4219 -0.4062 Q0.4375 -0.4375 0.4688 -0.4375 Q0.4844 -0.4219 0.4844 -0.4062 Q0.4844 -0.3906 0.4844 -0.375 Z"
    /></g
    ><g style="fill:rgb(200,200,200); stroke:rgb(200,200,200);" transform="translate(-24,-10)"
    ><polygon style="stroke:none;" points=" 322 46 330 50 322 54"
      /><polygon style="fill:none; stroke-width:0.5;" points=" 322 46 330 50 322 54"
    /></g
    ><g style="fill:rgb(255,165,0); stroke:rgb(255,165,0);" transform="translate(-24,-10)"
    ><rect x="307" width="7" height="7" y="47" style="stroke:none;"
      /><rect x="307" y="47" width="7" style="fill:none; stroke:black; stroke-width:0.5;" height="7"
    /></g
    ><g style="fill:blue; stroke:blue;" transform="translate(-24,-10)"
    ><path style="fill:none;" d="M298.2712 50.1294 L306.5002 50.3788"
    /></g
    ><g style="fill:blue; stroke:blue;" transform="translate(-24,-10)"
    ><path style="fill:none;" d="M314.4997 50.371 L321.5003 50.1452"
    /></g
    ><g style="fill:blue; stroke:blue;" transform="translate(-24,-10)"
    ><path style="fill:none;" d="M310.4664 54.5 L310 110 L30 110 L30 70 L51.5 70"
    /></g
    ><g style="fill:url(#linearGradient6); stroke:url(#linearGradient6);" transform="translate(-24,-10)"
    ><polygon style="stroke:none;" points=" 215 10 225 10 230 20 225 30 215 30 210 20"
      /><polygon style="fill:none; stroke-width:0.5; stroke:black;" points=" 215 10 225 10 230 20 225 30 215 30 210 20"
    /></g
    ><g transform="translate(-24,-10) scale(16,16) translate(13.6875,1.6181)" style="font-size:1; text-rendering:geometricPrecision; color-rendering:optimizeQuality; image-rendering:optimizeQuality; font-family:&apos;jlm_cmmi10&apos;; color-interpolation:linearRGB;"
    ><path style="stroke:none;" d="M0.4688 -0.375 Q0.4688 -0.3125 0.4375 -0.2188 Q0.375 -0.0312 0.2812 0 Q0.2656 0.0156 0.25 0.0156 Q0.1562 0.0156 0.125 -0.0469 Q0.1094 -0.0781 0.1094 -0.1094 Q0.1094 -0.1719 0.1562 -0.2812 L0.1719 -0.3125 Q0.1875 -0.3594 0.1875 -0.3906 Q0.1875 -0.4219 0.1562 -0.4219 Q0.1094 -0.4219 0.0625 -0.3281 Q0.0625 -0.3125 0.0625 -0.2969 Q0.0469 -0.2812 0.0469 -0.2812 Q0.0312 -0.2812 0.0312 -0.2812 Q0.0312 -0.3125 0.0469 -0.3438 Q0.0938 -0.4375 0.1562 -0.4375 Q0.2188 -0.4375 0.2344 -0.3906 Q0.25 -0.375 0.25 -0.3594 Q0.25 -0.3438 0.2344 -0.3125 Q0.1719 -0.1719 0.1719 -0.1094 L0.1719 -0.0938 Q0.1719 -0.0156 0.2344 -0.0156 L0.25 -0.0156 Q0.3281 -0.0156 0.3906 -0.1406 Q0.4219 -0.2344 0.4219 -0.2812 Q0.4219 -0.3281 0.3906 -0.3594 Q0.375 -0.375 0.375 -0.3906 Q0.375 -0.4219 0.4062 -0.4375 Q0.4062 -0.4375 0.4219 -0.4375 Q0.4531 -0.4375 0.4688 -0.4062 Q0.4688 -0.3906 0.4688 -0.375 Z"
    /></g
    ><g style="fill:rgb(200,200,200); stroke:rgb(200,200,200);" transform="translate(-24,-10)"
    ><polygon style="stroke:none;" points=" 230 16 238 20 230 24"
      /><polygon style="fill:none; stroke-width:0.5;" points=" 230 16 238 20 230 24"
    /></g
    ><g style="fill:blue; stroke:blue;" transform="translate(-24,-10)"
    ><path style="fill:none;" d="M238.5 20 L250 20 L250 40 L261.5 40"
    /></g
  ></g
></svg
>
