<?xml version="1.0" encoding="UTF-8"?>
<!DOCTYPE svg PUBLIC '-//W3C//DTD SVG 1.0//EN'
          'http://www.w3.org/TR/2001/REC-SVG-20010904/DTD/svg10.dtd'>
<svg xmlns:xlink="http://www.w3.org/1999/xlink" style="fill-opacity:1; color-rendering:auto; color-interpolation:auto; text-rendering:auto; stroke:black; stroke-linecap:square; stroke-miterlimit:10; shape-rendering:auto; stroke-opacity:1; fill:black; stroke-dasharray:none; font-weight:normal; stroke-width:1; font-family:'Dialog'; font-style:normal; stroke-linejoin:miter; font-size:12px; stroke-dashoffset:0; image-rendering:auto;" width="575" height="212" xmlns="http://www.w3.org/2000/svg"
><!--Generated by Scilab with Batik SVG Generator--><defs id="genericDefs"
  /><g
  ><defs id="defs1"
    ><clipPath clipPathUnits="userSpaceOnUse" id="clipPath1"
      ><path d="M68.9956 25.4384 L506.0044 25.4384 L506.0044 186.5616 L68.9956 186.5616 L68.9956 25.4384 Z"
      /></clipPath
      ><font horiz-adv-x="75.0" id="font1"
      ><font-face ascent="92.163086" descent="19.555664" units-per-em="100" style="font-style:normal; font-family:sans-serif; font-weight:normal;"
        /><missing-glyph horiz-adv-x="75.0" d="M12.5 0 L12.5 62.5 L62.5 62.5 L62.5 0 L12.5 0 ZM14.0625 1.5625 L60.9375 1.5625 L60.9375 60.9375 L14.0625 60.9375 L14.0625 1.5625 Z"
        /><glyph unicode="0" horiz-adv-x="56.0" d="M4.1562 35.2969 Q4.1562 48 6.7656 55.7422 Q9.375 63.4844 14.5234 67.6797 Q19.6719 71.875 27.4844 71.875 Q33.25 71.875 37.5938 69.5547 Q41.9375 67.2344 44.7734 62.8672 Q47.6094 58.5 49.2188 52.2266 Q50.8281 45.9531 50.8281 35.2969 Q50.8281 22.7031 48.2422 14.9688 Q45.6562 7.2344 40.5078 3.0078 Q35.3594 -1.2188 27.4844 -1.2188 Q17.1406 -1.2188 11.2344 6.2031 Q4.1562 15.1406 4.1562 35.2969 ZM13.1875 35.2969 Q13.1875 17.6719 17.3125 11.8359 Q21.4375 6 27.4844 6 Q33.5469 6 37.6719 11.8594 Q41.7969 17.7188 41.7969 35.2969 Q41.7969 52.9844 37.6719 58.7891 Q33.5469 64.5938 27.3906 64.5938 Q21.3438 64.5938 17.7188 59.4688 Q13.1875 52.9375 13.1875 35.2969 Z"
        /><glyph unicode="1" horiz-adv-x="56.0" d="M37.25 0 L28.4688 0 L28.4688 56 Q25.2969 52.9844 20.1406 49.9531 Q14.9844 46.9219 10.8906 45.4062 L10.8906 53.9062 Q18.2656 57.375 23.7812 62.3047 Q29.2969 67.2344 31.5938 71.875 L37.25 71.875 L37.25 0 Z"
        /><glyph unicode="-" horiz-adv-x="33.0" d="M3.1719 21.4844 L3.1719 30.3281 L30.1719 30.3281 L30.1719 21.4844 L3.1719 21.4844 Z"
        /><glyph unicode="5" horiz-adv-x="56.0" d="M4.1562 18.75 L13.375 19.5312 Q14.4062 12.7969 18.1406 9.3984 Q21.875 6 27.1562 6 Q33.5 6 37.8906 10.7891 Q42.2812 15.5781 42.2812 23.4844 Q42.2812 31 38.0625 35.3516 Q33.8438 39.7031 27 39.7031 Q22.75 39.7031 19.3359 37.7734 Q15.9219 35.8438 13.9688 32.7656 L5.7188 33.8438 L12.6406 70.6094 L48.25 70.6094 L48.25 62.2031 L19.6719 62.2031 L15.8281 42.9688 Q22.2656 47.4688 29.3438 47.4688 Q38.7188 47.4688 45.1641 40.9688 Q51.6094 34.4688 51.6094 24.2656 Q51.6094 14.5469 45.9531 7.4688 Q39.0625 -1.2188 27.1562 -1.2188 Q17.3906 -1.2188 11.2109 4.25 Q5.0312 9.7188 4.1562 18.75 Z"
        /><glyph unicode=")" horiz-adv-x="33.0" d="M12.3594 -21.0469 L6.0625 -21.0469 Q20.6562 2.3906 20.6562 25.875 Q20.6562 35.0625 18.5625 44.0938 Q16.8906 51.4219 13.9219 58.1562 Q12.0156 62.5469 6.0625 72.7969 L12.3594 72.7969 Q21.5312 60.5469 25.9219 48.1875 Q29.6875 37.5469 29.6875 25.9219 Q29.6875 12.75 24.6328 0.4453 Q19.5781 -11.8594 12.3594 -21.0469 Z"
        /><glyph unicode="B" horiz-adv-x="67.0" d="M7.3281 0 L7.3281 71.5781 L34.1875 71.5781 Q42.3906 71.5781 47.3438 69.4062 Q52.2969 67.2344 55.1016 62.7188 Q57.9062 58.2031 57.9062 53.2656 Q57.9062 48.6875 55.4219 44.6328 Q52.9375 40.5781 47.9062 38.0938 Q54.3906 36.1875 57.8828 31.5938 Q61.375 27 61.375 20.75 Q61.375 15.7188 59.25 11.3984 Q57.125 7.0781 54 4.7344 Q50.875 2.3906 46.1641 1.1953 Q41.4531 0 34.625 0 L7.3281 0 ZM16.7969 41.5 L32.2812 41.5 Q38.5781 41.5 41.3125 42.3281 Q44.9219 43.4062 46.75 45.8984 Q48.5781 48.3906 48.5781 52.1562 Q48.5781 55.7188 46.875 58.4297 Q45.1719 61.1406 41.9922 62.1406 Q38.8125 63.1406 31.1094 63.1406 L16.7969 63.1406 L16.7969 41.5 ZM16.7969 8.4531 L34.625 8.4531 Q39.2031 8.4531 41.0625 8.7969 Q44.3438 9.375 46.5391 10.7422 Q48.7344 12.1094 50.1484 14.7188 Q51.5625 17.3281 51.5625 20.75 Q51.5625 24.75 49.5156 27.7109 Q47.4688 30.6719 43.8281 31.8672 Q40.1875 33.0625 33.3438 33.0625 L16.7969 33.0625 L16.7969 8.4531 Z"
        /><glyph unicode="(" horiz-adv-x="33.0" d="M23.3906 -21.0469 Q16.1094 -11.8594 11.0859 0.4453 Q6.0625 12.75 6.0625 25.9219 Q6.0625 37.5469 9.8125 48.1875 Q14.2031 60.5469 23.3906 72.7969 L29.6875 72.7969 Q23.7812 62.6406 21.875 58.2969 Q18.8906 51.5625 17.1875 44.2344 Q15.0938 35.1094 15.0938 25.875 Q15.0938 2.3906 29.6875 -21.0469 L23.3906 -21.0469 Z"
        /><glyph unicode=" " horiz-adv-x="28.0" d=""
        /><glyph unicode="e" horiz-adv-x="56.0" d="M42.0938 16.7031 L51.1719 15.5781 Q49.0312 7.625 43.2188 3.2266 Q37.4062 -1.1719 28.375 -1.1719 Q17 -1.1719 10.3281 5.8359 Q3.6562 12.8438 3.6562 25.4844 Q3.6562 38.5781 10.3984 45.8047 Q17.1406 53.0312 27.875 53.0312 Q38.2812 53.0312 44.875 45.9531 Q51.4688 38.875 51.4688 26.0312 Q51.4688 25.25 51.4219 23.6875 L12.75 23.6875 Q13.2344 15.1406 17.5781 10.6016 Q21.9219 6.0625 28.4219 6.0625 Q33.25 6.0625 36.6719 8.6016 Q40.0938 11.1406 42.0938 16.7031 ZM13.2344 30.9062 L42.1875 30.9062 Q41.6094 37.4531 38.875 40.7188 Q34.6719 45.7969 27.9844 45.7969 Q21.9219 45.7969 17.7969 41.75 Q13.6719 37.7031 13.2344 30.9062 Z"
        /><glyph unicode="d" horiz-adv-x="56.0" d="M40.2344 0 L40.2344 6.5469 Q35.2969 -1.1719 25.7344 -1.1719 Q19.5312 -1.1719 14.3281 2.25 Q9.125 5.6719 6.2734 11.7969 Q3.4219 17.9219 3.4219 25.875 Q3.4219 33.6406 6.0078 39.9688 Q8.5938 46.2969 13.7734 49.6641 Q18.9531 53.0312 25.3438 53.0312 Q30.0312 53.0312 33.6953 51.0547 Q37.3594 49.0781 39.6562 45.9062 L39.6562 71.5781 L48.3906 71.5781 L48.3906 0 L40.2344 0 ZM12.4531 25.875 Q12.4531 15.9219 16.6484 10.9922 Q20.8438 6.0625 26.5625 6.0625 Q32.3281 6.0625 36.3516 10.7734 Q40.375 15.4844 40.375 25.1406 Q40.375 35.7969 36.2734 40.7734 Q32.1719 45.75 26.1719 45.75 Q20.3125 45.75 16.3828 40.9688 Q12.4531 36.1875 12.4531 25.875 Z"
        /><glyph unicode="u" horiz-adv-x="56.0" d="M40.5781 0 L40.5781 7.625 Q34.5156 -1.1719 24.125 -1.1719 Q19.5312 -1.1719 15.5547 0.5859 Q11.5781 2.3438 9.6484 5.0078 Q7.7188 7.6719 6.9375 11.5312 Q6.3906 14.1094 6.3906 19.7344 L6.3906 51.8594 L15.1875 51.8594 L15.1875 23.0938 Q15.1875 16.2188 15.7188 13.8125 Q16.5469 10.3594 19.2344 8.375 Q21.9219 6.3906 25.875 6.3906 Q29.8281 6.3906 33.2969 8.4219 Q36.7656 10.4531 38.2109 13.9453 Q39.6562 17.4375 39.6562 24.0781 L39.6562 51.8594 L48.4375 51.8594 L48.4375 0 L40.5781 0 Z"
        /><glyph unicode="t" horiz-adv-x="28.0" d="M25.7812 7.8594 L27.0469 0.0938 Q23.3438 -0.6875 20.4062 -0.6875 Q15.625 -0.6875 12.9922 0.8281 Q10.3594 2.3438 9.2812 4.8125 Q8.2031 7.2812 8.2031 15.1875 L8.2031 45.0156 L1.7656 45.0156 L1.7656 51.8594 L8.2031 51.8594 L8.2031 64.7031 L16.9375 69.9688 L16.9375 51.8594 L25.7812 51.8594 L25.7812 45.0156 L16.9375 45.0156 L16.9375 14.7031 Q16.9375 10.9375 17.4062 9.8672 Q17.875 8.7969 18.9219 8.1562 Q19.9688 7.5156 21.9219 7.5156 Q23.3906 7.5156 25.7812 7.8594 Z"
        /><glyph unicode="i" horiz-adv-x="22.0" d="M6.6406 61.4688 L6.6406 71.5781 L15.4375 71.5781 L15.4375 61.4688 L6.6406 61.4688 ZM6.6406 0 L6.6406 51.8594 L15.4375 51.8594 L15.4375 0 L6.6406 0 Z"
        /><glyph unicode="n" horiz-adv-x="56.0" d="M6.5938 0 L6.5938 51.8594 L14.5 51.8594 L14.5 44.4844 Q20.2188 53.0312 31 53.0312 Q35.6875 53.0312 39.625 51.3438 Q43.5625 49.6562 45.5156 46.9219 Q47.4688 44.1875 48.25 40.4375 Q48.7344 37.9844 48.7344 31.8906 L48.7344 0 L39.9375 0 L39.9375 31.5469 Q39.9375 36.9219 38.9141 39.5781 Q37.8906 42.2344 35.2812 43.8203 Q32.6719 45.4062 29.1562 45.4062 Q23.5312 45.4062 19.4531 41.8438 Q15.375 38.2812 15.375 28.3281 L15.375 0 L6.5938 0 Z"
        /><glyph unicode="g" horiz-adv-x="55.0" d="M4.9844 -4.2969 L13.5312 -5.5625 Q14.0625 -9.5156 16.5 -11.3281 Q19.7812 -13.7656 25.4375 -13.7656 Q31.5469 -13.7656 34.8672 -11.3281 Q38.1875 -8.8906 39.3594 -4.5 Q40.0469 -1.8125 39.9844 6.7812 Q34.2344 0 25.6406 0 Q14.9375 0 9.0781 7.7188 Q3.2188 15.4375 3.2188 26.2188 Q3.2188 33.6406 5.9062 39.9141 Q8.5938 46.1875 13.6953 49.6094 Q18.7969 53.0312 25.6875 53.0312 Q34.8594 53.0312 40.8281 45.6094 L40.8281 51.8594 L48.9219 51.8594 L48.9219 7.0312 Q48.9219 -5.0781 46.4609 -10.1328 Q44 -15.1875 38.6484 -18.1172 Q33.2969 -21.0469 25.4844 -21.0469 Q16.2188 -21.0469 10.5 -16.875 Q4.7812 -12.7031 4.9844 -4.2969 ZM12.25 26.8594 Q12.25 16.6562 16.3047 11.9688 Q20.3594 7.2812 26.4688 7.2812 Q32.5156 7.2812 36.6172 11.9453 Q40.7188 16.6094 40.7188 26.5625 Q40.7188 36.0781 36.5 40.9141 Q32.2812 45.75 26.3125 45.75 Q20.4531 45.75 16.3516 40.9922 Q12.25 36.2344 12.25 26.8594 Z"
        /><glyph unicode="a" horiz-adv-x="56.0" d="M40.4375 6.3906 Q35.5469 2.25 31.0312 0.5391 Q26.5156 -1.1719 21.3438 -1.1719 Q12.7969 -1.1719 8.2031 3 Q3.6094 7.1719 3.6094 13.6719 Q3.6094 17.4844 5.3438 20.6328 Q7.0781 23.7812 9.8906 25.6875 Q12.7031 27.5938 16.2188 28.5625 Q18.7969 29.25 24.0312 29.8906 Q34.6719 31.1562 39.7031 32.9062 Q39.75 34.7188 39.75 35.2031 Q39.75 40.5781 37.25 42.7812 Q33.8906 45.75 27.25 45.75 Q21.0469 45.75 18.0938 43.5781 Q15.1406 41.4062 13.7188 35.8906 L5.125 37.0625 Q6.2969 42.5781 8.9844 45.9688 Q11.6719 49.3594 16.75 51.1953 Q21.8281 53.0312 28.5156 53.0312 Q35.1562 53.0312 39.3047 51.4688 Q43.4531 49.9062 45.4062 47.5391 Q47.3594 45.1719 48.1406 41.5469 Q48.5781 39.3125 48.5781 33.4531 L48.5781 21.7344 Q48.5781 9.4688 49.1406 6.2266 Q49.7031 2.9844 51.375 0 L42.1875 0 Q40.8281 2.7344 40.4375 6.3906 ZM39.7031 26.0312 Q34.9062 24.0781 25.3438 22.7031 Q19.9219 21.9219 17.6797 20.9453 Q15.4375 19.9688 14.2109 18.0938 Q12.9844 16.2188 12.9844 13.9219 Q12.9844 10.4062 15.6484 8.0625 Q18.3125 5.7188 23.4375 5.7188 Q28.5156 5.7188 32.4688 7.9375 Q36.4219 10.1562 38.2812 14.0156 Q39.7031 17 39.7031 22.7969 L39.7031 26.0312 Z"
        /><glyph unicode="M" horiz-adv-x="83.0" d="M7.4219 0 L7.4219 71.5781 L21.6875 71.5781 L38.625 20.9062 Q40.9688 13.8125 42.0469 10.2969 Q43.2656 14.2031 45.8438 21.7812 L62.9844 71.5781 L75.7344 71.5781 L75.7344 0 L66.6094 0 L66.6094 59.9062 L45.7969 0 L37.25 0 L16.5469 60.9375 L16.5469 0 L7.4219 0 Z"
        /><glyph unicode="C" horiz-adv-x="72.0" d="M58.7969 25.0938 L68.2656 22.7031 Q65.2812 11.0312 57.5469 4.9062 Q49.8125 -1.2188 38.625 -1.2188 Q27.0469 -1.2188 19.7969 3.4922 Q12.5469 8.2031 8.7656 17.1406 Q4.9844 26.0781 4.9844 36.3281 Q4.9844 47.5156 9.2578 55.8359 Q13.5312 64.1562 21.4141 68.4766 Q29.2969 72.7969 38.7656 72.7969 Q49.5156 72.7969 56.8359 67.3281 Q64.1562 61.8594 67.0469 51.9531 L57.7188 49.75 Q55.2188 57.5625 50.4844 61.1328 Q45.75 64.7031 38.5781 64.7031 Q30.3281 64.7031 24.7812 60.7422 Q19.2344 56.7812 16.9922 50.1172 Q14.75 43.4531 14.75 36.375 Q14.75 27.25 17.4062 20.4375 Q20.0625 13.625 25.6797 10.2578 Q31.2969 6.8906 37.8438 6.8906 Q45.7969 6.8906 51.3203 11.4766 Q56.8438 16.0625 58.7969 25.0938 Z"
        /><glyph unicode="l" horiz-adv-x="22.0" d="M6.3906 0 L6.3906 71.5781 L15.1875 71.5781 L15.1875 0 L6.3906 0 Z"
        /><glyph unicode="p" horiz-adv-x="56.0" d="M6.5938 -19.875 L6.5938 51.8594 L14.5938 51.8594 L14.5938 45.125 Q17.4375 49.0781 21 51.0547 Q24.5625 53.0312 29.6406 53.0312 Q36.2812 53.0312 41.3594 49.6094 Q46.4375 46.1875 49.0234 39.9609 Q51.6094 33.7344 51.6094 26.3125 Q51.6094 18.3594 48.7578 11.9844 Q45.9062 5.6094 40.4609 2.2188 Q35.0156 -1.1719 29 -1.1719 Q24.6094 -1.1719 21.1172 0.6875 Q17.625 2.5469 15.375 5.375 L15.375 -19.875 L6.5938 -19.875 ZM14.5469 25.6406 Q14.5469 15.625 18.6016 10.8438 Q22.6562 6.0625 28.4219 6.0625 Q34.2812 6.0625 38.4531 11.0156 Q42.625 15.9688 42.625 26.375 Q42.625 36.2812 38.5469 41.2109 Q34.4688 46.1406 28.8125 46.1406 Q23.1875 46.1406 18.8672 40.8906 Q14.5469 35.6406 14.5469 25.6406 Z"
        /><glyph unicode="f" horiz-adv-x="29.0" d="M8.6875 0 L8.6875 45.0156 L0.9219 45.0156 L0.9219 51.8594 L8.6875 51.8594 L8.6875 57.375 Q8.6875 62.5938 9.625 65.1406 Q10.8906 68.5625 14.0859 70.6797 Q17.2812 72.7969 23.0469 72.7969 Q26.7656 72.7969 31.25 71.9219 L29.9375 64.2656 Q27.2031 64.75 24.75 64.75 Q20.75 64.75 19.0938 63.0391 Q17.4375 61.3281 17.4375 56.6406 L17.4375 51.8594 L27.5469 51.8594 L27.5469 45.0156 L17.4375 45.0156 L17.4375 0 L8.6875 0 Z"
        /><glyph unicode="r" horiz-adv-x="33.0" d="M6.5 0 L6.5 51.8594 L14.4062 51.8594 L14.4062 44 Q17.4375 49.5156 20 51.2734 Q22.5625 53.0312 25.6406 53.0312 Q30.0781 53.0312 34.6719 50.2031 L31.6406 42.0469 Q28.4219 43.9531 25.2031 43.9531 Q22.3125 43.9531 20.0156 42.2188 Q17.7188 40.4844 16.75 37.4062 Q15.2812 32.7188 15.2812 27.1562 L15.2812 0 L6.5 0 Z"
        /><glyph unicode="o" horiz-adv-x="56.0" d="M3.3281 25.9219 Q3.3281 40.3281 11.3281 47.2656 Q18.0156 53.0312 27.6406 53.0312 Q38.3281 53.0312 45.1172 46.0234 Q51.9062 39.0156 51.9062 26.6562 Q51.9062 16.6562 48.9062 10.9141 Q45.9062 5.1719 40.1641 2 Q34.4219 -1.1719 27.6406 -1.1719 Q16.75 -1.1719 10.0391 5.8125 Q3.3281 12.7969 3.3281 25.9219 ZM12.3594 25.9219 Q12.3594 15.9688 16.7031 11.0156 Q21.0469 6.0625 27.6406 6.0625 Q34.1875 6.0625 38.5312 11.0391 Q42.875 16.0156 42.875 26.2188 Q42.875 35.8438 38.5 40.7969 Q34.125 45.75 27.6406 45.75 Q21.0469 45.75 16.7031 40.8203 Q12.3594 35.8906 12.3594 25.9219 Z"
      /></font
    ></defs
    ><g style="fill:rgb(211,211,211); text-rendering:optimizeLegibility; stroke:rgb(211,211,211);"
    ><rect x="0" width="575" height="212" y="0" style="stroke:none;"
    /></g
    ><g style="stroke-linecap:butt; fill:white; text-rendering:geometricPrecision; stroke-linejoin:bevel; shape-rendering:crispEdges; stroke:white; stroke-width:0;"
    ><path style="stroke:none;" d="M506 25.44 L506 186.56 L69 25.44 Z"
      /><path style="stroke:none;" d="M506 186.56 L69 186.56 L69 25.44 Z"
      /><path style="stroke:none;" d="M506 25.44 L506 186.56 L506 186.56 Z"
      /><path style="stroke:none;" d="M69 25.44 L69 186.56 L69 186.56 Z"
      /><path style="stroke:none;" d="M506 25.44 L506 186.56 L69 25.44 Z"
      /><path style="stroke:none;" d="M506 186.56 L69 186.56 L69 25.44 Z"
      /><path style="stroke:none;" d="M506 25.44 L506 25.44 L506 186.56 Z"
      /><path style="stroke:none;" d="M69 25.44 L69 25.44 L69 186.56 Z"
      /><path style="stroke:none;" d="M506 25.44 L69 25.44 L506 25.44 Z"
      /><path style="stroke:none;" d="M69 25.44 L69 25.44 L506 25.44 Z"
      /><path style="stroke:none;" d="M506 186.56 L69 186.56 L506 186.56 Z"
      /><path style="stroke:none;" d="M69 186.56 L69 186.56 L506 186.56 Z"
    /></g
    ><g style="stroke-linecap:butt; text-rendering:geometricPrecision; shape-rendering:crispEdges;"
    ><path style="fill:none;" d="M69 186.56 L69 192.56"
      /><path style="fill:none;" d="M141.8333 186.56 L141.8333 192.56"
      /><path style="fill:none;" d="M214.6667 186.56 L214.6667 192.56"
      /><path style="fill:none;" d="M287.5 186.56 L287.5 192.56"
      /><path style="fill:none;" d="M360.3333 186.56 L360.3333 192.56"
      /><path style="fill:none;" d="M433.1667 186.56 L433.1667 192.56"
      /><path style="fill:none;" d="M506 186.56 L506 192.56"
      /><path style="fill:none;" d="M69 186.56 L69 189.56"
      /><path style="fill:none;" d="M122.9231 186.56 L122.9231 189.56"
      /><path style="fill:none;" d="M141.8333 186.56 L141.8333 189.56"
      /><path style="fill:none;" d="M195.7564 186.56 L195.7564 189.56"
      /><path style="fill:none;" d="M214.6667 186.56 L214.6667 189.56"
      /><path style="fill:none;" d="M268.5898 186.56 L268.5898 189.56"
      /><path style="fill:none;" d="M287.5 186.56 L287.5 189.56"
      /><path style="fill:none;" d="M341.4231 186.56 L341.4231 189.56"
      /><path style="fill:none;" d="M360.3333 186.56 L360.3333 189.56"
      /><path style="fill:none;" d="M414.2564 186.56 L414.2564 189.56"
      /><path style="fill:none;" d="M433.1667 186.56 L433.1667 189.56"
      /><path style="fill:none;" d="M487.0898 186.56 L487.0898 189.56"
      /><path style="fill:none;" d="M506 186.56 L506 189.56"
      /><path style="fill:none;" d="M506 186.56 L69 186.56"
    /></g
    ><g transform="translate(53,46.2727)" style="font-size:10px; stroke-linecap:butt; text-rendering:geometricPrecision; font-family:sans-serif; stroke-linejoin:bevel; stroke-width:0;"
    ><text x="-0.4219" xml:space="preserve" y="9.2163" style="stroke:none;"
      >0</text
    ></g
    ><g transform="translate(38,116.0382)" style="font-size:10px; stroke-linecap:butt; text-rendering:geometricPrecision; font-family:sans-serif; stroke-linejoin:bevel; stroke-width:0;"
    ><text x="-0.3125" xml:space="preserve" y="9.2163" style="stroke:none;"
      >-100</text
    ></g
    ><g transform="translate(38,150.9209)" style="font-size:10px; stroke-linecap:butt; text-rendering:geometricPrecision; font-family:sans-serif; stroke-linejoin:bevel; stroke-width:0;"
    ><text x="-0.3125" xml:space="preserve" y="9.2163" style="stroke:none;"
      >-150</text
    ></g
    ><g transform="translate(44,81.1554)" style="font-size:10px; stroke-linecap:butt; text-rendering:geometricPrecision; font-family:sans-serif; stroke-linejoin:bevel; stroke-width:0;"
    ><text x="-0.3125" xml:space="preserve" y="9.2163" style="stroke:none;"
      >-50</text
    ></g
    ><g style="text-rendering:geometricPrecision; font-size:10px; shape-rendering:crispEdges; font-family:sans-serif; stroke-linecap:butt;"
    ><path style="fill:none;" d="M69 157.4209 L63 157.4209"
      /><path style="fill:none;" d="M69 122.5382 L63 122.5382"
      /><path style="fill:none;" d="M69 87.6554 L63 87.6554"
      /><path style="fill:none;" d="M69 52.7727 L63 52.7727"
      /><path style="fill:none;" d="M69 25.44 L69 186.56"
      /><text x="1.25" y="11.2163" transform="translate(35,106) rotate(270) translate(-39.5,-17)" style="stroke-linejoin:bevel; shape-rendering:auto; stroke:none; stroke-width:0;" xml:space="preserve"
      >Magnitude (dB)</text
    ></g
    ><g style="stroke-linecap:butt; font-size:10px; fill:rgb(250,225,225); text-rendering:geometricPrecision; font-family:sans-serif; stroke-linejoin:bevel; shape-rendering:crispEdges; stroke:rgb(250,225,225); stroke-width:0;"
    ><path style="stroke:none;" d="M69 25.44 L69 52.7727 L287.5 52.7727 Z"
      /><path style="stroke:none;" d="M287.5 52.7727 L433.1667 122.5382 L433.1667 25.44 Z"
      /><path style="stroke:none;" d="M287.5 52.7727 L433.1667 25.44 L69 25.44 Z"
    /></g
    ><g style="text-rendering:geometricPrecision; font-size:10px; shape-rendering:crispEdges; font-family:sans-serif; stroke-linecap:butt;"
    ><path d="M99.1209 25.44 L99.6648 25.5442 L100.1995 25.6466 L100.7253 25.7474 L101.7515 25.944 L102.7453 26.1344 L103.7089 26.319 L104.644 26.4981 L105.5523 26.6721 L106.4352 26.8412 L107.2941 27.0058 L108.1303 27.166 L108.945 27.3221 L109.7392 27.4742 L110.514 27.6227 L111.2702 27.7675 L112.0088 27.909 L112.7306 28.0473 L113.4362 28.1825 L114.1264 28.3147 L114.8019 28.4441 L115.4633 28.5708 L116.7459 28.8165 L117.9786 29.0527 L119.165 29.28 L120.3085 29.4991 L121.4121 29.7105 L122.4785 29.9148 L123.5101 30.1124 L124.5092 30.3038 L125.4776 30.4893 L126.4173 30.6694 L127.3298 30.8442 L128.2168 31.0141 L129.0796 31.1794 L129.9194 31.3403 L131.5351 31.6498 L133.0722 31.9443 L134.5381 32.2252 L135.9391 32.4936 L137.2806 32.7506 L138.5675 32.9971 L139.8041 33.234 L140.9942 33.462 L142.1411 33.6818 L143.2479 33.8938 L144.3172 34.0987 L146.3533 34.4888 L148.2661 34.8553 L150.0699 35.2009 L151.7763 35.5278 L153.3953 35.838 L154.9355 36.1331 L156.4042 36.4145 L157.8077 36.6834 L159.1516 36.9409 L161.6792 37.4252 L164.0198 37.8737 L166.199 38.2913 L168.2378 38.682 L170.153 39.049 L171.9589 39.3951 L173.6672 39.7225 L176.8297 40.3287 L179.7045 40.8797 L182.3397 41.3849 L184.7722 41.8513 L187.0308 42.2844 L189.1389 42.6888 L192.9753 43.4247 L196.3963 44.0813 L199.4832 44.674 L202.2954 45.2143 L207.2653 46.1701 L211.5594 46.9972 L215.3396 47.7268 L218.7158 48.3801 L224.5481 49.514 L229.4706 50.4788 L233.7292 51.3224 L237.4819 52.0754 L240.8363 52.7586 L243.8688 53.3869 L246.6358 53.971 L249.1801 54.519 L251.5349 55.0371 L253.7265 55.5299 L255.776 56.0013 L259.5151 56.8913 L262.8586 57.7247 L265.8821 58.5133 L271.1798 59.9871 L273.5293 60.6823 L275.7162 61.3544 L277.7617 62.0057 L279.6829 62.6382 L281.494 63.2533 L283.2071 63.8523 L284.8321 64.4362 L286.3777 65.0059 L287.8513 65.562 L289.2592 66.1052 L290.6072 66.6361 L291.9001 67.1552 L293.1422 67.663 L294.3373 68.1598 L295.489 68.6462 L296.6001 69.1224 L297.6736 69.5889 L299.717 70.4938 L301.6364 71.3634 L303.446 72.1999 L305.1576 73.0054 L306.7813 73.7818 L308.3258 74.5308 L309.7983 75.2541 L312.5524 76.6292 L315.0858 77.9179 L317.4313 79.1294 L319.6147 80.2715 L323.5757 82.3746 L327.0954 84.2725 L333.1409 87.5833 L338.2143 90.4001 L346.4249 95.0109 L358.3355 101.7706 L373.7422 110.5772 L391.8235 120.9491 L411.6361 132.3292 L432.4495 144.2892 L453.8037 156.5616 L475.4394 168.996 L497.2188 181.5132 L506 186.56" style="fill:none; clip-path:url(#clipPath1);"
    /></g
    ><g transform="translate(248.8525,54.4478)" style="stroke-linecap:butt; font-size:10px; fill:white; text-rendering:geometricPrecision; font-family:sans-serif; stroke-linejoin:bevel; stroke:white; stroke-width:0;"
    ><circle r="3.5" style="stroke:none;" cx="0" cy="0"
    /></g
    ><g transform="translate(248.8525,54.4478)" style="stroke-linecap:butt; font-size:10px; fill:red; text-rendering:geometricPrecision; font-family:sans-serif; stroke:red; stroke-width:2;"
    ><circle r="3.5" style="fill:none;" cx="0" cy="0"
    /></g
    ><g transform="translate(295.141,68.4984)" style="stroke-linecap:butt; font-size:10px; fill:red; text-rendering:geometricPrecision; font-family:sans-serif; stroke:red; stroke-width:2;"
    ><path style="fill:none;" d="M-4 -4 L4 4"
      /><path style="fill:none;" d="M-4 4 L4 -4"
    /></g
    ><g style="stroke-linecap:butt; font-size:10px; fill:blue; text-rendering:geometricPrecision; font-family:sans-serif; shape-rendering:crispEdges; stroke-dasharray:1,4,7,4; stroke:blue;"
    ><path d="M69 52.7727 L506 52.7727" style="fill:none; clip-path:url(#clipPath1);"
      /><path d="M288.3931 186.56 L288.3931 25.44" style="fill:none; clip-path:url(#clipPath1);"
    /></g
    ><g style="stroke-linecap:butt; font-size:10px; fill:rgb(192,96,0); text-rendering:geometricPrecision; font-family:sans-serif; shape-rendering:crispEdges; stroke:rgb(192,96,0); stroke-width:2;"
    ><path d="M288.3931 65.7696 L288.3931 52.7727" style="fill:none; clip-path:url(#clipPath1);"
    /></g
    ><g style="stroke-linecap:butt; font-size:10px; fill:blue; text-rendering:geometricPrecision; font-family:sans-serif; shape-rendering:crispEdges; stroke-dasharray:1,4,7,4; stroke:blue;"
    ><path d="M240.9047 186.56 L240.9047 25.44" style="fill:none; clip-path:url(#clipPath1);"
    /></g
    ><g transform="translate(215.5,1)" style="font-size:10px; stroke-linecap:butt; text-rendering:geometricPrecision; font-family:sans-serif; stroke-linejoin:bevel; stroke-width:0;"
    ><text x="1.2656" xml:space="preserve" y="11.2163" style="stroke:none;"
      >Bode editor for open loop (C)</text
    ></g
  ></g
></svg
>
