<?xml version="1.0" encoding="UTF-8" standalone="no"?>
<!-- Generator: Adobe Illustrator 14.0.0, SVG Export Plug-In . SVG Version: 6.00 Build 43363)  -->

<svg
   xmlns:dc="http://purl.org/dc/elements/1.1/"
   xmlns:cc="http://creativecommons.org/ns#"
   xmlns:rdf="http://www.w3.org/1999/02/22-rdf-syntax-ns#"
   xmlns:svg="http://www.w3.org/2000/svg"
   xmlns="http://www.w3.org/2000/svg"
   xmlns:sodipodi="http://sodipodi.sourceforge.net/DTD/sodipodi-0.dtd"
   xmlns:inkscape="http://www.inkscape.org/namespaces/inkscape"
   version="1.1"
   id="Calque_1"
   x="0px"
   y="0px"
   width="40px"
   height="40px"
   viewBox="0 0 40 40"
   enable-background="new 0 0 40 40"
   xml:space="preserve"
   inkscape:version="0.91 r13725"
   sodipodi:docname="OnduleurBLDC.svg"><metadata
     id="metadata17"><rdf:RDF><cc:Work
         rdf:about=""><dc:format>image/svg+xml</dc:format><dc:type
           rdf:resource="http://purl.org/dc/dcmitype/StillImage" /><dc:title /></cc:Work></rdf:RDF></metadata><defs
     id="defs15" /><sodipodi:namedview
     pagecolor="#ffffff"
     bordercolor="#666666"
     borderopacity="1"
     objecttolerance="10"
     gridtolerance="10"
     guidetolerance="10"
     inkscape:pageopacity="0"
     inkscape:pageshadow="2"
     inkscape:window-width="1536"
     inkscape:window-height="801"
     id="namedview13"
     showgrid="false"
     inkscape:zoom="11.8"
     inkscape:cx="2.3293674"
     inkscape:cy="19.707324"
     inkscape:window-x="-8"
     inkscape:window-y="-8"
     inkscape:window-maximized="1"
     inkscape:current-layer="Calque_1" /><line
     style="fill:none;stroke:#0000ff;stroke-width:0.375;stroke-miterlimit:4;stroke-dasharray:none"
     id="line5942"
     x1="10.965675"
     y1="25.558559"
     x2="10.965675"
     y2="13.492775" /><line
     y2="10.699904"
     x2="27.979374"
     y1="10.699904"
     x1="1.7547443"
     id="line5942_2_"
     style="fill:none;stroke:#0000ff;stroke-width:0.40000001;stroke-miterlimit:4;stroke-dasharray:0.8, 0.4;stroke-dashoffset:0" /><line
     style="fill:none;stroke:#0000ff;stroke-width:0.42094526"
     id="line5946"
     x1="10.965675"
     y1="9.0373898"
     x2="10.965675"
     y2="4.7025242" /><line
     style="fill:none;stroke:#3399ff;stroke-width:0.37688714"
     id="line5944"
     x1="10.808245"
     y1="13.529341"
     x2="7.0399313"
     y2="8.1778622" /><ellipse
     style="fill:none;stroke:#0000ff;stroke-width:0.37688714"
     cx="-17.772591"
     cy="10.928019"
     id="circle12"
     rx="0.33260578"
     ry="0.37574968"
     transform="matrix(0,-1,1,0,0,0)" /><line
     style="fill:none;stroke:#0000ff;stroke-width:0.375;stroke-miterlimit:4;stroke-dasharray:none"
     id="line5942-0"
     x1="20.832571"
     y1="25.438713"
     x2="20.832571"
     y2="13.492775" /><line
     style="fill:none;stroke:#0000ff;stroke-width:0.42094526"
     id="line5946-3"
     x1="20.832571"
     y1="9.2786236"
     x2="20.832571"
     y2="4.9437571" /><line
     style="fill:none;stroke:#3399ff;stroke-width:0.37688714"
     id="line5944-0"
     x1="20.67514"
     y1="13.770574"
     x2="16.906826"
     y2="8.419096" /><ellipse
     style="fill:none;stroke:#0000ff;stroke-width:0.37688714"
     cx="-19.886406"
     cy="20.794914"
     id="circle12-6"
     rx="0.33260578"
     ry="0.37574968"
     transform="matrix(0,-1,1,0,0,0)" /><line
     style="fill:none;stroke:#0000ff;stroke-width:0.375;stroke-miterlimit:4;stroke-dasharray:none"
     id="line5942-9"
     x1="30.660156"
     y1="25.798258"
     x2="30.660156"
     y2="13.492775" /><line
     style="fill:none;stroke:#0000ff;stroke-width:0.42094526"
     id="line5946-36"
     x1="30.660156"
     y1="9.3984718"
     x2="30.660156"
     y2="5.0636053" /><line
     style="fill:none;stroke:#3399ff;stroke-width:0.37688714"
     id="line5944-3"
     x1="30.502728"
     y1="13.890422"
     x2="26.734413"
     y2="8.5389442" /><ellipse
     style="fill:none;stroke:#0000ff;stroke-width:0.37688714"
     cx="-21.803984"
     cy="30.502653"
     id="circle12-65"
     rx="0.33260578"
     ry="0.37574968"
     transform="matrix(0,-1,1,0,0,0)" /><line
     style="fill:none;stroke:#3399ff;stroke-width:0.37688714"
     id="line5944-7"
     x1="30.622574"
     y1="30.908924"
     x2="26.854261"
     y2="25.557446" /><ellipse
     style="fill:none;stroke:#0000ff;stroke-width:0.37688714"
     cx="-31.152176"
     cy="30.742348"
     id="circle12-0"
     rx="0.33260578"
     ry="0.37574968"
     transform="matrix(0,-1,1,0,0,0)" /><line
     style="fill:none;stroke:#3399ff;stroke-width:0.37688714"
     id="line5944-5"
     x1="20.435444"
     y1="30.90892"
     x2="16.66713"
     y2="25.557446" /><ellipse
     style="fill:none;stroke:#0000ff;stroke-width:0.37688714"
     cx="-31.152176"
     cy="20.555218"
     id="circle12-1"
     rx="0.33260578"
     ry="0.37574968"
     transform="matrix(0,-1,1,0,0,0)" /><line
     style="fill:none;stroke:#0000ff;stroke-width:0.375;stroke-miterlimit:4;stroke-dasharray:none"
     id="line5942-92"
     x1="11.124833"
     y1="35.505997"
     x2="11.124833"
     y2="30.631126" /><line
     style="fill:none;stroke:#3399ff;stroke-width:0.37688714"
     id="line5944-6"
     x1="10.967404"
     y1="30.908924"
     x2="7.19909"
     y2="25.557446" /><ellipse
     style="fill:none;stroke:#0000ff;stroke-width:0.37688714"
     cx="-31.152176"
     cy="11.087178"
     id="circle12-3"
     rx="0.33260578"
     ry="0.37574968"
     transform="matrix(0,-1,1,0,0,0)" /><line
     style="fill:none;stroke:#0000ff;stroke-width:0.375;stroke-miterlimit:4;stroke-dasharray:none"
     id="line5942-92-6"
     x1="20.374264"
     y1="35.386147"
     x2="20.374264"
     y2="30.511276" /><line
     style="fill:none;stroke:#0000ff;stroke-width:0.375;stroke-miterlimit:4;stroke-dasharray:none"
     id="line5942-92-8"
     x1="30.801092"
     y1="35.625847"
     x2="30.801092"
     y2="30.750973" /><line
     style="fill:none;stroke:#0000ff;stroke-width:0.40000001;stroke-miterlimit:4;stroke-dasharray:none"
     id="line5946-36-6"
     x1="35.125801"
     y1="17.790581"
     x2="10.896069"
     y2="17.790581" /><line
     style="fill:none;stroke:#0000ff;stroke-width:0.40000001;stroke-miterlimit:4;stroke-dasharray:none"
     id="line5946-36-6-3"
     x1="36.084591"
     y1="19.947857"
     x2="20.603804"
     y2="19.947857" /><line
     style="fill:none;stroke:#0000ff;stroke-width:0.40000001;stroke-miterlimit:4;stroke-dasharray:none"
     id="line5946-36-6-3-0"
     x1="35.387993"
     y1="21.985281"
     x2="30.693584"
     y2="21.985281" /><line
     style="fill:none;stroke:#0000ff;stroke-width:0.41837409;stroke-miterlimit:4;stroke-dasharray:none"
     id="line5946-36-6-8"
     x1="30.811251"
     y1="4.9667802"
     x2="4.3043938"
     y2="4.9667802" /><line
     style="fill:none;stroke:#0000ff;stroke-width:0.40000001;stroke-miterlimit:4;stroke-dasharray:none"
     id="line5942-92-7"
     x1="4.4343982"
     y1="22.025745"
     x2="4.4343982"
     y2="4.8064675" /><line
     style="fill:none;stroke:#0000ff;stroke-width:0.42680162;stroke-miterlimit:4;stroke-dasharray:none"
     id="line5946-36-6-8-0"
     x1="30.991024"
     y1="35.408325"
     x2="3.4055283"
     y2="35.408325" /><line
     style="fill:none;stroke:#0000ff;stroke-width:0.40000001;stroke-miterlimit:4;stroke-dasharray:none"
     id="line5946-36-6-3-0-7"
     x1="4.6243291"
     y1="22.105133"
     x2="3.1658328"
     y2="22.105133" /><line
     y2="28.457108"
     x2="29.172028"
     y1="28.457108"
     x1="5.5840673"
     id="line5942_2_-1"
     style="fill:none;stroke:#0000ff;stroke-width:0.40000001;stroke-miterlimit:4;stroke-dasharray:0.8, 0.4;stroke-dashoffset:0" /><line
     y2="10.670694"
     x2="5.632885"
     y1="28.625774"
     x1="5.632885"
     id="line5942_2_-5"
     style="fill:none;stroke:#0000ff;stroke-width:0.40000001;stroke-miterlimit:4;stroke-dasharray:0.8, 0.4;stroke-dashoffset:0" /><line
     style="fill:none;stroke:#0000ff;stroke-width:0.40000001;stroke-miterlimit:4;stroke-dasharray:none"
     id="line5942-92-2"
     x1="34.995792"
     y1="17.771122"
     x2="34.995792"
     y2="10.019882" /><line
     style="fill:none;stroke:#0000ff;stroke-width:0.40000001;stroke-miterlimit:4;stroke-dasharray:none"
     id="line5942-92-2-5"
     x1="35.115643"
     y1="35.388866"
     x2="35.115643"
     y2="21.765045" /><line
     style="fill:none;stroke:#0000ff;stroke-width:0.40000001;stroke-miterlimit:4;stroke-dasharray:none"
     id="line5946-36-6-3-0-9"
     x1="36.144512"
     y1="35.288475"
     x2="34.805866"
     y2="35.288475" /><line
     style="fill:none;stroke:#0000ff;stroke-width:0.2136007;stroke-miterlimit:4;stroke-dasharray:none"
     id="line5946-36-6-3-0-9-9"
     x1="36.144512"
     y1="10.180196"
     x2="34.805866"
     y2="10.180196" /><g
     id="g7"
     transform="matrix(0,-0.18079666,-0.21784078,0,24.405198,40.135803)"><line
       style="fill:none;stroke:#0000ff;stroke-width:2"
       id="line9"
       x1="20"
       y1="4.3639998"
       x2="20"
       y2="32.967999" /><line
       style="fill:none;stroke:#0000ff;stroke-width:2"
       id="line11"
       x1="15.233"
       y1="9.132"
       x2="15.233"
       y2="28.200001" /><line
       style="fill:none;stroke:#0000ff;stroke-width:2"
       id="line13"
       x1="10.466"
       y1="13.899"
       x2="10.466"
       y2="23.434" /><line
       style="fill:none;stroke:#0000ff;stroke-width:2"
       id="line15"
       x1="29.535"
       y1="18.667"
       x2="20"
       y2="18.666" /></g></svg>