<?xml version="1.0" encoding="UTF-8" standalone="no"?>
<!-- Generator: Adobe Illustrator 14.0.0, SVG Export Plug-In . SVG Version: 6.00 Build 43363)  -->

<svg
   xmlns:dc="http://purl.org/dc/elements/1.1/"
   xmlns:cc="http://creativecommons.org/ns#"
   xmlns:rdf="http://www.w3.org/1999/02/22-rdf-syntax-ns#"
   xmlns:svg="http://www.w3.org/2000/svg"
   xmlns="http://www.w3.org/2000/svg"
   xmlns:sodipodi="http://sodipodi.sourceforge.net/DTD/sodipodi-0.dtd"
   xmlns:inkscape="http://www.inkscape.org/namespaces/inkscape"
   version="1.1"
   id="Calque_1"
   x="0px"
   y="0px"
   width="40px"
   height="40px"
   viewBox="0 0 40 40"
   enable-background="new 0 0 40 40"
   xml:space="preserve"
   inkscape:version="0.91 r13725"
   sodipodi:docname="SIMM_EMF_SINUS.svg"><metadata
     id="metadata29"><rdf:RDF><cc:Work
         rdf:about=""><dc:format>image/svg+xml</dc:format><dc:type
           rdf:resource="http://purl.org/dc/dcmitype/StillImage" /></cc:Work></rdf:RDF></metadata><defs
     id="defs27" /><sodipodi:namedview
     pagecolor="#ffffff"
     bordercolor="#666666"
     borderopacity="1"
     objecttolerance="10"
     gridtolerance="10"
     guidetolerance="10"
     inkscape:pageopacity="0"
     inkscape:pageshadow="2"
     inkscape:window-width="1920"
     inkscape:window-height="1017"
     id="namedview25"
     showgrid="false"
     inkscape:zoom="5.9"
     inkscape:cx="-10.254237"
     inkscape:cy="20"
     inkscape:window-x="-8"
     inkscape:window-y="-8"
     inkscape:window-maximized="1"
     inkscape:current-layer="Calque_1" /><rect
     x="3.079"
     y="16.993"
     fill="#C0C0C0"
     stroke="#000000"
     width="9.225"
     height="3.188"
     id="rect3" /><rect
     x="28.453"
     y="17.003"
     fill="#C0C0C0"
     stroke="#000000"
     width="9.225"
     height="3.187"
     id="rect5" /><polyline
     fill="none"
     stroke="#0000FF"
     stroke-linecap="square"
     points="0.322,5.188 19.999,5.188 19.999,33.938 0.322,33.938 "
     id="polyline7" /><polyline
     fill="none"
     stroke="#0000FF"
     stroke-linecap="square"
     points="39.678,5.187 19.999,5.187 19.999,33.937 39.678,33.937 "
     id="polyline9" /><circle
     fill="#FFFFFF"
     stroke="#0000FF"
     cx="20.141"
     cy="18.595"
     r="8.327"
     id="circle11" /><g
     id="g13"><line
       fill="none"
       stroke="#000000"
       x1="0.945"
       y1="24.194"
       x2="11.693"
       y2="24.194"
       id="line15" /><line
       fill="none"
       stroke="#000000"
       x1="0.571"
       y1="27.988"
       x2="4.026"
       y2="24.194"
       id="line17" /><line
       fill="none"
       stroke="#000000"
       x1="4.026"
       y1="27.988"
       x2="7.481"
       y2="24.194"
       id="line19" /><line
       fill="none"
       stroke="#000000"
       x1="7.481"
       y1="27.988"
       x2="10.937"
       y2="24.194"
       id="line21" /><line
       fill="none"
       stroke="#000000"
       x1="6.128"
       y1="24.194"
       x2="6.128"
       y2="20.401"
       id="line23" /></g><path
     inkscape:connector-curvature="0"
     style="fill:none;stroke:#000000;stroke-width:0.77819383;stroke-linecap:round"
     d="m 6.8478122,19.050511 c 0,0 5.6992648,-24.470038 13.3928888,0 3.24158,9.563587 7.550864,19.304279 13.25013,0.649613"
     id="path9" /></svg>