<?xml version="1.0" encoding="UTF-8" standalone="no"?>
<!-- Generator: Adobe Illustrator 14.0.0, SVG Export Plug-In . SVG Version: 6.00 Build 43363)  -->

<svg
   xmlns:dc="http://purl.org/dc/elements/1.1/"
   xmlns:cc="http://creativecommons.org/ns#"
   xmlns:rdf="http://www.w3.org/1999/02/22-rdf-syntax-ns#"
   xmlns:svg="http://www.w3.org/2000/svg"
   xmlns="http://www.w3.org/2000/svg"
   xmlns:sodipodi="http://sodipodi.sourceforge.net/DTD/sodipodi-0.dtd"
   xmlns:inkscape="http://www.inkscape.org/namespaces/inkscape"
   version="1.1"
   id="Calque_1"
   x="0px"
   y="0px"
   width="40px"
   height="40px"
   viewBox="0 0 40 40"
   enable-background="new 0 0 40 40"
   xml:space="preserve"
   inkscape:version="0.48.2 r9819"
   sodipodi:docname="Cylinder.svg"><metadata
   id="metadata3010"><rdf:RDF><cc:Work
       rdf:about=""><dc:format>image/svg+xml</dc:format><dc:type
         rdf:resource="http://purl.org/dc/dcmitype/StillImage" /><dc:title /></cc:Work></rdf:RDF></metadata><defs
   id="defs3008" /><sodipodi:namedview
   pagecolor="#ffffff"
   bordercolor="#666666"
   borderopacity="1"
   objecttolerance="10"
   gridtolerance="10"
   guidetolerance="10"
   inkscape:pageopacity="0"
   inkscape:pageshadow="2"
   inkscape:window-width="1280"
   inkscape:window-height="962"
   id="namedview3006"
   showgrid="false"
   inkscape:zoom="11.8"
   inkscape:cx="9.107262"
   inkscape:cy="11.974669"
   inkscape:window-x="-8"
   inkscape:window-y="-8"
   inkscape:window-maximized="1"
   inkscape:current-layer="g3002" />
<g
   id="g3002">
	




<rect
   style="fill:#00bebe;stroke:#000000;stroke-width:1.06902921000000010;stroke-opacity:1;fill-opacity:1"
   id="rect3794"
   width="30.762712"
   height="15.399062"
   x="4.6610169"
   y="7.7365317" /><rect
   style="fill:#666666;fill-opacity:1;stroke:#000000;stroke-opacity:1;stroke-width:0.5;stroke-miterlimit:4;stroke-dasharray:none"
   id="rect2988"
   width="5.6779661"
   height="14.491525"
   x="17.288136"
   y="8.2203398" /><rect
   style="fill:#666666;fill-opacity:1;stroke:#000000;stroke-width:0.4944497;stroke-miterlimit:4;stroke-opacity:1;stroke-dasharray:none"
   id="rect2988-1"
   width="16.24345"
   height="4.2372875"
   x="0.97457713"
   y="13.474577" /><rect
   style="fill:#666666;fill-opacity:1;stroke:#000000;stroke-width:0.50000000000000000;stroke-miterlimit:4;stroke-dasharray:none;stroke-opacity:1"
   id="rect2988-1-7"
   width="16.610168"
   height="4.2372875"
   x="22.966103"
   y="13.474577" /><path
   style="fill:none;stroke:#005a5a;stroke-width:0.65439188;stroke-linecap:butt;stroke-linejoin:miter;stroke-miterlimit:4;stroke-opacity:1;stroke-dasharray:none"
   d="m 10.170905,22.616624 0,6.923393 -9.64926746,0"
   id="path3033"
   inkscape:connector-curvature="0" /><path
   style="fill:none;stroke:#005a5a;stroke-width:0.66739088;stroke-linecap:butt;stroke-linejoin:miter;stroke-miterlimit:4;stroke-opacity:1;stroke-dasharray:none"
   d="m 30.457456,22.716274 0,7.242994 9.593563,0"
   id="path3033-4"
   inkscape:connector-curvature="0" /></g>
</svg>