<?xml version="1.0" encoding="UTF-8" standalone="no"?>
<!-- Generator: Adobe Illustrator 14.0.0, SVG Export Plug-In . SVG Version: 6.00 Build 43363)  -->

<svg
   xmlns:dc="http://purl.org/dc/elements/1.1/"
   xmlns:cc="http://creativecommons.org/ns#"
   xmlns:rdf="http://www.w3.org/1999/02/22-rdf-syntax-ns#"
   xmlns:svg="http://www.w3.org/2000/svg"
   xmlns="http://www.w3.org/2000/svg"
   xmlns:sodipodi="http://sodipodi.sourceforge.net/DTD/sodipodi-0.dtd"
   xmlns:inkscape="http://www.inkscape.org/namespaces/inkscape"
   version="1.1"
   id="Calque_1"
   x="0px"
   y="0px"
   width="40px"
   height="40px"
   viewBox="0 0 40 40"
   enable-background="new 0 0 40 40"
   xml:space="preserve"
   inkscape:version="0.48.2 r9819"
   sodipodi:docname="VolEfficiency.svg"><metadata
   id="metadata3010"><rdf:RDF><cc:Work
       rdf:about=""><dc:format>image/svg+xml</dc:format><dc:type
         rdf:resource="http://purl.org/dc/dcmitype/StillImage" /><dc:title /></cc:Work></rdf:RDF></metadata><defs
   id="defs3008" /><sodipodi:namedview
   pagecolor="#ffffff"
   bordercolor="#666666"
   borderopacity="1"
   objecttolerance="10"
   gridtolerance="10"
   guidetolerance="10"
   inkscape:pageopacity="0"
   inkscape:pageshadow="2"
   inkscape:window-width="1280"
   inkscape:window-height="962"
   id="namedview3006"
   showgrid="false"
   inkscape:zoom="11.8"
   inkscape:cx="9.107262"
   inkscape:cy="11.974669"
   inkscape:window-x="-8"
   inkscape:window-y="-8"
   inkscape:window-maximized="1"
   inkscape:current-layer="g3002" />
<g
   id="g3002">
	




<path
   style="fill:none;stroke:#005a5a;stroke-width:0.8122828;stroke-linecap:butt;stroke-linejoin:miter;stroke-miterlimit:4;stroke-opacity:1;stroke-dasharray:none"
   d="m 8.6534149,18.873331 -8.52441378,0"
   id="path3033"
   inkscape:connector-curvature="0"
   sodipodi:nodetypes="cc" /><path
   style="fill:none;stroke:#005a5a;stroke-width:0.9;stroke-linecap:butt;stroke-linejoin:miter;stroke-miterlimit:4;stroke-opacity:1;stroke-dasharray:0.9,0.9;stroke-dashoffset:0"
   d="m 40.074492,34.65772 -19.871666,0 0.09033,-15.987612"
   id="path2992"
   inkscape:connector-curvature="0"
   sodipodi:nodetypes="ccc" /><path
   style="fill:none;stroke:#005a5a;stroke-width:1.24688971px;stroke-linecap:butt;stroke-linejoin:miter;stroke-opacity:1"
   d="M 8.7342008,9.3834967 8.3665469,28.243623 20.131468,18.403556 z"
   id="path2988"
   inkscape:connector-curvature="0" /><path
   style="fill:none;stroke:#005a5a;stroke-width:1.25384927px;stroke-linecap:butt;stroke-linejoin:miter;stroke-opacity:1"
   d="M 32.25413,9.090365 32.446778,28.621499 20.858307,18.519771 z"
   id="path2988-1"
   inkscape:connector-curvature="0"
   sodipodi:nodetypes="cccc" /><path
   style="fill:none;stroke:#005a5a;stroke-width:0.8122828;stroke-linecap:butt;stroke-linejoin:miter;stroke-miterlimit:4;stroke-opacity:1;stroke-dasharray:none"
   d="m 40.176729,18.898305 -8.015938,-0.08475"
   id="path3033-7"
   inkscape:connector-curvature="0"
   sodipodi:nodetypes="cc" /></g>
</svg>