<?xml version="1.0" encoding="UTF-8" standalone="no"?>
<!-- Created with Inkscape (http://www.inkscape.org/) -->

<svg
   xmlns:dc="http://purl.org/dc/elements/1.1/"
   xmlns:cc="http://creativecommons.org/ns#"
   xmlns:rdf="http://www.w3.org/1999/02/22-rdf-syntax-ns#"
   xmlns:svg="http://www.w3.org/2000/svg"
   xmlns="http://www.w3.org/2000/svg"
   xmlns:xlink="http://www.w3.org/1999/xlink"
   xmlns:sodipodi="http://sodipodi.sourceforge.net/DTD/sodipodi-0.dtd"
   xmlns:inkscape="http://www.inkscape.org/namespaces/inkscape"
   width="64px"
   height="64px"
   id="svg2985"
   version="1.1"
   inkscape:version="0.48.5 r10040"
   sodipodi:docname="Nouveau document 2">
  <defs
     id="defs2987">
    <linearGradient
       inkscape:collect="always"
       id="linearGradient3019">
      <stop
         style="stop-color:#0000ff;stop-opacity:1;"
         offset="0"
         id="stop3021" />
      <stop
         style="stop-color:#0000ff;stop-opacity:0;"
         offset="1"
         id="stop3023" />
    </linearGradient>
    <inkscape:perspective
       sodipodi:type="inkscape:persp3d"
       inkscape:vp_x="66.675347 : 31.083766 : 1"
       inkscape:vp_y="0 : -693.86513 : 0"
       inkscape:vp_z="12.592952 : 31.083766 : 1"
       inkscape:persp3d-origin="39.634151 : 38.484995 : 1"
       id="perspective3001" />
    <linearGradient
       inkscape:collect="always"
       xlink:href="#linearGradient3019"
       id="linearGradient3025"
       x1="23.454546"
       y1="54.545456"
       x2="39.090908"
       y2="16.545454"
       gradientUnits="userSpaceOnUse"
       gradientTransform="matrix(3.6254191,0,0,3.150124,-79.933447,-55.748926)" />
    <linearGradient
       inkscape:collect="always"
       xlink:href="#linearGradient3019"
       id="linearGradient3041"
       gradientUnits="userSpaceOnUse"
       gradientTransform="matrix(3.6254191,0,0,3.150124,-79.933447,-55.748926)"
       x1="28.868586"
       y1="13.65713"
       x2="21.295794"
       y2="25.66243" />
  </defs>
  <sodipodi:namedview
     id="base"
     pagecolor="#ffffff"
     bordercolor="#666666"
     borderopacity="1.0"
     inkscape:pageopacity="0.0"
     inkscape:pageshadow="2"
     inkscape:zoom="5.5"
     inkscape:cx="32"
     inkscape:cy="32"
     inkscape:current-layer="layer1"
     showgrid="true"
     inkscape:document-units="px"
     inkscape:grid-bbox="true"
     inkscape:window-width="1600"
     inkscape:window-height="838"
     inkscape:window-x="-8"
     inkscape:window-y="-8"
     inkscape:window-maximized="1" />
  <metadata
     id="metadata2990">
    <rdf:RDF>
      <cc:Work
         rdf:about="">
        <dc:format>image/svg+xml</dc:format>
        <dc:type
           rdf:resource="http://purl.org/dc/dcmitype/StillImage" />
        <dc:title></dc:title>
      </cc:Work>
    </rdf:RDF>
  </metadata>
  <g
     id="layer1"
     inkscape:label="Layer 1"
     inkscape:groupmode="layer">
    <rect
       style="fill:#0000ff;fill-rule:evenodd;stroke:#000000;stroke-width:1px;stroke-linecap:butt;stroke-linejoin:miter;stroke-opacity:1"
       id="rect2999"
       width="5.090909"
       height="52"
       x="12.909091"
       y="5.6363635" />
    <rect
       style="fill:url(#linearGradient3041);fill-opacity:1;fill-rule:evenodd;stroke:#000000;stroke-width:3.37942600000000000px;stroke-linecap:butt;stroke-linejoin:miter;stroke-opacity:1"
       id="rect3017"
       width="59.984211"
       height="60.711483"
       x="2.4624388"
       y="2.0988035" />
    <path
       style="fill:none;stroke:#000000;stroke-width:1px;stroke-linecap:butt;stroke-linejoin:miter;stroke-opacity:1"
       d="m 18.545455,5.8181818 32,25.4545452 -31.818182,26.181818 0,0 z"
       id="path3035"
       inkscape:connector-curvature="0" />
    <rect
       style="fill:#0000ff;fill-rule:evenodd;stroke:#000000;stroke-width:1px;stroke-linecap:butt;stroke-linejoin:miter;stroke-opacity:1"
       id="rect3037"
       width="2.7272727"
       height="53.636364"
       x="50.18182"
       y="5.2727275" />
    <path
       style="fill:#a0a0a0;stroke:none"
       d="m 29.727273,33.249466 c -9.607266,-5.270345 -10.367975,-5.722569 -10.42308,-6.196276 -0.03541,-0.304421 0.01911,-0.484615 0.134864,-0.445732 0.106869,0.0359 4.973938,2.683451 10.815709,5.883451 9.949234,5.449983 10.603399,5.838318 10.336956,6.136364 -0.156444,0.175 -0.333127,0.315771 -0.392629,0.312824 -0.0595,-0.0029 -4.77182,-2.563731 -10.47182,-5.690631 z"
       id="path3049"
       inkscape:connector-curvature="0" />
    <path
       style="fill:#a0a0a0;stroke:none"
       d="m 35.60859,42.598265 c -0.03472,-0.0993 -2.763135,-1.657061 -6.063135,-3.46169 -4.486852,-2.453666 -5.862442,-3.281956 -5.454546,-3.28437 0.4191,-0.0025 0.482278,-0.04406 0.272727,-0.179478 -0.216636,-0.140001 -0.179242,-0.178012 0.181819,-0.184816 0.438982,-0.0083 0.442461,-0.01771 0.101612,-0.275512 -0.341396,-0.258218 -0.338424,-0.266984 0.09091,-0.268142 0.436712,-0.0012 0.435079,-0.007 -0.101612,-0.362439 l -0.545455,-0.36124 0.636364,-0.0024 0.636363,-0.0024 -0.545454,-0.361241 -0.545455,-0.36124 0.636364,-0.004 c 0.478038,-0.003 0.56851,-0.04783 0.363636,-0.180232 -0.209765,-0.135561 -0.146802,-0.177536 0.272728,-0.181818 0.41953,-0.0043 0.482492,-0.04626 0.272727,-0.181818 C 25.601546,32.805453 25.63894,32.767443 26,32.760638 c 0.426804,-0.008 0.434223,-0.02397 0.12156,-0.260926 -0.317709,-0.240781 -0.314866,-0.255114 0.06196,-0.312399 0.274232,-0.04169 -0.721533,-0.670728 -3.257923,-2.058074 l -3.652867,-1.998034 0,-0.683784 c 0,-0.376082 0.05709,-0.683785 0.126866,-0.683785 0.06978,0 1.868798,0.946342 3.997828,2.102982 2.12903,1.15664 3.958655,2.048785 4.065833,1.982545 0.124895,-0.07719 0.07671,-0.210024 -0.134192,-0.369926 -0.30723,-0.232938 -0.298905,-0.250301 0.125483,-0.261716 l 0.454546,-0.01223 -0.451804,-0.250086 -0.451803,-0.250086 0.481946,-0.06165 c 0.381971,-0.04886 -0.416225,-0.551968 -3.847821,-2.425289 -4.26105,-2.326123 -4.331005,-2.373737 -4.407636,-3 -0.105397,-0.861356 -0.04262,-4.52269 0.07965,-4.644954 0.05383,-0.05383 3.057418,1.521537 6.674643,3.500814 6.052114,3.311602 6.523061,3.603321 5.903479,3.656793 l -0.673293,0.05811 0.709957,0.436218 0.709957,0.436218 L 32,27.669837 c -0.450276,0.006 -0.560635,0.05639 -0.377395,0.172357 0.198021,0.125326 0.148863,0.178159 -0.208872,0.224489 -0.359096,0.04651 0.884819,0.800174 5.351536,3.242408 8.204333,4.485823 7.661962,4.158842 7.40732,4.465667 -0.119413,0.143883 -0.317774,0.261606 -0.440802,0.261606 -0.123029,0 -3.061952,-1.554546 -6.53094,-3.454546 -3.468988,-1.9 -6.446947,-3.452057 -6.617686,-3.449016 -0.263749,0.0047 -0.255748,0.03746 0.0532,0.217834 0.355783,0.20772 0.354627,0.214472 -0.05354,0.312653 -0.325964,0.07841 0.956085,0.85218 5.863636,3.538964 3.454448,1.891238 6.280814,3.4952 6.280814,3.564359 0,0.184848 -0.753304,0.93847 -1.391484,1.39207 -0.549276,0.390411 -0.55992,0.390925 -0.907069,0.04377 -0.446185,-0.446185 -12.670168,-7.251689 -12.792356,-7.121937 -0.05,0.0531 0.0021,0.129979 0.1158,0.170852 0.361705,0.130037 11.030003,6.064546 11.919956,6.630774 0.790244,0.502791 0.838924,0.57627 0.652633,0.985131 -0.110717,0.242999 -0.281062,0.441815 -0.378542,0.441815 -0.09748,0 -0.361771,0.184091 -0.587309,0.409091 -0.225538,0.225 -0.670173,0.613636 -0.988078,0.863636 -0.317906,0.25 -0.813269,0.659091 -1.100808,0.909091 -0.28754,0.25 -0.630626,0.536364 -0.762415,0.636364 -0.131789,0.1 -0.373775,0.287505 -0.537746,0.41668 -0.178764,0.140827 -0.323408,0.162572 -0.361265,0.05431 z m 4.118683,-4.016447 C 39.665469,38.481818 39.578822,38.4 39.534724,38.4 c -0.0441,0 -0.08018,0.08182 -0.08018,0.181818 0,0.1 0.08665,0.181818 0.19255,0.181818 0.105901,0 0.141981,-0.08182 0.08018,-0.181818 z m -2,-1.090909 c -0.0618,-0.1 -0.148451,-0.181818 -0.192549,-0.181818 -0.0441,0 -0.08018,0.08182 -0.08018,0.181818 0,0.1 0.08665,0.181818 0.19255,0.181818 0.105901,0 0.141981,-0.08182 0.08018,-0.181818 z m -2.363637,-1.272727 c -0.0618,-0.1 -0.14845,-0.181818 -0.192548,-0.181818 -0.0441,0 -0.08018,0.08182 -0.08018,0.181818 0,0.1 0.08665,0.181818 0.192549,0.181818 0.105901,0 0.141982,-0.08182 0.08018,-0.181818 z m -2,-1.090909 c -0.0618,-0.1 -0.14845,-0.181818 -0.192548,-0.181818 -0.0441,0 -0.08018,0.08182 -0.08018,0.181818 0,0.1 0.08665,0.181818 0.192549,0.181818 0.105901,0 0.141982,-0.08182 0.08018,-0.181818 z m -2,-1.090909 c -0.0618,-0.1 -0.14845,-0.181819 -0.192548,-0.181819 -0.0441,0 -0.08018,0.08182 -0.08018,0.181819 0,0.1 0.08665,0.181818 0.192549,0.181818 0.105901,0 0.141982,-0.08182 0.08018,-0.181818 z m -2,-1.090909 c -0.0618,-0.1 -0.14845,-0.181819 -0.192548,-0.181819 -0.0441,0 -0.08018,0.08182 -0.08018,0.181819 0,0.1 0.08665,0.181818 0.192549,0.181818 0.105901,0 0.141982,-0.08182 0.08018,-0.181818 z m -1.636363,-0.909091 c -0.0618,-0.1 -0.14845,-0.181819 -0.192549,-0.181819 -0.0441,0 -0.08018,0.08182 -0.08018,0.181819 0,0.1 0.08665,0.181818 0.192549,0.181818 0.105902,0 0.141982,-0.08182 0.08018,-0.181818 z m -1.636364,-0.909091 c -0.0618,-0.1 -0.14845,-0.181818 -0.192548,-0.181818 -0.0441,0 -0.08018,0.08182 -0.08018,0.181818 0,0.1 0.08665,0.181818 0.192548,0.181818 0.105902,0 0.141983,-0.08182 0.08018,-0.181818 z m -1.636364,-0.909091 c -0.0618,-0.1 -0.14845,-0.181818 -0.192548,-0.181818 -0.0441,0 -0.08018,0.08182 -0.08018,0.181818 0,0.1 0.08665,0.181818 0.192549,0.181818 0.105901,0 0.141982,-0.08182 0.08018,-0.181818 z m -1.636363,-0.909091 c -0.0618,-0.1 -0.14845,-0.181818 -0.192549,-0.181818 -0.0441,0 -0.08018,0.08182 -0.08018,0.181818 0,0.1 0.08665,0.181818 0.192548,0.181818 0.105902,0 0.141982,-0.08182 0.08018,-0.181818 z M 21.181818,28.4 c -0.0618,-0.1 -0.14845,-0.181818 -0.192548,-0.181818 -0.0441,0 -0.08018,0.08182 -0.08018,0.181818 0,0.1 0.08665,0.181818 0.192548,0.181818 0.105902,0 0.141983,-0.08182 0.08018,-0.181818 z m -0.545454,-0.363636 c -0.0618,-0.1 -0.148451,-0.181819 -0.192549,-0.181819 -0.0441,0 -0.08018,0.08182 -0.08018,0.181819 0,0.1 0.08665,0.181818 0.192549,0.181818 0.105902,0 0.141982,-0.08182 0.08018,-0.181818 z m -0.545455,-0.363637 c -0.0618,-0.1 -0.14845,-0.181818 -0.192548,-0.181818 -0.0441,0 -0.08018,0.08182 -0.08018,0.181818 0,0.1 0.08665,0.181818 0.192548,0.181818 0.105902,0 0.141982,-0.08182 0.08018,-0.181818 z"
       id="path3051"
       inkscape:connector-curvature="0" />
    <path
       style="fill:#a0a0a0;stroke:none"
       d="m 35.350091,42.324633 c -0.201952,-0.141453 -2.624292,-1.521068 -5.382979,-3.065811 -2.758687,-1.544744 -5.185195,-2.927278 -5.39224,-3.072298 -0.364599,-0.255375 -0.365784,-0.271357 -0.03765,-0.507864 0.186339,-0.134305 0.296575,-0.35422 0.244971,-0.488698 -0.05161,-0.134478 0.0172,-0.247229 0.152899,-0.250557 0.152001,-0.0037 0.08758,-0.138758 -0.167783,-0.351712 l -0.414508,-0.345664 0.596326,-0.05738 0.596327,-0.05738 -1,-0.49336 C 23.750504,33.241715 23.638659,33.138005 24,33.12813 c 0.439101,-0.012 0.442554,-0.02149 0.101613,-0.279367 -0.341396,-0.258219 -0.338424,-0.266984 0.09091,-0.268143 0.442194,-0.0012 0.441891,-0.0025 -0.08168,-0.347647 -0.514886,-0.339439 -0.517073,-0.347691 -0.10811,-0.407892 0.310551,-0.04572 -0.229832,-0.413822 -2.110845,-1.437903 -2.751131,-1.4978 -2.807112,-1.56468 -2.532946,-3.026111 l 0.115912,-0.617865 1.762572,0.943064 c 0.969415,0.518685 2.287965,1.233625 2.930113,1.588755 0.642147,0.35513 1.114357,0.559639 1.049355,0.454464 -0.065,-0.105175 -0.385849,-0.303883 -0.712995,-0.441572 l -0.59481,-0.250345 0.618476,-0.09151 c 0.586269,-0.08675 0.467922,-0.173566 -2.272728,-1.66728 l -2.891203,-1.575768 -0.05465,-2.769579 c -0.03025,-1.533064 0.02031,-2.844543 0.113255,-2.937486 0.181152,-0.181152 2.16958,0.772675 6.114034,2.932834 2.370813,1.298363 2.829411,1.513424 2.180297,1.022459 -0.194113,-0.14682 -0.271114,-0.272446 -0.171114,-0.27917 0.1,-0.0067 -0.02273,-0.129154 -0.272728,-0.272067 l -0.454545,-0.259842 0.545454,-0.01448 0.545455,-0.01448 -0.727273,-0.395607 C 26.499961,22.344691 26.482568,22.315694 26.90328,22.251244 L 27.352015,22.1825 26.90328,21.934057 26.454545,21.685613 27,21.675073 c 0.467,-0.009 0.310091,-0.140118 -1.090909,-0.911437 -1.390626,-0.765607 -1.554451,-0.901757 -1.090909,-0.906624 0.430025,-0.0045 -0.108648,-0.365876 -2.545455,-1.707583 -2.675141,-1.472935 -3.098648,-1.766199 -3.14844,-2.180189 -0.03164,-0.263082 -0.0026,-0.478331 0.06461,-0.478331 0.06718,0 6.780215,3.649073 14.917856,8.10905 13.470716,7.382863 14.779154,8.139991 14.610809,8.454546 C 48.615867,32.244527 48.460745,32.4 48.372849,32.4 c -0.0879,0 -0.44484,0.2768 -0.793207,0.61511 -0.348367,0.338311 -0.870397,0.75511 -1.160064,0.926221 l -0.526667,0.311111 -6.719184,-3.677556 C 35.478178,28.55223 32.25,26.713187 32,26.488122 c -0.25,-0.225064 -1.15,-0.797538 -2,-1.272164 -0.85,-0.474626 -1.606818,-0.89812 -1.681818,-0.941097 -0.075,-0.04298 -0.136364,-0.03703 -0.136364,0.01322 0,0.05025 0.828141,0.560255 1.840313,1.133351 1.582441,0.895986 1.798219,1.072773 1.539916,1.261649 -0.267525,0.195619 -0.23513,0.261447 0.296052,0.601589 l 0.596446,0.381934 -0.51073,0.0031 c -0.280902,0.0017 -0.464483,0.07789 -0.407958,0.169352 0.05653,0.09146 0.0062,0.198477 -0.111816,0.237818 -0.341809,0.113937 0.502734,0.629254 6.478635,3.953092 3.096473,1.722278 5.790149,3.243624 5.985946,3.380766 0.320687,0.224618 0.325878,0.260905 0.05233,0.365876 -0.19722,0.07568 -2.168058,-0.870847 -5.622309,-2.700203 -6.025997,-3.191343 -7.51168,-3.949093 -7.742791,-3.949093 -0.08898,0 -0.124444,0.195363 -0.0788,0.43414 0.06339,0.331627 0.561897,0.704497 2.11115,1.579099 7.102709,4.009701 9.681605,5.483935 9.80776,5.606641 0.07878,0.07662 -0.232797,0.485932 -0.692389,0.909572 -0.722233,0.665731 -0.87582,0.737582 -1.131824,0.529491 -0.255167,-0.207409 -0.279904,-0.197267 -0.178569,0.07321 0.07832,0.209055 -0.04701,0.468422 -0.375049,0.776179 -0.549909,0.5159 -4.202906,3.546214 -4.274908,3.546214 -0.02527,0 -0.211183,-0.115734 -0.413134,-0.257185 l 0,0 z m 4.377182,-3.742815 C 39.665469,38.481818 39.578822,38.4 39.534724,38.4 c -0.0441,0 -0.08018,0.08182 -0.08018,0.181818 0,0.1 0.08665,0.181818 0.19255,0.181818 0.105901,0 0.141981,-0.08182 0.08018,-0.181818 z m 0,-0.909091 c -0.0618,-0.1 -0.148451,-0.181818 -0.192549,-0.181818 -0.0441,0 -0.08018,0.08182 -0.08018,0.181818 0,0.1 0.08665,0.181818 0.19255,0.181818 0.105901,0 0.141981,-0.08182 0.08018,-0.181818 z m -0.909091,-0.545454 c -0.0618,-0.1 -0.148451,-0.181818 -0.192549,-0.181818 -0.0441,0 -0.08018,0.08182 -0.08018,0.181818 0,0.1 0.08665,0.181818 0.192549,0.181818 0.105901,0 0.141981,-0.08182 0.08018,-0.181818 z M 37.909091,36.581818 C 37.847287,36.481818 37.76064,36.4 37.716542,36.4 c -0.0441,0 -0.08018,0.08182 -0.08018,0.181818 0,0.1 0.08665,0.181818 0.192549,0.181818 0.105902,0 0.141982,-0.08182 0.08018,-0.181818 z m -2.545455,-0.363636 c -0.0618,-0.1 -0.14845,-0.181818 -0.192548,-0.181818 -0.0441,0 -0.08018,0.08182 -0.08018,0.181818 0,0.1 0.08665,0.181818 0.192549,0.181818 0.105901,0 0.141982,-0.08182 0.08018,-0.181818 z m 1.215152,-0.403031 c -0.130466,-0.130466 -0.215152,-0.1412 -0.215152,-0.02727 0,0.242687 0.21502,0.457707 0.336364,0.336364 0.05167,-0.05167 -0.0029,-0.190757 -0.121212,-0.309091 l 0,0 z m -3.215152,-0.687878 c -0.0618,-0.1 -0.14845,-0.181818 -0.192548,-0.181818 -0.0441,0 -0.08018,0.08182 -0.08018,0.181818 0,0.1 0.08665,0.181818 0.192549,0.181818 0.105901,0 0.141982,-0.08182 0.08018,-0.181818 z m 1.578788,-0.221213 c -0.130466,-0.130465 -0.215151,-0.1412 -0.215151,-0.02727 0,0.242688 0.21502,0.457708 0.336363,0.336364 0.05167,-0.05167 -0.0029,-0.190756 -0.121212,-0.309091 l 0,0 z m -1.383982,-0.791775 c -0.192543,-0.14079 -0.396831,-0.209229 -0.453974,-0.152087 -0.05714,0.05714 0.05364,0.219089 0.246181,0.35988 0.192543,0.140791 0.396831,0.209229 0.453974,0.152087 0.05714,-0.05714 -0.05364,-0.219089 -0.246181,-0.35988 z m -8.103897,-0.805194 c 0,-0.1 -0.08182,-0.181818 -0.181818,-0.181818 -0.1,0 -0.181818,0.08182 -0.181818,0.181818 0,0.1 0.08182,0.181818 0.181818,0.181818 0.1,0 0.181818,-0.08182 0.181818,-0.181818 z m 6.215152,-0.221212 c -0.130466,-0.130466 -0.215152,-0.141201 -0.215152,-0.02727 0,0.242687 0.21502,0.457707 0.336364,0.336364 0.05167,-0.05167 -0.0029,-0.190758 -0.121212,-0.309091 l 0,0 z m -2.306061,-0.142424 c -0.0618,-0.1 -0.14845,-0.181819 -0.192548,-0.181819 -0.0441,0 -0.08018,0.08182 -0.08018,0.181819 0,0.1 0.08665,0.181818 0.192549,0.181818 0.105901,0 0.141982,-0.08182 0.08018,-0.181818 z m -3.084447,-0.503197 c -0.03182,-0.431911 -0.254741,-0.769531 -0.508101,-0.769531 -0.149429,0 -0.146427,0.06102 0.01073,0.218182 0.12,0.12 0.218182,0.365455 0.218182,0.545455 0,0.18 0.06814,0.327272 0.151432,0.327272 0.08329,0 0.140779,-0.14462 0.127757,-0.321378 l -1e-6,0 z m 1.448084,-0.405894 c -0.0618,-0.1 -0.14845,-0.181819 -0.192549,-0.181819 -0.0441,0 -0.08018,0.08182 -0.08018,0.181819 0,0.1 0.08665,0.181818 0.192549,0.181818 0.105902,0 0.141982,-0.08182 0.08018,-0.181818 z m 2,0 c -0.0618,-0.1 -0.14845,-0.181819 -0.192549,-0.181819 -0.0441,0 -0.08018,0.08182 -0.08018,0.181819 0,0.1 0.08665,0.181818 0.192549,0.181818 0.105902,0 0.141982,-0.08182 0.08018,-0.181818 z m -4.818182,-0.811785 c 0,-0.04648 -0.184091,-0.182604 -0.409091,-0.302495 -0.370949,-0.197659 -0.385826,-0.189779 -0.159555,0.08451 0.232331,0.28164 0.568646,0.410562 0.568646,0.217983 z m 1.181818,-0.09731 c -0.0618,-0.1 -0.14845,-0.181818 -0.192548,-0.181818 -0.0441,0 -0.08018,0.08182 -0.08018,0.181818 0,0.1 0.08665,0.181818 0.192548,0.181818 0.105902,0 0.141983,-0.08182 0.08018,-0.181818 z M 27.636364,30.6923 c 0,-0.02743 -0.102273,-0.05377 -0.227273,-0.05852 -0.125,-0.0048 -0.390909,-0.06495 -0.590909,-0.13377 -0.236659,-0.08143 -0.205711,-0.03108 0.08863,0.14421 0.378755,0.225557 0.729555,0.248677 0.729555,0.04808 z m -3.898388,-0.207173 c -0.194113,-0.14682 -0.439567,-0.264343 -0.545454,-0.261163 -0.105887,0.0032 -0.0337,0.125908 0.160411,0.272727 0.194113,0.14682 0.439567,0.264343 0.545454,0.261163 0.105887,-0.0032 0.0337,-0.125908 -0.160411,-0.272727 z m 0.716569,-0.266945 c -0.0618,-0.1 -0.14845,-0.181818 -0.192548,-0.181818 -0.0441,0 -0.08018,0.08182 -0.08018,0.181818 0,0.1 0.08665,0.181818 0.192549,0.181818 0.105901,0 0.141982,-0.08182 0.08018,-0.181818 z m 1.647068,-0.09669 c -0.194113,-0.146819 -0.439568,-0.264045 -0.545455,-0.260502 -0.105887,0.0035 0.01202,0.123372 0.262024,0.266285 0.588955,0.336677 0.732336,0.333752 0.283431,-0.0058 l 0,-10e-7 z M 28,30.146725 c 0,-0.0393 -0.126977,-0.120182 -0.282171,-0.179735 -0.161804,-0.06209 -0.234785,-0.03161 -0.171087,0.07146 C 27.653516,30.211211 28,30.293982 28,30.146725 z m -6.005265,-0.662918 c -0.431142,-0.272662 -0.664076,-0.1881 -0.280735,0.101915 0.1927,0.145786 0.394876,0.220554 0.44928,0.16615 0.0544,-0.0544 -0.02144,-0.175033 -0.168545,-0.268065 z m 5.418653,0.218204 c 0.256346,-0.16269 -0.07214,-0.533525 -0.810526,-0.915011 -0.68319,-0.352971 -0.724768,-0.222524 -0.05741,0.180113 0.843118,0.508676 0.849502,0.5171 0.540189,0.712716 C 26.93854,29.772861 26.9,29.848977 27,29.848977 c 0.1,0 0.286025,-0.06613 0.413388,-0.146966 z m -4.595206,-0.39292 c -0.0618,-0.1 -0.14845,-0.181818 -0.192549,-0.181818 -0.0441,0 -0.08018,0.08182 -0.08018,0.181818 0,0.1 0.08665,0.181818 0.192548,0.181818 0.105902,0 0.141982,-0.08182 0.08018,-0.181818 z m -2.823448,-0.916193 c -0.431141,-0.272662 -0.664075,-0.1881 -0.280734,0.101915 0.1927,0.145786 0.394876,0.220554 0.44928,0.16615 0.0544,-0.0544 -0.02144,-0.175033 -0.168546,-0.268065 z M 21.181818,28.4 c -0.0618,-0.1 -0.14845,-0.181818 -0.192548,-0.181818 -0.0441,0 -0.08018,0.08182 -0.08018,0.181818 0,0.1 0.08665,0.181818 0.192548,0.181818 0.105902,0 0.141983,-0.08182 0.08018,-0.181818 z m 1.842987,-1.632316 c -1.586358,-0.896589 -2.999698,-1.725945 -3.140758,-1.843014 -0.141059,-0.117069 -0.30337,-0.165953 -0.360691,-0.108632 -0.123737,0.123737 -0.151187,0.106315 3.203917,2.033538 1.45,0.832903 2.759091,1.521996 2.909091,1.531319 0.15,0.0093 -1.025202,-0.716622 -2.611559,-1.613211 l 0,0 z m -2.388441,1.26868 c -0.0618,-0.1 -0.148451,-0.181819 -0.192549,-0.181819 -0.0441,0 -0.08018,0.08182 -0.08018,0.181819 0,0.1 0.08665,0.181818 0.192549,0.181818 0.105902,0 0.141982,-0.08182 0.08018,-0.181818 z m -0.545455,-0.363637 c -0.0618,-0.1 -0.14845,-0.181818 -0.192548,-0.181818 -0.0441,0 -0.08018,0.08182 -0.08018,0.181818 0,0.1 0.08665,0.181818 0.192548,0.181818 0.105902,0 0.141982,-0.08182 0.08018,-0.181818 z"
       id="path3053"
       inkscape:connector-curvature="0" />
    <path
       style="fill:#0000ff;stroke:none"
       d="m 35.090909,42.19138 c -0.35,-0.213993 -2.779276,-1.596584 -5.398392,-3.072425 -2.619115,-1.47584 -4.926742,-2.798719 -5.128059,-2.939726 -0.355172,-0.248771 -0.35598,-0.263624 -0.02723,-0.500569 0.186339,-0.134305 0.296575,-0.35422 0.244971,-0.488698 -0.05161,-0.134478 0.0172,-0.247229 0.152899,-0.250557 0.149132,-0.0037 0.07694,-0.147494 -0.182508,-0.363636 l -0.429234,-0.357587 0.611052,-7.78e-4 0.611052,-7.79e-4 -0.818182,-0.543898 c -0.45,-0.299144 -0.718477,-0.544248 -0.596616,-0.544676 0.122137,-4.29e-4 0.174602,-0.123167 0.116911,-0.273506 -0.05896,-0.153636 -0.0045,-0.272727 0.124795,-0.272727 0.158562,0 0.136363,-0.10286 -0.07185,-0.332937 -0.165717,-0.183115 -0.252708,-0.381531 -0.193315,-0.440925 0.120261,-0.12026 -0.622617,-0.620426 -2.646343,-1.781734 -1.827928,-1.04895 -2.188125,-1.433242 -2.188125,-2.3345 0,-0.398644 0.06649,-0.765901 0.147758,-0.816126 0.08127,-0.05023 1.358151,0.558582 2.837521,1.352906 2.628221,1.411182 3.293845,1.712288 2.561061,1.158537 -0.286289,-0.216344 -0.311491,-0.305804 -0.119565,-0.424421 0.318854,-0.197063 -0.161792,-0.530794 -3.017684,-2.095296 -1.241037,-0.679859 -2.227273,-1.335244 -2.227273,-1.480092 0,-0.142977 0.03619,-0.259957 0.08042,-0.259957 0.04423,0 1.002841,0.539408 2.130241,1.198686 2.386475,1.395555 3.795752,2.128231 3.897627,2.026356 0.03967,-0.03967 -1.201437,-0.801992 -2.758022,-1.694042 -1.556586,-0.89205 -2.98809,-1.768278 -3.181121,-1.947174 -0.308865,-0.286246 -0.350966,-0.584854 -0.350966,-2.48927 0,-1.27981 0.07604,-2.211002 0.18611,-2.279027 0.16533,-0.102179 3.808965,1.705762 7.359345,3.651645 1.186327,0.650199 1.40402,0.54006 0.474173,-0.239902 -0.228752,-0.191879 -0.18767,-0.228459 0.263803,-0.234893 l 0.534751,-0.0076 -0.636364,-0.341646 c -0.551829,-0.296261 -0.591262,-0.359302 -0.296846,-0.474563 0.315008,-0.123324 0.308445,-0.150146 -0.09091,-0.371564 -0.351383,-0.194821 -0.370025,-0.239828 -0.101513,-0.245088 0.504155,-0.0099 0.235307,-0.271536 -1.05381,-1.025638 -0.676116,-0.395511 -1.093161,-0.742878 -0.977622,-0.814285 0.114527,-0.07078 -0.377043,-0.458284 -1.138901,-0.897792 C 19.756526,16.611733 18.993595,16.073071 19.299318,15.767349 19.45636,15.610307 47.2513,30.88655 48.128822,31.612193 L 48.636364,32.031891 48,32.574324 c -0.35,0.298337 -0.965373,0.781894 -1.367493,1.074569 l -0.731129,0.532138 -5.814325,-3.21187 c -3.197879,-1.766528 -7.144122,-4.021554 -8.769428,-5.01117 -1.625306,-0.989616 -2.998956,-1.755448 -3.052556,-1.701848 -0.0536,0.0536 0.736969,0.569907 1.756819,1.147351 1.614418,0.914092 1.814529,1.07896 1.547018,1.274568 -0.276943,0.202506 -0.248414,0.262349 0.289193,0.606605 l 0.596446,0.381934 -0.51073,0.0031 c -0.280902,0.0017 -0.464483,0.07789 -0.407958,0.169352 0.05653,0.09146 0.0011,0.200194 -0.123265,0.241635 -0.326215,0.108738 0.565945,0.646986 6.860135,4.138773 3.1,1.719766 5.711409,3.197619 5.803131,3.284115 0.09882,0.09319 0.04404,0.204362 -0.134453,0.272855 -0.1941,0.07448 -2.322469,-0.950731 -5.984949,-2.882892 -8.089957,-4.267901 -7.636128,-4.062026 -7.458714,-3.383592 0.124895,0.477599 0.811581,0.910509 6.684076,4.213864 2.6,1.462534 4.877189,2.769092 5.06042,2.903465 0.311167,0.228193 0.27748,0.295625 -0.510571,1.022025 -0.729354,0.672295 -0.883869,0.745079 -1.139916,0.536951 -0.255167,-0.207409 -0.279904,-0.197267 -0.178569,0.07321 0.07832,0.209055 -0.04701,0.468422 -0.375049,0.776179 -0.531286,0.498429 -4.202285,3.546656 -4.269909,3.545534 -0.02252,-3.73e-4 -0.327315,-0.175765 -0.677315,-0.389758 z m 4.636364,-4.518653 c -0.0618,-0.1 -0.148451,-0.181818 -0.192549,-0.181818 -0.0441,0 -0.08018,0.08182 -0.08018,0.181818 0,0.1 0.08665,0.181818 0.19255,0.181818 0.105901,0 0.141981,-0.08182 0.08018,-0.181818 z m -0.909091,-0.545454 c -0.0618,-0.1 -0.148451,-0.181818 -0.192549,-0.181818 -0.0441,0 -0.08018,0.08182 -0.08018,0.181818 0,0.1 0.08665,0.181818 0.192549,0.181818 0.105901,0 0.141981,-0.08182 0.08018,-0.181818 z M 37.909091,36.581818 C 37.847287,36.481818 37.76064,36.4 37.716542,36.4 c -0.0441,0 -0.08018,0.08182 -0.08018,0.181818 0,0.1 0.08665,0.181818 0.192549,0.181818 0.105902,0 0.141982,-0.08182 0.08018,-0.181818 z M 35,34.945455 c -0.0618,-0.1 -0.14845,-0.181819 -0.192549,-0.181819 -0.0441,0 -0.08018,0.08182 -0.08018,0.181819 0,0.1 0.08665,0.181818 0.192548,0.181818 0.105902,0 0.141982,-0.08182 0.08018,-0.181818 z m -1.464963,-0.803317 c -0.193956,-0.141823 -0.391315,-0.219193 -0.438576,-0.171933 -0.100066,0.100066 0.368789,0.422922 0.620108,0.427011 0.09411,0.0015 0.01242,-0.113254 -0.181532,-0.255078 l 0,0 z m -8.080492,-0.833047 c 0,-0.1 -0.08182,-0.181818 -0.181818,-0.181818 -0.1,0 -0.181818,0.08182 -0.181818,0.181818 0,0.1 0.08182,0.181818 0.181818,0.181818 0.1,0 0.181818,-0.08182 0.181818,-0.181818 z m 0.774108,-0.987785 c -0.04651,-0.243282 -0.198796,-0.486169 -0.338423,-0.539748 -0.308128,-0.11824 -0.311975,-0.07166 -0.04286,0.518978 0.267774,0.587699 0.491998,0.599913 0.381287,0.02077 z m 3.49862,-0.284942 c -0.0618,-0.1 -0.14845,-0.181819 -0.192549,-0.181819 -0.0441,0 -0.08018,0.08182 -0.08018,0.181819 0,0.1 0.08665,0.181818 0.192549,0.181818 0.105902,0 0.141982,-0.08182 0.08018,-0.181818 z M 24.649637,31.03246 c -0.1927,-0.145787 -0.394876,-0.220554 -0.44928,-0.16615 -0.114126,0.114126 0.347654,0.43867 0.617825,0.434214 0.1,-0.0017 0.02415,-0.122278 -0.168545,-0.268064 l 0,0 z m 2.701931,-0.469227 c -0.568474,-0.222616 -0.741398,-0.171495 -0.370237,0.109452 0.189732,0.143617 0.429756,0.208719 0.533386,0.144672 0.108732,-0.0672 0.03973,-0.174675 -0.163149,-0.254124 l 0,0 z m -3.634999,-0.06654 c -0.461744,-0.349245 -0.731811,-0.352763 -0.443842,-0.0058 0.124489,0.15 0.354691,0.272727 0.511559,0.272727 0.228327,0 0.21482,-0.05324 -0.06772,-0.266945 l 0,0 z m 2.465249,-0.369418 c -0.124489,-0.15 -0.359507,-0.269828 -0.522263,-0.266285 -0.203616,0.0044 -0.154138,0.08749 0.158627,0.266285 0.583485,0.33355 0.640459,0.33355 0.363636,0 z m 1.670455,-0.03329 c -0.13125,-0.05252 -0.288068,-0.04606 -0.348485,0.01435 -0.06042,0.06042 0.04697,0.103389 0.238636,0.09549 0.211808,-0.0087 0.254891,-0.05181 0.109849,-0.109848 l 0,-10e-7 z M 22.181818,29.69218 c 0,-0.0893 -0.129419,-0.212029 -0.287597,-0.272727 -0.444779,-0.170678 -0.503547,-0.133673 -0.257857,0.162365 0.250845,0.302251 0.545454,0.361859 0.545454,0.110362 z m 5.224374,-0.147119 c 0.07066,-0.211987 -1.1827,-1.065522 -1.337434,-0.910788 -0.05166,0.05166 0.158803,0.243228 0.467703,0.4257 0.329958,0.194911 0.522603,0.43349 0.46701,0.578363 -0.05309,0.13836 2e-4,0.214988 0.121405,0.174584 0.118818,-0.03961 0.24541,-0.160143 0.281316,-0.267859 z m -7.224374,-0.94379 c 0,-0.0893 -0.129419,-0.212029 -0.287598,-0.272728 -0.444778,-0.170677 -0.503546,-0.133672 -0.257856,0.162366 0.250845,0.30225 0.545454,0.361859 0.545454,0.110362 z m 1,-0.201271 c -0.0618,-0.1 -0.14845,-0.181818 -0.192548,-0.181818 -0.0441,0 -0.08018,0.08182 -0.08018,0.181818 0,0.1 0.08665,0.181818 0.192548,0.181818 0.105902,0 0.141983,-0.08182 0.08018,-0.181818 z"
       id="path3055"
       inkscape:connector-curvature="0" />
    <path
       style="fill:#0000ff"
       d="m 19.272727,46.418375 0,-9.807137 1.784586,0.978551 c 1.486865,0.815298 1.87198,0.955178 2.308437,0.838451 0.492091,-0.131605 0.383898,-0.215476 -1.784586,-1.383404 l -2.308437,-1.243303 -0.0061,-1.109857 c -0.0034,-0.610422 -0.01662,-1.846221 -0.02945,-2.746221 -0.04023,-2.822981 -0.01267,-3.042447 0.353753,-2.817221 0.175,0.107565 1.177273,0.705153 2.227273,1.327973 1.05,0.622819 1.894467,1.21269 1.876592,1.310823 -0.01787,0.09813 0.09708,0.321606 0.255453,0.496606 0.192399,0.212599 0.214706,0.318182 0.06722,0.318182 -0.1214,0 -0.167946,0.0854 -0.103436,0.189783 0.06451,0.10438 0.02944,0.29564 -0.07794,0.425021 -0.147208,0.177375 -0.08397,0.294781 0.257075,0.477304 0.248767,0.133137 0.452305,0.310059 0.452305,0.393161 0,0.0831 0.264447,0.151095 0.58766,0.151095 l 0.587661,0 -0.688426,-0.467798 c -0.53664,-0.364656 -0.680558,-0.575117 -0.652742,-0.954545 0.04273,-0.582917 -0.177885,-1.30493 -0.398735,-1.30493 -0.08719,0 -0.302652,-0.120486 -0.478795,-0.267746 -0.176143,-0.147261 -1.015714,-0.703236 -1.865714,-1.2355 -1.123147,-0.703307 -1.529972,-1.056302 -1.488794,-1.2918 0.03552,-0.203154 -0.08318,-0.360615 -0.318182,-0.422069 -0.285633,-0.07469 -0.374843,-0.244788 -0.374843,-0.7147 l 0,-0.616677 2,1.003038 c 1.1,0.55167 1.999565,0.94099 1.999034,0.865155 -9.44e-4,-0.134536 -3.502295,-2.07994 -3.953579,-2.196669 -0.196496,-0.05082 -0.344768,-0.759396 -0.158908,-0.759396 0.0376,0 1.019419,0.524508 2.181819,1.165574 2.387745,1.316845 2.892505,1.325713 0.650697,0.01143 -2.249391,-1.318727 -1.573682,-1.175709 0.895792,0.1896 2.195602,1.213892 3.415065,1.578596 1.687489,0.504675 -0.606148,-0.376801 -0.947303,-0.498101 -1.004785,-0.357256 -0.05277,0.129304 -0.09289,0.10589 -0.101905,-0.05948 -0.0082,-0.15 -0.869464,-0.791021 -1.913963,-1.424491 -1.0445,-0.63347 -1.987849,-1.258711 -2.096331,-1.389424 -0.1239,-0.149291 -0.17813,-1.025497 -0.145845,-2.356473 l 0.05139,-2.118813 1.85806,0.908988 c 1.021933,0.499944 1.895445,0.848498 1.941137,0.774566 0.04569,-0.07393 -0.848695,-0.605219 -1.987528,-1.180637 -1.928024,-0.974173 -2.078607,-1.08887 -2.186814,-1.665662 -0.06392,-0.340696 -0.08747,-0.698436 -0.05235,-0.794977 0.03512,-0.09654 1.275235,0.492249 2.755806,1.308424 1.936925,1.067743 2.579959,1.501187 2.292664,1.545398 -0.38087,0.05861 -0.375049,0.07742 0.126234,0.407893 l 0.525518,0.346448 -0.5,0.0012 c -0.922349,0.0022 -0.512723,0.447946 1.296038,1.410289 1.899351,1.010542 2.704492,1.244442 2.141232,0.622047 -0.403281,-0.445623 -0.379272,-0.5752 0.108184,-0.583874 0.380722,-0.0068 0.373423,-0.02661 -0.10525,-0.286048 -0.310118,-0.168081 -0.475703,-0.379456 -0.417031,-0.532352 0.05352,-0.139471 0.02264,-0.299733 -0.06863,-0.356138 -0.09126,-0.05641 -0.128082,-0.202208 -0.08182,-0.324005 0.04627,-0.121797 -0.297606,-0.462205 -0.764163,-0.75646 -0.466556,-0.294256 -1.101623,-0.788349 -1.411259,-1.097986 -0.309637,-0.309637 -1.503428,-1.124881 -2.652869,-1.811653 -2.289264,-1.367798 -2.589262,-1.571133 -2.479694,-1.680701 0.209137,-0.209138 27.621247,14.860938 28.389801,15.607572 0.185606,0.180312 -0.399747,0.75117 -1.747732,1.704454 l -0.656826,0.464501 -3.888629,-2.171826 c -2.138747,-1.194504 -6.050664,-3.406928 -8.69315,-4.916498 -2.642485,-1.509569 -4.888394,-2.744671 -4.990909,-2.744671 -0.322496,0 0.144696,0.357703 1.639738,1.255459 0.823433,0.494462 1.429453,0.980847 1.430863,1.148394 0.0013,0.159856 0.157208,0.461657 0.346361,0.67067 0.286099,0.316135 0.296599,0.380022 0.06246,0.380022 -0.431386,0 -0.557018,0.55594 -0.187154,0.828184 0.176737,0.130089 2.966768,1.733339 6.200069,3.562777 3.233302,1.829437 5.788905,3.356192 5.679118,3.392787 -0.109785,0.0366 -2.976585,-1.372504 -6.370663,-3.131333 -3.394079,-1.758828 -6.297409,-3.197869 -6.451846,-3.197869 -0.44987,0 -0.325076,0.475867 0.252172,0.96159 0.293131,0.246653 3.001587,1.866445 6.018792,3.599537 l 5.485825,3.151076 -0.736742,0.687224 c -0.417731,0.389656 -0.848521,0.644329 -0.994894,0.58816 -0.15422,-0.05918 -0.294318,0.03922 -0.347977,0.244411 -0.0761,0.290998 -4.314859,4.040729 -4.56771,4.040729 -0.151566,0 -10.743733,-6.03872 -10.987377,-6.264035 -0.189609,-0.175345 -0.181707,-0.315714 0.04206,-0.747016 0.253225,-0.488093 0.248205,-0.558433 -0.062,-0.868636 -0.185646,-0.185646 -0.490934,-0.305303 -0.67842,-0.265904 -0.286335,0.06017 -0.2536,0.120027 0.204572,0.37406 0.541382,0.300169 0.542061,0.302522 0.09091,0.315235 -0.399656,0.01125 -0.415817,0.03536 -0.133829,0.199551 0.289541,0.16859 0.29335,0.214109 0.03918,0.46828 -0.216968,0.216967 -0.233293,0.339669 -0.07118,0.535001 0.16244,0.195728 0.153516,0.254757 -0.03918,0.259139 -0.137244,0.0031 0.0693,0.201585 0.458998,0.441032 l 0.708533,0.43536 -0.616062,0.05897 c -0.551905,0.05283 -0.133393,0.322098 4.01874,2.585669 2.549141,1.389685 4.979085,2.724987 5.399876,2.967336 l 0.765076,0.440637 -0.583257,0.583698 c -0.320792,0.321034 -0.612336,0.565743 -0.647877,0.5438 -0.03554,-0.02194 -1.426449,1.084351 -3.090909,2.458431 -1.664459,1.37408 -4.887653,4.029807 -7.162653,5.901618 l -4.136364,3.403291 0,-9.807138 z m 6.636364,-6.382011 c -0.0618,-0.1 -0.194188,-0.181819 -0.294188,-0.181819 -0.1,0 -0.131252,0.08182 -0.06945,0.181819 0.0618,0.1 0.194188,0.181818 0.294188,0.181818 0.1,0 0.131251,-0.08182 0.06945,-0.181818 z m 0.06032,-0.36642 c 0.262274,-0.0024 0.266412,-0.02663 0.03058,-0.179035 -0.15,-0.09694 -0.6,-0.174604 -1,-0.172591 -0.722008,0.0036 -0.723982,0.0055 -0.272727,0.264062 0.25,0.14322 0.56351,0.22214 0.696688,0.175375 0.133179,-0.04677 0.378634,-0.08628 0.545455,-0.08781 z m 13.848766,-1.997217 c 0,-0.1 -0.08182,-0.181818 -0.181818,-0.181818 -0.1,0 -0.181819,0.08182 -0.181819,0.181818 0,0.1 0.08182,0.181818 0.181819,0.181818 0.1,0 0.181818,-0.08182 0.181818,-0.181818 z m -0.909091,-0.545454 c 0,-0.1 -0.08182,-0.181818 -0.181818,-0.181818 -0.1,0 -0.181818,0.08182 -0.181818,0.181818 0,0.1 0.08182,0.181818 0.181818,0.181818 0.1,0 0.181818,-0.08182 0.181818,-0.181818 z M 38,36.581818 C 38,36.481818 37.918182,36.4 37.818182,36.4 c -0.1,0 -0.181818,0.08182 -0.181818,0.181818 0,0.1 0.08182,0.181818 0.181818,0.181818 0.1,0 0.181818,-0.08182 0.181818,-0.181818 z m -2.909091,-1.636363 c 0,-0.1 -0.08182,-0.181819 -0.181818,-0.181819 -0.1,0 -0.181818,0.08182 -0.181818,0.181819 0,0.1 0.08182,0.181818 0.181818,0.181818 0.1,0 0.181818,-0.08182 0.181818,-0.181818 z m -1.502164,-0.852814 c -0.169048,-0.169048 -0.35841,-0.25631 -0.420804,-0.193915 -0.178943,0.178942 0.09576,0.501274 0.427205,0.501274 0.277541,0 0.277043,-0.02391 -0.0064,-0.307359 l 1e-6,0 z m -8.1342,-0.78355 c 0,-0.1 -0.08182,-0.181818 -0.181818,-0.181818 -0.1,0 -0.181818,0.08182 -0.181818,0.181818 0,0.1 0.08182,0.181818 0.181818,0.181818 0.1,0 0.181818,-0.08182 0.181818,-0.181818 z m 0.909091,-0.783431 c 0,-0.351592 -0.494145,-0.964848 -0.651032,-0.807961 -0.171672,0.171672 0.217272,1.045937 0.465316,1.045937 0.102144,0 0.185716,-0.107089 0.185716,-0.237976 z m 3.454546,-0.489296 c 0,-0.1 -0.08182,-0.181819 -0.181818,-0.181819 -0.1,0 -0.181819,0.08182 -0.181819,0.181819 0,0.1 0.08182,0.181818 0.181819,0.181818 0.1,0 0.181818,-0.08182 0.181818,-0.181818 z m -5.090909,-1 c -0.124489,-0.15 -0.295576,-0.272728 -0.380193,-0.272728 -0.08462,0 -0.106754,0.122728 -0.04919,0.272728 0.05756,0.15 0.228647,0.272727 0.380193,0.272727 0.224307,0 0.233454,-0.05071 0.04919,-0.272727 z m 2.864546,-0.318182 c -0.04117,-0.125 -0.269069,-0.255585 -0.506452,-0.29019 -0.376824,-0.05493 -0.401037,-0.02608 -0.190768,0.227273 0.284744,0.343096 0.804951,0.39004 0.69722,0.06292 z m -3.955455,-0.227273 c 0,-0.15 -0.122728,-0.272727 -0.272728,-0.272727 -0.283922,0 -0.360721,0.215036 -0.151515,0.424242 0.209206,0.209206 0.424243,0.132408 0.424243,-0.151515 z m 2.682728,-0.318182 c -0.04117,-0.125 -0.272984,-0.250132 -0.515152,-0.278072 -0.426388,-0.04919 -0.42915,-0.04201 -0.08737,0.227273 0.427365,0.336717 0.704375,0.360072 0.602523,0.0508 z m 1.533181,-0.07875 c -0.13125,-0.05252 -0.288068,-0.04606 -0.348485,0.01435 -0.06042,0.06042 0.04697,0.103389 0.238636,0.09549 0.211808,-0.0087 0.254891,-0.05181 0.109849,-0.109848 l 0,-10e-7 z m -5.670455,-0.426958 c 0,-0.217667 -0.512841,-0.45115 -0.662411,-0.301579 -0.159221,0.15922 0.110845,0.489103 0.400414,0.489103 0.144099,0 0.261997,-0.08439 0.261997,-0.187524 z m 5.200223,-0.02407 c 0.149314,-0.241594 -0.715265,-1.061129 -1.119453,-1.061129 -0.363046,0 -0.335312,0.0811 0.237412,0.694269 0.569804,0.610038 0.698633,0.663621 0.882041,0.36686 z m -2.46634,-0.234982 c -0.120854,-0.14562 -0.17371,-0.339231 -0.117459,-0.430246 0.05625,-0.09102 -0.03898,-0.286701 -0.21162,-0.434855 -0.4754,-0.407968 -0.76844,-0.546472 -0.76844,-0.363197 0,0.09062 0.184091,0.253548 0.409091,0.362061 0.39632,0.191138 0.397266,0.197681 0.0303,0.209603 -0.646176,0.02099 -0.660983,0.254709 -0.03721,0.587351 0.736938,0.392992 0.984461,0.417655 0.695338,0.06928 z M 21.272727,28.4 c 0,-0.1 -0.08182,-0.181818 -0.181818,-0.181818 -0.1,0 -0.181818,0.08182 -0.181818,0.181818 0,0.1 0.08182,0.181818 0.181818,0.181818 0.1,0 0.181818,-0.08182 0.181818,-0.181818 z"
       id="path3057"
       inkscape:connector-curvature="0" />
    <path
       style="fill:#0000ff"
       d="m 19.272727,46.423576 0,-9.669147 1.753579,0.922893 c 1.687714,0.888229 2.519149,1.078283 2.519149,0.575843 0,-0.130758 -0.94091,-0.756516 -2.09091,-1.39057 l -2.090909,-1.152828 -0.04999,-3.050343 c -0.02851,-1.739753 0.0236,-3.123942 0.121302,-3.22164 0.220553,-0.220553 3.174719,1.538203 3.961568,2.358511 0.501589,0.522916 0.557663,0.674983 0.42258,1.14599 -0.136516,0.476002 -0.0922,0.588324 0.358828,0.909484 0.283019,0.201527 0.745942,0.366413 1.028718,0.366413 l 0.514139,0 -0.653763,-0.444244 c -0.557234,-0.378651 -0.668007,-0.570623 -0.75024,-1.300187 -0.05306,-0.470769 -0.207407,-0.919573 -0.342989,-0.997342 -0.135581,-0.07777 -1.064693,-0.663327 -2.064693,-1.301244 -1.325863,-0.845789 -1.80284,-1.246969 -1.761521,-1.481596 0.03537,-0.200876 -0.08416,-0.358577 -0.318182,-0.419775 -0.285654,-0.0747 -0.374843,-0.244787 -0.374843,-0.714839 l 0,-0.616816 1.814879,0.910749 c 0.998183,0.500911 1.918638,0.908196 2.045454,0.905074 0.29628,-0.0073 -0.871142,-0.742632 -2.496696,-1.572629 -1.165892,-0.595296 -1.627315,-0.945897 -1.462199,-1.111013 0.03492,-0.03492 0.929988,0.399238 1.989049,0.964787 2.316389,1.236973 2.964801,1.244826 0.859214,0.0104 -2.258712,-1.324191 -1.629261,-1.20746 0.834684,0.154792 1.189479,0.657633 2.278712,1.195696 2.420517,1.195696 0.286427,0 -0.22035,-0.388931 -1.2828,-0.984498 -1.231051,-0.690077 -4.363833,-2.711983 -4.550501,-2.936905 -0.10723,-0.129204 -0.162122,-1.101009 -0.132086,-2.338434 l 0.05139,-2.117353 1.694241,0.824959 c 0.931833,0.453727 1.775297,0.824958 1.874367,0.824958 0.41014,0 -0.120979,-0.384988 -1.721245,-1.247668 -1.879355,-1.013132 -2.17561,-1.276162 -2.088593,-1.854361 0.05688,-0.377971 0.128476,-0.358292 1.682225,0.462397 2.204209,1.164262 3.046038,1.712698 2.926304,1.906433 -0.05536,0.08957 0.08255,0.291189 0.306478,0.448032 l 0.407134,0.285167 -0.404092,0 c -0.55787,0 -0.505695,0.307368 0.116191,0.684491 2.217731,1.344873 4.134108,2.078991 3.331232,1.276115 -0.306394,-0.306394 -0.266197,-0.505412 0.10303,-0.510103 0.26185,-0.0033 0.241126,-0.06329 -0.117058,-0.338688 -0.239382,-0.184055 -0.381229,-0.422037 -0.315216,-0.528849 0.06601,-0.106811 0.03554,-0.246419 -0.06773,-0.310238 -0.103262,-0.06382 -0.141416,-0.191005 -0.08479,-0.282633 0.05663,-0.09163 -0.281372,-0.433701 -0.751114,-0.760163 -0.469742,-0.326463 -1.127,-0.847385 -1.460573,-1.157606 -0.333574,-0.31022 -1.593097,-1.162178 -2.798941,-1.893239 -1.958241,-1.187214 -2.582564,-1.633632 -2.284659,-1.633632 0.09529,0 4.280821,2.200316 7.152802,3.760197 0.825,0.448088 1.5,0.740851 1.5,0.650584 0,-0.177045 -8.800655,-5.011378 -9.287224,-5.101613 -0.257693,-0.04779 -0.284779,-0.359219 -0.220905,-2.539912 0.04004,-1.366994 0.08893,-2.49718 0.108647,-2.511524 0.01971,-0.01434 2.366263,1.251344 5.214552,2.81264 3.824094,2.096184 5.064774,2.854931 4.743137,2.900697 -0.386677,0.05502 -0.335305,0.121003 0.457656,0.587808 l 0.893227,0.525831 -0.636363,0.0089 c -0.599143,0.0084 -0.615721,0.0245 -0.283431,0.275828 0.34139,0.258214 0.338416,0.266975 -0.09091,0.267876 -0.394302,8.36e-4 -0.362666,0.05093 0.283431,0.448871 l 0.727272,0.447939 -0.62566,0.0057 c -0.58952,0.0053 -0.605274,0.02109 -0.272727,0.272619 0.340936,0.257872 0.337482,0.267361 -0.101613,0.27917 L 29,19.321977 l 0.454545,0.259841 0.454546,0.259842 -0.545455,0.01406 -0.545454,0.01406 0.636363,0.348395 0.636364,0.348394 -0.580179,0.0076 c -0.319098,0.0042 -0.623764,0.07814 -0.677036,0.16434 -0.05327,0.0862 2.703263,1.695484 6.125633,3.576197 6.805129,3.739657 13.027582,7.273627 13.3134,7.56119 0.185988,0.187124 -0.389372,0.750155 -1.749376,1.71189 l -0.658469,0.46564 -3.341531,-1.851533 c -1.837844,-1.018342 -5.617433,-3.153557 -8.399089,-4.744919 -4.67859,-2.676584 -6.318132,-3.540589 -5.851535,-3.083639 0.1,0.09793 0.836364,0.582192 1.636364,1.076132 0.841107,0.51932 1.481632,1.043318 1.51877,1.24247 0.03532,0.189419 0.191187,0.487579 0.346362,0.662579 0.254415,0.28692 0.254482,0.318182 6.91e-4,0.318182 -0.36994,0 -0.530764,0.443069 -0.260697,0.718215 0.117186,0.119389 2.897956,1.743487 6.17949,3.609105 3.281533,1.865618 5.877113,3.421804 5.767955,3.458189 -0.109158,0.03639 -2.904164,-1.332694 -6.211122,-3.042403 -3.306959,-1.709708 -6.217456,-3.159962 -6.467771,-3.222788 -0.37244,-0.09348 -0.443571,-0.05427 -0.391554,0.21584 0.09423,0.489271 1.167782,1.187435 6.857425,4.459571 l 5.157724,2.966228 -0.739309,0.68962 c -0.46256,0.431472 -0.844891,0.649105 -1.021359,0.581387 -0.182183,-0.06991 -0.282051,-0.0056 -0.282051,0.181685 0,0.254479 -3.945455,3.822102 -4.475249,4.046684 -0.111387,0.04722 -2.218601,-1.064085 -4.682698,-2.46956 -2.464106,-1.405475 -4.520698,-2.555409 -4.570214,-2.555409 -0.276973,0 -0.01949,0.338162 0.409971,0.538429 0.425268,0.198313 0.452188,0.250676 0.18011,0.350344 -0.227332,0.08328 0.888853,0.773909 3.85772,2.386932 2.297685,1.248362 4.14959,2.351568 4.115344,2.451568 -0.03425,0.1 -0.133856,0.16814 -0.221356,0.151421 -0.0875,-0.01671 -2.110679,-1.10604 -4.495952,-2.420714 -2.385274,-1.314676 -4.371073,-2.356107 -4.412888,-2.314293 -0.04181,0.04181 1.889319,1.160884 4.291407,2.486818 2.402088,1.325935 4.367433,2.433479 4.367433,2.461206 0,0.02773 -0.797728,0.688982 -1.772728,1.469456 -1.617005,1.294393 -12.61548,10.305453 -13.363636,10.94884 -0.302472,0.260115 -0.318182,-0.203785 -0.318182,-9.395522 z m 6.779907,-6.568849 c 0.05227,-0.199902 0.01888,-0.410527 -0.07421,-0.46806 -0.09309,-0.05753 -0.146772,0.0037 -0.119295,0.136182 0.06065,0.292311 -0.781188,0.241269 -0.966519,-0.0586 -0.06781,-0.10971 -0.235019,-0.15581 -0.371584,-0.102441 -0.155871,0.06091 -0.02834,0.185525 0.342608,0.334751 0.325,0.130741 0.590909,0.301594 0.590909,0.37967 0,0.30825 0.508836,0.119804 0.598089,-0.221498 l 0,0 z m 13.765548,-2.182 c 0,-0.1 -0.08182,-0.181818 -0.181818,-0.181818 -0.1,0 -0.181819,0.08182 -0.181819,0.181818 0,0.1 0.08182,0.181818 0.181819,0.181818 0.1,0 0.181818,-0.08182 0.181818,-0.181818 z M 25,37.490909 c 0.0618,-0.1 -0.06092,-0.181818 -0.272727,-0.181818 -0.211804,0 -0.334531,0.08182 -0.272728,0.181818 0.0618,0.1 0.184531,0.181818 0.272728,0.181818 0.0882,0 0.210924,-0.08182 0.272727,-0.181818 z m 1.181818,-0.359942 c 0,-0.09797 -0.321721,-0.342252 -0.714936,-0.542856 -0.911904,-0.465218 -0.976869,-0.585135 -0.654072,-1.207327 0.236357,-0.455579 0.233165,-0.547257 -0.02914,-0.837106 -0.305009,-0.337031 -0.965484,-0.448627 -0.965484,-0.163131 0,0.0893 0.140889,0.216431 0.313086,0.282509 0.246686,0.09466 0.26185,0.151808 0.0715,0.269451 -0.17709,0.109449 -0.185508,0.183971 -0.03153,0.279135 0.149442,0.09236 0.154324,0.196978 0.01692,0.362543 -0.271784,0.32748 -0.12959,1.013293 0.270792,1.30606 0.395535,0.289222 0.702357,0.326202 0.541055,0.06521 -0.166384,-0.269215 0.152134,-0.220462 0.556158,0.08513 0.415061,0.313934 0.625661,0.347725 0.625661,0.100385 z m 12.727273,-0.0037 c 0,-0.1 -0.08182,-0.181818 -0.181818,-0.181818 -0.1,0 -0.181818,0.08182 -0.181818,0.181818 0,0.1 0.08182,0.181818 0.181818,0.181818 0.1,0 0.181818,-0.08182 0.181818,-0.181818 z M 38,36.581818 C 38,36.481818 37.918182,36.4 37.818182,36.4 c -0.1,0 -0.181818,0.08182 -0.181818,0.181818 0,0.1 0.08182,0.181818 0.181818,0.181818 0.1,0 0.181818,-0.08182 0.181818,-0.181818 z m -2.909091,-1.636363 c 0,-0.1 -0.08182,-0.181819 -0.181818,-0.181819 -0.1,0 -0.181818,0.08182 -0.181818,0.181819 0,0.1 0.08182,0.181818 0.181818,0.181818 0.1,0 0.181818,-0.08182 0.181818,-0.181818 z M 33.588745,34.09264 C 33.419697,33.923593 33.230335,33.836331 33.167941,33.898725 32.988998,34.077669 33.263702,34.4 33.595146,34.4 c 0.277541,0 0.277043,-0.02391 -0.0064,-0.30736 l 1e-6,0 z m -8.1342,-0.783549 c 0,-0.1 -0.08182,-0.181818 -0.181818,-0.181818 -0.1,0 -0.181818,0.08182 -0.181818,0.181818 0,0.1 0.08182,0.181818 0.181818,0.181818 0.1,0 0.181818,-0.08182 0.181818,-0.181818 z m 0.909091,-0.783431 c 0,-0.351593 -0.494145,-0.964849 -0.651032,-0.80796 -0.171672,0.171671 0.217272,1.045936 0.465316,1.045936 0.102144,0 0.185716,-0.107089 0.185716,-0.237976 z m 3.454546,-0.489296 c 0,-0.1 -0.08182,-0.181819 -0.181818,-0.181819 -0.1,0 -0.181819,0.08182 -0.181819,0.181819 0,0.1 0.08182,0.181818 0.181819,0.181818 0.1,0 0.181818,-0.08182 0.181818,-0.181818 z m -5.138528,-1.034633 c -0.169048,-0.169047 -0.35841,-0.256309 -0.420804,-0.193915 -0.178943,0.178944 0.09576,0.501275 0.427205,0.501275 0.277541,0 0.277043,-0.02391 -0.0064,-0.30736 l 1e-6,0 z m -1.04329,-0.510822 c 0,-0.15 -0.122728,-0.272727 -0.272728,-0.272727 -0.283922,0 -0.360721,0.215036 -0.151515,0.424242 0.209206,0.209207 0.424243,0.132407 0.424243,-0.151515 z m 3.818181,0.09091 c 0,-0.1 -0.168465,-0.181818 -0.374366,-0.181818 -0.205902,0 -0.323801,0.08182 -0.261997,0.181818 0.0618,0.1 0.230268,0.181818 0.374367,0.181818 0.144098,0 0.261996,-0.08182 0.261996,-0.181818 z m -1.090909,-0.344183 c 0,-0.174879 -0.442181,-0.386711 -0.787597,-0.377308 -0.116822,0.0032 -0.05358,0.125909 0.14053,0.272728 0.400653,0.303038 0.647067,0.342865 0.647067,0.10458 z m -4.181818,-0.570613 c 0,-0.217667 -0.512841,-0.451151 -0.662411,-0.30158 -0.159221,0.15922 0.110845,0.489103 0.400414,0.489103 0.144099,0 0.261997,-0.08439 0.261997,-0.187523 z m 5.200223,-0.02407 c 0.152829,-0.247282 -0.719484,-1.061129 -1.13736,-1.061129 -0.206609,0 -0.144071,0.164171 0.237411,0.623237 0.570292,0.686274 0.705716,0.752169 0.899949,0.437892 z m -2.46634,-0.234983 c -0.120854,-0.145619 -0.171001,-0.343613 -0.11144,-0.439986 0.05956,-0.09637 -0.109521,-0.346558 -0.37574,-0.555965 -0.519677,-0.408778 -0.802008,-0.371129 -0.444775,0.05931 0.17452,0.210283 0.152741,0.275907 -0.110454,0.33282 -0.261197,0.05648 -0.198481,0.151825 0.308526,0.469056 0.733549,0.458976 1.051395,0.517344 0.733883,0.134764 l 0,0 z M 21.272727,28.4 c 0,-0.1 -0.08182,-0.181818 -0.181818,-0.181818 -0.1,0 -0.181818,0.08182 -0.181818,0.181818 0,0.1 0.08182,0.181818 0.181818,0.181818 0.1,0 0.181818,-0.08182 0.181818,-0.181818 z"
       id="path3059"
       inkscape:connector-curvature="0" />
    <path
       style="fill:#ffeeaa"
       d="m 19.272727,46.429267 0,-9.663456 1.884124,0.937036 c 1.251179,0.622255 1.994973,0.8945 2.214098,0.810415 0.305497,-0.117231 0.307911,-0.148687 0.03253,-0.424066 -0.163593,-0.163594 -1.139483,-0.761709 -2.168643,-1.329145 l -1.871202,-1.031702 -0.04999,-3.059634 c -0.03004,-1.83851 0.02154,-3.131173 0.129253,-3.238882 0.231561,-0.23156 2.918799,1.356752 3.854929,2.278485 0.610829,0.601437 0.66582,0.729944 0.523984,1.224497 -0.139758,0.487307 -0.09772,0.595801 0.356112,0.918954 0.283019,0.201527 0.745942,0.366413 1.028718,0.366413 l 0.514139,0 -0.67857,-0.4611 c -0.568973,-0.386627 -0.67857,-0.56508 -0.67857,-1.104895 0,-0.812051 -0.46194,-1.267307 -2.691086,-2.652145 -1.259522,-0.782469 -1.640632,-1.108024 -1.555824,-1.329029 0.07675,-0.199997 -0.01033,-0.32478 -0.27493,-0.393974 -0.299148,-0.07823 -0.387251,-0.241637 -0.387251,-0.718251 l 0,-0.616983 1.59091,0.795982 c 1.947921,0.974608 2.831223,1.25882 1.772727,0.570395 -0.4,-0.260151 -1.3,-0.765434 -2,-1.122849 -1.183089,-0.604077 -1.627473,-0.945739 -1.454742,-1.11847 0.03902,-0.03902 0.757228,0.303156 1.596024,0.760384 2.670369,1.455619 3.471719,1.538095 1.017434,0.104715 -2.012869,-1.175579 -1.302613,-1.057071 0.877475,0.146409 1.080095,0.596247 2.127445,1.141955 2.327445,1.212683 0.323653,0.114457 0.333649,0.0984 0.09091,-0.145986 -0.15,-0.151021 -0.609974,-0.46226 -1.022166,-0.691644 -1.148935,-0.639379 -4.120406,-2.518104 -4.477834,-2.831129 -0.269439,-0.235966 -0.318182,-0.608574 -0.318182,-2.432293 0,-1.184501 0.02896,-2.153638 0.06435,-2.153638 0.03539,0 0.862442,0.37295 1.837888,0.828778 0.975445,0.455829 1.809882,0.792434 1.854304,0.748013 0.08658,-0.08658 -0.47606,-0.441972 -2.211088,-1.396619 -1.429514,-0.786547 -1.727273,-1.057957 -1.727273,-1.574428 0,-0.424393 0.007,-0.425895 0.676938,-0.145964 0.372315,0.155564 1.226067,0.59944 1.897226,0.986391 0.675827,0.389644 1.176342,0.589026 1.121792,0.446871 -0.05417,-0.141173 -0.205653,-0.256679 -0.33662,-0.256679 -0.130968,0 -0.265396,-0.06608 -0.29873,-0.146852 C 22.3,19.445106 21.556818,18.990821 20.681818,18.516353 19.249714,17.739795 19.090909,17.601408 19.090909,17.12999 l 0,-0.523694 1.5,0.822729 c 0.825,0.452501 2.011364,1.105543 2.636364,1.451205 1.567999,0.867196 1.432377,0.511921 -0.181818,-0.47629 -2.536482,-1.552836 -3.256732,-2.035088 -3.169585,-2.122235 0.07826,-0.07826 3.725983,1.803188 7.351403,3.791764 0.725,0.39767 1.318182,0.650729 1.318182,0.562355 0,-0.200207 -3.266913,-2.120427 -3.393006,-1.994334 -0.05051,0.05051 -0.238857,-0.05517 -0.418541,-0.234855 -0.179684,-0.179683 -1.532553,-0.961268 -3.006376,-1.736855 l -2.679679,-1.410157 0.07672,-2.151665 c 0.04219,-1.183416 0.127935,-2.202885 0.190537,-2.265487 0.0626,-0.0626 1.612768,0.701689 3.444813,1.698426 4.599951,2.502634 6.058264,3.382073 6.058264,3.653452 0,0.127865 0.327273,0.430572 0.727273,0.672681 0.712594,0.431314 0.716964,0.440217 0.216542,0.441129 -0.328267,6e-4 -0.466097,0.07315 -0.385797,0.203078 0.06871,0.11118 0.02158,0.266022 -0.104743,0.344093 -0.168627,0.104218 -0.126491,0.19717 0.158525,0.349706 0.445614,0.238485 0.515058,0.5586 0.121179,0.5586 -0.162653,0 -0.226116,0.106598 -0.162366,0.272728 0.06912,0.18011 -0.0064,0.272727 -0.222275,0.272727 -0.302889,0 -0.300977,0.01963 0.026,0.266945 0.341073,0.257974 0.337658,0.267552 -0.101613,0.285033 l -0.454545,0.01809 0.409091,0.197297 c 0.522468,0.251977 0.525723,0.505365 0.0065,0.505365 -0.351498,0 -0.368806,0.03274 -0.136364,0.257915 0.146429,0.141853 3.866234,2.259446 8.266234,4.705762 9.106893,5.06326 11.181818,6.266352 11.181818,6.483494 0,0.08431 -0.572727,0.59008 -1.272727,1.123922 -0.7,0.533842 -1.272727,1.032827 -1.272727,1.108854 0,0.224455 -0.662424,0.82042 -1.047893,0.942764 -0.230453,0.07314 -0.751129,-0.109893 -1.472494,-0.517633 -0.613788,-0.346932 -1.11723,-0.573867 -1.11876,-0.504296 -0.0015,0.06957 -0.06289,0.0394 -0.136364,-0.06704 -0.131646,-0.190725 -5.460445,-3.16799 -6.097569,-3.406787 -0.965161,-0.361745 0.293266,0.451026 3.794723,2.450869 2.152131,1.229182 3.831106,2.262164 3.731053,2.295515 -0.100053,0.03335 -3.041265,-1.397235 -6.536031,-3.17908 -3.494766,-1.781846 -6.414048,-3.180907 -6.487294,-3.109029 -0.267669,0.262674 0.448123,0.979251 1.757038,1.758963 0.737475,0.439309 3.336041,1.9471 5.774591,3.350648 l 4.433727,2.551905 -0.742585,0.692678 c -0.464864,0.433618 -0.848073,0.652198 -1.024637,0.584444 -0.182183,-0.06991 -0.282051,-0.0056 -0.282051,0.181685 0,0.253564 -3.944146,3.821353 -4.472311,4.045557 -0.109772,0.0466 -2.230738,-1.064706 -4.713258,-2.46956 -4.259087,-2.410213 -5.44015,-2.98834 -4.496249,-2.200908 0.225,0.187702 0.409091,0.421906 0.409091,0.520453 0,0.19854 1.083012,0.908342 2.963944,1.942555 2.242138,1.232818 1.107776,0.886751 -1.453715,-0.443495 -3.628178,-1.884203 -2.429333,-1.071723 2.171589,1.471729 2.175,1.202369 3.954546,2.212249 3.954546,2.244177 0,0.03193 -1.043182,0.901505 -2.318182,1.932394 -2.358035,1.906567 -12.237868,9.991466 -12.818182,10.48942 -0.302464,0.259538 -0.318182,-0.204343 -0.318182,-9.390431 z m 6.777202,-6.564194 c 0.116664,-0.446128 -0.03822,-0.610226 -0.33976,-0.359969 -0.164418,0.136456 -0.345073,0.132545 -0.617718,-0.01336 -0.211936,-0.113425 -0.483075,-0.167227 -0.602531,-0.11956 -0.119456,0.04767 0.04872,0.193636 0.373716,0.32438 0.325,0.130742 0.590909,0.301595 0.590909,0.379671 0,0.302951 0.508061,0.122769 0.595384,-0.211153 l 0,-5e-6 z m 13.768253,-2.192346 c 0,-0.1 -0.08182,-0.181818 -0.181818,-0.181818 -0.1,0 -0.181819,0.08182 -0.181819,0.181818 0,0.1 0.08182,0.181818 0.181819,0.181818 0.1,0 0.181818,-0.08182 0.181818,-0.181818 z M 25.090909,37.490909 c 0,-0.1 -0.122727,-0.181818 -0.272727,-0.181818 -0.15,0 -0.272727,0.08182 -0.272727,0.181818 0,0.1 0.122727,0.181818 0.272727,0.181818 0.15,0 0.272727,-0.08182 0.272727,-0.181818 z m 1.090909,-0.359942 c 0,-0.09797 -0.321721,-0.342252 -0.714936,-0.542856 -0.911904,-0.465218 -0.976869,-0.585135 -0.654072,-1.207327 0.236357,-0.455579 0.233165,-0.547257 -0.02914,-0.837106 -0.2795,-0.308843 -0.965484,-0.457465 -0.965484,-0.209176 0,0.06397 0.143182,0.225009 0.318182,0.357853 0.228047,0.173112 0.247493,0.243172 0.06865,0.247318 -0.19413,0.0045 -0.202262,0.06274 -0.03663,0.262322 0.143123,0.172452 0.151332,0.294598 0.02504,0.372647 -0.319722,0.1976 -0.131622,1.039291 0.294684,1.318616 0.222742,0.145947 0.473855,0.222797 0.558027,0.170775 0.08417,-0.05202 0.271861,-0.01942 0.417087,0.07245 0.348246,0.220302 0.718591,0.217459 0.718591,-0.0055 z m 12.727273,-0.0037 c 0,-0.1 -0.08182,-0.181818 -0.181818,-0.181818 -0.1,0 -0.181818,0.08182 -0.181818,0.181818 0,0.1 0.08182,0.181818 0.181818,0.181818 0.1,0 0.181818,-0.08182 0.181818,-0.181818 z M 38,36.581818 C 38,36.481818 37.918182,36.4 37.818182,36.4 c -0.1,0 -0.181818,0.08182 -0.181818,0.181818 0,0.1 0.08182,0.181818 0.181818,0.181818 0.1,0 0.181818,-0.08182 0.181818,-0.181818 z m -2.909091,-1.636363 c 0,-0.1 -0.08182,-0.181819 -0.181818,-0.181819 -0.1,0 -0.181818,0.08182 -0.181818,0.181819 0,0.1 0.08182,0.181818 0.181818,0.181818 0.1,0 0.181818,-0.08182 0.181818,-0.181818 z M 33.588745,34.09264 C 33.419697,33.923593 33.230335,33.836331 33.167941,33.898725 32.988998,34.077669 33.263702,34.4 33.595146,34.4 c 0.277541,0 0.277043,-0.02391 -0.0064,-0.30736 l 1e-6,0 z m 11.502164,-0.419913 c 0,-0.1 -0.08665,-0.181818 -0.192549,-0.181818 -0.105902,0 -0.141982,0.08182 -0.08018,0.181818 0.0618,0.1 0.148451,0.181818 0.192549,0.181818 0.0441,0 0.08018,-0.08182 0.08018,-0.181818 z M 25.454545,33.309091 c 0,-0.1 -0.08182,-0.181818 -0.181818,-0.181818 -0.1,0 -0.181818,0.08182 -0.181818,0.181818 0,0.1 0.08182,0.181818 0.181818,0.181818 0.1,0 0.181818,-0.08182 0.181818,-0.181818 z m 0.909091,-0.783431 c 0,-0.351593 -0.494145,-0.964849 -0.651032,-0.80796 -0.171672,0.171671 0.217272,1.045936 0.465316,1.045936 0.102144,0 0.185716,-0.107089 0.185716,-0.237976 z m 16.727273,0.05616 c 0,-0.1 -0.08665,-0.181818 -0.192549,-0.181818 -0.105902,0 -0.141982,0.08182 -0.08018,0.181818 0.0618,0.1 0.148451,0.181818 0.192549,0.181818 0.0441,0 0.08018,-0.08182 0.08018,-0.181818 z M 29.818182,32.036364 c 0,-0.1 -0.08182,-0.181819 -0.181818,-0.181819 -0.1,0 -0.181819,0.08182 -0.181819,0.181819 0,0.1 0.08182,0.181818 0.181819,0.181818 0.1,0 0.181818,-0.08182 0.181818,-0.181818 z m 11.44928,-0.552557 c -0.431142,-0.272662 -0.664075,-0.1881 -0.280735,0.101915 0.1927,0.145787 0.394877,0.220554 0.44928,0.166149 0.0544,-0.0544 -0.02144,-0.175033 -0.168545,-0.268064 z M 24.679654,31.001731 c -0.169048,-0.169047 -0.35841,-0.256309 -0.420804,-0.193915 -0.178943,0.178944 0.09576,0.501275 0.427205,0.501275 0.277541,0 0.277043,-0.02391 -0.0064,-0.30736 l 1e-6,0 z m 14.951444,-0.427015 c -0.431142,-0.272661 -0.664074,-0.1881 -0.280734,0.101915 0.1927,0.145787 0.394876,0.220554 0.44928,0.166149 0.0544,-0.0544 -0.02144,-0.175033 -0.168546,-0.268064 z m -15.994734,0.01783 c 0,-0.21452 -0.35461,-0.444 -0.484849,-0.313762 -0.130238,0.13024 0.09924,0.484849 0.313761,0.484849 0.0941,0 0.171088,-0.07699 0.171088,-0.171087 z m 3.727272,-0.01073 C 27.301833,30.481818 27.128539,30.4 26.978539,30.4 c -0.15,0 -0.222161,0.08182 -0.160357,0.181818 0.0618,0.1 0.235097,0.181818 0.385097,0.181818 0.15,0 0.222161,-0.08182 0.160357,-0.181818 z m -1,-0.344183 c 0,-0.174879 -0.442181,-0.386711 -0.787597,-0.377308 -0.116822,0.0032 -0.05358,0.125909 0.14053,0.272728 0.400653,0.303038 0.647067,0.342865 0.647067,0.10458 z m 8.363637,-0.168284 c 0,-0.08186 -0.265909,-0.281171 -0.590909,-0.442918 l -0.590909,-0.294086 0.545454,-0.01807 0.545455,-0.01807 -0.454546,-0.259838 -0.454545,-0.259842 0.454545,-0.0095 c 0.431223,-0.009 0.421894,-0.02947 -0.181818,-0.398575 -2.251468,-1.376531 -2.434949,-1.51269 -2.120137,-1.573317 0.177125,-0.03411 0.808434,0.22772 1.40291,0.581847 0.625568,0.372653 1.080863,0.549867 1.080863,0.420707 0,-0.12274 -0.838636,-0.69232 -1.863636,-1.265733 -1.025,-0.573413 -2.375,-1.333325 -3,-1.688694 -1.665496,-0.946983 -1.384056,-0.506849 0.365158,0.571059 0.888411,0.54746 1.524626,1.065619 1.562703,1.272728 0.03532,0.192131 0.191187,0.49251 0.346362,0.66751 0.254415,0.28692 0.254482,0.318182 6.91e-4,0.318182 -0.1548,0 -0.329369,0.124862 -0.38793,0.277472 -0.102443,0.266937 0.309401,0.581283 2.431198,1.855652 0.708085,0.425282 0.909091,0.483544 0.909091,0.2635 l 0,0 z m 3.803031,-0.09256 c -0.09913,-0.07794 -2.868353,-1.645396 -3.382906,-1.914813 -0.30644,-0.160451 -0.428229,-0.155999 -0.52915,0.01934 -0.0721,0.12527 -0.06835,0.171318 0.0083,0.10233 0.07669,-0.06899 0.232987,-0.04265 0.347332,0.05854 0.344647,0.304989 3.474842,1.950355 3.556384,1.869389 0.04167,-0.04137 0.04167,-0.102029 0,-0.134791 l 0,0 z M 22.181818,29.667022 c 0,-0.234353 -0.518013,-0.445978 -0.684394,-0.279598 -0.06779,0.06779 -0.0029,0.199374 0.144205,0.292405 0.351955,0.222584 0.540189,0.21812 0.540189,-0.01281 z m 5.200417,-0.02439 c 0.07673,-0.124146 -0.08826,-0.38733 -0.398361,-0.63546 -0.806043,-0.644967 -1.104407,-0.527305 -0.501782,0.19788 0.570414,0.686421 0.705704,0.752189 0.900143,0.43758 l 0,0 z m -2.43678,-0.18809 c -0.12,-0.12 -0.218182,-0.360814 -0.218182,-0.535145 0,-0.174329 -0.179155,-0.442447 -0.398122,-0.595817 -0.460232,-0.322359 -0.663423,-0.235447 -0.345405,0.147741 0.17452,0.210284 0.152741,0.275908 -0.110454,0.33282 -0.261197,0.05648 -0.198481,0.151825 0.308526,0.469056 0.689548,0.431445 1.114699,0.532407 0.763637,0.181345 l 0,0 z M 21.272727,28.4 c 0,-0.1 -0.08182,-0.181818 -0.181818,-0.181818 -0.1,0 -0.181818,0.08182 -0.181818,0.181818 0,0.1 0.08182,0.181818 0.181818,0.181818 0.1,0 0.181818,-0.08182 0.181818,-0.181818 z m 6.539672,-4.5 c -0.0032,-0.075 -0.118053,-0.284441 -0.255272,-0.465426 -0.169785,-0.223935 -0.289985,-0.26354 -0.376245,-0.123968 -0.06972,0.112801 -0.241206,0.161174 -0.381091,0.107495 -0.437644,-0.167939 -0.277686,0.04853 0.245664,0.332449 0.565431,0.306752 0.775349,0.347657 0.766944,0.14945 l 0,0 z m -1.846251,-0.850681 c -0.268619,-0.236555 -0.453392,-0.480105 -0.410606,-0.541224 0.04279,-0.06112 -0.0238,-0.0184 -0.147966,0.09493 -0.158044,0.144255 -0.165323,0.228478 -0.02427,0.2808 0.110819,0.04111 0.356274,0.191913 0.545455,0.335126 0.547697,0.414617 0.572587,0.301679 0.03739,-0.169637 l 0,0 z m -1.254027,-0.7156 c -0.04167,-0.03645 -0.280303,-0.172577 -0.530303,-0.302494 -0.415781,-0.21607 -0.433265,-0.210417 -0.20501,0.06628 0.137245,0.166372 0.375881,0.302495 0.530303,0.302495 0.154422,0 0.246677,-0.02983 0.20501,-0.06628 z m 2.643751,-0.102974 c 0.05753,-0.09309 0.02012,-0.221471 -0.08315,-0.28529 -0.103262,-0.06382 -0.146407,-0.18293 -0.09588,-0.26469 0.05053,-0.08176 -0.02995,-0.24976 -0.178853,-0.373336 -0.187936,-0.155973 -0.270725,-0.162273 -0.270725,-0.0206 0,0.112245 0.09184,0.204081 0.204081,0.204081 0.141001,0 0.134119,0.0843 -0.02226,0.272727 -0.182478,0.219873 -0.177983,0.273267 0.02319,0.275512 0.195997,0.0022 0.191022,0.0406 -0.02319,0.179034 -0.235034,0.151891 -0.230235,0.176635 0.03472,0.179034 0.169098,0.0015 0.354524,-0.07338 0.412057,-0.166471 z m -2.484604,-0.786222 c -0.370803,-0.224488 -0.657167,-0.46484 -0.636364,-0.534116 0.05596,-0.186354 -0.723661,-0.870135 -0.849087,-0.744709 -0.05909,0.05909 0.03447,0.211205 0.207918,0.338031 0.173446,0.126827 0.315356,0.339462 0.315356,0.472524 0,0.133061 0.286364,0.384984 0.636364,0.559828 0.907429,0.453312 1.12488,0.392205 0.325813,-0.09156 l 0,0 z m 1.330248,-0.691482 c -0.239166,-0.199173 -0.484492,-0.312489 -0.545169,-0.251812 -0.129125,0.129125 0.505608,0.628852 0.787495,0.619995 0.105887,-0.0033 -0.0032,-0.169009 -0.242326,-0.368183 l 0,0 z m -0.974158,-0.580314 c -0.04162,-0.125 -0.229925,-0.257164 -0.418455,-0.293698 -0.296564,-0.05747 -0.309917,-0.02682 -0.09903,0.227273 0.2884,0.347501 0.625482,0.390769 0.517489,0.06642 z"
       id="path3061"
       inkscape:connector-curvature="0" />
    <path
       style="fill:#ffeeaa"
       d="m 23.818182,12.189803 c -2.55,-1.405803 -4.662975,-2.5806749 -4.695499,-2.6108271 -0.03252,-0.030152 -0.03252,-0.2651848 0,-0.5222946 0.05856,-0.4629363 0.08825,-0.4514226 3.059135,1.1865937 1.65,0.909736 3.691592,2.19671 4.536872,2.859941 0.845279,0.663231 1.663461,1.305545 1.818182,1.427365 0.795921,0.626671 -0.520931,-0.02657 -4.71869,-2.340778 z"
       id="path3063"
       inkscape:connector-curvature="0" />
    <path
       style="fill:#ffeeaa"
       d="m 19.393266,48.983493 c -0.138785,-7.719088 -0.153872,-12.038038 -0.04205,-12.038038 0.04317,0 0.834957,0.368181 1.759531,0.818181 0.924575,0.45 1.871074,0.818182 2.103332,0.818182 0.88948,0 0.351621,-0.558016 -1.668621,-1.731156 l -2.09091,-1.214177 0,-3.072787 c 0,-1.690034 0.06308,-3.072789 0.140166,-3.072789 0.346592,0 2.927756,1.666002 3.54804,2.290069 0.559176,0.562586 0.668118,0.783864 0.581063,1.180226 -0.08463,0.385298 -0.0044,0.568647 0.381768,0.8724 0.459207,0.361212 0.465329,0.384578 0.100756,0.384578 -0.385327,0 -0.525928,0.257027 -0.237958,0.435003 0.08261,0.05105 0.118633,0.488782 0.08005,0.972726 -0.08439,1.058574 0.207572,1.399414 1.360658,1.588458 0.992879,0.162778 1.010293,-0.114384 0.04545,-0.72346 -0.821595,-0.518651 -0.788326,-0.452105 -0.545428,-1.090978 0.122739,-0.322827 0.12066,-0.592609 -0.0064,-0.830016 -0.168298,-0.314468 -0.125187,-0.351733 0.406904,-0.351733 l 0.595146,0 -0.66707,-0.474627 c -0.498704,-0.354833 -0.696273,-0.647486 -0.782778,-1.1595 -0.125052,-0.740179 -0.605831,-1.2779 -1.885412,-2.108719 -0.436769,-0.283589 -0.702678,-0.546098 -0.590909,-0.583354 0.111769,-0.03726 0.203216,-0.183649 0.203216,-0.325315 0,-0.302998 -0.665845,-0.350951 -0.764476,-0.05506 -0.08839,0.26516 -1.235524,-0.697531 -1.235524,-1.036864 0,-0.141111 -0.08384,-0.256565 -0.186318,-0.256565 -0.186798,0 -0.610529,-0.900122 -0.48352,-1.027131 0.03718,-0.03719 0.846667,0.301434 1.798851,0.752489 0.952183,0.451053 1.783139,0.820096 1.846569,0.820096 0.331576,0 0.02931,-0.345021 -0.623897,-0.712143 -0.888922,-0.499602 -0.847576,-0.673257 0.0691,-0.290244 0.820606,0.342871 0.916956,0.343164 0.786188,0.0024 -0.143888,-0.374967 0.02879,-0.341447 0.947946,0.184009 0.435207,0.248795 0.864752,0.452355 0.954545,0.452355 0.469024,0 -0.06295,-0.421608 -2.29867,-1.82179 -3.677523,-2.303139 -3.369291,-1.915232 -3.372601,-4.244384 -0.0015,-1.086399 0.02196,-1.999061 0.05222,-2.028139 0.03027,-0.02908 0.81824,0.27386 1.751049,0.673194 0.932809,0.399334 1.750309,0.671768 1.816667,0.60541 0.06636,-0.06636 -0.0014,-0.19011 -0.150561,-0.275005 -2.356264,-1.34101 -3.55113,-2.179699 -3.603187,-2.529114 -0.05503,-0.369342 0.05944,-0.338063 1.606858,0.439098 0.916358,0.460223 1.75953,0.805627 1.873715,0.767566 0.114185,-0.03806 0.0047,-0.194742 -0.243222,-0.348178 -0.247958,-0.153435 -1.087404,-0.668553 -1.865436,-1.144706 -1.23062,-0.753133 -1.944906,-1.431407 -1.731813,-1.6445 0.03568,-0.03567 0.962758,0.429852 2.060186,1.034503 1.097427,0.604652 2.261231,1.214673 2.586231,1.355603 1.023344,0.443753 0.664514,-0.0793 -0.597052,-0.870297 -0.653378,-0.409667 -1.152896,-0.779914 -1.110038,-0.822772 0.04286,-0.04286 1.239618,0.548107 2.659469,1.313253 2.909544,1.56793 3.820349,1.98359 3.820349,1.743475 0,-0.196458 -1.268434,-1.017616 -2.909091,-1.883286 -0.65,-0.342964 -1.713637,-0.931707 -2.363637,-1.308317 -0.65,-0.376611 -1.809722,-1.001548 -2.57716,-1.388749 -0.767439,-0.387201 -1.449598,-0.791789 -1.515909,-0.899083 -0.06631,-0.107294 -0.06482,-0.600401 0.0033,-1.095793 l 0.123879,-0.900711 1.982939,0 c 1.880672,0 1.982938,-0.01931 1.982938,-0.374367 0,-0.205902 -0.07522,-0.327877 -0.16716,-0.271056 -0.09194,0.05682 -0.290639,-0.02017 -0.441558,-0.171088 C 22.51309,12.159843 22.301948,12.036364 22.194805,12.036364 22.087662,12.036364 22,11.949717 22,11.843815 c 0,-0.105902 -0.06136,-0.155398 -0.136364,-0.109993 -0.075,0.04541 -0.241862,-0.03158 -0.370805,-0.171087 -0.135276,-0.146357 -0.154502,-0.253644 -0.04545,-0.253644 0.543222,0 0.0504,-0.547032 -0.991298,-1.100347 -0.761375,-0.4044158 -1.180828,-0.7398557 -1.181818,-0.9451076 -0.0019,-0.3897354 0.05526,-0.3921717 0.751665,-0.032048 0.304327,0.1573737 0.594231,0.2452248 0.644231,0.1952248 0.121084,-0.1210842 -0.939509,-0.6631768 -1.297492,-0.6631768 -0.179328,0 -0.281756,-0.1652433 -0.281756,-0.4545455 0,-0.25 0.05457,-0.4545454 0.121264,-0.4545454 0.520847,0 5.298711,3.1860855 5.090339,3.3944575 -0.0368,0.03679 -0.713095,-0.302206 -1.502888,-0.753336 -2.243463,-1.2814651 -2.01046,-0.9644154 0.304629,0.414513 2.621275,1.561301 4.590498,2.977728 4.348121,3.127526 -0.188053,0.116223 0.240544,0.391575 1.093081,0.702251 0.533992,0.194594 2.419358,1.664927 2.294714,1.789571 -0.04699,0.04699 -0.610175,-0.208007 -1.251516,-0.566666 -0.641342,-0.358658 -1.220246,-0.597935 -1.286455,-0.531726 -0.06621,0.06621 -0.12038,0.02703 -0.12038,-0.08707 0,-0.249947 -0.997192,-0.795356 -1.158766,-0.633781 -0.06268,0.06268 -0.113961,0.03164 -0.113961,-0.06898 0,-0.189908 -0.89687,-0.692398 -1.136364,-0.636672 -0.075,0.01745 -0.136363,-0.0412 -0.136363,-0.130347 0,-0.08914 -0.335911,-0.296481 -0.746468,-0.460754 -0.410558,-0.164272 -0.870298,-0.422506 -1.021645,-0.573854 -0.151348,-0.151347 -0.318005,-0.232349 -0.370351,-0.180004 -0.201227,0.201228 0.403629,0.650792 2.317816,1.722736 1.091521,0.611252 2.451685,1.520116 3.022584,2.019698 0.735131,0.643296 1.175412,0.898631 1.508941,0.87509 0.650528,-0.04592 3.692389,1.658083 5.472134,3.065395 0.799344,0.632071 1.453352,1.110865 1.453352,1.063986 0,-0.04688 0.250455,0.159593 0.556566,0.458826 0.306111,0.299233 0.858383,0.735655 1.227272,0.969826 0.36889,0.234171 0.87999,0.636572 1.135779,0.894222 0.255789,0.257651 0.951243,0.837969 1.545454,1.289594 0.594211,0.451626 1.203111,0.933523 1.353111,1.070883 0.15,0.13736 0.654216,0.507785 1.120482,0.823169 0.466264,0.315384 0.875354,0.635775 0.909091,0.71198 0.08623,0.194787 1.970427,1.740222 1.970427,1.61616 0,-0.05594 0.228462,0.120531 0.507695,0.39216 0.279231,0.271631 0.831503,0.752725 1.227272,1.0691 1.308222,1.045787 0.519377,0.830667 -2.013825,-0.549175 -2.035287,-1.108627 -2.409095,-1.371841 -2.017584,-1.420669 0.387455,-0.04832 -0.06999,-0.358772 -2.361358,-1.602587 -2.228887,-1.209898 -2.754251,-1.563348 -2.43556,-1.638581 0.323033,-0.07626 -0.06882,-0.355732 -1.911245,-1.363128 -1.817159,-0.99358 -2.231452,-1.287547 -1.918673,-1.361418 0.31264,-0.07384 -0.104729,-0.36943 -1.929812,-1.366739 -1.842221,-1.006675 -2.23498,-1.285791 -1.879993,-1.336023 l 0.448735,-0.0635 -0.448735,-0.248444 -0.448735,-0.248443 0.545454,-0.01054 c 0.469786,-0.0091 0.328275,-0.129781 -1.020073,-0.870079 -0.86104,-0.472747 -1.689683,-0.963537 -1.841429,-1.090645 -0.231546,-0.193952 -0.2931,-0.165333 -0.382889,0.17802 -0.06868,0.262638 -0.01001,0.463397 0.163864,0.560702 0.234341,0.131143 0.224755,0.217437 -0.07111,0.640161 -0.188081,0.268722 -0.305904,0.590858 -0.261829,0.715858 0.04484,0.12717 -0.06668,0.230111 -0.253197,0.233716 -0.274239,0.0053 -0.255947,0.04933 0.10318,0.248346 0.415376,0.230189 0.419852,0.251228 0.09242,0.434466 -0.18925,0.105909 -0.303863,0.229068 -0.254696,0.273687 0.136829,0.12417 7.193946,4.14358 12.180304,6.937342 5.14432,2.882266 7.272727,4.142149 7.272727,4.305 0,0.06336 -0.297736,0.342287 -0.661636,0.619849 -0.3639,0.27756 -1.112993,0.941817 -1.664647,1.476124 -0.551657,0.534309 -1.114826,0.971471 -1.25149,0.971471 -0.319692,0 -2.656618,-1.177557 -4.479743,-2.257302 -1.385527,-0.820578 -4.203103,-2.288153 -4.392993,-2.288153 -0.418154,0 0.235107,0.486244 2.1838,1.625477 1.253309,0.732701 2.247291,1.363638 2.208849,1.402081 -0.03844,0.03844 -2.147969,-0.953916 -4.687836,-2.20524 -2.539867,-1.251325 -4.720213,-2.275525 -4.845213,-2.276 -0.415053,-0.0016 -0.235266,0.499902 0.369629,1.031008 0.328296,0.288247 2.989296,1.905327 5.913333,3.593511 l 5.316431,3.069423 -0.373569,0.397647 c -0.205464,0.218706 -0.596009,0.509902 -0.86788,0.647104 -0.271869,0.1372 -1.230671,0.949658 -2.130671,1.805462 -0.9,0.855805 -1.936859,1.78362 -2.304132,2.061813 l -0.667768,0.505803 -0.786777,-0.397545 c -0.432728,-0.218651 -2.489186,-1.333342 -4.569908,-2.477093 -2.080721,-1.143751 -3.874305,-2.049154 -3.985742,-2.012009 -0.111437,0.03715 0.118244,0.425658 0.510402,0.86336 0.485904,0.542333 0.597189,0.749625 0.349379,0.650791 -0.2,-0.07977 -0.527272,-0.182729 -0.727272,-0.228806 -0.32537,-0.07496 -0.332854,-0.05844 -0.07112,0.156991 0.160884,0.132422 2.021136,1.222586 4.133893,2.422586 L 34.540513,43.4 34.110129,43.763636 c -1.348676,1.139511 -14.233923,11.677699 -14.39895,11.776168 -0.140366,0.08375 -0.232803,-1.822579 -0.317913,-6.556311 z m 6.751177,-9.230466 c 0.04777,-0.333923 -0.04528,-0.375736 -0.863636,-0.388082 -0.504444,-0.0076 -0.917024,0.03807 -0.916846,0.101519 6.18e-4,0.217665 0.999676,0.725694 1.363312,0.693251 0.214564,-0.01914 0.385582,-0.185862 0.41717,-0.406688 z m 13.673739,-2.0803 c 0,-0.1 -0.08182,-0.181818 -0.181818,-0.181818 -0.1,0 -0.181819,0.08182 -0.181819,0.181818 0,0.1 0.08182,0.181818 0.181819,0.181818 0.1,0 0.181818,-0.08182 0.181818,-0.181818 z M 25.090909,37.490909 c 0,-0.1 -0.122727,-0.181818 -0.272727,-0.181818 -0.15,0 -0.272727,0.08182 -0.272727,0.181818 0,0.1 0.122727,0.181818 0.272727,0.181818 0.15,0 0.272727,-0.08182 0.272727,-0.181818 z m 13.818182,-0.363636 c 0,-0.1 -0.08182,-0.181818 -0.181818,-0.181818 -0.1,0 -0.181818,0.08182 -0.181818,0.181818 0,0.1 0.08182,0.181818 0.181818,0.181818 0.1,0 0.181818,-0.08182 0.181818,-0.181818 z M 38,36.581818 C 38,36.481818 37.918182,36.4 37.818182,36.4 c -0.1,0 -0.181818,0.08182 -0.181818,0.181818 0,0.1 0.08182,0.181818 0.181818,0.181818 0.1,0 0.181818,-0.08182 0.181818,-0.181818 z m -2.909091,-1.636363 c 0,-0.1 -0.08182,-0.181819 -0.181818,-0.181819 -0.1,0 -0.181818,0.08182 -0.181818,0.181819 0,0.1 0.08182,0.181818 0.181818,0.181818 0.1,0 0.181818,-0.08182 0.181818,-0.181818 z m -1.318097,-0.772728 c -0.114549,-0.344034 -0.681903,-0.392945 -0.681903,-0.05879 0,0.16866 0.155454,0.286058 0.378788,0.286058 0.222177,0 0.347501,-0.09397 0.303115,-0.227273 z m 11.318097,-0.5 c 0,-0.1 -0.08182,-0.181818 -0.181818,-0.181818 -0.1,0 -0.181818,0.08182 -0.181818,0.181818 0,0.1 0.08182,0.181818 0.181818,0.181818 0.1,0 0.181818,-0.08182 0.181818,-0.181818 z M 25.454545,33.309091 c 0,-0.1 -0.08182,-0.181818 -0.181818,-0.181818 -0.1,0 -0.181818,0.08182 -0.181818,0.181818 0,0.1 0.08182,0.181818 0.181818,0.181818 0.1,0 0.181818,-0.08182 0.181818,-0.181818 z m 0.909091,-0.886829 c 0,-0.366433 -0.483486,-0.872109 -0.662593,-0.693002 -0.05959,0.05959 -0.05606,0.316707 0.0079,0.571364 0.134039,0.534052 0.654735,0.630791 0.654735,0.121638 z m 16.727273,0.159556 c 0,-0.1 -0.08182,-0.181818 -0.181818,-0.181818 -0.1,0 -0.181818,0.08182 -0.181818,0.181818 0,0.1 0.08182,0.181818 0.181818,0.181818 0.1,0 0.181818,-0.08182 0.181818,-0.181818 z M 29.818182,32.036364 c 0,-0.1 -0.08182,-0.181819 -0.181818,-0.181819 -0.1,0 -0.181819,0.08182 -0.181819,0.181819 0,0.1 0.08182,0.181818 0.181819,0.181818 0.1,0 0.181818,-0.08182 0.181818,-0.181818 z m 11.590994,-0.409091 c -0.04162,-0.125 -0.229925,-0.257164 -0.418454,-0.293698 -0.296564,-0.05747 -0.309918,-0.02683 -0.09904,0.227272 0.2884,0.347502 0.625482,0.390769 0.517489,0.06643 z M 24.863721,31.081818 c -0.114549,-0.344034 -0.681903,-0.392945 -0.681903,-0.05878 0,0.16866 0.155454,0.286058 0.378788,0.286058 0.222177,0 0.347501,-0.09397 0.303115,-0.227273 z m 14.909092,-0.363636 c -0.04162,-0.125 -0.229926,-0.257164 -0.418455,-0.293698 -0.296563,-0.05747 -0.309918,-0.02683 -0.09903,0.227272 0.2884,0.347502 0.625481,0.390769 0.517489,0.06643 z M 23.636364,30.490909 c 0,-0.15 -0.122728,-0.272727 -0.272728,-0.272727 -0.15,0 -0.272727,0.122727 -0.272727,0.272727 0,0.15 0.122727,0.272727 0.272727,0.272727 0.15,0 0.272728,-0.122727 0.272728,-0.272727 z m 3.818181,0.09091 c 0,-0.1 -0.163636,-0.181818 -0.363636,-0.181818 -0.2,0 -0.363636,0.08182 -0.363636,0.181818 0,0.1 0.163636,0.181818 0.363636,0.181818 0.2,0 0.363636,-0.08182 0.363636,-0.181818 z m -1.135453,-0.409091 c -0.04117,-0.125 -0.26907,-0.255585 -0.506452,-0.290189 -0.376824,-0.05493 -0.401037,-0.02609 -0.190769,0.227273 0.284745,0.343096 0.804952,0.39004 0.697221,0.06292 z m 8.408181,-0.142069 c 0,-0.10314 -0.122728,-0.23462 -0.272728,-0.29218 -0.373748,-0.143422 -0.34399,-0.428149 0.04545,-0.434916 0.290259,-0.005 0.288345,-0.02286 -0.02181,-0.20306 -0.258872,-0.1504 -0.284366,-0.231913 -0.106846,-0.341626 0.161349,-0.09972 -0.0587,-0.323674 -0.714564,-0.727229 -1.00234,-0.616745 -1.165459,-0.947934 -0.228156,-0.463236 0.600683,0.310625 0.935929,0.364416 0.933426,0.149771 -0.0027,-0.230737 -5.489098,-3.5 -5.873624,-3.5 -0.37105,0 0.01969,0.389595 1.245246,1.241609 0.753517,0.523849 1.526491,1.209729 1.71772,1.52418 0.316062,0.519722 0.321223,0.591082 0.05674,0.784478 -0.415941,0.304144 -0.196889,0.552198 1.379655,1.562322 1.377074,0.882316 1.839493,1.058258 1.839493,0.699887 z m 3.818182,0.01598 c 0,-0.267389 -3.596813,-2.238004 -3.826152,-2.096265 -0.235785,0.145723 0.374714,0.54863 2.371606,1.565176 1.558098,0.793171 1.454546,0.75536 1.454546,0.531089 z m -11.09091,-0.407655 c 0,-0.299794 -0.739119,-1.057167 -1.031693,-1.057167 -0.3599,0 -0.291561,0.377326 0.154296,0.851918 0.423922,0.451244 0.877397,0.557329 0.877397,0.205255 l 0,-6e-6 z m -2.363636,-0.03497 c 0,-0.328061 -0.595937,-1.366307 -0.837431,-1.458976 -0.361184,-0.1386 -0.35365,-0.145364 -0.494461,0.443856 -0.08827,0.369371 -0.01163,0.522837 0.383513,0.767889 0.455296,0.282366 0.948379,0.410908 0.948379,0.247237 l 0,-6e-6 z M 21.272727,28.4 c 0,-0.1 -0.08182,-0.181818 -0.181818,-0.181818 -0.1,0 -0.181818,0.08182 -0.181818,0.181818 0,0.1 0.08182,0.181818 0.181818,0.181818 0.1,0 0.181818,-0.08182 0.181818,-0.181818 z m 6.545455,-4.614101 c 0,-0.38807 -0.431474,-0.654389 -0.873098,-0.538902 -0.510292,0.133444 -0.50721,0.318277 0.0095,0.567458 0.570161,0.274979 0.863637,0.265275 0.863637,-0.02856 l -1e-6,0 z m -1.62004,-0.628125 c -0.297707,-0.55627 -0.688402,-0.812356 -0.847248,-0.555339 -0.08084,0.130804 0.03141,0.355671 0.276683,0.554284 0.533143,0.431713 0.801311,0.432209 0.570565,0.0011 l 0,1e-6 z M 24.465249,22.12149 c -0.394463,-0.298357 -0.647067,-0.343418 -0.647067,-0.115429 0,0.2545 0.22362,0.394226 0.621212,0.388157 0.372155,-0.0057 0.372607,-0.01046 0.02585,-0.272728 l 0,0 z m 2.989296,0.108528 c 0,-0.340722 -0.35901,-1.102745 -0.519534,-1.102745 -0.09069,0 -0.157266,0.286363 -0.14794,0.636363 0.01289,0.483804 0.09493,0.636364 0.342216,0.636364 0.178892,0 0.325258,-0.07649 0.325258,-0.169982 z m -2.015151,-0.433345 c -0.04167,-0.03183 -0.506564,-0.453296 -1.033105,-0.936592 -0.526541,-0.483296 -1.005258,-0.830809 -1.063816,-0.772251 -0.159602,0.159602 0.856433,1.419168 1.284723,1.592655 0.361836,0.146568 0.964898,0.232838 0.812198,0.116188 l 0,0 z m 1.106061,-0.807483 c 0,-0.193073 -0.740968,-0.636101 -0.861797,-0.515273 -0.148541,0.148542 0.323803,0.653356 0.611332,0.653356 0.137755,0 0.250465,-0.06214 0.250465,-0.138083 z m -1.272728,-0.776715 c 0,-0.234352 -0.518013,-0.445977 -0.684394,-0.279596 -0.06779,0.06779 -0.0029,0.199373 0.144205,0.292405 0.351955,0.222583 0.540189,0.21812 0.540189,-0.01281 z m 1.090909,-6.692381 c 0,-0.180345 -0.91817,-0.626166 -1.039569,-0.504767 -0.04592,0.04592 0.148745,0.209342 0.432586,0.363165 0.619295,0.335615 0.606983,0.332743 0.606983,0.141602 z M 24,12.247366 c 0,-0.180344 -0.918171,-0.626165 -1.03957,-0.504766 -0.04592,0.04592 0.148746,0.209342 0.432587,0.363164 C 24.012312,12.441379 24,12.438507 24,12.247366 l 0,0 z m -1.636364,-0.938275 c 0,-0.1 -0.08665,-0.181818 -0.192548,-0.181818 -0.105902,0 -0.141982,0.08182 -0.08018,0.181818 0.0618,0.1 0.14845,0.181818 0.192549,0.181818 0.0441,0 0.08018,-0.08182 0.08018,-0.181818 z"
       id="path3065"
       inkscape:connector-curvature="0" />
    <path
       style="fill:#ffeeaa"
       d="m 19.393238,49.256245 c -0.13297,-7.096501 -0.155819,-12.31079 -0.05395,-12.31079 0.03661,0 0.843805,0.368181 1.793764,0.818181 1.66848,0.790366 2.503308,1.005673 2.503308,0.645617 0,-0.245458 -0.946067,-0.919742 -2.681819,-1.911389 l -1.5,-0.856962 0,-3.074997 c 0,-1.691247 0.06308,-3.074996 0.140166,-3.074996 0.346592,0 2.927756,1.666002 3.54804,2.290069 0.559176,0.562586 0.668118,0.783864 0.581063,1.180226 -0.08463,0.385298 -0.0044,0.568647 0.381768,0.8724 0.459207,0.361212 0.465329,0.384578 0.100756,0.384578 -0.385327,0 -0.525928,0.257027 -0.237958,0.435003 0.08261,0.05105 0.118633,0.488782 0.08005,0.972726 -0.08439,1.058574 0.207572,1.399414 1.360658,1.588458 0.992879,0.162778 1.010293,-0.114384 0.04545,-0.72346 -0.821595,-0.518651 -0.788326,-0.452105 -0.545428,-1.090978 0.122739,-0.322827 0.12066,-0.592609 -0.0064,-0.830016 -0.168056,-0.314015 -0.125277,-0.351733 0.398933,-0.351733 l 0.587175,0 -0.620556,-0.457831 C 24.867814,33.464902 24.570354,33.040504 24.429593,32.563775 24.1634,31.662236 23.849856,31.302178 22.673794,30.5475 22.17331,30.226342 21.857872,29.932224 21.972821,29.893909 c 0.114948,-0.03832 0.208997,-0.185576 0.208997,-0.327242 0,-0.302998 -0.665845,-0.350951 -0.764476,-0.05506 -0.08839,0.26516 -1.235524,-0.697531 -1.235524,-1.036864 0,-0.141111 -0.08384,-0.256565 -0.186318,-0.256565 -0.186798,0 -0.610529,-0.900122 -0.48352,-1.027131 0.03718,-0.03719 0.846667,0.301434 1.798851,0.752489 0.952183,0.451053 1.783139,0.820096 1.846569,0.820096 0.331576,0 0.02931,-0.345021 -0.623897,-0.712143 -0.888922,-0.499602 -0.847576,-0.673257 0.0691,-0.290244 0.820606,0.342871 0.916956,0.343164 0.786188,0.0024 -0.138818,-0.361755 -0.07398,-0.349662 0.974841,0.181818 2.047356,1.037475 1.20677,0.237638 -1.573597,-1.497313 -3.440371,-2.146787 -3.166723,-1.791624 -3.170024,-4.114315 -0.0015,-1.086399 0.02196,-1.999061 0.05222,-2.028139 0.03027,-0.02908 0.81824,0.27386 1.751049,0.673194 0.932809,0.399334 1.750991,0.666704 1.818182,0.594155 0.06719,-0.07255 0.04035,-0.163223 -0.05965,-0.2015 -0.1,-0.03828 -0.979545,-0.563341 -1.954545,-1.166808 -1.264103,-0.782404 -1.772728,-1.199234 -1.772728,-1.452792 0,-0.318103 0.174149,-0.268118 1.652314,0.474261 0.908772,0.456413 1.745737,0.7987 1.859922,0.760639 0.114185,-0.03806 0.0047,-0.194742 -0.243222,-0.348178 -0.247958,-0.153435 -1.087404,-0.668553 -1.865436,-1.144706 -1.234168,-0.755304 -1.944867,-1.431446 -1.730222,-1.64609 0.03655,-0.03655 1.045451,0.467809 2.242003,1.120797 1.196553,0.652988 2.359641,1.260602 2.584641,1.350253 0.795218,0.316854 0.394015,-0.158745 -0.778144,-0.922437 -0.65298,-0.425433 -1.150804,-0.809945 -1.106277,-0.854473 0.04453,-0.04453 1.308985,0.57999 2.809907,1.387817 3.051035,1.642129 3.734018,1.948697 3.627156,1.62811 -0.03824,-0.114729 -0.570299,-0.504015 -1.182345,-0.86508 -1.103945,-0.651249 -1.752807,-1.010173 -5.960635,-3.297181 l -2.182389,-1.186156 0.06403,-1.904754 c 0.03522,-1.047614 0.143159,-1.986571 0.239869,-2.086571 0.116129,-0.12008 0.788939,0.143142 1.981421,0.775188 1.064326,0.564121 1.80451,0.862693 1.802966,0.727273 -0.0014,-0.126354 -0.423836,-0.462138 -0.938655,-0.746187 -0.623748,-0.34415 -0.860399,-0.563198 -0.709327,-0.656566 0.274588,-0.169704 -0.260995,-0.627552 -1.507873,-1.289019 -0.510654,-0.2709014 -0.841526,-0.5716541 -0.841526,-0.7649224 0,-0.3810934 0.12673,-0.3890684 0.727273,-0.045767 0.532892,0.3046289 0.727273,0.3342028 0.727273,0.1106509 C 20.727273,9.2396906 20.4,9.0358077 20,8.8757594 19.6,8.7157111 19.272727,8.4613728 19.272727,8.3105631 c 0,-0.4253339 0.19652,-0.3474153 1.889124,0.7490246 C 22.699741,10.055806 23.165641,10.548231 22,9.9454545 21.681414,9.7807073 21.38522,9.6814467 21.341791,9.7248753 c -0.04343,0.043429 0.720993,0.5519187 1.698715,1.1299787 2.540424,1.501977 4.648613,3.036535 4.390646,3.195967 -0.133165,0.0823 0.08751,0.284258 0.586799,0.537014 1.67672,0.848815 2.453679,1.648183 0.871419,0.896551 -0.849405,-0.403499 -0.983026,-0.476412 -3.602673,-1.965866 -0.928363,-0.527839 -1.735966,-0.911675 -1.794674,-0.852967 -0.184338,0.184338 0.353769,0.576895 2.463916,1.797461 1.125767,0.651174 2.470825,1.554837 2.989018,2.00814 0.518194,0.453303 1.192566,0.876016 1.498606,0.939363 0.787866,0.163079 2.997826,1.372941 4.723,2.585648 1.446411,1.016752 6.156152,4.736157 12.812073,10.11803 0.609469,0.492807 1.076079,0.92806 1.036909,0.967229 -0.20218,0.202181 -4.106454,-2.080039 -4.106454,-2.400402 0,-0.136617 -1.100396,-0.88182 -2.445326,-1.656006 -1.344927,-0.774187 -2.429018,-1.494575 -2.40909,-1.600861 0.01993,-0.106287 -0.822857,-0.707741 -1.872857,-1.336564 -1.05,-0.628824 -1.909091,-1.24335 -1.909091,-1.365615 0,-0.264482 -2.259054,-1.668982 -2.422142,-1.505895 -0.06203,0.06203 0.0076,0.188898 0.15468,0.28193 0.208631,0.131942 0.16748,0.1744 -0.187083,0.193023 -0.373603,0.01962 -0.389791,0.03904 -0.09091,0.109032 0.2,0.04683 0.445454,0.187957 0.545454,0.313602 0.1,0.125645 0.427273,0.360922 0.727273,0.522837 l 0.545455,0.29439 L 35,22.940537 c -0.435529,0.0077 0.05914,0.344342 2.454545,1.670431 1.65,0.913433 3.102273,1.66237 3.227273,1.664305 0.125,0.0019 0.227273,0.05856 0.227273,0.125845 0,0.145244 0.939987,0.62176 1.136364,0.576066 0.075,-0.01746 0.136363,0.04016 0.136363,0.128031 0,0.08787 0.265909,0.267314 0.590909,0.398769 0.325,0.131454 0.631818,0.2936 0.681818,0.360323 0.05,0.06673 0.359493,0.258946 0.687764,0.427158 0.328269,0.168211 0.54922,0.382913 0.491,0.477115 -0.126651,0.204924 0.4988,0.602344 2.88544,1.833455 1.182286,0.609861 1.730266,0.985314 1.611471,1.104109 -0.118793,0.118792 -0.573416,-0.06705 -1.336931,-0.546522 -2.380447,-1.494875 -7.494914,-4.221633 -7.64216,-4.074387 -0.08406,0.08406 1.136186,0.874814 2.711655,1.757232 3.524803,1.97424 5.319034,3.058444 5.319034,3.214146 0,0.06513 -0.265909,0.322411 -0.590909,0.571747 -0.325,0.249336 -1.076133,0.913593 -1.669182,1.476125 -0.593051,0.562533 -1.188274,1.022788 -1.322722,1.022788 -0.325012,0 -2.114689,-0.909915 -5.324109,-2.706904 -2.485584,-1.391707 -3.102214,-1.659142 -3.086315,-1.338551 0.0037,0.075 0.907921,0.657162 2.009335,1.293695 1.101417,0.636531 1.966048,1.193858 1.921402,1.238502 -0.04464,0.04464 -0.916518,-0.338026 -1.9375,-0.850379 -1.020982,-0.512352 -1.909109,-0.874385 -1.973619,-0.80452 -0.06451,0.06987 -0.03396,0.157242 0.06788,0.194166 0.101843,0.03692 1.229237,0.636156 2.505321,1.331627 1.276084,0.695469 2.890484,1.564193 3.587558,1.930495 0.697073,0.366301 1.267406,0.718005 1.267406,0.781563 0,0.06356 -0.168595,0.220849 -0.374655,0.349537 -0.335065,0.209252 -0.666464,0.06755 -3.136364,-1.34112 -1.51894,-0.866304 -3.02114,-1.731853 -3.338221,-1.923444 -0.317083,-0.191593 -0.622516,-0.273915 -0.678742,-0.18294 -0.05622,0.09098 1.300222,0.968602 3.014325,1.95028 l 3.116555,1.784869 -0.695378,0.601107 c -0.382459,0.330609 -0.798535,0.601108 -0.924617,0.601108 -0.126082,0 -0.379923,0.184091 -0.564092,0.409091 -0.45491,0.55576 -2.74328,2.676576 -3.561116,3.300369 l -0.66371,0.506238 -2.266008,-1.202111 c -1.246305,-0.661162 -2.305869,-1.137616 -2.354587,-1.058787 -0.04872,0.07883 0.773011,0.630394 1.826064,1.225705 1.053054,0.595311 2.048388,1.180182 2.211854,1.299711 0.518639,0.379238 0.06902,0.484765 -0.464477,0.109015 C 33.962286,42.047418 30.96956,40.4 30.740144,40.4 c -0.11552,0 -0.318073,0.100922 -0.450118,0.224269 -0.23186,0.216589 0.145619,0.46592 4.037628,2.666906 0.157626,0.08914 -2.212106,2.138412 -7.090909,6.132001 -4.03021,3.298966 -7.416732,6.051366 -7.525605,6.116444 -0.140327,0.08388 -0.232868,-1.745202 -0.317902,-6.283375 z m 10.821031,-8.873612 c 0.337275,-0.180504 0.238101,-0.275424 -1.057407,-1.012035 -1.469772,-0.835694 -1.912151,-1.153489 -1.602317,-1.151063 0.095,7.27e-4 0.816233,0.368925 1.602739,0.818181 1.280799,0.731599 2.301133,1.095324 1.833625,0.653646 -0.298661,-0.282162 -4.459988,-2.428344 -4.544519,-2.343813 -0.04429,0.04429 0.211718,0.421931 0.568896,0.839211 0.638599,0.74606 0.590189,0.949569 -0.13372,0.562145 -0.201991,-0.108101 -0.405626,-0.158178 -0.452524,-0.111281 -0.09002,0.09002 3.010382,1.932143 3.264729,1.939756 0.08157,0.0024 0.315798,-0.08519 0.520498,-0.194747 l 0,0 z m -4.12336,-0.608208 c 0,-0.286747 -0.151745,-0.356685 -0.863636,-0.398045 -0.475,-0.0276 -0.863637,-0.01191 -0.863637,0.03485 0,0.18198 1.196761,0.808044 1.454546,0.76092 0.15,-0.02742 0.272727,-0.206396 0.272727,-0.397724 z m 13.727273,-2.101698 c 0,-0.1 -0.08182,-0.181818 -0.181818,-0.181818 -0.1,0 -0.181819,0.08182 -0.181819,0.181818 0,0.1 0.08182,0.181818 0.181819,0.181818 0.1,0 0.181818,-0.08182 0.181818,-0.181818 z M 25.090909,37.490909 c 0,-0.1 -0.122727,-0.181818 -0.272727,-0.181818 -0.15,0 -0.272727,0.08182 -0.272727,0.181818 0,0.1 0.122727,0.181818 0.272727,0.181818 0.15,0 0.272727,-0.08182 0.272727,-0.181818 z m 13.818182,-0.363636 c 0,-0.1 -0.08182,-0.181818 -0.181818,-0.181818 -0.1,0 -0.181818,0.08182 -0.181818,0.181818 0,0.1 0.08182,0.181818 0.181818,0.181818 0.1,0 0.181818,-0.08182 0.181818,-0.181818 z M 38,36.581818 C 38,36.481818 37.918182,36.4 37.818182,36.4 c -0.1,0 -0.181818,0.08182 -0.181818,0.181818 0,0.1 0.08182,0.181818 0.181818,0.181818 0.1,0 0.181818,-0.08182 0.181818,-0.181818 z m -2.909091,-1.636363 c 0,-0.1 -0.08182,-0.181819 -0.181818,-0.181819 -0.1,0 -0.181818,0.08182 -0.181818,0.181819 0,0.1 0.08182,0.181818 0.181818,0.181818 0.1,0 0.181818,-0.08182 0.181818,-0.181818 z m -1.318097,-0.772728 c -0.114549,-0.344034 -0.681903,-0.392945 -0.681903,-0.05879 0,0.16866 0.155454,0.286058 0.378788,0.286058 0.222177,0 0.347501,-0.09397 0.303115,-0.227273 z m 11.318097,-0.5 c 0,-0.1 -0.08182,-0.181818 -0.181818,-0.181818 -0.1,0 -0.181818,0.08182 -0.181818,0.181818 0,0.1 0.08182,0.181818 0.181818,0.181818 0.1,0 0.181818,-0.08182 0.181818,-0.181818 z M 25.454545,33.309091 c 0,-0.1 -0.08182,-0.181818 -0.181818,-0.181818 -0.1,0 -0.181818,0.08182 -0.181818,0.181818 0,0.1 0.08182,0.181818 0.181818,0.181818 0.1,0 0.181818,-0.08182 0.181818,-0.181818 z m 10.399003,-0.503362 c -0.120697,-0.04023 -0.177909,-0.140365 -0.127137,-0.222516 0.05077,-0.08215 -0.9919,-0.740009 -2.317049,-1.461904 -2.681957,-1.46104 -2.600065,-1.409393 -2.458793,-1.550667 0.05615,-0.05615 1.150126,0.436013 2.431064,1.093687 1.280939,0.657673 2.414546,1.162678 2.519128,1.122231 0.180119,-0.06966 -4.25909,-2.281467 -5.128034,-2.555011 -0.550449,-0.17328 -0.544087,0.250969 0.01159,0.773002 0.673937,0.633129 4.908875,3.10906 5.107697,2.986182 0.11157,-0.06895 0.09682,-0.139911 -0.03847,-0.185004 l -10e-7,0 z m -9.489912,-0.383467 c 0,-0.366433 -0.483486,-0.872109 -0.662593,-0.693002 -0.05959,0.05959 -0.05606,0.316707 0.0079,0.571364 0.134039,0.534052 0.654735,0.630791 0.654735,0.121638 z m 16.727273,0.159556 c 0,-0.1 -0.08182,-0.181818 -0.181818,-0.181818 -0.1,0 -0.181818,0.08182 -0.181818,0.181818 0,0.1 0.08182,0.181818 0.181818,0.181818 0.1,0 0.181818,-0.08182 0.181818,-0.181818 z M 29.818182,32.036364 c 0,-0.1 -0.08182,-0.181819 -0.181818,-0.181819 -0.1,0 -0.181819,0.08182 -0.181819,0.181819 0,0.1 0.08182,0.181818 0.181819,0.181818 0.1,0 0.181818,-0.08182 0.181818,-0.181818 z m 11.590994,-0.409091 c -0.04162,-0.125 -0.229925,-0.257164 -0.418454,-0.293698 -0.296564,-0.05747 -0.309918,-0.02683 -0.09904,0.227272 0.2884,0.347502 0.625482,0.390769 0.517489,0.06643 z M 24.863721,31.081818 c -0.114549,-0.344034 -0.681903,-0.392945 -0.681903,-0.05878 0,0.16866 0.155454,0.286058 0.378788,0.286058 0.222177,0 0.347501,-0.09397 0.303115,-0.227273 z m 14.909092,-0.363636 c -0.04162,-0.125 -0.229926,-0.257164 -0.418455,-0.293698 -0.296563,-0.05747 -0.309918,-0.02683 -0.09903,0.227272 0.2884,0.347502 0.625481,0.390769 0.517489,0.06643 z M 23.636364,30.490909 c 0,-0.15 -0.122728,-0.272727 -0.272728,-0.272727 -0.15,0 -0.272727,0.122727 -0.272727,0.272727 0,0.15 0.122727,0.272727 0.272727,0.272727 0.15,0 0.272728,-0.122727 0.272728,-0.272727 z m 3.818181,0.09091 c 0,-0.1 -0.163636,-0.181818 -0.363636,-0.181818 -0.2,0 -0.363636,0.08182 -0.363636,0.181818 0,0.1 0.163636,0.181818 0.363636,0.181818 0.2,0 0.363636,-0.08182 0.363636,-0.181818 z m -1.135453,-0.409091 c -0.04117,-0.125 -0.26907,-0.255585 -0.506452,-0.290189 -0.376824,-0.05493 -0.401037,-0.02609 -0.190769,0.227273 0.284745,0.343096 0.804952,0.39004 0.697221,0.06292 z m 8.408181,-0.142069 c 0,-0.10314 -0.122728,-0.23462 -0.272728,-0.29218 -0.373748,-0.143422 -0.34399,-0.428149 0.04545,-0.434916 0.290259,-0.005 0.288345,-0.02286 -0.02181,-0.20306 -0.240543,-0.139751 -0.276769,-0.236609 -0.123845,-0.33112 0.138792,-0.08578 -0.11616,-0.346833 -0.712372,-0.729422 -0.991711,-0.636378 -1.132091,-0.946649 -0.213349,-0.471549 0.815291,0.421604 1.09746,0.337627 0.533625,-0.158813 -0.48595,-0.427865 -5.223393,-3.191416 -5.470913,-3.191416 -0.374036,0 0.01353,0.387337 1.242336,1.241609 0.753517,0.523848 1.526491,1.209729 1.71772,1.52418 0.316062,0.519722 0.321223,0.591082 0.05674,0.784478 -0.415941,0.304144 -0.196889,0.552198 1.379655,1.562322 1.377074,0.882316 1.839493,1.058258 1.839493,0.699887 z m 3.818182,0.02298 c 0,-0.210284 -1.631875,-1.173282 -1.764118,-1.041038 -0.05456,0.05456 -0.232232,-0.05927 -0.394817,-0.252975 -0.373866,-0.445412 -1.731262,-1.030218 -1.620588,-0.698196 0.04167,0.124996 0.888648,0.660102 1.882184,1.189122 2.027489,1.079563 1.897339,1.024474 1.897339,0.803087 z m -11.09091,-0.414649 c 0,-0.2998 -0.739119,-1.057173 -1.031693,-1.057173 -0.3599,0 -0.291561,0.377326 0.154296,0.851918 0.423922,0.451244 0.877397,0.557329 0.877397,0.205255 z m -2.363636,-0.121195 c 0,-0.243263 -0.795435,-1.355034 -1.022805,-1.429563 -0.112543,-0.03689 -0.244876,0.143489 -0.294072,0.400843 -0.06652,0.347984 0.02716,0.559642 0.365507,0.825784 0.471221,0.370662 0.95137,0.473084 0.95137,0.202936 z M 21.272727,28.4 c 0,-0.1 -0.08182,-0.181818 -0.181818,-0.181818 -0.1,0 -0.181818,0.08182 -0.181818,0.181818 0,0.1 0.08182,0.181818 0.181818,0.181818 0.1,0 0.181818,-0.08182 0.181818,-0.181818 z m 18.250782,-1.883987 c -0.631385,-0.364915 -2.307007,-1.008603 -2.108311,-0.809906 0.440957,0.440957 2.315749,1.388171 2.381038,1.202989 0.03793,-0.10758 -0.0848,-0.284469 -0.272727,-0.393083 z m -4.694624,-2.576341 c -0.403021,-0.30483 -0.647067,-0.342651 -0.647067,-0.100278 0,0.187967 0.320168,0.345856 0.727273,0.358651 0.203232,0.0064 0.182794,-0.05945 -0.08021,-0.258373 z m -7.010703,-0.153773 c 0,-0.38807 -0.431474,-0.654389 -0.873098,-0.538902 -0.510292,0.133444 -0.50721,0.318277 0.0095,0.567458 0.570161,0.274979 0.863637,0.265275 0.863637,-0.02856 l -1e-6,0 z M 34,23.503161 c 0,-0.171927 -0.7745,-0.489741 -0.870268,-0.357113 -0.02865,0.03967 -0.110466,-0.01677 -0.181818,-0.125423 -0.172244,-0.262296 -1.737926,-1.16608 -2.020073,-1.16608 -0.122116,0 -0.170638,0.08315 -0.107826,0.184784 0.06281,0.101632 0.183379,0.142031 0.267928,0.08978 0.08455,-0.05225 0.181169,-0.02643 0.21471,0.05739 0.08112,0.202707 2.18034,1.453616 2.470074,1.471894 C 33.897727,23.666275 34,23.596423 34,23.503161 z m -8.009975,-0.571715 c -0.296044,-0.415755 -0.451009,-0.50664 -0.60329,-0.353819 -0.152143,0.152682 -0.08786,0.295722 0.249629,0.55542 0.667206,0.513421 0.806331,0.434115 0.353661,-0.201601 z M 24.465249,22.12149 c -0.394463,-0.298357 -0.647067,-0.343418 -0.647067,-0.115429 0,0.2545 0.22362,0.394226 0.621212,0.388157 0.372155,-0.0057 0.372607,-0.01046 0.02585,-0.272728 l 0,0 z m 2.989296,0.108528 c 0,-0.340722 -0.35901,-1.102745 -0.519534,-1.102745 -0.09069,0 -0.157266,0.286363 -0.14794,0.636363 0.01289,0.483804 0.09493,0.636364 0.342216,0.636364 0.178892,0 0.325258,-0.07649 0.325258,-0.169982 z m -2.015151,-0.440763 c -0.04167,-0.03591 -0.51381,-0.450131 -1.049207,-0.92049 -0.535397,-0.47036 -1.014114,-0.814535 -1.063816,-0.764833 -0.147482,0.147482 0.896529,1.412785 1.300825,1.576553 0.376301,0.152427 0.952369,0.229575 0.812198,0.10877 z m 4.164329,-0.732768 c -0.199556,-0.145919 -0.251064,-0.309813 -0.149178,-0.474669 0.101711,-0.164571 0.04994,-0.332148 -0.149463,-0.483752 -0.269171,-0.204652 -0.240877,-0.233287 0.240373,-0.243267 0.499266,-0.01035 0.514662,-0.02851 0.181818,-0.214415 -0.2,-0.111707 -0.398573,-0.232792 -0.441273,-0.269077 -0.148854,-0.126493 0.625879,-0.596149 0.992859,-0.601888 0.480016,-0.0075 2.365889,1.201757 2.049739,1.314338 -0.130729,0.04655 -0.180221,0.146492 -0.109983,0.222087 0.07024,0.07559 0.252226,0.01293 0.404418,-0.139267 0.247738,-0.247738 0.244419,-0.289105 -0.0317,-0.395062 -0.249343,-0.09568 -0.260886,-0.147724 -0.06027,-0.271712 0.264876,-0.163703 -0.156853,-0.476206 -2.19045,-1.623131 -0.974698,-0.549718 -1.027488,-0.559889 -1.117593,-0.215325 -0.05202,0.198906 0.01873,0.455676 0.157202,0.570602 0.212211,0.176118 0.199049,0.284312 -0.08375,0.688503 -0.184542,0.263751 -0.299469,0.581821 -0.255394,0.706821 0.04484,0.127169 -0.06668,0.23011 -0.253197,0.233715 -0.274239,0.0053 -0.255947,0.04933 0.10318,0.248346 0.41886,0.23212 0.422537,0.25067 0.09091,0.458656 -0.206322,0.129399 -0.264402,0.251779 -0.144115,0.303665 0.110819,0.0478 0.356145,0.200001 0.545168,0.338218 0.189024,0.138218 0.384589,0.210396 0.434589,0.160396 0.05,-0.05 -0.04625,-0.191202 -0.213887,-0.313782 l 0,0 z m 3.949812,-0.09796 c -0.231794,-0.37505 -0.795318,-0.574933 -0.935287,-0.331748 -0.0721,0.12527 -0.06836,0.171328 0.0083,0.102349 0.07668,-0.06898 0.308841,0.03243 0.515918,0.225353 0.381379,0.355308 0.629651,0.357752 0.411049,0.004 l 0,0 z m -7.326262,-0.230246 c -0.219445,-0.219445 -0.453831,-0.344149 -0.520859,-0.277121 -0.176898,0.176897 0.287516,0.676111 0.62898,0.676111 0.233766,0 0.21254,-0.07833 -0.108121,-0.39899 z m -0.954546,-0.515808 c 0,-0.234352 -0.518013,-0.445977 -0.684394,-0.279596 -0.06779,0.06779 -0.0029,0.199373 0.144205,0.292405 0.351955,0.222583 0.540189,0.21812 0.540189,-0.01281 z m 0.752585,-6.909433 c -0.454094,-0.378299 -0.752585,-0.459032 -0.752585,-0.203554 0,0.161895 0.688947,0.544181 1,0.554885 0.1,0.0034 -0.01134,-0.154658 -0.247415,-0.351331 l 0,0 z m -2.363636,-1.272727 c -0.454095,-0.378299 -0.752585,-0.459032 -0.752585,-0.203554 0,0.161895 0.688947,0.544181 1,0.554884 0.1,0.0034 -0.01134,-0.154657 -0.247415,-0.35133 l 0,0 z m -1.388949,-0.721224 c -0.0618,-0.1 -0.14845,-0.181818 -0.192548,-0.181818 -0.0441,0 -0.08018,0.08182 -0.08018,0.181818 0,0.1 0.08665,0.181818 0.192549,0.181818 0.105901,0 0.141982,-0.08182 0.08018,-0.181818 z"
       id="path3067"
       inkscape:connector-curvature="0" />
    <rect
       style="fill:#0000ff"
       id="rect3085"
       width="11.636364"
       height="6.3636365"
       x="1.0909091"
       y="28.90909" />
    <rect
       style="fill:#0000ff"
       id="rect3087"
       width="10.909091"
       height="6.181818"
       x="53.454544"
       y="28.90909" />
  </g>
</svg>
