<?xml version="1.0" encoding="UTF-8" standalone="no"?>
<!-- Generator: Adobe Illustrator 14.0.0, SVG Export Plug-In . SVG Version: 6.00 Build 43363)  -->

<svg
   xmlns:osb="http://www.openswatchbook.org/uri/2009/osb"
   xmlns:dc="http://purl.org/dc/elements/1.1/"
   xmlns:cc="http://creativecommons.org/ns#"
   xmlns:rdf="http://www.w3.org/1999/02/22-rdf-syntax-ns#"
   xmlns:svg="http://www.w3.org/2000/svg"
   xmlns="http://www.w3.org/2000/svg"
   xmlns:xlink="http://www.w3.org/1999/xlink"
   xmlns:sodipodi="http://sodipodi.sourceforge.net/DTD/sodipodi-0.dtd"
   xmlns:inkscape="http://www.inkscape.org/namespaces/inkscape"
   version="1.1"
   id="Calque_1"
   x="0px"
   y="0px"
   width="40px"
   height="40px"
   viewBox="0 0 40 40"
   enable-background="new 0 0 40 40"
   xml:space="preserve"
   inkscape:version="0.48.2 r9819"
   sodipodi:docname="FlowVolumetric.svg"><metadata
   id="metadata3010"><rdf:RDF><cc:Work
       rdf:about=""><dc:format>image/svg+xml</dc:format><dc:type
         rdf:resource="http://purl.org/dc/dcmitype/StillImage" /><dc:title /></cc:Work></rdf:RDF></metadata><defs
   id="defs3008"><pattern
     inkscape:collect="always"
     xlink:href="#pattern5308"
     id="pattern5325"
     patternTransform="matrix(1.0335264,-0.03096439,0.01968889,0.65717401,-1.6604873,-10.048729)" /><pattern
     inkscape:collect="always"
     xlink:href="#Wavy"
     id="pattern5308"
     patternTransform="matrix(1.0335264,-0.03096439,0.01968889,0.65717401,-0.25423729,-0.42372881)" /><pattern
     inkscape:stockid="Wavy"
     id="Wavy"
     height="5.1805778"
     width="30.066020"
     patternUnits="userSpaceOnUse"
     inkscape:collect="always"><path
       id="path5107"
       d="M 7.597,0.061 C 5.079,-0.187 2.656,0.302 -0.01,1.788 L -0.01,3.061 C 2.773,1.431 5.173,1.052 7.472,1.280 C 9.770,1.508 11.969,2.361 14.253,3.218 C 18.820,4.931 23.804,6.676 30.066,3.061 L 30.062,1.788 C 23.622,5.497 19.246,3.770 14.691,2.061 C 12.413,1.207 10.115,0.311 7.597,0.061 z "
       style="fill:black;stroke:none;" /></pattern><linearGradient
     id="linearGradient3754"
     osb:paint="solid"><stop
       style="stop-color:#3f3a3a;stop-opacity:1;"
       offset="0"
       id="stop3756" /></linearGradient><pattern
     patternUnits="userSpaceOnUse"
     width="28.90625"
     height="20.59375"
     patternTransform="translate(1.40625,9.625)"
     id="pattern5322"><rect
       y="0.036016464"
       x="0.034428"
       height="20.508474"
       width="28.81356"
       id="rect2984"
       style="fill:url(#pattern5325);fill-opacity:1;stroke:#005a5a;stroke-width:0;stroke-linejoin:miter;stroke-miterlimit:4;stroke-opacity:1;stroke-dasharray:none;stroke-dashoffset:0" /></pattern></defs><sodipodi:namedview
   pagecolor="#ffffff"
   bordercolor="#666666"
   borderopacity="1"
   objecttolerance="10"
   gridtolerance="10"
   guidetolerance="10"
   inkscape:pageopacity="0"
   inkscape:pageshadow="2"
   inkscape:window-width="1280"
   inkscape:window-height="962"
   id="namedview3006"
   showgrid="false"
   inkscape:zoom="11.8"
   inkscape:cx="18.178312"
   inkscape:cy="11.974669"
   inkscape:window-x="-8"
   inkscape:window-y="-8"
   inkscape:window-maximized="1"
   inkscape:current-layer="g3002" />
<g
   id="g3002">
	




<path
   style="fill:none;stroke:#005a5a;stroke-width:1.63018775;stroke-linecap:butt;stroke-linejoin:miter;stroke-miterlimit:4;stroke-opacity:1;stroke-dasharray:none"
   d="m 39.284948,19.805534 -7.29154,0"
   id="path3033"
   inkscape:connector-curvature="0"
   sodipodi:nodetypes="cc" /><path
   style="fill:none;stroke:#005a5a;stroke-width:1.77060378px;stroke-linecap:butt;stroke-linejoin:miter;stroke-opacity:1"
   d="m 0.64902459,7.5716287 30.82059441,0.084746 0,23.4657875 -30.61105353,-0.106669"
   id="path2992"
   inkscape:connector-curvature="0"
   sodipodi:nodetypes="cccc" /><rect
   style="stroke:none;fill:url(#pattern5322)"
   width="28.90625"
   height="20.59375"
   x="1.40625"
   y="9.625"
   id="rect5327" /></g>
</svg>