// Copyright (C) 2010 - DIGITEO - Michael Baudin
//
// This file must be used under the terms of the CeCILL.
// This source file is licensed as described in the file COPYING, which
// you should have received as part of this distribution.  The terms
// are also available at
// http://www.cecill.info/licences/Licence_CeCILL_V2-en.txt
//
// Do not check ref, because output depends on the machine.
// <-- NO CHECK REF -->
//
//
// assert_close --
//   Returns 1 if the two real matrices computed and expected are close,
//   i.e. if the relative distance between computed and expected is lesser than epsilon.
// Arguments
//   computed, expected : the two matrices to compare
//   epsilon : a small number
//
function flag = assert_close ( computed, expected, epsilon )
  if expected==0.0 then
    shift = norm(computed-expected);
  else
    shift = norm(computed-expected)/norm(expected);
  end
  if shift < epsilon then
    flag = 1;
  else
    flag = 0;
  end
  if flag <> 1 then bugmes();quit;end
endfunction
//
// assert_equal --
//   Returns 1 if the two real matrices computed and expected are equal.
// Arguments
//   computed, expected : the two matrices to compare
//   epsilon : a small number
//
function flag = assert_equal ( computed , expected )
  if computed==expected then
    flag = 1;
  else
    flag = 0;
  end
  if flag <> 1 then bugmes();quit;end
endfunction
scibench_getsettings ( );
env = scibench_getsettings ( );
env
 env  =

Benchmark Environment:
=========================
version: scilab-5.3.0-beta-4
nproc: 4
os:  Windows Vista
archi: x86
cpu: Intel(R) Xeon(R) CPU           E5410  @ 2.33GHz
assert_equal ( env.nproc<>0 , %t );
assert_equal ( env.cpu<>"" , %t );
assert_equal ( env.os<>"" , %t );
assert_equal ( env.archi<>"" , %t );
