// Scilab ( http://www.scilab.org/ ) - This file is part of Scilab
// Copyright (C) 2008-2009 - INRIA - Michael Baudin
//
// This file must be used under the terms of the CeCILL.
// This source file is licensed as described in the file COPYING, which
// you should have received as part of this distribution.  The terms
// are also available at
// http://www.cecill.info/licences/Licence_CeCILL_V2-en.txt
//
// assert_close --
//   Returns 1 if the two real matrices computed and expected are close,
//   i.e. if the relative distance between computed and expected is lesser than epsilon.
// Arguments
//   computed, expected : the two matrices to compare
//   epsilon : a small number
//
function flag = assert_close ( computed, expected, epsilon )
  if expected==0.0 then
    shift = norm(computed-expected);
  else
    shift = norm(computed-expected)/norm(expected);
  end
  if shift < epsilon then
    flag = 1;
  else
    flag = 0;
  end
  if flag <> 1 then bugmes();quit;end
endfunction
//
// assert_equal --
//   Returns 1 if the two real matrices computed and expected are equal.
// Arguments
//   computed, expected : the two matrices to compare
//   epsilon : a small number
//
function flag = assert_equal ( computed , expected )
  if computed==expected then
    flag = 1;
  else
    flag = 0;
  end
  if flag <> 1 then bugmes();quit;end
endfunction
//
// In this case, the mydata variable is passed
// explicitely by the neldermead class.
// So the actual name "mydata" does not matter
// and whatever variable name can be used.
//
function [ y , index ] = rosenbrock ( x , index )
  global _MYDATA_
  a = _MYDATA_.a
  y = 100*(x(2)-x(1)^2)^2 + ( a - x(1))^2;
  _MYDATA_.nb = _MYDATA_.nb + 1
endfunction
//
// Test with an additional argument
//
global _MYDATA_
_MYDATA_ = tlist(["T_MYSTUFF","a","nb"]);
_MYDATA_.a = 12.0;
_MYDATA_.nb = 0;
nm = neldermead_new ();
nm = neldermead_configure(nm,"-numberofvariables",2);
nm = neldermead_configure(nm,"-function",rosenbrock);
nm = neldermead_configure(nm,"-x0",[-1.2 1.0]');
nm = neldermead_configure(nm,"-maxiter",400);
nm = neldermead_configure(nm,"-maxfunevals",600);
nm = neldermead_configure(nm,"-tolfunrelative",10*%eps);
nm = neldermead_configure(nm,"-tolxrelative",10*%eps);
nm = neldermead_configure(nm,"-simplex0method","axes");
nm = neldermead_configure(nm,"-simplex0length",1.0);
nm = neldermead_configure(nm,"-method","variable");
nm = neldermead_configure(nm,"-verbosetermination",0);
nm = neldermead_configure(nm,"-storehistory",%f);
nm = neldermead_search(nm);
// Check optimum point
xopt = neldermead_get(nm,"-xopt");
assert_close ( xopt , [12.0 144.0]', 1e-6 );
// Check _MYDATA_.nb
// The variable is not just read, it is also written and the nb field
// IS updated.
assert_equal ( _MYDATA_.nb > 100 , %T );
nm = neldermead_destroy(nm);
