// =============================================================================
// Scilab ( http://www.scilab.org/ ) - This file is part of Scilab
// Copyright (C) 2008 - INRIA - Jean-Baptiste SILVY <jean-baptiste.silvy@inria.fr>
//
//  This file is distributed under the same license as the Scilab package.
// =============================================================================
// <-- TEST WITH GRAPHIC -->
// non regression bug for Matplot_properties
// used to crash Scilab
Matplot(1:32);
