// =============================================================================
// Scilab ( http://www.scilab.org/ ) - This file is part of Scilab
// Copyright (C) 2007-2008 - INRIA
//
//  This file is distributed under the same license as the Scilab package.
// =============================================================================
// <-- JVM NOT MANDATORY -->
// =============================================================================
// unit tests isascii
// =============================================================================
chars = ascii(1:127);
if or(isascii(chars)) <> %T then bugmes();quit;end
// =============================================================================
if or(isascii(255:300)) <> %F then bugmes();quit;end
// =============================================================================
if or(isascii('This is a sentence')) <> %T then bugmes();quit;end
// =============================================================================
if isascii(code2str(120)) <> %T then bugmes();quit;end
// =============================================================================
if or(isascii(code2str(120:150))) <> %T then bugmes();quit;end
// =============================================================================
tab_ref = [
"世界A您好",
"азеAазея",
"ハロー・Aワールド",
"เฮลโลเAวิลด์",
"حرياتAوحقوق",
"תוAכנית"];
r_ref = list([%F,%F,%T,%F,%F], ..
[%F,%F,%F,%T,%F,%F,%F,%F], ..
[%F,%F,%F,%F,%T,%F,%F,%F,%F], ..
[%F,%F,%F,%F,%F,%F,%T,%F,%F,%F,%F,%F], ..
[%F,%F,%F,%F,%F,%T,%F,%F,%F,%F,%F], ..
[%F,%F,%T,%F,%F,%F,%F]);
for i = 1 : size(tab_ref,'*')
 if and(isascii(tab_ref(i))<> r_ref(i)) then bugmes();quit;end
end
