/* XPM */
static char * puffin_128_xpm[] = {
"128 128 732 2",
"  	c None",
". 	c #4C4C4C",
"+ 	c #363636",
"@ 	c #222222",
"# 	c #0E0E0E",
"$ 	c #050505",
"% 	c #010101",
"& 	c #040404",
"* 	c #0D0D0D",
"= 	c #282828",
"- 	c #444444",
"; 	c #3A3A3A",
"> 	c #151515",
", 	c #000000",
"' 	c #2F2F2F",
") 	c #343434",
"! 	c #646464",
"~ 	c #020202",
"{ 	c #131313",
"] 	c #303030",
"^ 	c #202020",
"/ 	c #5B5B5B",
"( 	c #848484",
"_ 	c #9F9F9F",
": 	c #B1B1B1",
"< 	c #BDBDBD",
"[ 	c #BBBBBB",
"} 	c #AAAAAA",
"| 	c #8A8A8A",
"1 	c #4F4F4F",
"2 	c #494949",
"3 	c #373737",
"4 	c #767676",
"5 	c #C7C7C7",
"6 	c #FAFAFA",
"7 	c #FFFFFF",
"8 	c #E1E1E1",
"9 	c #878787",
"0 	c #030303",
"a 	c #98984F",
"b 	c #E5E5E5",
"c 	c #E6E6E6",
"d 	c #6C6C6C",
"e 	c #F0BA29",
"f 	c #030B00",
"g 	c #CBCBCB",
"h 	c #C3C3C3",
"i 	c #3F3F3F",
"j 	c #DC7079",
"k 	c #FF861A",
"l 	c #B39F1B",
"m 	c #4D4D4D",
"n 	c #F9F9F9",
"o 	c #A9A9A9",
"p 	c #2C2C2C",
"q 	c #181818",
"r 	c #DF745C",
"s 	c #CB211C",
"t 	c #FFC72A",
"u 	c #727E13",
"v 	c #D3D3D3",
"w 	c #919191",
"x 	c #FDFDFD",
"y 	c #A4A4A4",
"z 	c #5C5C5C",
"A 	c #DD6950",
"B 	c #D02F10",
"C 	c #E5653C",
"D 	c #FFDF2B",
"E 	c #273203",
"F 	c #BFBFBF",
"G 	c #292929",
"H 	c #6E6E6E",
"I 	c #FEFEFE",
"J 	c #AEAEAE",
"K 	c #474747",
"L 	c #E27F6A",
"M 	c #D33B0D",
"N 	c #D13D45",
"O 	c #FFA032",
"P 	c #E9DD2A",
"Q 	c #1B1B1B",
"R 	c #ACACAC",
"S 	c #A2A2A2",
"T 	c #7B7B7B",
"U 	c #2D2D2D",
"V 	c #D13306",
"W 	c #D95739",
"X 	c #D13E44",
"Y 	c #FFD12E",
"Z 	c #CCC825",
"` 	c #575757",
" .	c #BEBEBE",
"..	c #2B2B2B",
"+.	c #C9C9C9",
"@.	c #F5F5F5",
"#.	c #E0E0E0",
"$.	c #828282",
"%.	c #888888",
"&.	c #505050",
"*.	c #D44019",
"=.	c #D74E2C",
"-.	c #D85340",
";.	c #D8553D",
">.	c #FFF530",
",.	c #B3AA1E",
"'.	c #5D5D5D",
").	c #696969",
"!.	c #393939",
"~.	c #323232",
"{.	c #454545",
"].	c #B0B0B0",
"^.	c #EDEDED",
"/.	c #464646",
"(.	c #DF735B",
"_.	c #D23A0F",
":.	c #DA5C3F",
"<.	c #D44642",
"[.	c #E07334",
"}.	c #FEFD32",
"|.	c #A39418",
"1.	c #3B3B3B",
"2.	c #EAEAEA",
"3.	c #DBDBDB",
"4.	c #A8A8A8",
"5.	c #838383",
"6.	c #787878",
"7.	c #979797",
"8.	c #B4B4B4",
"9.	c #F3F3F3",
"0.	c #D33C11",
"a.	c #D9583A",
"b.	c #D9593C",
"c.	c #D23E43",
"d.	c #E78B2F",
"e.	c #9F8D17",
"f.	c #F1F1F1",
"g.	c #EFEFEF",
"h.	c #BCBCBC",
"i.	c #F2F2F2",
"j.	c #C4C4C4",
"k.	c #B3B3B3",
"l.	c #CCCCCC",
"m.	c #DC664D",
"n.	c #D5441E",
"o.	c #DA5B3E",
"p.	c #D13D44",
"q.	c #EC9B2B",
"r.	c #A69418",
"s.	c #B6B6B6",
"t.	c #515151",
"u.	c #D5431D",
"v.	c #D95839",
"w.	c #EDA12A",
"x.	c #BDA61D",
"y.	c #E07C67",
"z.	c #D4411A",
"A.	c #D95A3D",
"B.	c #D13C44",
"C.	c #EB992B",
"D.	c #EBCF27",
"E.	c #D9D9D9",
"F.	c #171717",
"G.	c #D95638",
"H.	c #D7502F",
"I.	c #D34143",
"J.	c #E48231",
"K.	c #FEF630",
"L.	c #FEFC31",
"M.	c #5F5109",
"N.	c #1E1E1E",
"O.	c #F8F8F8",
"P.	c #D33F16",
"Q.	c #D7503D",
"R.	c #D9563D",
"S.	c #FED929",
"T.	c #E8CE26",
"U.	c #4E4E4E",
"V.	c #E17D68",
"W.	c #D5431C",
"X.	c #D95A3C",
"Y.	c #D03945",
"Z.	c #EEA42A",
"`.	c #927C13",
" +	c #7D7D7D",
".+	c #DA5F45",
"++	c #D74E2D",
"@+	c #D54C40",
"#+	c #D8543E",
"$+	c #FEE02B",
"%+	c #FEF930",
"&+	c #413203",
"*+	c #565656",
"=+	c #D7502E",
"-+	c #D95537",
";+	c #DA5C3B",
">+	c #E68430",
",+	c #F1E02B",
"'+	c #0D0500",
")+	c #D54722",
"!+	c #D9573C",
"~+	c #D03845",
"{+	c #F1AA28",
"]+	c #D9C925",
"^+	c #7E7E7E",
"/+	c #E28471",
"(+	c #D54520",
"_+	c #DA5B3B",
":+	c #D64E3F",
"<+	c #F5C028",
"[+	c #D0C123",
"}+	c #020000",
"|+	c #121212",
"1+	c #929292",
"2+	c #ECECEC",
"3+	c #F0F0F0",
"4+	c #868686",
"5+	c #DF7762",
"6+	c #D85131",
"7+	c #D74D2B",
"8+	c #D64926",
"9+	c #DA5D40",
"0+	c #D95536",
"a+	c #D54824",
"b+	c #D8522C",
"c+	c #D23C31",
"d+	c #D23D38",
"e+	c #F7C728",
"f+	c #DACE26",
"g+	c #2A1E01",
"h+	c #717171",
"i+	c #F4F4F4",
"j+	c #898989",
"k+	c #D9593D",
"l+	c #DB6146",
"m+	c #DD6C54",
"n+	c #E07862",
"o+	c #DB5F43",
"p+	c #D85232",
"q+	c #E17B66",
"r+	c #DE6D4F",
"s+	c #D54744",
"t+	c #D23A33",
"u+	c #F2B421",
"v+	c #FFEB2D",
"w+	c #F6E62C",
"x+	c #6C621F",
"y+	c #1A1C2A",
"z+	c #515152",
"A+	c #6F6F6F",
"B+	c #242424",
"C+	c #858585",
"D+	c #B5B5B5",
"E+	c #A1A1A1",
"F+	c #7C7C7C",
"G+	c #404040",
"H+	c #FADE5F",
"I+	c #484848",
"J+	c #353535",
"K+	c #1D1D1D",
"L+	c #999A9B",
"M+	c #B4B6B6",
"N+	c #E4E5E6",
"O+	c #E1E3E4",
"P+	c #D4D6D7",
"Q+	c #FDFFFF",
"R+	c #797A7B",
"S+	c #D7D9DA",
"T+	c #D8DADA",
"U+	c #EAECED",
"V+	c #D7DADA",
"W+	c #E0E1E2",
"X+	c #D5D7D8",
"Y+	c #DADBDC",
"Z+	c #FBFDFE",
"`+	c #9E9FA0",
" @	c #D9DBDB",
".@	c #DCDEDF",
"+@	c #F9FBFC",
"@@	c #979899",
"#@	c #DFE0E1",
"$@	c #D5D7D9",
"%@	c #DDDFDF",
"&@	c #FBFDFD",
"*@	c #CACCCD",
"=@	c #686868",
"-@	c #D8DADB",
";@	c #F1F2F3",
">@	c #F9FAFB",
",@	c #C6C8C9",
"'@	c #757777",
")@	c #FAFDFD",
"!@	c #949596",
"~@	c #3A3B3B",
"{@	c #E8EAEB",
"]@	c #FCFEFF",
"^@	c #B0B1B2",
"/@	c #555656",
"(@	c #E0E2E3",
"_@	c #F5F7F8",
":@	c #BBBDBE",
"<@	c #4D4E4E",
"[@	c #D6D8D9",
"}@	c #F8F9FA",
"|@	c #F5F8F9",
"1@	c #A1A2A3",
"2@	c #DDDEDF",
"3@	c #DFE1E3",
"4@	c #CCCECF",
"5@	c #DADCDD",
"6@	c #C8CACB",
"7@	c #818283",
"8@	c #E8EBEC",
"9@	c #101010",
"0@	c #FCFDFE",
"a@	c #666768",
"b@	c #DFDFE0",
"c@	c #F9FCFD",
"d@	c #F3F5F6",
"e@	c #ADAEAF",
"f@	c #DCDDDE",
"g@	c #F1F4F4",
"h@	c #B5B5B7",
"i@	c #1A1A1A",
"j@	c #F4F6F9",
"k@	c #A9ABB0",
"l@	c #DADBDB",
"m@	c #D5DBED",
"n@	c #D3DAFA",
"o@	c #F4FBFF",
"p@	c #83879C",
"q@	c #5A5A5A",
"r@	c #D4DAF4",
"s@	c #DDDBCE",
"t@	c #EADF8F",
"u@	c #FAE86F",
"v@	c #DFCA33",
"w@	c #C9B621",
"x@	c #B3A51D",
"y@	c #857C13",
"z@	c #3C3B05",
"A@	c #D5DAF1",
"B@	c #E4DDAD",
"C@	c #FFE32C",
"D@	c #FFE42C",
"E@	c #FFE02B",
"F@	c #FFEF2E",
"G@	c #FFF22F",
"H@	c #CCC023",
"I@	c #706A0E",
"J@	c #D9DBDF",
"K@	c #D5DBF2",
"L@	c #F9E13F",
"M@	c #FFE52C",
"N@	c #FFE32B",
"O@	c #FFE22B",
"P@	c #FFE92D",
"Q@	c #DCCF27",
"R@	c #6C660D",
"S@	c #DADBDE",
"T@	c #D4DBF6",
"U@	c #F2DF67",
"V@	c #FFE12B",
"W@	c #C7BD22",
"X@	c #3E3504",
"Y@	c #626262",
"Z@	c #DBDDDE",
"`@	c #D2DAFC",
" #	c #E8DD9C",
".#	c #FFF42F",
"+#	c #8F8615",
"@#	c #D6D9DA",
"##	c #D5DBEC",
"$#	c #DCDCCF",
"%#	c #FFF02F",
"&#	c #CDC324",
"*#	c #2E2402",
"=#	c #F3E061",
"-#	c #F9EB2D",
";#	c #72690E",
">#	c #D4DAF5",
",#	c #E0DCC0",
"'#	c #B7AC1E",
")#	c #1E1701",
"!#	c #545454",
"~#	c #DFE1E2",
"{#	c #D1DAFE",
"]#	c #F3DF63",
"^#	c #FFE62C",
"/#	c #F3E42C",
"(#	c #807912",
"_#	c #D5DBEE",
":#	c #D8DBE3",
"<#	c #FEE32E",
"[#	c #DFCF27",
"}#	c #847B12",
"|#	c #302D03",
"1#	c #DADBD8",
"2#	c #D2DAFB",
"3#	c #DFDCC3",
"4#	c #FEF830",
"5#	c #FFE82D",
"6#	c #E2CA25",
"7#	c #CEB621",
"8#	c #C3AD1F",
"9#	c #C0AA1E",
"0#	c #BAA61D",
"a#	c #B09E1B",
"b#	c #9E8F17",
"c#	c #827811",
"d#	c #5D570A",
"e#	c #2C2C03",
"f#	c #272727",
"g#	c #D5D8D9",
"h#	c #DADBDA",
"i#	c #E1DDB9",
"j#	c #FFF630",
"k#	c #FEF931",
"l#	c #DECB26",
"m#	c #AEA11C",
"n#	c #6E680E",
"o#	c #1F1F01",
"p#	c #DEDCCA",
"q#	c #FDE330",
"r#	c #FAE42C",
"s#	c #BFB220",
"t#	c #736D0F",
"u#	c #111301",
"v#	c #D2DAFE",
"w#	c #FCE338",
"x#	c #FFEE2E",
"y#	c #F2DF2B",
"z#	c #AA9F1B",
"A#	c #4E4B07",
"B#	c #D8DBE2",
"C#	c #FCE236",
"D#	c #FFF12F",
"E#	c #FEF730",
"F#	c #D6C424",
"G#	c #867D13",
"H#	c #3A3804",
"I#	c #FDE32E",
"J#	c #FFE72C",
"K#	c #FEFA31",
"L#	c #A99C1A",
"M#	c #68620D",
"N#	c #00000E",
"O#	c #D5D6D7",
"P#	c #DADBD9",
"Q#	c #FAE32C",
"R#	c #CABA22",
"S#	c #7B7010",
"T#	c #47401D",
"U#	c #D0D9FE",
"V#	c #E8DD99",
"W#	c #FEDF2B",
"X#	c #F2D72A",
"Y#	c #FFE956",
"Z#	c #D5D7D7",
"`#	c #D9DBE1",
" $	c #F3DF5E",
".$	c #FFEA2D",
"+$	c #FFE432",
"@$	c #FFE84B",
"#$	c #D5DBF0",
"$$	c #D8DBE1",
"%$	c #FFE435",
"&$	c #FFE84F",
"*$	c #D0DAFE",
"=$	c #E9DD96",
"-$	c #FFE643",
";$	c #FFEA61",
">$	c #D9DBDC",
",$	c #D8DBE5",
"'$	c #D5DBEF",
")$	c #FBE13B",
"!$	c #FFE439",
"~$	c #FFE960",
"{$	c #E7DD9D",
"]$	c #FFE74C",
"^$	c #D6DBE8",
"/$	c #FDE230",
"($	c #FFE434",
"_$	c #D3DAFC",
":$	c #E8DE9B",
"<$	c #D5DBEB",
"[$	c #DCDBD2",
"}$	c #FFE12C",
"|$	c #D2DAFD",
"1$	c #F2DF66",
"2$	c #D5DBF1",
"3$	c #DCDBD1",
"4$	c #EADE8D",
"5$	c #FFE64A",
"6$	c #F6E052",
"7$	c #FFE42F",
"8$	c #D5DAF2",
"9$	c #FFE431",
"0$	c #FFE53B",
"a$	c #FFE744",
"b$	c #FFE855",
"c$	c #E4DDAA",
"d$	c #F3DF66",
"e$	c #FFE330",
"f$	c #FFEC71",
"g$	c #D6DBEC",
"h$	c #FBE239",
"i$	c #FFE63F",
"j$	c #FFEA63",
"k$	c #D3DAF7",
"l$	c #FEE32F",
"m$	c #FFE42E",
"n$	c #FFE745",
"o$	c #DBDBD4",
"p$	c #D3DAF9",
"q$	c #F1E06A",
"r$	c #FFE22C",
"s$	c #FFE856",
"t$	c #D3DAF8",
"u$	c #E2DDB2",
"v$	c #F2E067",
"w$	c #FDE233",
"x$	c #FFEC75",
"y$	c #D7DCDE",
"z$	c #D7E2E4",
"A$	c #D8E3E4",
"B$	c #D9DDDB",
"C$	c #D9DBDE",
"D$	c #D4DAF7",
"E$	c #D4DAF6",
"F$	c #E2DDB5",
"G$	c #EADF8E",
"H$	c #F8E144",
"I$	c #FFE32D",
"J$	c #FFDD2A",
"K$	c #FFEC6E",
"L$	c #D7D7D8",
"M$	c #D9E6E9",
"N$	c #E1F0F3",
"O$	c #DFDEDE",
"P$	c #DEDBDB",
"Q$	c #DFEFF1",
"R$	c #D9ECF0",
"S$	c #D6DADB",
"T$	c #D9DADB",
"U$	c #D7DBE8",
"V$	c #D7DBE5",
"W$	c #DCDBCF",
"X$	c #E2DDB6",
"Y$	c #E8DE99",
"Z$	c #EEDF7B",
"`$	c #F4E05D",
" %	c #F9E142",
".%	c #FEE22E",
"+%	c #D7D8D9",
"@%	c #D9EAED",
"#%	c #DF6D55",
"$%	c #DD694F",
"%%	c #D8DCDD",
"&%	c #D6E2E4",
"*%	c #D7ECF1",
"=%	c #D8EFFA",
"-%	c #D7EEFE",
";%	c #D1E4FE",
">%	c #D0D9F9",
",%	c #D3D9F8",
"'%	c #D8DBE4",
")%	c #DBDCD3",
"!%	c #E0DDBE",
"~%	c #E5DDA8",
"{%	c #E9DE90",
"]%	c #EFDF77",
"^%	c #F3E05E",
"/%	c #F8E147",
"(%	c #FCE235",
"_%	c #D2DBDD",
":%	c #D12704",
"<%	c #D74824",
"[%	c #D74925",
"}%	c #D63B10",
"|%	c #D9390B",
"1%	c #D3DADB",
"2%	c #DDF1F5",
"3%	c #DBE7EA",
"4%	c #D7D8DA",
"5%	c #DADBDF",
"6%	c #D6DBEA",
"7%	c #D3DAFB",
"8%	c #D7DBE7",
"9%	c #DEDCC9",
"0%	c #E2DDB7",
"a%	c #E6DDA4",
"b%	c #F2DF68",
"c%	c #F6E054",
"d%	c #FFE854",
"e%	c #FFE63E",
"f%	c #FFE537",
"g%	c #FFE74B",
"h%	c #D74016",
"i%	c #D85436",
"j%	c #D95B3E",
"k%	c #D95637",
"l%	c #D12904",
"m%	c #DCF1F5",
"n%	c #DCEBEF",
"o%	c #E16447",
"p%	c #DB4A26",
"q%	c #DA451E",
"r%	c #DB4924",
"s%	c #DC4C28",
"t%	c #DFF1F5",
"u%	c #DADBDD",
"v%	c #D5DBF3",
"w%	c #D4DAF8",
"x%	c #D4DBF5",
"y%	c #DDDCCE",
"z%	c #DFDDC3",
"A%	c #E1DCB4",
"B%	c #DFDAB7",
"C%	c #DDDAC3",
"D%	c #EAE3B3",
"E%	c #E17058",
"F%	c #D23507",
"G%	c #D5F4F9",
"H%	c #DC4116",
"I%	c #D33D13",
"J%	c #D54621",
"K%	c #D63708",
"L%	c #D5DBEA",
"M%	c #D3D8ED",
"N%	c #D1D8F1",
"O%	c #D9DEF6",
"P%	c #D13609",
"Q%	c #D13407",
"R%	c #E3806B",
"S%	c #E89584",
"T%	c #D3390C",
"U%	c #D33D11",
"V%	c #DEDFE0",
"W%	c #D64A26",
"X%	c #D2390E",
"Y%	c #E2806C",
"Z%	c #D95232",
"`%	c #D64E2D",
" &	c #D2380D",
".&	c #E79787",
"+&	c #DFE1E1",
"@&	c #E07A65",
"#&	c #DA5C40",
"$&	c #D33E13",
"%&	c #DA5F44",
"&&	c #E89788",
"*&	c #D2390D",
"=&	c #DF745D",
"-&	c #D13508",
";&	c #D43F16",
">&	c #DC6348",
",&	c #D44119",
"'&	c #D95436",
")&	c #D5441D",
"!&	c #DA5D42",
"~&	c #DA5E42",
"{&	c #DC674E",
"]&	c #D5451E",
"^&	c #D03005",
"/&	c #E69382",
"(&	c #DF735C",
"_&	c #DA5E43",
":&	c #D64A28",
"<&	c #E3826F",
"[&	c #DF715A",
"}&	c #D64B28",
"|&	c #DA5B3F",
"1&	c #CD2504",
"2&	c #D64C2A",
"3&	c #E38674",
"4&	c #D2380C",
"5&	c #D8502F",
"6&	c #D64C29",
"7&	c #E58F7E",
"8&	c #DD6A50",
"9&	c #E2816E",
"0&	c #D4431B",
"a&	c #D95738",
"b&	c #D54A25",
"c&	c #DE6D56",
"d&	c #D64B29",
"e&	c #DC6950",
"f&	c #D9593A",
"g&	c #D74F2F",
"h&	c #D64D2B",
"i&	c #DB6247",
"j&	c #E58D7C",
"k&	c #DB6147",
"l&	c #DD6D56",
"m&	c #E07B65",
"n&	c #E2806D",
"o&	c #DD6A53",
"p&	c #DB6045",
"q&	c #D95A3E",
"r&	c #D33E14",
"s&	c #E5907F",
"t&	c #D85334",
"u&	c #D03206",
"v&	c #E27F6B",
"w&	c #D33C10",
"x&	c #D85333",
"y&	c #D74D2A",
"z&	c #D64925",
"A&	c #D74F2E",
"B&	c #D54925",
"C&	c #DC674D",
"D&	c #D03105",
"E&	c #DE6E57",
"F&	c #D54620",
"G&	c #E69383",
"H&	c #DE6F58",
"I&	c #D33D14",
"J&	c #DF7661",
"K&	c #E59181",
"L&	c #D95434",
"M&	c #DC6A50",
"N&	c #D03306",
"O&	c #D75131",
"P&	c #E28370",
"Q&	c #D2370B",
"R&	c #E79686",
"S&	c #E69585",
"T&	c #E07A66",
"U&	c #DE7059",
"V&	c #D85233",
"W&	c #E48A78",
"                                                                . + @ # $ % & * = -                                                                                                                                                                             ",
"                                                        ; > , , , , , , , , , , , , , , '                                                                                                                                                                       ",
"                                                  ) , , , , , , , , , , , , , , , , , , , , > !                                                                                                                                                                 ",
"                                            - ~ , , , , , , , , , , , , , , , , , , , , , , , , {                                                                                                                                                               ",
"                                        ] , , , , , ^ / ( _ : < [ } | 1 , , , , , , , , , , , , , , 2                                                                                                                                                           ",
"                                    3 , , , , % 4 5 6 7 7 7 7 7 7 7 7 7 8 9 0 , , , , , , , , , , , , {                                                                                                                                                         ",
"                                a , , , , , 4 b 7 7 7 7 7 7 7 7 7 7 7 7 7 7 c d , , , , , , , , , , , , %                                                                                                                                                       ",
"                              e f , , , ] g 7 7 7 7 7 7 7 7 7 7 7 7 7 7 7 7 7 7 h i , , , , , , , , , , , ,                                                                                                                                                     ",
"                          j k l , , , m n 7 7 7 7 7 7 7 7 7 7 7 7 7 7 7 7 7 7 7 7 7 o p , , , , , , , , , , q                                                                                                                                                   ",
"                        r s t u , , @ 7 7 7 7 7 7 7 7 v w 7 7 7 7 7 7 7 7 7 7 7 7 7 7 x y ' , , , , , , , , , z                                                                                                                                                 ",
"                      A B C D E , , F 7 7 7 7 7 7 7 x G , H 7 7 7 7 7 7 7 7 7 7 7 7 7 7 7 I J K , , , , , , , ,                                                                                                                                                 ",
"                    L M N O P , , Q 7 7 7 7 7 7 7 7 R , , , S 7 7 7 7 7 7 7 7 7 7 7 7 7 7 7 7 7 g T U , , , , , p                                                                                                                                               ",
"                    V W X Y Z , , ` 7 7 7 7 7 7 7 7  ., , , ..+.[ g @.7 7 7 7 7 7 7 7 7 7 7 7 7 7 7 7 #.o $.%.&.,                                                                                                                                               ",
"                  *.=.-.;.>.,., , '.7 7 7 7 7 7 7 7 7 )., , # - !.~.{.4 ].^.7 7 7 7 7 7 7 7 7 7 7 7 7 7 7 7 7 /., i                                                                                                                                             ",
"                (._.:.<.[.}.|., , 1.7 7 7 7 7 7 7 7 7 g , / 2.7 7 n 3.4.5.6.$.7.8.9.7 7 7 7 7 7 7 7 7 7 7 7 3 , , %                                                                                                                                             ",
"                0.a.b.c.d.}.e., , % f.7 7 7 7 7 7 7 7 g.h.7 7 7 7 7 7 7 7 i.j.k.l.6 7 7 7 7 7 7 7 7 7 7 7 '., , , ,                                                                                                                                             ",
"              m.n.o.b.p.q.}.r., , , s.7 7 7 7 7 7 7 7 7 7 7 7 7 7 7 7 7 7 7 7 7 7 7 7 7 7 7 7 7 7 7 7 7 %., , , , , t.                                                                                                                                          ",
"              u.v.b.b.p.w.}.x., , , 2 7 7 7 7 7 7 7 7 7 7 7 7 7 7 7 7 7 7 7 7 7 7 7 7 7 7 7 7 7 7 7 7 k., , , , , , '                                                                                                                                           ",
"            y.z.A.b.b.B.C.}.D., , , , g 7 7 7 7 7 7 7 7 7 7 7 7 7 7 7 7 7 7 7 7 7 7 7 7 7 7 7 7 7 7 E., , , , , , , F.                                                                                                                                          ",
"            G.H.b.b.b.I.J.K.L.M., , , N.7 7 7 7 7 7 7 7 7 7 7 7 7 7 7 7 7 7 7 7 7 7 7 7 7 7 7 7 7 O.F., , , , , , , $                                                                                                                                           ",
"            P.b.b.b.b.Q.R.S.}.T., , , , ` 7 7 7 7 7 7 7 7 7 7 7 7 7 7 7 7 7 7 7 7 7 7 7 7 7 7 7 7 U., , , , , , , , ,                                                                                                                                           ",
"          V.W.A.b.b.b.X.Y.Z.}.}.`., , , , ).7 7 7 7 7 7 7 7 7 7 7 7 7 7 7 7 7 7 7 7 7 7 7 7 7 7  +, , , , , , , , , ,                                                                                                                                           ",
"          .+++b.b.b.b.X.@+#+$+}.%+&+, , , , *+@.7 7 7 7 7 7 7 7 7 7 7 7 7 7 7 7 7 7 7 7 7 7 7 $., , , , , , , , , , ,                                                                                                                                           ",
"          =+-+b.b.b.b.b.;+Y.>+%+}.,+'+, , , , = +.7 7 7 7 7 7 7 7 7 7 7 7 7 7 7 7 7 7 7 7 x )., , , , , , , , , , , ,                                                                                                                                           ",
"          )+b.b.b.b.b.b.b.!+~+{+}.}.]+, , , , , , ^+g.7 7 7 7 7 7 7 7 7 7 7 7 7 7 7 7 7 v + , , , , , , , , , , , , ,                                                                                                                                           ",
"        /+(+b.b.b.b.b.b.b._+:+c.<+}.}.[+}+, , , , , |+1+2+7 7 7 7 7 7 7 7 7 7 7 7 7 3+4+, , , , , , , , , , , , , , ,                                                                                                                                           ",
"        5+)+-+6+7+8+G.9+0+a+b+c+d+e+}.}.f+g+, , , , , , % h+F i+7 7 7 7 7 7 7 7 3.j+|+, , , , , , , , , , , , , , , ,                                                                                                                                           ",
"        k+n.G.l+m+n+o+p+l+q+m+r+s+t+u+v+}.w+x+y+z+A+1.B+, , , > ` C+y D+D+E+F+G+, , , , , , , , , , , , , , , , , , ,                                                                                                                                           ",
"                                      H+                  ) , , , , , , , , , , , , , , , , , , , , , , , , , , , , , 1                                                                                                                                         ",
"                                                            , , , , , , , , , , , , , , , , , , , , , , , , , , , , , I+                                                                                                                                        ",
"                                                            , , , , , , , , , , , , , , , , , , , , , , , , , , , , , 1.                                                                                                                                        ",
"                                                          |+, , , , , , , , , , , , , , , , , , , , , , , , , , , , , J+                                                                                                                                        ",
"                                                        I+, , , , , , , , , , , , , , , , , , , , , , , , , , , , , , ..                                                                                                                                        ",
"                                                        , , , , , , , , , , , , , , , , , , , , , , , , , , , , , , , B+                                                                                                                                        ",
"                                                      , , , , , , , , , , , , , , , , , , , , , , , , , , , , , , , , F.                                                                                                                                        ",
"                                                    K+, , , , , , , , , , , , , , , , , , , , , , , , , , , , , , , , ~                                                                                                                                         ",
"                                                  L+, , , , , , , , , , , , , , , , , , , , , , , , , , , , , , , , , ,                                                                                                                                         ",
"                                                  M+, , , , , , , , , , , , , , , , , , , , , , , , , , , , , , , , , , &.                                                                                                                                      ",
"                                                N+O+@ , , , , , , , , , , , , , , , , , , , , , , , , , , , , , , , , , ,                                                                                                                                       ",
"                                                P+Q+R+, , , , , , , , , , , , , , , , , , , , , , , , , , , , , , , , , , q                                                                                                                                     ",
"                                              S+T+U+V+, , , , , , , , , , , , , , , , , , , , , , , , , , , , , , , , , , , t.                                                                                                                                  ",
"                                            W+X+Y+S+Z+`+, , , , , , , , , , , , , , , , , , , , , , , , , , , , , , , , , , , 2                                                                                                                                 ",
"                                            S+ @Y+ @.@+@@@, , , , , , , , , , , , , , , , , , , , , , , , , , , , , , , , , , , 3                                                                                                                               ",
"                                          #@$@Y+Y+Y+T+%@&@*@=@, , , , , , , , , , , , , , , , , , , , , , , , , , , , , , , , , , q                                                                                                                             ",
"                                           @-@Y+Y+Y+Y+ @S+;@>@,@'@|+, , , , , , , , , , , , , , , , , , , , , , , , , , , , , , , , ,                                                                                                                           ",
"                                          X+Y+Y+Y+Y+Y+Y+Y+T+Y+;@)@S+!@~@, , , , , , , , , , , , , , , , , , , , , , , , , , , , , , , , !                                                                                                                       ",
"                                        .@S+Y+Y+Y+Y+Y+Y+Y+Y+Y+ @ @{@]@U+^@/@, , , , , , , , , , , , , , , , , , , , , , , , , , , , , , , ;                                                                                                                     ",
"                                        S+Y+Y+Y+Y+Y+Y+Y+Y+Y+Y+Y+Y+Y+T+(@>@_@:@<@, , , , , , , , , , , , , , , , , , , , , , , , , , , , , , ^                                                                                                                   ",
"                                        [@Y+Y+Y+Y+Y+Y+Y+Y+Y+Y+Y+Y+Y+Y+Y+T+.@}@|@1@, , , , , , , , , , , , , , , , , , , , , , , , , , , , , , 0                                                                                                                 ",
"                                      2@S+Y+Y+Y+Y+Y+Y+Y+Y+Y+Y+Y+Y+Y+Y+Y+Y+Y+S+3@7 4@{ , , , , , , , , , , , , , , , , , , , , , , , , , , , , , ,                                                                                                               ",
"                                      5@T+Y+Y+Y+Y+Y+Y+Y+Y+Y+Y+Y+Y+Y+Y+Y+Y+Y+Y+ @S+7 6@% , , , , , , , , , , , , , , , , , , , , , , , , , , , , , ,                                                                                                             ",
"                                      T+Y+Y+Y+Y+Y+Y+Y+Y+Y+Y+Y+Y+Y+Y+Y+Y+Y+Y+Y+Y+Y+S+7 7@, , , , , , , , , , , , , , , , , , , , , , , , , , , , , , ,                                                                                                           ",
"                                      V+Y+Y+Y+Y+Y+Y+Y+Y+Y+Y+Y+Y+Y+Y+Y+Y+Y+Y+Y+Y+Y+ @8@.@9@, , , , , , , , , , , , , , , , , , , , , , , , , , , , , , ,                                                                                                         ",
"                                    #@S+Y+Y+Y+Y+Y+Y+Y+Y+Y+Y+Y+Y+Y+Y+Y+Y+Y+Y+Y+Y+Y+Y+T+0@a@, , , , , , , , , , , , , , , , , , , , , , , , , , , , , , , ,                                                                                                       ",
"                                    b@S+Y+Y+Y+Y+Y+Y+Y+Y+Y+Y+Y+Y+Y+Y+Y+Y+Y+Y+Y+Y+Y+Y+ @c@!@, , , , , , , , , , , , , , , , , , , , , , , , , , , , , , , , ,                                                                                                     ",
"                                    %@T+Y+Y+Y+Y+Y+Y+Y+Y+Y+Y+Y+Y+Y+Y+Y+Y+Y+Y+Y+Y+Y+Y+Y+d@e@, , , , , , , , , , , , , , , , , , , , , , , , , , , , , , , , , ,                                                                                                   ",
"                                    f@ @Y+Y+Y+Y+Y+Y+Y+Y+Y+Y+Y+Y+Y+Y+Y+Y+Y+Y+Y+Y+Y+Y+Y+g@h@, , , , , , , , , , , , , , , , , , , , , , , , , , , , , , , , , , i@                                                                                                ",
"                                    .@ @Y+Y+Y+Y+Y+Y+Y+Y+Y+Y+Y+Y+Y+Y+Y+Y+Y+Y+Y+Y+Y+Y+Y+j@k@, , , , , , , , , , , , , , , , , , , , , , , , , , , , , , , , , , , p                                                                                               ",
"                                    %@V+Y+Y+Y+Y+Y+Y+Y+Y+Y+Y+Y+Y+Y+Y+Y+Y+Y+Y+Y+l@l@m@n@o@p@, , , , , , , , , , , , , , , , , , , , , , , , , , , , , , , , , , , , q@                                                                                            ",
"                                    #@S+Y+Y+Y+Y+Y+Y+Y+Y+Y+Y+Y+Y+Y+Y+Y+Y+Y+Y+Y+l@r@s@t@u@v@w@x@y@z@, , , , , , , , , , , , , , , , , , , , , , , , , , , , , , , , ,                                                                                             ",
"                                      S+Y+Y+Y+Y+Y+Y+Y+Y+Y+Y+Y+Y+Y+Y+Y+Y+Y+Y+Y+A@B@C@D@E@F@L.}.}.G@H@I@, , , , , , , , , , , , , , , , , , , , , , , , , , , , , , , ,                                                                                           ",
"                                      T+Y+Y+Y+Y+Y+Y+Y+Y+Y+Y+Y+Y+Y+Y+Y+Y+Y+Y+J@K@L@M@N@N@N@N@O@O@P@}.}.Q@R@, , , , , , , , , , , , , , , , , , , , , , , , , , , , , , {                                                                                         ",
"                                       @ @Y+Y+Y+Y+Y+Y+Y+Y+Y+Y+Y+Y+Y+Y+Y+Y+Y+S@T@U@D@N@N@N@N@N@N@N@V@N@L.}.W@X@, , , , , , , , , , , , , , , , , , , , , , , , , , , , , Y@                                                                                      ",
"                                      Z@V+Y+Y+Y+Y+Y+Y+Y+Y+Y+Y+Y+Y+Y+Y+Y+Y+Y+l@`@ #D@N@N@N@N@N@N@N@N@N@V@D@}..#+#, , , , , , , , , , , , , , , , , , , , , , , , , , , , ,                                                                                       ",
"                                      b@@#Y+Y+Y+Y+Y+Y+Y+Y+Y+Y+Y+Y+Y+Y+Y+Y+Y+Y+##$#N@D@N@N@N@N@N@N@N@N@N@N@E@%#}.&#*#, , , , , , , , , , , , , , , , , , , , , , , , , , , q@                                                                                    ",
"                                        S+Y+Y+Y+Y+Y+Y+Y+Y+Y+Y+Y+Y+Y+Y+Y+Y+Y+Y+Y+`@=#D@N@N@N@N@N@N@N@N@N@N@N@V@N@}.-#;#, , , , , , , , , , , , , , , , , , , , , , , , , , ,                                                                                     ",
"                                        Y+T+Y+Y+Y+Y+Y+Y+Y+Y+Y+Y+Y+Y+Y+Y+Y+Y+Y+l@>#,#D@N@N@N@N@N@N@N@N@N@N@N@N@N@E@>.}.'#)#, , , , , , , , , , , , , , , , , , , , , , , , , !#                                                                                  ",
"                                        ~#X+Y+Y+Y+Y+Y+Y+Y+Y+Y+Y+Y+Y+Y+Y+Y+Y+Y+Y+Y+{#]#D@N@N@N@N@N@N@N@N@N@N@N@N@N@E@^#}./#(#, , , , , , , , , , , , , , , , , , , , , , , , ,                                                                                   ",
"                                          [@Y+Y+Y+Y+Y+Y+Y+Y+Y+Y+Y+Y+Y+Y+Y+Y+Y+Y+l@_#:#<#D@N@N@N@N@N@N@N@N@N@N@N@N@N@O@E@>.}.[#}#|#, , , , , , , , , , , , , , , , , , , , , , ,                                                                                 ",
"                                          .@@#Y+Y+Y+Y+Y+Y+Y+Y+Y+Y+Y+Y+Y+Y+Y+Y+Y+Y+1#2#3#D@D@N@N@N@N@N@N@N@N@N@N@N@N@N@N@V@O@4#}.5#6#7#8#9#0#a#b#c#d#e#, , , , , , , , , , , , , f#                                                                              ",
"                                            g#Y+Y+Y+Y+Y+Y+Y+Y+Y+Y+Y+Y+Y+Y+Y+Y+Y+Y+Y+h#{#i#D@D@N@N@N@N@N@N@N@N@N@N@N@N@N@N@N@O@N@v+j#L.}.}.}.}.}.}.k#5#l#m#n#o#, , , , , , , , , , =@                                                                            ",
"                                            Z@S+Y+Y+Y+Y+Y+Y+Y+Y+Y+Y+Y+Y+Y+Y+Y+Y+Y+Y+l@l@{#p#q#D@N@N@N@N@N@N@N@N@N@N@N@N@N@N@N@N@N@N@N@N@N@N@N@N@N@M@v+K.}.}.r#s#t#u#, , , , , , , ,                                                                             ",
"                                              X+Y+Y+Y+Y+Y+Y+Y+Y+Y+Y+Y+Y+Y+Y+Y+Y+Y+Y+Y+l@h#v#l@w#D@N@N@N@N@N@N@N@N@N@N@N@N@N@N@N@N@N@N@N@N@N@N@N@N@N@N@N@O@N@x#}.}.y#z#A#, , , , , , ,                                                                           ",
"                                              %@X+Y+Y+Y+Y+Y+Y+Y+Y+Y+Y+Y+Y+Y+Y+Y+Y+Y+Y+Y+Y+1#n@B#C#D@N@N@N@N@N@N@N@N@N@N@N@N@N@N@N@N@N@N@N@N@N@N@N@N@N@N@N@N@N@O@N@D#}.E#F#G#H#, , , , ,                                                                         ",
"                                                [@ @Y+Y+Y+Y+Y+Y+Y+Y+Y+Y+Y+Y+Y+Y+Y+Y+Y+Y+Y+Y+1#2#h#I#D@N@N@N@N@N@N@N@N@N@N@N@N@N@N@N@N@N@N@N@N@N@N@N@N@N@N@N@N@N@N@N@V@J#K#}.F@l#L#M#o#, N#                                                                      ",
"                                                (@O#Y+Y+Y+Y+Y+Y+Y+Y+Y+Y+Y+Y+Y+Y+Y+Y+Y+Y+Y+Y+Y+P#{#3#D@D@N@N@N@N@N@N@N@N@N@N@N@N@N@N@N@N@N@N@N@N@N@N@N@N@N@N@N@N@N@N@N@N@O@O@P@K.}.}.Q#R#S#T#                                                                    ",
"                                                  5@[@Y+Y+Y+Y+Y+Y+Y+Y+Y+Y+Y+Y+Y+Y+Y+Y+Y+Y+Y+Y+Y+l@U#V#D@N@N@N@N@N@N@N@N@N@N@N@N@N@N@N@N@N@N@N@N@N@N@N@N@N@N@N@N@N@N@N@N@N@N@N@N@O@D@x#L.}.W#X#Y#                                                                ",
"                                                    Z# @Y+Y+Y+Y+Y+Y+Y+Y+Y+Y+Y+Y+Y+Y+Y+Y+Y+Y+Y+Y+l@`#{# $D@N@N@N@N@N@N@N@N@N@N@N@N@N@N@N@N@N@N@N@N@N@N@N@N@N@N@N@N@N@N@N@N@N@N@N@N@N@N@N@N@.$J#D E@O@+$@$                                                        ",
"                                                      P+Y+Y+Y+Y+Y+Y+Y+Y+Y+Y+Y+Y+Y+Y+Y+Y+Y+Y+Y+Y+Y+h##$$$<#D@N@N@N@N@N@N@N@N@N@N@N@N@N@N@N@N@N@N@N@N@N@N@N@N@N@N@N@N@N@N@N@N@N@N@N@N@N@N@N@N@N@N@N@O@V@E@E@N@%$&$                                                ",
"                                                      f@X+5@Y+Y+Y+Y+Y+Y+Y+Y+Y+Y+Y+Y+Y+Y+Y+Y+Y+Y+Y+Y+P#*$=$D@N@N@N@N@N@N@N@N@N@N@N@N@N@N@N@N@N@N@N@N@N@N@N@N@N@N@N@N@N@N@N@N@N@N@N@N@N@N@N@N@N@N@N@N@N@N@N@O@V@E@E@C@-$;$                                        ",
"                                                        >$[@5@Y+Y+Y+Y+Y+Y+Y+Y+Y+Y+Y+Y+Y+Y+Y+Y+Y+Y+Y+l@,$'$)$D@N@N@N@N@N@N@N@N@N@N@N@N@N@N@N@N@N@N@N@N@N@N@N@N@N@N@N@N@N@N@N@N@N@N@N@N@N@N@N@N@N@N@N@N@N@N@N@N@N@N@O@E@E@V@!$~$                                  ",
"                                                          Y+T+Y+Y+Y+Y+Y+Y+Y+Y+Y+Y+Y+Y+Y+Y+Y+Y+Y+Y+Y+Y+h#{#{$D@N@N@N@N@N@N@N@N@N@N@N@N@N@N@N@N@N@N@N@N@N@N@N@N@N@N@N@N@N@N@N@N@N@N@N@N@N@N@N@N@N@N@N@N@N@N@N@N@N@N@N@N@N@N@V@E@V@]$                              ",
"                                                            X+T+Y+Y+Y+Y+Y+Y+Y+Y+Y+Y+Y+Y+Y+Y+Y+Y+Y+Y+Y+Y+^$J@/$D@N@N@N@N@N@N@N@N@N@N@N@N@N@N@N@N@N@N@N@N@N@N@N@N@N@N@N@N@N@N@N@N@N@N@N@N@N@N@N@N@N@N@N@N@N@N@N@N@N@N@N@N@N@N@N@O@E@E@($~$                        ",
"                                                              Y+V+Y+Y+Y+Y+Y+Y+Y+Y+Y+Y+Y+Y+Y+Y+Y+Y+Y+Y+Y+l@_$U@D@N@N@N@N@N@N@N@N@N@N@N@N@N@N@N@N@N@N@N@N@N@N@N@N@N@N@N@N@N@N@N@N@N@N@N@N@N@N@N@N@N@N@N@N@N@N@N@N@N@N@N@N@N@N@N@N@N@N@V@E@O@-$                    ",
"                                                                Y+S+Y+Y+Y+Y+Y+Y+Y+Y+Y+Y+Y+Y+Y+Y+Y+Y+Y+Y+l@`@:$D@N@N@N@N@N@N@N@N@N@N@N@N@N@N@N@N@N@N@N@N@N@N@N@N@N@N@N@N@N@N@N@N@N@N@N@N@N@N@N@N@N@N@N@N@N@N@N@N@N@N@N@N@N@N@N@N@N@N@N@N@O@E@E@($                ",
"                                                                  Y+S+Y+Y+Y+Y+Y+Y+Y+Y+Y+Y+Y+Y+Y+Y+Y+Y+Y+Y+<$[$N@D@N@N@N@N@N@N@N@N@N@N@N@N@N@N@N@N@N@N@N@N@N@N@N@N@N@N@N@N@N@N@N@N@N@N@N@N@N@N@N@N@N@N@N@N@N@N@N@N@N@N@N@N@N@N@N@N@N@N@N@N@N@N@V@E@}$            ",
"                                                                    %@S+ @Y+Y+Y+Y+Y+Y+Y+Y+Y+Y+Y+Y+Y+Y+Y+Y+Y+|$1$D@N@N@N@N@N@N@N@N@N@N@N@N@N@N@N@N@N@N@N@N@N@N@N@N@N@N@N@N@N@N@N@N@N@N@N@N@N@N@N@N@N@N@N@N@N@N@N@N@N@N@N@N@N@N@N@N@N@N@N@N@N@N@N@D@D D           ",
"                                                                        T+T+Y+Y+Y+Y+Y+Y+Y+Y+Y+Y+Y+Y+Y+Y+Y+l@2$3$D@D@N@N@N@N@N@N@N@N@N@N@N@N@N@N@N@N@N@N@N@N@N@N@N@N@N@N@N@N@N@N@N@N@N@N@N@N@N@N@N@N@N@N@N@N@N@N@N@N@N@N@N@N@N@N@N@N@N@N@N@N@N@O@E@E@            ",
"                                                                          Z@S+ @Y+Y+Y+Y+Y+Y+Y+Y+Y+Y+Y+Y+Y+Y+h#{#4$D@N@N@N@N@N@N@N@N@N@N@N@N@N@N@N@N@N@N@N@N@N@N@N@N@N@N@N@N@N@N@N@N@N@N@N@N@N@N@N@N@N@N@N@N@N@N@N@N@N@N@N@N@N@N@N@N@N@N@O@E@E@V@5$              ",
"                                                                               @T+Y+Y+Y+Y+Y+Y+Y+Y+Y+Y+Y+Y+Y+l@:#`@6$D@N@N@N@N@N@N@N@N@N@N@N@N@N@N@N@N@N@N@N@N@N@N@N@N@N@N@N@N@N@N@N@N@N@N@N@N@N@N@N@N@N@N@N@N@N@N@N@N@N@O@V@V@V@E@E@E@V@7$-$                    ",
"                                                                                Z@S+T+Y+Y+Y+Y+Y+Y+Y+Y+Y+Y+Y+Y+P#8$B#<#D@N@N@N@N@N@N@N@N@N@N@N@N@N@N@N@N@N@N@N@N@N@N@N@N@N@N@N@N@N@N@N@N@N@N@N@N@N@N@N@N@N@N@N@N@N@N@7$N@O@9$($0$a$b$                            ",
"                                                                                    5@S+ @Y+Y+Y+Y+Y+Y+Y+Y+Y+Y+Y+P#{#c$D@N@N@N@N@N@N@N@N@N@N@N@N@N@N@N@N@N@N@N@N@N@N@N@N@N@N@N@N@N@N@N@N@N@N@N@N@N@N@N@N@N@N@N@N@N@O@($                                          ",
"                                                                                         @S+Y+Y+Y+Y+Y+Y+Y+Y+Y+Y+Y+J@{#d$D@N@N@N@N@N@N@N@N@N@N@N@N@N@N@N@N@N@N@N@N@N@N@N@N@N@N@N@N@N@N@N@N@N@N@N@N@N@N@N@N@N@N@N@N@N@V@e$f$                                      ",
"                                                                                          .@T+T+Y+Y+Y+Y+Y+Y+Y+Y+Y+h#g$_#h$D@N@N@N@N@N@N@N@N@N@N@N@N@N@N@N@N@N@N@N@N@N@N@N@N@N@N@N@N@N@N@N@N@N@N@N@N@N@N@N@N@N@N@N@N@N@O@E@N@i$j$                                ",
"                                                                                               @S+Y+Y+Y+Y+Y+Y+Y+Y+Y+1#k$P#l$D@N@N@N@N@N@N@N@N@N@N@N@N@N@N@N@N@N@N@N@N@N@N@N@N@N@N@N@N@N@N@N@N@N@N@N@N@N@N@N@N@N@N@N@N@N@N@O@V@E@V@m$n$                          ",
"                                                                                                f@[@Y+Y+Y+Y+Y+Y+Y+Y+Y+1#n@o$h$D@N@N@N@N@N@N@N@N@N@N@N@N@N@N@N@N@N@N@N@N@N@N@N@N@N@N@N@N@N@N@N@N@N@N@N@N@N@N@N@N@N@N@N@N@N@N@N@N@N@O@E@E@O@0$                    ",
"                                                                                                  S+S+Y+Y+Y+Y+Y+Y+Y+Y+Y+P#p$:#q$D@D@D@N@N@N@N@N@N@N@N@N@N@N@N@N@N@N@N@N@N@N@N@N@N@N@N@N@N@N@N@N@N@N@N@N@N@N@N@N@N@N@N@N@N@N@N@N@N@N@N@N@O@V@E@r$s$              ",
"                                                                                                    l@X+5@Y+Y+Y+Y+Y+Y+Y+Y+1#_#t$u$v$w$D@D@D@D@D@N@N@N@N@N@N@N@N@N@N@N@N@N@N@N@N@N@N@N@N@N@N@N@N@N@N@N@N@N@N@N@N@N@N@N@N@N@N@N@N@N@N@N@N@N@N@N@O@E@E@x$          ",
"                                                                                                      5@X+5@Y+Y+Y+Y+ @y$z$A$B$C$D$E$h#F$G$v$H$I$D@D@D@D@D@D@N@N@N@N@N@N@N@N@N@N@N@N@N@N@N@N@N@N@N@N@N@N@N@N@N@N@N@N@N@N@N@N@N@N@N@N@N@N@N@N@N@N@N@V@J$K$        ",
"                                                                                                        T+@#Y+Y+Y+L$M$N$O$P$Q$R$S$T$U$>#2#>#V$W$X$Y$Z$`$ %.%D@D@D@D@D@D@D@D@N@N@N@N@N@N@N@N@N@N@N@N@N@N@N@N@N@N@N@N@N@N@N@N@N@N@N@N@N@N@N@N@N@N@N@N@E@V@        ",
"                                                                                                          [@S+5@+%@%    #%$%      %%l@T+&%*%=%-%;%>%,%K@'%)%!%~%{%]%^%/%(%N@D@D@D@D@D@D@D@D@D@N@N@N@N@N@N@N@O@O@O@V@E@V@V@V@V@E@E@V@V@O@O@N@O@V@E@E@($          ",
"                                                                                                            @#+%_%    :%<%[%}%|%    1%2%          3%4%5%:#6%K@D$7%p$K@8%h#9%0%a%{%Z$b%c%H$(%I$N@D@D@D@N@V@O@N@O@C@($&$        d%@$e%f%7$C@N@C@%$g%              ",
"                                                                                                                    h%i%b.j%k%l%  m%n%  o%p%q%r%s%  t%@#Y+Y+Y+Y+Y+u%J@B#8%m@v%w%7%n@x%_#'%l@y%z%0%A%B%C%D%                                                      ",
"                                                                                                                  E%P.o.A.G.F%    G%  H%I%0+b.J%K%  t%V+ @ @T+T+T+ @ @Y+Y+Y+Y+Y+Y+u%S@J@:#8%L%M%N%r@O%                                                          ",
"                                                                                                                  P%b.A.b.Q%R%      S%T%j%A.p+U%              V%.@Z@Y+Y+-@ @T+S+-@-@V+ @T+T+l@.@                                                                ",
"                                                                                                                H.W%o.A.X%Y%        Z%`%A.a. &.&                              +&2@.@%@Z@                                                                        ",
"                                                                                                              @&X%:.#&$&%&        &&*&j%:.0.=&                                                                                                                  ",
"                                                                                                              -&a.#&;&>&          ,&p+9+n.'&                                                                                                                    ",
"                                                                                                            )&++!&(+W           b.(+~&=.z.                                                                                                                      ",
"                                                                                                    a.j%  {&]&o+J%a.          !&n.#&W n.                                                                                                                        ",
"                                                                                                q+^&I%/&(&)&_&:&v.  <&#&[&m+}&}&|&k+J%[&                                                                                                                        ",
"                                                                                              ~&1&a.  Y%(+b.0+2&  3&4&5&6&7+W A.b.A.,&7&                                                                                                                        ",
"                                                                                              l+8&  9&0&a.:.*&     &A.b.b.b.b.b.b.a&b&                                                                                                                          ",
"                                                                                                  c&u.A.A.d&e&  f&g&A.b.b.b.b.b.b.h&i&                                                                                                                          ",
"                                                                    j&J%k&l&m&<&          n&o&p&H.}&o.b.q&r&  s&I%:.b.b.b.b.k+b.t&u&9&                                                                                                                          ",
"                                                                  v&w&x&6+y&W%z&7+W%G.A&}&B&:&p+a.A.b.o.n.V.  ]&a.b.b.A.b.p+W%a+-+m.                                                                                                                            ",
"                                                                C&r&G.q&b.b.b.b.b.a.b.a.a.b.b.b.b.A.A.}&z.  e&D&++:.x&)+J%q&E&                                                                                                                                  ",
"                                                            V.a+F&q&A.b.b.b.b.b.b.b.b.b.b.b.b.A.W W%u.a&    ++G&H&I&a.J&                                                                                                                                        ",
"                                                        K&x&z.L&j%b.b.b.b.b.b.b.b.b.b.b.b.b.:.6+F&M&                                                                                                                                                            ",
"                                                      N&X%p+o.b.b.b.b.b.b.b.b.b.b.b.b.b.b.A.p+O&                                                                                                                                                                ",
"                                                      P&)&B&o.k+b.b.b.b.b.b.b.b.b.b.b.b.b.|&Q&R&                                                                                                                                                                ",
"                                                          j%;&W j%b.b.b.b.b.A.a.7+f&a+;&}&J%b.                                                                                                                                                                  ",
"                                                            P&O&a&b.b.b.A.A.d&(+e&j%Y%S&T&7+                                                                                                                                                                    ",
"                                                              [&B&b.b.A.A&z._&                                                                                                                                                                                  ",
"                                                              U&2&o.6+z.k%                                                                                                                                                                                      ",
"                                                              e&B&,&V&W&                                                                                                                                                                                        ",
"                                                              ++n.P&                                                                                                                                                                                            ",
"                                                              y.                                                                                                                                                                                                "};
