// =============================================================================
// Scilab ( http://www.scilab.org/ ) - This file is part of Scilab
// Copyright (C) 2008 - INRIA
//
//  This file is distributed under the same license as the Scilab package.
// =============================================================================
//type
if type(1)<>1 then bugmes();quit;end
a=%s;if type(a)<>2  then bugmes();quit;end
