// =============================================================================
// Scilab ( http://www.scilab.org/ ) - This file is part of Scilab
// Copyright (C) 2009 - DIGITEO - Allan CORNET
//
//  This file is distributed under the same license as the Scilab package.
// =============================================================================
// <-- JVM NOT MANDATORY -->
[n,d]=rat(%pi);
if n <> 355 then bugmes();quit;end
if d <> 113 then bugmes();quit;end
[n,d]=rat(%pi,1.d-12);
if n <> 1146408 then bugmes();quit;end
if d <> 364913 then bugmes();quit;end
