// =============================================================================
// Scilab ( http://www.scilab.org/ ) - This file is part of Scilab
// Copyright (C) 2004-2008 - INRIA Allan CORNET
//
//  This file is distributed under the same license as the Scilab package.
// =============================================================================
java_file_to_test = "Boolean.java";
my_test_path = pathconvert(SCI+"/modules/javasci/tests/unit_tests",%f,%f);
my_file_path = pathconvert(my_test_path+"/"+java_file_to_test,%f,%f);
exec (my_test_path+"/test_java.sci",-1);
if test_java(my_file_path) <> %T then bugmes();quit;end;
 
!----------------------------------------------------  !
!                                                      !
!boolean A=                                            !
!                                                      !
!                                                      !
!                                                      !
!  T                                                   !
!                                                      !
!----------------------------------------------------  !
!                                                      !
!true                                                  !
!                                                      !
!----------------------------------------------------  !
!                                                      !
!boolean P=                                            !
!                                                      !
!                                                      !
!                                                      !
!  F                                                   !
!                                                      !
!----------------------------------------------------  !
!                                                      !
!false                                                 !
