// =============================================================================
// Scilab ( http://www.scilab.org/ ) - This file is part of Scilab
// Copyright (C) ????-2008 - INRIA - Vincent COUVERT <vincent.couvert@inria.fr>
// Copyright (C) 2005-2008 - INRIA - Pierre MARECHAL <pierre.marechal@inria.fr>
//
//  This file is distributed under the same license as the Scilab package.
// =============================================================================
// <-- JVM NOT MANDATORY -->
// <-- ENGLISH IMPOSED -->
// <-- Non-regression test for bug 853 -->
//
// <-- Bugzilla URL -->
// http://bugzilla.scilab.org/show_bug.cgi?id=853
//
// <-- Short Description -->
//    Error with the m2sci on personnal function :
//
//    function CORPABOT_vJuin04
//
//    % COntinuous Reltaive Phase Analyser Based On the Tangeant
//    (CO.R.P.A.B.O.T.)
//    % Salesse Robin UMR6152 June 17th 2004
//
//
//
//
//    %%%%%%%%%%%%%%%%%%%%%%%%%%%%%%%%%%%%%%%%%%%%%%%%%%%%%%%%%%%%%%%%%%
//    % Nettoyage du workspace
//    clear all;
//
//    % Nettoyage du Command Window
//    clc;
//
//    tic;
// ...
MFILECONTENTS=["dir_name=''path'';";
"dir_target=dir(dir_name);";
"for i=1:10";
"  RC(i)=[dir_name,''\'',dir_target(i).name];";
"end"]
 MFILECONTENTS  =
 
!dir_name='path';                            !
!                                            !
!dir_target=dir(dir_name);                   !
!                                            !
!for i=1:10                                  !
!                                            !
!  RC(i)=[dir_name,'\',dir_target(i).name];  !
!                                            !
!end                                         !
MFILE=TMPDIR+"/bug853.m"
 MFILE  =
 
 TMPDIR/bug853.m   
SCIFILE=TMPDIR+"/bug853.sci"
 SCIFILE  =
 
 TMPDIR/bug853.sci   
mputl(MFILECONTENTS,MFILE);
mfile2sci(MFILE,TMPDIR);
  ****** Beginning of mfile2sci() session ******
  File to convert: TMPDIR/bug853.m
  Result file path: TMPDIR/
  Recursive mode: OFF
  Only double values used in M-file: NO
  Verbose mode: 3
  Generate formated code: NO
  M-file reading...
  M-file reading: Done
  Syntax modification...
  Syntax modification: Done
  Macro to tree conversion...
  Conversion of M-tree...
  Conversion of M-tree: Done
  Macro to tree conversion: Done
  ****** End of mfile2sci() session ******
SCIFILECONTENTS=mgetl(SCIFILE);
SCIFILECONTENTSREF=["";
		"// Display mode";
		"mode(0);";
		"";
		"// Display warning for floating point exception";
		"ieee(1);";
		"";
		"dir_name = ""path"";";
		"dir_target = mtlb_dir(dir_name);";
		"for i = 1:10";
		"  RC(1,i) = dir_name+""\""+dir_target(i).name;";
		"end;"]
 SCIFILECONTENTSREF  =
 
!                                                 !
!                                                 !
!// Display mode                                  !
!                                                 !
!mode(0);                                         !
!                                                 !
!                                                 !
!                                                 !
!// Display warning for floating point exception  !
!                                                 !
!ieee(1);                                         !
!                                                 !
!                                                 !
!                                                 !
!dir_name = "path";                               !
!                                                 !
!dir_target = mtlb_dir(dir_name);                 !
!                                                 !
!for i = 1:10                                     !
!                                                 !
!  RC(1,i) = dir_name+"\"+dir_target(i).name;     !
!                                                 !
!end;                                             !
if or(SCIFILECONTENTSREF<>SCIFILECONTENTS) then bugmes();quit;end
