// =============================================================================
// Scilab ( http://www.scilab.org/ ) - This file is part of Scilab
// Copyright (C) 2009 - DIGITEO - Pierre MARECHAL <pierre.marechal@scilab.org>
//
//  This file is distributed under the same license as the Scilab package.
// =============================================================================
// <-- JVM NOT MANDATORY -->
load("SCI/modules/atoms/macros/atoms_internals/lib");
// Do not use the autoload system
config_autoload = atomsGetConfig("autoloadAddAfterInstall");
config_Verbose  = atomsGetConfig("Verbose");
atomsSetConfig("autoloadAddAfterInstall","False");
atomsSetConfig("Verbose" ,"False");
// Load the 2nd scenario : See scene2.test.atoms.scilab.org.txt
// =============================================================================
atomsRepositorySetOfl("http://scene2.test.atoms.scilab.org");
atomsSystemUpdate();
// Install toolbox N°2
atomsInstall(["toolbox_2","2.0";"toolbox_2","2.1"],"user");
// Check input parameters
if execstr("atomsIsInstalled()","errcatch") == 0 then bugmes();quit;end
if execstr("atomsIsInstalled([""toolbox_1"",""1.0"";""toolbox_2"",""2.0""],[""1.0"";""2.0""]  )","errcatch") == 0 then bugmes();quit;end
// Check output results
if ~ atomsIsInstalled("toolbox_1") then bugmes();quit;end
if ~ atomsIsInstalled("toolbox_2") then bugmes();quit;end
if ~ atomsIsInstalled(["toolbox_1","1.0"]) then bugmes();quit;end
if ~ atomsIsInstalled(["toolbox_2","2.0"]) then bugmes();quit;end
if ~ atomsIsInstalled(["toolbox_2","2.1"]) then bugmes();quit;end
if atomsIsInstalled(["toolbox_1","1.0"],"allusers") then bugmes();quit;end
if atomsIsInstalled(["toolbox_2","2.0"],"allusers") then bugmes();quit;end
if atomsIsInstalled(["toolbox_2","2.1"],"allusers") then bugmes();quit;end
if ~ atomsIsInstalled(["toolbox_1","1.0"],"user") then bugmes();quit;end
if ~ atomsIsInstalled(["toolbox_2","2.0"],"user") then bugmes();quit;end
if ~ atomsIsInstalled(["toolbox_2","2.1"],"user") then bugmes();quit;end
if ~ atomsIsInstalled(["toolbox_1","1.0"],"all") then bugmes();quit;end
if ~ atomsIsInstalled(["toolbox_2","2.0"],"all") then bugmes();quit;end
if ~ atomsIsInstalled(["toolbox_2","2.1"],"all") then bugmes();quit;end
if or( atomsIsInstalled(["toolbox_1","1.0";"toolbox_2","0.0";"toolbox_2","2.1";"toolbox_99","1.0"]) <> [%T;%F;%T;%F] )  then bugmes();quit;end
A = ["toolbox_1","1.0" "allusers" ;
	 "toolbox_2","2.0" "allusers" ;
	 "toolbox_2","2.1" "allusers" ;
	 "toolbox_1","1.0" "user"     ;
	 "toolbox_2","2.0" "user"     ;
	 "toolbox_2","2.1" "user"     ;
	 "toolbox_1","1.0" "all"      ;
	 "toolbox_2","2.0" "all"      ;
	 "toolbox_2","2.1" "all"      ;
	 "toolbox_1","1.0" ""         ;
	 "toolbox_2","2.0" ""         ;
	 "toolbox_2","2.1" ""         ];
if or( atomsIsInstalled(A,"all")      <> [ %F ; %F ; %F ; %T ; %T ; %T ; %T ; %T ; %T ; %T ; %T ; %T ]) then bugmes();quit;end
if or( atomsIsInstalled(A,"user")     <> [ %F ; %F ; %F ; %T ; %T ; %T ; %T ; %T ; %T ; %T ; %T ; %T ]) then bugmes();quit;end
if or( atomsIsInstalled(A,"allusers") <> [ %F ; %F ; %F ; %F ; %F ; %F ; %F ; %F ; %F ; %F ; %F ; %F ]) then bugmes();quit;end
// Remove toolbox_5 & toolbox_3
// =============================================================================
atomsRemove("toolbox_2","user");
// no module should be installed
if ~isempty( atomsGetInstalled() ) then bugmes();quit;end
// Restore original values
// =============================================================================
atomsSetConfig("autoloadAddAfterInstall",config_autoload);
atomsSetConfig("Verbose" ,config_Verbose);
atomsRepositorySetOfl("http://atoms.scilab.org");
