// Copyright (C) 2012 - Michael Baudin
//
// This file must be used under the terms of the CeCILL.
// This source file is licensed as described in the file COPYING, which
// you should have received as part of this distribution.  The terms
// are also available at
// http://www.cecill.info/licences/Licence_CeCILL_V2-en.txt
// <-- JVM NOT MANDATORY -->
k = 3;
s = 2;
d = 2;
values = randnum_combinesumk(k,s,d)
 values  =
 
    0.    2.  
    1.    1.  
    2.    0.  
expected = [
    0.    2.  
    1.    1.  
    2.    0.  
];
assert_checkequal(values,expected);
//
k = 3;
s = 2;
d = 3;
values = randnum_combinesumk(k,s,d);
expected = [
    0.    0.    2.  
    0.    1.    1.  
    0.    2.    0.  
    1.    0.    1.  
    1.    1.    0.  
    2.    0.    0.  
];
assert_checkequal(values,expected);
//
k = 3;
s = 2;
d = 4;
values = randnum_combinesumk(k,s,d);
expected = [
    0.    0.    0.    2.  
    0.    0.    1.    1.  
    0.    0.    2.    0.  
    0.    1.    0.    1.  
    0.    1.    1.    0.  
    0.    2.    0.    0.  
    1.    0.    0.    1.  
    1.    0.    1.    0.  
    1.    1.    0.    0.  
    2.    0.    0.    0.  
];
assert_checkequal(values,expected);
//
k = 2;
s = 3;
d = 4;
values = randnum_combinesumk(k,s,d);
expected = [
    0.    0.    1.    2.  
    0.    0.    2.    1.  
    0.    1.    0.    2.  
    0.    1.    1.    1.  
    0.    1.    2.    0.  
    0.    2.    0.    1.  
    0.    2.    1.    0.  
    1.    0.    0.    2.  
    1.    0.    1.    1.  
    1.    0.    2.    0.  
    1.    1.    0.    1.  
    1.    1.    1.    0.  
    1.    2.    0.    0.  
    2.    0.    0.    1.  
    2.    0.    1.    0.  
    2.    1.    0.    0.  
];
assert_checkequal(values,expected);
//
k = 2;
s = 3;
d = 2;
values = randnum_combinesumk(k,s,d);
expected = [
    1.    2.  
    2.    1.  
];
assert_checkequal(values,expected);
//
k = 2;
s = 3;
d = 3;
values = randnum_combinesumk(k,s,d);
expected = [
    0.    1.    2.  
    0.    2.    1.  
    1.    0.    2.  
    1.    1.    1.  
    1.    2.    0.  
    2.    0.    1.  
    2.    1.    0.  
];
assert_checkequal(values,expected);
//
k = 2;
d = 3;
for s = 0 : k
    values = randnum_combinesumk(k,s,d);
    mprintf("#{%d-uplets which sum to %d}=%d\n",..
    d,s,size(values,"r"))
end
#{3-uplets which sum to 0}=1
#{3-uplets which sum to 1}=3
#{3-uplets which sum to 2}=6
//
k = 20;
d = 3;
for s = 0 : k
    values = randnum_combinesumk(k,s,d);
    mprintf("#{%d-uplets which sum to %d}=%d\n",..
    d,s,size(values,"r"))
end
#{3-uplets which sum to 0}=1
#{3-uplets which sum to 1}=3
#{3-uplets which sum to 2}=6
#{3-uplets which sum to 3}=10
#{3-uplets which sum to 4}=15
#{3-uplets which sum to 5}=21
#{3-uplets which sum to 6}=28
#{3-uplets which sum to 7}=36
#{3-uplets which sum to 8}=45
#{3-uplets which sum to 9}=55
#{3-uplets which sum to 10}=66
#{3-uplets which sum to 11}=78
#{3-uplets which sum to 12}=91
#{3-uplets which sum to 13}=105
#{3-uplets which sum to 14}=120
#{3-uplets which sum to 15}=136
#{3-uplets which sum to 16}=153
#{3-uplets which sum to 17}=171
#{3-uplets which sum to 18}=190
#{3-uplets which sum to 19}=210
#{3-uplets which sum to 20}=231
