// Copyright (C) 2012 - Michael Baudin
//
// This file must be used under the terms of the CeCILL.
// This source file is licensed as described in the file COPYING, which
// you should have received as part of this distribution.  The terms
// are also available at
// http://www.cecill.info/licences/Licence_CeCILL_V2-en.txt
// <-- JVM NOT MANDATORY -->
//
seed = 1.;
[ value , seed ] = randnum_parkmiller ( seed );
assert_checkequal ( seed , 16807. );
assert_checkalmostequal ( value , 0.0000078263692594256109 );
[ value , seed ] = randnum_parkmiller ( seed );
assert_checkequal ( seed , 282475249. );
assert_checkalmostequal ( value , 0.1315377881431662454581  );
// Terms #1 to #10
seed = 1.;
[ value , seed ] = randnum_parkmiller ( seed , 10 );
expected= [...
    0.0000078263692594256109  
    0.1315377881431662454581  
    0.7556053221950331799661  
    0.4586501319234492779486  
    0.5327672374121692477900  
    0.2189591863280903605293  
    0.0470446162144861276810  
    0.6788647168683189514482  
    0.6792964058366122159782  
    0.9346928959408276060827  
    ];
assert_checkalmostequal ( value, expected );
// 100 samples in dimension 10
seed = 1.;
[ value , seed ] = randnum_parkmiller ( seed , 100,10 );
assert_checkequal ( size(value) , [100 10] );
assert_checktrue ( value > 0 );
assert_checktrue ( value < 1 );
assert_checktrue ( seed >=1 );
assert_checktrue ( seed <=2147483646 );
