// Copyright (C) 2010 - 2011 - M3M - UTBM - Sebastien Salmon
// Copyright (C) 2011 - DIGITEO - Michael Baudin
//
// This file must be used under the terms of the CC-BY-NC-SA
// http://creativecommons.org/licenses/by-nc-sa/2.0/
function f=script(x)
    f=sum(x.^2,"c")
endfunction
D = 2;
wmax=0.9; // initial weigth parameter
wmin=0.4; // final weigth parameter
weights=[wmax;wmin];
itmax=100; //Maximum iteration number
c1=2; // knowledge factors for personnal best
c2=2; // knowledge factors for global best
c=[c1;c2];
N=20; // problem dimensions: number of particles
launch_proba=0.9;
speed_factor=2;
number_raptor=N;
borne_sup=ones(D,1)*100;
borne_inf=-borne_sup;
bounds=[borne_inf,borne_sup];
vitesse_max=0.1*borne_sup;
vitesse_min=0.1*borne_inf;
speed=[vitesse_min,vitesse_max];
radius=1e-6;
n_radius=10;
verbose = 0; // 1 to activate autosave and graphics by default
grand('setsd',0); // the random generator must be initialized
[fopt,xopt,itopt]=PSO_inertial_radius(script,bounds,speed,itmax,N,weights,c,radius,n_radius,verbose);
assert_checkalmostequal ( fopt , 0 , [], 1.e-1 );
assert_checkalmostequal ( xopt , zeros(1,D) , [], 1.e-1 );
//
// Try with verbose
verbose = 1;
lines(0);
grand('setsd',0); 
[fopt,xopt,itopt]=PSO_inertial_radius(script,bounds,speed,itmax,N,weights,c,radius,n_radius,verbose);
Iter #1, Fbest=4.783140e+001, gbest=[-4.4669777 -5.2799155]
Iter #2, Fbest=4.279581e+001, gbest=[2.1575841 -6.1758106]
Iter #3, Fbest=4.279581e+001, gbest=[2.1575841 -6.1758106]
Iter #4, Fbest=4.279581e+001, gbest=[2.1575841 -6.1758106]
Iter #5, Fbest=5.394186e+000, gbest=[1.2541302 -1.9548258]
Iter #6, Fbest=5.394186e+000, gbest=[1.2541302 -1.9548258]
Iter #7, Fbest=5.394186e+000, gbest=[1.2541302 -1.9548258]
Iter #8, Fbest=5.394186e+000, gbest=[1.2541302 -1.9548258]
Iter #9, Fbest=5.394186e+000, gbest=[1.2541302 -1.9548258]
Iter #10, Fbest=5.394186e+000, gbest=[1.2541302 -1.9548258]
Iter #11, Fbest=5.394186e+000, gbest=[1.2541302 -1.9548258]
Iter #12, Fbest=5.394186e+000, gbest=[1.2541302 -1.9548258]
Iter #13, Fbest=5.394186e+000, gbest=[1.2541302 -1.9548258]
Iter #14, Fbest=5.394186e+000, gbest=[1.2541302 -1.9548258]
Iter #15, Fbest=5.394186e+000, gbest=[1.2541302 -1.9548258]
Iter #16, Fbest=5.394186e+000, gbest=[1.2541302 -1.9548258]
Iter #17, Fbest=1.893051e+000, gbest=[-0.0011227 -1.3758815]
Iter #18, Fbest=1.893051e+000, gbest=[-0.0011227 -1.3758815]
Iter #19, Fbest=1.893051e+000, gbest=[-0.0011227 -1.3758815]
Iter #20, Fbest=1.840665e+000, gbest=[0.1444783 -1.3489964]
Iter #21, Fbest=1.840665e+000, gbest=[0.1444783 -1.3489964]
Iter #22, Fbest=1.840665e+000, gbest=[0.1444783 -1.3489964]
Iter #23, Fbest=1.840665e+000, gbest=[0.1444783 -1.3489964]
Iter #24, Fbest=1.840665e+000, gbest=[0.1444783 -1.3489964]
Iter #25, Fbest=1.840665e+000, gbest=[0.1444783 -1.3489964]
Iter #26, Fbest=1.840665e+000, gbest=[0.1444783 -1.3489964]
Iter #27, Fbest=1.840665e+000, gbest=[0.1444783 -1.3489964]
Iter #28, Fbest=1.840665e+000, gbest=[0.1444783 -1.3489964]
Iter #29, Fbest=1.840665e+000, gbest=[0.1444783 -1.3489964]
Iter #30, Fbest=1.840665e+000, gbest=[0.1444783 -1.3489964]
Iter #31, Fbest=9.499212e-001, gbest=[0.9457762 0.2354327]
Iter #32, Fbest=9.499212e-001, gbest=[0.9457762 0.2354327]
Iter #33, Fbest=1.292298e-001, gbest=[-0.3588409 -0.0215182]
Iter #34, Fbest=1.292298e-001, gbest=[-0.3588409 -0.0215182]
Iter #35, Fbest=1.292298e-001, gbest=[-0.3588409 -0.0215182]
Iter #36, Fbest=1.292298e-001, gbest=[-0.3588409 -0.0215182]
Iter #37, Fbest=1.292298e-001, gbest=[-0.3588409 -0.0215182]
Iter #38, Fbest=1.292298e-001, gbest=[-0.3588409 -0.0215182]
Iter #39, Fbest=1.292298e-001, gbest=[-0.3588409 -0.0215182]
Iter #40, Fbest=1.292298e-001, gbest=[-0.3588409 -0.0215182]
Iter #41, Fbest=9.560831e-002, gbest=[0.1110895 -0.2885610]
Iter #42, Fbest=9.560831e-002, gbest=[0.1110895 -0.2885610]
Iter #43, Fbest=9.560831e-002, gbest=[0.1110895 -0.2885610]
Iter #44, Fbest=9.560831e-002, gbest=[0.1110895 -0.2885610]
Iter #45, Fbest=9.560831e-002, gbest=[0.1110895 -0.2885610]
Iter #46, Fbest=5.498277e-002, gbest=[-0.1128630 0.2055352]
Iter #47, Fbest=5.498277e-002, gbest=[-0.1128630 0.2055352]
Iter #48, Fbest=5.498277e-002, gbest=[-0.1128630 0.2055352]
Iter #49, Fbest=5.498277e-002, gbest=[-0.1128630 0.2055352]
Iter #50, Fbest=5.498277e-002, gbest=[-0.1128630 0.2055352]
Iter #51, Fbest=5.498277e-002, gbest=[-0.1128630 0.2055352]
Iter #52, Fbest=5.498277e-002, gbest=[-0.1128630 0.2055352]
Iter #53, Fbest=5.498277e-002, gbest=[-0.1128630 0.2055352]
Iter #54, Fbest=1.213294e-002, gbest=[-0.0569047 0.0943122]
Iter #55, Fbest=1.840804e-003, gbest=[-0.0405312 -0.0140721]
Iter #56, Fbest=1.840804e-003, gbest=[-0.0405312 -0.0140721]
Iter #57, Fbest=1.805279e-003, gbest=[-0.0409399 -0.0113667]
Iter #58, Fbest=1.805279e-003, gbest=[-0.0409399 -0.0113667]
Iter #59, Fbest=1.805279e-003, gbest=[-0.0409399 -0.0113667]
Iter #60, Fbest=1.805279e-003, gbest=[-0.0409399 -0.0113667]
Iter #61, Fbest=1.345940e-003, gbest=[0.0124061 0.0345258]
Iter #62, Fbest=6.634503e-004, gbest=[-0.0255799 0.0030199]
Iter #63, Fbest=6.634503e-004, gbest=[-0.0255799 0.0030199]
Iter #64, Fbest=6.361536e-004, gbest=[-0.0243974 0.0063968]
Iter #65, Fbest=6.361536e-004, gbest=[-0.0243974 0.0063968]
Iter #66, Fbest=4.784104e-004, gbest=[-0.0064889 -0.0208879]
Iter #67, Fbest=3.606627e-004, gbest=[-0.0102973 0.0159571]
Iter #68, Fbest=3.275530e-004, gbest=[-0.0167774 0.0067875]
Iter #69, Fbest=1.897097e-004, gbest=[-0.0115404 0.0075186]
Iter #70, Fbest=2.038855e-005, gbest=[0.0006868 -0.0044628]
Iter #71, Fbest=2.038855e-005, gbest=[0.0006868 -0.0044628]
Iter #72, Fbest=6.521655e-006, gbest=[-0.0015880 -0.0020000]
Iter #73, Fbest=6.521655e-006, gbest=[-0.0015880 -0.0020000]
Iter #74, Fbest=6.521655e-006, gbest=[-0.0015880 -0.0020000]
Iter #75, Fbest=6.521655e-006, gbest=[-0.0015880 -0.0020000]
Iter #76, Fbest=1.228499e-006, gbest=[-0.0000303 0.0011080]
Iter #77, Fbest=1.228499e-006, gbest=[-0.0000303 0.0011080]
Iter #78, Fbest=1.228499e-006, gbest=[-0.0000303 0.0011080]
Iter #79, Fbest=1.228499e-006, gbest=[-0.0000303 0.0011080]
Iter #80, Fbest=1.228499e-006, gbest=[-0.0000303 0.0011080]
Iter #81, Fbest=1.228499e-006, gbest=[-0.0000303 0.0011080]
Iter #82, Fbest=1.147236e-006, gbest=[0.0006990 -0.0008116]
Iter #83, Fbest=1.333542e-007, gbest=[0.0003405 0.0001320]
Iter #84, Fbest=1.333542e-007, gbest=[0.0003405 0.0001320]
Iter #85, Fbest=1.333542e-007, gbest=[0.0003405 0.0001320]
Iter #86, Fbest=1.333542e-007, gbest=[0.0003405 0.0001320]
Iter #87, Fbest=1.333542e-007, gbest=[0.0003405 0.0001320]
Iter #88, Fbest=1.333542e-007, gbest=[0.0003405 0.0001320]
Iter #89, Fbest=1.333542e-007, gbest=[0.0003405 0.0001320]
Iter #90, Fbest=1.333542e-007, gbest=[0.0003405 0.0001320]
Iter #91, Fbest=1.333542e-007, gbest=[0.0003405 0.0001320]
Iter #92, Fbest=2.505837e-008, gbest=[-0.0001306 0.0000894]
Iter #93, Fbest=2.505837e-008, gbest=[-0.0001306 0.0000894]
Iter #94, Fbest=2.505837e-008, gbest=[-0.0001306 0.0000894]
Iter #95, Fbest=1.128267e-008, gbest=[-0.0000831 0.0000662]
Iter #96, Fbest=6.203028e-010, gbest=[0.0000186 0.0000166]
Iter #97, Fbest=6.203028e-010, gbest=[0.0000186 0.0000166]
Iter #98, Fbest=6.203028e-010, gbest=[0.0000186 0.0000166]
Iter #99, Fbest=6.203028e-010, gbest=[0.0000186 0.0000166]
assert_checkalmostequal ( fopt , 0 , [], 1.e-1 );
assert_checkalmostequal ( xopt , zeros(1,D) , [], 1.e-1 );
//
// Try with an output function
function stop = myoutputfun ( i , fopt , xopt )
  sx = strcat(string(xopt)," ")
  mprintf("Iter %d, fopt=%e, xopt=[%s]\n",i,fopt,sx)
  stop = %f
  plot(i,fopt,"bo")
endfunction
h = scf();
xtitle("Objective function value vs Iteration","Iteration number","Objective function value");
grand('setsd',0);
[fopt,xopt,itopt]=PSO_inertial_radius(script,bounds,speed,itmax,N,weights,c,radius,n_radius,myoutputfun); 
Iter 1, fopt=4.783140e+001, xopt=[-4.4669777 -5.2799155]
Iter 2, fopt=4.279581e+001, xopt=[2.1575841 -6.1758106]
Iter 3, fopt=4.279581e+001, xopt=[2.1575841 -6.1758106]
Iter 4, fopt=4.279581e+001, xopt=[2.1575841 -6.1758106]
Iter 5, fopt=5.394186e+000, xopt=[1.2541302 -1.9548258]
Iter 6, fopt=5.394186e+000, xopt=[1.2541302 -1.9548258]
Iter 7, fopt=5.394186e+000, xopt=[1.2541302 -1.9548258]
Iter 8, fopt=5.394186e+000, xopt=[1.2541302 -1.9548258]
Iter 9, fopt=5.394186e+000, xopt=[1.2541302 -1.9548258]
Iter 10, fopt=5.394186e+000, xopt=[1.2541302 -1.9548258]
Iter 11, fopt=5.394186e+000, xopt=[1.2541302 -1.9548258]
Iter 12, fopt=5.394186e+000, xopt=[1.2541302 -1.9548258]
Iter 13, fopt=5.394186e+000, xopt=[1.2541302 -1.9548258]
Iter 14, fopt=5.394186e+000, xopt=[1.2541302 -1.9548258]
Iter 15, fopt=5.394186e+000, xopt=[1.2541302 -1.9548258]
Iter 16, fopt=5.394186e+000, xopt=[1.2541302 -1.9548258]
Iter 17, fopt=1.893051e+000, xopt=[-0.0011227 -1.3758815]
Iter 18, fopt=1.893051e+000, xopt=[-0.0011227 -1.3758815]
Iter 19, fopt=1.893051e+000, xopt=[-0.0011227 -1.3758815]
Iter 20, fopt=1.840665e+000, xopt=[0.1444783 -1.3489964]
Iter 21, fopt=1.840665e+000, xopt=[0.1444783 -1.3489964]
Iter 22, fopt=1.840665e+000, xopt=[0.1444783 -1.3489964]
Iter 23, fopt=1.840665e+000, xopt=[0.1444783 -1.3489964]
Iter 24, fopt=1.840665e+000, xopt=[0.1444783 -1.3489964]
Iter 25, fopt=1.840665e+000, xopt=[0.1444783 -1.3489964]
Iter 26, fopt=1.840665e+000, xopt=[0.1444783 -1.3489964]
Iter 27, fopt=1.840665e+000, xopt=[0.1444783 -1.3489964]
Iter 28, fopt=1.840665e+000, xopt=[0.1444783 -1.3489964]
Iter 29, fopt=1.840665e+000, xopt=[0.1444783 -1.3489964]
Iter 30, fopt=1.840665e+000, xopt=[0.1444783 -1.3489964]
Iter 31, fopt=9.499212e-001, xopt=[0.9457762 0.2354327]
Iter 32, fopt=9.499212e-001, xopt=[0.9457762 0.2354327]
Iter 33, fopt=1.292298e-001, xopt=[-0.3588409 -0.0215182]
Iter 34, fopt=1.292298e-001, xopt=[-0.3588409 -0.0215182]
Iter 35, fopt=1.292298e-001, xopt=[-0.3588409 -0.0215182]
Iter 36, fopt=1.292298e-001, xopt=[-0.3588409 -0.0215182]
Iter 37, fopt=1.292298e-001, xopt=[-0.3588409 -0.0215182]
Iter 38, fopt=1.292298e-001, xopt=[-0.3588409 -0.0215182]
Iter 39, fopt=1.292298e-001, xopt=[-0.3588409 -0.0215182]
Iter 40, fopt=1.292298e-001, xopt=[-0.3588409 -0.0215182]
Iter 41, fopt=9.560831e-002, xopt=[0.1110895 -0.2885610]
Iter 42, fopt=9.560831e-002, xopt=[0.1110895 -0.2885610]
Iter 43, fopt=9.560831e-002, xopt=[0.1110895 -0.2885610]
Iter 44, fopt=9.560831e-002, xopt=[0.1110895 -0.2885610]
Iter 45, fopt=9.560831e-002, xopt=[0.1110895 -0.2885610]
Iter 46, fopt=5.498277e-002, xopt=[-0.1128630 0.2055352]
Iter 47, fopt=5.498277e-002, xopt=[-0.1128630 0.2055352]
Iter 48, fopt=5.498277e-002, xopt=[-0.1128630 0.2055352]
Iter 49, fopt=5.498277e-002, xopt=[-0.1128630 0.2055352]
Iter 50, fopt=5.498277e-002, xopt=[-0.1128630 0.2055352]
Iter 51, fopt=5.498277e-002, xopt=[-0.1128630 0.2055352]
Iter 52, fopt=5.498277e-002, xopt=[-0.1128630 0.2055352]
Iter 53, fopt=5.498277e-002, xopt=[-0.1128630 0.2055352]
Iter 54, fopt=1.213294e-002, xopt=[-0.0569047 0.0943122]
Iter 55, fopt=1.840804e-003, xopt=[-0.0405312 -0.0140721]
Iter 56, fopt=1.840804e-003, xopt=[-0.0405312 -0.0140721]
Iter 57, fopt=1.805279e-003, xopt=[-0.0409399 -0.0113667]
Iter 58, fopt=1.805279e-003, xopt=[-0.0409399 -0.0113667]
Iter 59, fopt=1.805279e-003, xopt=[-0.0409399 -0.0113667]
Iter 60, fopt=1.805279e-003, xopt=[-0.0409399 -0.0113667]
Iter 61, fopt=1.345940e-003, xopt=[0.0124061 0.0345258]
Iter 62, fopt=6.634503e-004, xopt=[-0.0255799 0.0030199]
Iter 63, fopt=6.634503e-004, xopt=[-0.0255799 0.0030199]
Iter 64, fopt=6.361536e-004, xopt=[-0.0243974 0.0063968]
Iter 65, fopt=6.361536e-004, xopt=[-0.0243974 0.0063968]
Iter 66, fopt=4.784104e-004, xopt=[-0.0064889 -0.0208879]
Iter 67, fopt=3.606627e-004, xopt=[-0.0102973 0.0159571]
Iter 68, fopt=3.275530e-004, xopt=[-0.0167774 0.0067875]
Iter 69, fopt=1.897097e-004, xopt=[-0.0115404 0.0075186]
Iter 70, fopt=2.038855e-005, xopt=[0.0006868 -0.0044628]
Iter 71, fopt=2.038855e-005, xopt=[0.0006868 -0.0044628]
Iter 72, fopt=6.521655e-006, xopt=[-0.0015880 -0.0020000]
Iter 73, fopt=6.521655e-006, xopt=[-0.0015880 -0.0020000]
Iter 74, fopt=6.521655e-006, xopt=[-0.0015880 -0.0020000]
Iter 75, fopt=6.521655e-006, xopt=[-0.0015880 -0.0020000]
Iter 76, fopt=1.228499e-006, xopt=[-0.0000303 0.0011080]
Iter 77, fopt=1.228499e-006, xopt=[-0.0000303 0.0011080]
Iter 78, fopt=1.228499e-006, xopt=[-0.0000303 0.0011080]
Iter 79, fopt=1.228499e-006, xopt=[-0.0000303 0.0011080]
Iter 80, fopt=1.228499e-006, xopt=[-0.0000303 0.0011080]
Iter 81, fopt=1.228499e-006, xopt=[-0.0000303 0.0011080]
Iter 82, fopt=1.147236e-006, xopt=[0.0006990 -0.0008116]
Iter 83, fopt=1.333542e-007, xopt=[0.0003405 0.0001320]
Iter 84, fopt=1.333542e-007, xopt=[0.0003405 0.0001320]
Iter 85, fopt=1.333542e-007, xopt=[0.0003405 0.0001320]
Iter 86, fopt=1.333542e-007, xopt=[0.0003405 0.0001320]
Iter 87, fopt=1.333542e-007, xopt=[0.0003405 0.0001320]
Iter 88, fopt=1.333542e-007, xopt=[0.0003405 0.0001320]
Iter 89, fopt=1.333542e-007, xopt=[0.0003405 0.0001320]
Iter 90, fopt=1.333542e-007, xopt=[0.0003405 0.0001320]
Iter 91, fopt=1.333542e-007, xopt=[0.0003405 0.0001320]
Iter 92, fopt=2.505837e-008, xopt=[-0.0001306 0.0000894]
Iter 93, fopt=2.505837e-008, xopt=[-0.0001306 0.0000894]
Iter 94, fopt=2.505837e-008, xopt=[-0.0001306 0.0000894]
Iter 95, fopt=1.128267e-008, xopt=[-0.0000831 0.0000662]
Iter 96, fopt=6.203028e-010, xopt=[0.0000186 0.0000166]
Iter 97, fopt=6.203028e-010, xopt=[0.0000186 0.0000166]
Iter 98, fopt=6.203028e-010, xopt=[0.0000186 0.0000166]
Iter 99, fopt=6.203028e-010, xopt=[0.0000186 0.0000166]
assert_checkalmostequal ( fopt , 0 , [], 1.e-1 );
assert_checkalmostequal ( xopt , zeros(1,D) , [], 1.e-1 );
close(h);
//
// Try with an output function, as a list
function stop = myoutputfun2 ( i , fopt , xopt , h )
  sx = strcat(string(xopt)," ")
  mprintf("Iter %d, fopt=%e, xopt=[%s]\n",i,fopt,sx)
  stop = %f
  plot(xopt(1),xopt(2),"bo")
endfunction
function f=scriptV(x1,x2)
    f=x1.^2 + x2.^2
endfunction
h = scf();
xtitle("Optimum vs Iteration","X1","X2");
x1=linspace(-10,10,100);
x2=x1;
[ XX1 , XX2 ]= meshgrid (x1 , x2 );
Z = scriptV ( XX1 , XX2 );
contour(x1,x2,scriptV,[0.1 1 5 10 50 100]);
grand('setsd',0);
[fopt,xopt,itopt]=PSO_inertial_radius(script,bounds,speed,itmax,N,weights,c,radius,n_radius,list(myoutputfun2,h));  
Iter 1, fopt=4.783140e+001, xopt=[-4.4669777 -5.2799155]
Iter 2, fopt=4.279581e+001, xopt=[2.1575841 -6.1758106]
Iter 3, fopt=4.279581e+001, xopt=[2.1575841 -6.1758106]
Iter 4, fopt=4.279581e+001, xopt=[2.1575841 -6.1758106]
Iter 5, fopt=5.394186e+000, xopt=[1.2541302 -1.9548258]
Iter 6, fopt=5.394186e+000, xopt=[1.2541302 -1.9548258]
Iter 7, fopt=5.394186e+000, xopt=[1.2541302 -1.9548258]
Iter 8, fopt=5.394186e+000, xopt=[1.2541302 -1.9548258]
Iter 9, fopt=5.394186e+000, xopt=[1.2541302 -1.9548258]
Iter 10, fopt=5.394186e+000, xopt=[1.2541302 -1.9548258]
Iter 11, fopt=5.394186e+000, xopt=[1.2541302 -1.9548258]
Iter 12, fopt=5.394186e+000, xopt=[1.2541302 -1.9548258]
Iter 13, fopt=5.394186e+000, xopt=[1.2541302 -1.9548258]
Iter 14, fopt=5.394186e+000, xopt=[1.2541302 -1.9548258]
Iter 15, fopt=5.394186e+000, xopt=[1.2541302 -1.9548258]
Iter 16, fopt=5.394186e+000, xopt=[1.2541302 -1.9548258]
Iter 17, fopt=1.893051e+000, xopt=[-0.0011227 -1.3758815]
Iter 18, fopt=1.893051e+000, xopt=[-0.0011227 -1.3758815]
Iter 19, fopt=1.893051e+000, xopt=[-0.0011227 -1.3758815]
Iter 20, fopt=1.840665e+000, xopt=[0.1444783 -1.3489964]
Iter 21, fopt=1.840665e+000, xopt=[0.1444783 -1.3489964]
Iter 22, fopt=1.840665e+000, xopt=[0.1444783 -1.3489964]
Iter 23, fopt=1.840665e+000, xopt=[0.1444783 -1.3489964]
Iter 24, fopt=1.840665e+000, xopt=[0.1444783 -1.3489964]
Iter 25, fopt=1.840665e+000, xopt=[0.1444783 -1.3489964]
Iter 26, fopt=1.840665e+000, xopt=[0.1444783 -1.3489964]
Iter 27, fopt=1.840665e+000, xopt=[0.1444783 -1.3489964]
Iter 28, fopt=1.840665e+000, xopt=[0.1444783 -1.3489964]
Iter 29, fopt=1.840665e+000, xopt=[0.1444783 -1.3489964]
Iter 30, fopt=1.840665e+000, xopt=[0.1444783 -1.3489964]
Iter 31, fopt=9.499212e-001, xopt=[0.9457762 0.2354327]
Iter 32, fopt=9.499212e-001, xopt=[0.9457762 0.2354327]
Iter 33, fopt=1.292298e-001, xopt=[-0.3588409 -0.0215182]
Iter 34, fopt=1.292298e-001, xopt=[-0.3588409 -0.0215182]
Iter 35, fopt=1.292298e-001, xopt=[-0.3588409 -0.0215182]
Iter 36, fopt=1.292298e-001, xopt=[-0.3588409 -0.0215182]
Iter 37, fopt=1.292298e-001, xopt=[-0.3588409 -0.0215182]
Iter 38, fopt=1.292298e-001, xopt=[-0.3588409 -0.0215182]
Iter 39, fopt=1.292298e-001, xopt=[-0.3588409 -0.0215182]
Iter 40, fopt=1.292298e-001, xopt=[-0.3588409 -0.0215182]
Iter 41, fopt=9.560831e-002, xopt=[0.1110895 -0.2885610]
Iter 42, fopt=9.560831e-002, xopt=[0.1110895 -0.2885610]
Iter 43, fopt=9.560831e-002, xopt=[0.1110895 -0.2885610]
Iter 44, fopt=9.560831e-002, xopt=[0.1110895 -0.2885610]
Iter 45, fopt=9.560831e-002, xopt=[0.1110895 -0.2885610]
Iter 46, fopt=5.498277e-002, xopt=[-0.1128630 0.2055352]
Iter 47, fopt=5.498277e-002, xopt=[-0.1128630 0.2055352]
Iter 48, fopt=5.498277e-002, xopt=[-0.1128630 0.2055352]
Iter 49, fopt=5.498277e-002, xopt=[-0.1128630 0.2055352]
Iter 50, fopt=5.498277e-002, xopt=[-0.1128630 0.2055352]
Iter 51, fopt=5.498277e-002, xopt=[-0.1128630 0.2055352]
Iter 52, fopt=5.498277e-002, xopt=[-0.1128630 0.2055352]
Iter 53, fopt=5.498277e-002, xopt=[-0.1128630 0.2055352]
Iter 54, fopt=1.213294e-002, xopt=[-0.0569047 0.0943122]
Iter 55, fopt=1.840804e-003, xopt=[-0.0405312 -0.0140721]
Iter 56, fopt=1.840804e-003, xopt=[-0.0405312 -0.0140721]
Iter 57, fopt=1.805279e-003, xopt=[-0.0409399 -0.0113667]
Iter 58, fopt=1.805279e-003, xopt=[-0.0409399 -0.0113667]
Iter 59, fopt=1.805279e-003, xopt=[-0.0409399 -0.0113667]
Iter 60, fopt=1.805279e-003, xopt=[-0.0409399 -0.0113667]
Iter 61, fopt=1.345940e-003, xopt=[0.0124061 0.0345258]
Iter 62, fopt=6.634503e-004, xopt=[-0.0255799 0.0030199]
Iter 63, fopt=6.634503e-004, xopt=[-0.0255799 0.0030199]
Iter 64, fopt=6.361536e-004, xopt=[-0.0243974 0.0063968]
Iter 65, fopt=6.361536e-004, xopt=[-0.0243974 0.0063968]
Iter 66, fopt=4.784104e-004, xopt=[-0.0064889 -0.0208879]
Iter 67, fopt=3.606627e-004, xopt=[-0.0102973 0.0159571]
Iter 68, fopt=3.275530e-004, xopt=[-0.0167774 0.0067875]
Iter 69, fopt=1.897097e-004, xopt=[-0.0115404 0.0075186]
Iter 70, fopt=2.038855e-005, xopt=[0.0006868 -0.0044628]
Iter 71, fopt=2.038855e-005, xopt=[0.0006868 -0.0044628]
Iter 72, fopt=6.521655e-006, xopt=[-0.0015880 -0.0020000]
Iter 73, fopt=6.521655e-006, xopt=[-0.0015880 -0.0020000]
Iter 74, fopt=6.521655e-006, xopt=[-0.0015880 -0.0020000]
Iter 75, fopt=6.521655e-006, xopt=[-0.0015880 -0.0020000]
Iter 76, fopt=1.228499e-006, xopt=[-0.0000303 0.0011080]
Iter 77, fopt=1.228499e-006, xopt=[-0.0000303 0.0011080]
Iter 78, fopt=1.228499e-006, xopt=[-0.0000303 0.0011080]
Iter 79, fopt=1.228499e-006, xopt=[-0.0000303 0.0011080]
Iter 80, fopt=1.228499e-006, xopt=[-0.0000303 0.0011080]
Iter 81, fopt=1.228499e-006, xopt=[-0.0000303 0.0011080]
Iter 82, fopt=1.147236e-006, xopt=[0.0006990 -0.0008116]
Iter 83, fopt=1.333542e-007, xopt=[0.0003405 0.0001320]
Iter 84, fopt=1.333542e-007, xopt=[0.0003405 0.0001320]
Iter 85, fopt=1.333542e-007, xopt=[0.0003405 0.0001320]
Iter 86, fopt=1.333542e-007, xopt=[0.0003405 0.0001320]
Iter 87, fopt=1.333542e-007, xopt=[0.0003405 0.0001320]
Iter 88, fopt=1.333542e-007, xopt=[0.0003405 0.0001320]
Iter 89, fopt=1.333542e-007, xopt=[0.0003405 0.0001320]
Iter 90, fopt=1.333542e-007, xopt=[0.0003405 0.0001320]
Iter 91, fopt=1.333542e-007, xopt=[0.0003405 0.0001320]
Iter 92, fopt=2.505837e-008, xopt=[-0.0001306 0.0000894]
Iter 93, fopt=2.505837e-008, xopt=[-0.0001306 0.0000894]
Iter 94, fopt=2.505837e-008, xopt=[-0.0001306 0.0000894]
Iter 95, fopt=1.128267e-008, xopt=[-0.0000831 0.0000662]
Iter 96, fopt=6.203028e-010, xopt=[0.0000186 0.0000166]
Iter 97, fopt=6.203028e-010, xopt=[0.0000186 0.0000166]
Iter 98, fopt=6.203028e-010, xopt=[0.0000186 0.0000166]
Iter 99, fopt=6.203028e-010, xopt=[0.0000186 0.0000166]
assert_checkalmostequal ( fopt , 0 , [], 1.e-1 );
assert_checkalmostequal ( xopt , zeros(1,D) , [], 1.e-1 );
close(h);
//
// Try with default options (except itmax, which default is too large for unit tests).
grand('setsd',0); 
[fopt,xopt,itopt]=PSO_inertial_radius(script,bounds,speed,itmax);
assert_checkalmostequal ( fopt , 0 , [], 1.e-1 );
assert_checkalmostequal ( xopt , zeros(1,D) , [], 1.e-1 );
//
// Try to set only the verbose option to ON.
grand('setsd',0); 
verbose = 1;
[fopt,xopt,itopt]=PSO_inertial_radius(script,bounds,speed,itmax,[],[],[],[],[],verbose);
Iter #1, Fbest=4.783140e+001, gbest=[-4.4669777 -5.2799155]
WARNING: save_graphichandle: handle no more valid ignored.
Iter #2, Fbest=4.279581e+001, gbest=[2.1575841 -6.1758106]
WARNING: save_graphichandle: handle no more valid ignored.
Iter #3, Fbest=4.279581e+001, gbest=[2.1575841 -6.1758106]
WARNING: save_graphichandle: handle no more valid ignored.
Iter #4, Fbest=4.279581e+001, gbest=[2.1575841 -6.1758106]
WARNING: save_graphichandle: handle no more valid ignored.
Iter #5, Fbest=5.394186e+000, gbest=[1.2541302 -1.9548258]
WARNING: save_graphichandle: handle no more valid ignored.
Iter #6, Fbest=5.394186e+000, gbest=[1.2541302 -1.9548258]
WARNING: save_graphichandle: handle no more valid ignored.
Iter #7, Fbest=5.394186e+000, gbest=[1.2541302 -1.9548258]
WARNING: save_graphichandle: handle no more valid ignored.
Iter #8, Fbest=5.394186e+000, gbest=[1.2541302 -1.9548258]
WARNING: save_graphichandle: handle no more valid ignored.
Iter #9, Fbest=5.394186e+000, gbest=[1.2541302 -1.9548258]
WARNING: save_graphichandle: handle no more valid ignored.
Iter #10, Fbest=5.394186e+000, gbest=[1.2541302 -1.9548258]
WARNING: save_graphichandle: handle no more valid ignored.
Iter #11, Fbest=5.394186e+000, gbest=[1.2541302 -1.9548258]
WARNING: save_graphichandle: handle no more valid ignored.
Iter #12, Fbest=5.394186e+000, gbest=[1.2541302 -1.9548258]
WARNING: save_graphichandle: handle no more valid ignored.
Iter #13, Fbest=5.394186e+000, gbest=[1.2541302 -1.9548258]
WARNING: save_graphichandle: handle no more valid ignored.
Iter #14, Fbest=5.394186e+000, gbest=[1.2541302 -1.9548258]
WARNING: save_graphichandle: handle no more valid ignored.
Iter #15, Fbest=5.394186e+000, gbest=[1.2541302 -1.9548258]
WARNING: save_graphichandle: handle no more valid ignored.
Iter #16, Fbest=5.394186e+000, gbest=[1.2541302 -1.9548258]
WARNING: save_graphichandle: handle no more valid ignored.
Iter #17, Fbest=1.893051e+000, gbest=[-0.0011227 -1.3758815]
WARNING: save_graphichandle: handle no more valid ignored.
Iter #18, Fbest=1.893051e+000, gbest=[-0.0011227 -1.3758815]
WARNING: save_graphichandle: handle no more valid ignored.
Iter #19, Fbest=1.893051e+000, gbest=[-0.0011227 -1.3758815]
WARNING: save_graphichandle: handle no more valid ignored.
Iter #20, Fbest=1.840665e+000, gbest=[0.1444783 -1.3489964]
WARNING: save_graphichandle: handle no more valid ignored.
Iter #21, Fbest=1.840665e+000, gbest=[0.1444783 -1.3489964]
WARNING: save_graphichandle: handle no more valid ignored.
Iter #22, Fbest=1.840665e+000, gbest=[0.1444783 -1.3489964]
WARNING: save_graphichandle: handle no more valid ignored.
Iter #23, Fbest=1.840665e+000, gbest=[0.1444783 -1.3489964]
WARNING: save_graphichandle: handle no more valid ignored.
Iter #24, Fbest=1.840665e+000, gbest=[0.1444783 -1.3489964]
WARNING: save_graphichandle: handle no more valid ignored.
Iter #25, Fbest=1.840665e+000, gbest=[0.1444783 -1.3489964]
WARNING: save_graphichandle: handle no more valid ignored.
Iter #26, Fbest=1.840665e+000, gbest=[0.1444783 -1.3489964]
WARNING: save_graphichandle: handle no more valid ignored.
Iter #27, Fbest=1.840665e+000, gbest=[0.1444783 -1.3489964]
WARNING: save_graphichandle: handle no more valid ignored.
Iter #28, Fbest=1.840665e+000, gbest=[0.1444783 -1.3489964]
WARNING: save_graphichandle: handle no more valid ignored.
Iter #29, Fbest=1.840665e+000, gbest=[0.1444783 -1.3489964]
WARNING: save_graphichandle: handle no more valid ignored.
Iter #30, Fbest=1.840665e+000, gbest=[0.1444783 -1.3489964]
WARNING: save_graphichandle: handle no more valid ignored.
Iter #31, Fbest=9.499212e-001, gbest=[0.9457762 0.2354327]
WARNING: save_graphichandle: handle no more valid ignored.
Iter #32, Fbest=9.499212e-001, gbest=[0.9457762 0.2354327]
WARNING: save_graphichandle: handle no more valid ignored.
Iter #33, Fbest=1.292298e-001, gbest=[-0.3588409 -0.0215182]
WARNING: save_graphichandle: handle no more valid ignored.
Iter #34, Fbest=1.292298e-001, gbest=[-0.3588409 -0.0215182]
WARNING: save_graphichandle: handle no more valid ignored.
Iter #35, Fbest=1.292298e-001, gbest=[-0.3588409 -0.0215182]
WARNING: save_graphichandle: handle no more valid ignored.
Iter #36, Fbest=1.292298e-001, gbest=[-0.3588409 -0.0215182]
WARNING: save_graphichandle: handle no more valid ignored.
Iter #37, Fbest=1.292298e-001, gbest=[-0.3588409 -0.0215182]
WARNING: save_graphichandle: handle no more valid ignored.
Iter #38, Fbest=1.292298e-001, gbest=[-0.3588409 -0.0215182]
WARNING: save_graphichandle: handle no more valid ignored.
Iter #39, Fbest=1.292298e-001, gbest=[-0.3588409 -0.0215182]
WARNING: save_graphichandle: handle no more valid ignored.
Iter #40, Fbest=1.292298e-001, gbest=[-0.3588409 -0.0215182]
WARNING: save_graphichandle: handle no more valid ignored.
Iter #41, Fbest=9.560831e-002, gbest=[0.1110895 -0.2885610]
WARNING: save_graphichandle: handle no more valid ignored.
Iter #42, Fbest=9.560831e-002, gbest=[0.1110895 -0.2885610]
WARNING: save_graphichandle: handle no more valid ignored.
Iter #43, Fbest=9.560831e-002, gbest=[0.1110895 -0.2885610]
WARNING: save_graphichandle: handle no more valid ignored.
Iter #44, Fbest=9.560831e-002, gbest=[0.1110895 -0.2885610]
WARNING: save_graphichandle: handle no more valid ignored.
Iter #45, Fbest=9.560831e-002, gbest=[0.1110895 -0.2885610]
WARNING: save_graphichandle: handle no more valid ignored.
Iter #46, Fbest=5.498277e-002, gbest=[-0.1128630 0.2055352]
WARNING: save_graphichandle: handle no more valid ignored.
Iter #47, Fbest=5.498277e-002, gbest=[-0.1128630 0.2055352]
WARNING: save_graphichandle: handle no more valid ignored.
Iter #48, Fbest=5.498277e-002, gbest=[-0.1128630 0.2055352]
WARNING: save_graphichandle: handle no more valid ignored.
Iter #49, Fbest=5.498277e-002, gbest=[-0.1128630 0.2055352]
WARNING: save_graphichandle: handle no more valid ignored.
Iter #50, Fbest=5.498277e-002, gbest=[-0.1128630 0.2055352]
WARNING: save_graphichandle: handle no more valid ignored.
Iter #51, Fbest=5.498277e-002, gbest=[-0.1128630 0.2055352]
WARNING: save_graphichandle: handle no more valid ignored.
Iter #52, Fbest=5.498277e-002, gbest=[-0.1128630 0.2055352]
WARNING: save_graphichandle: handle no more valid ignored.
Iter #53, Fbest=5.498277e-002, gbest=[-0.1128630 0.2055352]
WARNING: save_graphichandle: handle no more valid ignored.
Iter #54, Fbest=1.213294e-002, gbest=[-0.0569047 0.0943122]
WARNING: save_graphichandle: handle no more valid ignored.
Iter #55, Fbest=1.840804e-003, gbest=[-0.0405312 -0.0140721]
WARNING: save_graphichandle: handle no more valid ignored.
Iter #56, Fbest=1.840804e-003, gbest=[-0.0405312 -0.0140721]
WARNING: save_graphichandle: handle no more valid ignored.
Iter #57, Fbest=1.805279e-003, gbest=[-0.0409399 -0.0113667]
WARNING: save_graphichandle: handle no more valid ignored.
Iter #58, Fbest=1.805279e-003, gbest=[-0.0409399 -0.0113667]
WARNING: save_graphichandle: handle no more valid ignored.
Iter #59, Fbest=1.805279e-003, gbest=[-0.0409399 -0.0113667]
WARNING: save_graphichandle: handle no more valid ignored.
Iter #60, Fbest=1.805279e-003, gbest=[-0.0409399 -0.0113667]
WARNING: save_graphichandle: handle no more valid ignored.
Iter #61, Fbest=1.345940e-003, gbest=[0.0124061 0.0345258]
WARNING: save_graphichandle: handle no more valid ignored.
Iter #62, Fbest=6.634503e-004, gbest=[-0.0255799 0.0030199]
WARNING: save_graphichandle: handle no more valid ignored.
Iter #63, Fbest=6.634503e-004, gbest=[-0.0255799 0.0030199]
WARNING: save_graphichandle: handle no more valid ignored.
Iter #64, Fbest=6.361536e-004, gbest=[-0.0243974 0.0063968]
WARNING: save_graphichandle: handle no more valid ignored.
Iter #65, Fbest=6.361536e-004, gbest=[-0.0243974 0.0063968]
WARNING: save_graphichandle: handle no more valid ignored.
Iter #66, Fbest=4.784104e-004, gbest=[-0.0064889 -0.0208879]
WARNING: save_graphichandle: handle no more valid ignored.
Iter #67, Fbest=3.606627e-004, gbest=[-0.0102973 0.0159571]
WARNING: save_graphichandle: handle no more valid ignored.
Iter #68, Fbest=3.275530e-004, gbest=[-0.0167774 0.0067875]
WARNING: save_graphichandle: handle no more valid ignored.
Iter #69, Fbest=1.897097e-004, gbest=[-0.0115404 0.0075186]
WARNING: save_graphichandle: handle no more valid ignored.
Iter #70, Fbest=2.038855e-005, gbest=[0.0006868 -0.0044628]
WARNING: save_graphichandle: handle no more valid ignored.
Iter #71, Fbest=2.038855e-005, gbest=[0.0006868 -0.0044628]
WARNING: save_graphichandle: handle no more valid ignored.
Iter #72, Fbest=6.521655e-006, gbest=[-0.0015880 -0.0020000]
WARNING: save_graphichandle: handle no more valid ignored.
Iter #73, Fbest=6.521655e-006, gbest=[-0.0015880 -0.0020000]
WARNING: save_graphichandle: handle no more valid ignored.
Iter #74, Fbest=6.521655e-006, gbest=[-0.0015880 -0.0020000]
WARNING: save_graphichandle: handle no more valid ignored.
Iter #75, Fbest=6.521655e-006, gbest=[-0.0015880 -0.0020000]
WARNING: save_graphichandle: handle no more valid ignored.
Iter #76, Fbest=1.228499e-006, gbest=[-0.0000303 0.0011080]
WARNING: save_graphichandle: handle no more valid ignored.
Iter #77, Fbest=1.228499e-006, gbest=[-0.0000303 0.0011080]
WARNING: save_graphichandle: handle no more valid ignored.
Iter #78, Fbest=1.228499e-006, gbest=[-0.0000303 0.0011080]
WARNING: save_graphichandle: handle no more valid ignored.
Iter #79, Fbest=1.228499e-006, gbest=[-0.0000303 0.0011080]
WARNING: save_graphichandle: handle no more valid ignored.
Iter #80, Fbest=1.228499e-006, gbest=[-0.0000303 0.0011080]
WARNING: save_graphichandle: handle no more valid ignored.
Iter #81, Fbest=1.228499e-006, gbest=[-0.0000303 0.0011080]
WARNING: save_graphichandle: handle no more valid ignored.
Iter #82, Fbest=1.147236e-006, gbest=[0.0006990 -0.0008116]
WARNING: save_graphichandle: handle no more valid ignored.
Iter #83, Fbest=1.333542e-007, gbest=[0.0003405 0.0001320]
WARNING: save_graphichandle: handle no more valid ignored.
Iter #84, Fbest=1.333542e-007, gbest=[0.0003405 0.0001320]
WARNING: save_graphichandle: handle no more valid ignored.
Iter #85, Fbest=1.333542e-007, gbest=[0.0003405 0.0001320]
WARNING: save_graphichandle: handle no more valid ignored.
Iter #86, Fbest=1.333542e-007, gbest=[0.0003405 0.0001320]
WARNING: save_graphichandle: handle no more valid ignored.
Iter #87, Fbest=1.333542e-007, gbest=[0.0003405 0.0001320]
WARNING: save_graphichandle: handle no more valid ignored.
Iter #88, Fbest=1.333542e-007, gbest=[0.0003405 0.0001320]
WARNING: save_graphichandle: handle no more valid ignored.
Iter #89, Fbest=1.333542e-007, gbest=[0.0003405 0.0001320]
WARNING: save_graphichandle: handle no more valid ignored.
Iter #90, Fbest=1.333542e-007, gbest=[0.0003405 0.0001320]
WARNING: save_graphichandle: handle no more valid ignored.
Iter #91, Fbest=1.333542e-007, gbest=[0.0003405 0.0001320]
WARNING: save_graphichandle: handle no more valid ignored.
Iter #92, Fbest=2.505837e-008, gbest=[-0.0001306 0.0000894]
WARNING: save_graphichandle: handle no more valid ignored.
Iter #93, Fbest=2.505837e-008, gbest=[-0.0001306 0.0000894]
WARNING: save_graphichandle: handle no more valid ignored.
Iter #94, Fbest=2.505837e-008, gbest=[-0.0001306 0.0000894]
WARNING: save_graphichandle: handle no more valid ignored.
Iter #95, Fbest=1.128267e-008, gbest=[-0.0000831 0.0000662]
WARNING: save_graphichandle: handle no more valid ignored.
Iter #96, Fbest=6.203028e-010, gbest=[0.0000186 0.0000166]
WARNING: save_graphichandle: handle no more valid ignored.
Iter #97, Fbest=6.203028e-010, gbest=[0.0000186 0.0000166]
WARNING: save_graphichandle: handle no more valid ignored.
Iter #98, Fbest=6.203028e-010, gbest=[0.0000186 0.0000166]
WARNING: save_graphichandle: handle no more valid ignored.
Iter #99, Fbest=6.203028e-010, gbest=[0.0000186 0.0000166]
WARNING: save_graphichandle: handle no more valid ignored.
assert_checkalmostequal ( fopt , 0 , [], 1.e-1 );
assert_checkalmostequal ( xopt , zeros(1,D) , [], 1.e-1 );
