// Copyright (C) 2010 - 2011 - M3M - UTBM - Sebastien Salmon
// Copyright (C) 2011 - DIGITEO - Michael Baudin
//
// This file must be used under the terms of the CC-BY-NC-SA
// http://creativecommons.org/licenses/by-nc-sa/2.0/
function f=script(x)
    f=sum(x.^2,"c")
endfunction
D = 2;
wmax=0.9; // initial weigth parameter
wmin=0.4; // final weigth parameter
weights=[wmax;wmin];
itmax=100; //Maximum iteration number
c1=2; // knowledge factors for personnal best
c2=2; // knowledge factors for global best
c=[c1;c2];
N=20; // problem dimensions: number of particles
launchp=0.9;
speed_factor=2;
number_raptor=N;
borne_sup=ones(D,1)*100;
borne_inf=-borne_sup;
bounds=[borne_inf,borne_sup];
vitesse_max=0.1*borne_sup;
vitesse_min=0.1*borne_inf;
speed=[vitesse_min,vitesse_max];
radius=1e-6;
n_radius=10;
speedf=2;
nraptor=N;
verbose = 0; // 1 to activate autosave and graphics by default
grand('setsd',0); // the random generator must be initialized
[fopt,xopt,itopt]=PSO_bsg_starcraft_radius(script,bounds,speed,itmax,N,weights,c,..
    launchp,speedf,nraptor,radius,n_radius,verbose);
assert_checkalmostequal ( fopt , 0 , [], 1.e-1 );
assert_checkalmostequal ( xopt , zeros(1,D) , [], 1.e-1 );
//
// Try with verbose
verbose = 1;
lines(0);
grand('setsd',0); 
[fopt,xopt,itopt]=PSO_bsg_starcraft_radius(script,bounds,speed,itmax,N,weights,c,..
    launchp,speedf,nraptor,radius,n_radius,verbose);
Iter #1, Fbest=4.783140e+001, gbest=[-4.4669777 -5.2799155]
	Enabling Starcraft Protoss carrier at iteration
	Sending Raptors
	Gain =-2.233908e+001
	Enabling FTL jump
Iter #2, Fbest=2.549232e+001, gbest=[0.7540102 -4.9923729]
Iter #3, Fbest=2.549232e+001, gbest=[0.7540102 -4.9923729]
Iter #4, Fbest=2.380381e+001, gbest=[-1.2077328 -4.7270699]
Iter #5, Fbest=2.228979e+001, gbest=[2.3611279 -4.0883816]
Iter #6, Fbest=2.228979e+001, gbest=[2.3611279 -4.0883816]
Iter #7, Fbest=2.228979e+001, gbest=[2.3611279 -4.0883816]
Iter #8, Fbest=2.228979e+001, gbest=[2.3611279 -4.0883816]
Iter #9, Fbest=2.228979e+001, gbest=[2.3611279 -4.0883816]
Iter #10, Fbest=6.116186e+000, gbest=[-1.5816585 1.901195]
Iter #11, Fbest=6.116186e+000, gbest=[-1.5816585 1.901195]
Iter #12, Fbest=4.629761e+000, gbest=[-1.8552692 1.0898336]
	Enabling Starcraft Protoss carrier at iteration
	Sending Raptors
	FTL jump not required
Iter #13, Fbest=4.629761e+000, gbest=[-1.8552692 1.0898336]
Iter #14, Fbest=4.629761e+000, gbest=[-1.8552692 1.0898336]
Iter #15, Fbest=2.395138e-001, gbest=[0.2689365 0.4088850]
Iter #16, Fbest=2.395138e-001, gbest=[0.2689365 0.4088850]
Iter #17, Fbest=2.395138e-001, gbest=[0.2689365 0.4088850]
Iter #18, Fbest=2.395138e-001, gbest=[0.2689365 0.4088850]
Iter #19, Fbest=2.395138e-001, gbest=[0.2689365 0.4088850]
Iter #20, Fbest=2.395138e-001, gbest=[0.2689365 0.4088850]
	Enabling Starcraft Protoss carrier at iteration
	Sending Raptors
	FTL jump not required
Iter #21, Fbest=2.395138e-001, gbest=[0.2689365 0.4088850]
Iter #22, Fbest=2.395138e-001, gbest=[0.2689365 0.4088850]
	Enabling Starcraft Protoss carrier at iteration
	Sending Raptors
	FTL jump not required
Iter #23, Fbest=2.395138e-001, gbest=[0.2689365 0.4088850]
Iter #24, Fbest=2.395138e-001, gbest=[0.2689365 0.4088850]
Iter #25, Fbest=2.395138e-001, gbest=[0.2689365 0.4088850]
Iter #26, Fbest=2.395138e-001, gbest=[0.2689365 0.4088850]
Iter #27, Fbest=2.395138e-001, gbest=[0.2689365 0.4088850]
Iter #28, Fbest=2.395138e-001, gbest=[0.2689365 0.4088850]
	Enabling Starcraft Protoss carrier at iteration
	Sending Raptors
	FTL jump not required
Iter #29, Fbest=2.395138e-001, gbest=[0.2689365 0.4088850]
Iter #30, Fbest=2.395138e-001, gbest=[0.2689365 0.4088850]
Iter #31, Fbest=2.395138e-001, gbest=[0.2689365 0.4088850]
Iter #32, Fbest=2.395138e-001, gbest=[0.2689365 0.4088850]
Iter #33, Fbest=2.395138e-001, gbest=[0.2689365 0.4088850]
Iter #34, Fbest=2.395138e-001, gbest=[0.2689365 0.4088850]
Iter #35, Fbest=2.395138e-001, gbest=[0.2689365 0.4088850]
Iter #36, Fbest=2.395138e-001, gbest=[0.2689365 0.4088850]
Iter #37, Fbest=2.395138e-001, gbest=[0.2689365 0.4088850]
Iter #38, Fbest=2.395138e-001, gbest=[0.2689365 0.4088850]
Iter #39, Fbest=2.215267e-001, gbest=[0.1570309 -0.4436981]
Iter #40, Fbest=2.215267e-001, gbest=[0.1570309 -0.4436981]
Iter #41, Fbest=2.215267e-001, gbest=[0.1570309 -0.4436981]
	Enabling Starcraft Protoss carrier at iteration
	Sending Raptors
	Gain =-7.050116e-001
	Enabling FTL jump
Iter #42, Fbest=1.040698e-003, gbest=[-0.0068863 0.0315163]
Iter #43, Fbest=1.040698e-003, gbest=[-0.0068863 0.0315163]
Iter #44, Fbest=1.040698e-003, gbest=[-0.0068863 0.0315163]
Iter #45, Fbest=1.040698e-003, gbest=[-0.0068863 0.0315163]
Iter #46, Fbest=1.040698e-003, gbest=[-0.0068863 0.0315163]
Iter #47, Fbest=1.040698e-003, gbest=[-0.0068863 0.0315163]
Iter #48, Fbest=1.040698e-003, gbest=[-0.0068863 0.0315163]
Iter #49, Fbest=1.040698e-003, gbest=[-0.0068863 0.0315163]
Iter #50, Fbest=1.040698e-003, gbest=[-0.0068863 0.0315163]
Iter #51, Fbest=1.040698e-003, gbest=[-0.0068863 0.0315163]
Iter #52, Fbest=9.445550e-004, gbest=[-0.0077713 0.0297349]
Iter #53, Fbest=9.445550e-004, gbest=[-0.0077713 0.0297349]
Iter #54, Fbest=9.445550e-004, gbest=[-0.0077713 0.0297349]
Iter #55, Fbest=9.445550e-004, gbest=[-0.0077713 0.0297349]
Iter #56, Fbest=9.445550e-004, gbest=[-0.0077713 0.0297349]
Iter #57, Fbest=3.482407e-004, gbest=[-0.0046372 0.0180759]
Iter #58, Fbest=3.482407e-004, gbest=[-0.0046372 0.0180759]
Iter #59, Fbest=3.482407e-004, gbest=[-0.0046372 0.0180759]
Iter #60, Fbest=1.032250e-004, gbest=[0.0019386 -0.0099733]
Iter #61, Fbest=1.032250e-004, gbest=[0.0019386 -0.0099733]
Iter #62, Fbest=1.032250e-004, gbest=[0.0019386 -0.0099733]
Iter #63, Fbest=1.032250e-004, gbest=[0.0019386 -0.0099733]
Iter #64, Fbest=1.032250e-004, gbest=[0.0019386 -0.0099733]
Iter #65, Fbest=1.032250e-004, gbest=[0.0019386 -0.0099733]
Iter #66, Fbest=1.032250e-004, gbest=[0.0019386 -0.0099733]
Iter #67, Fbest=1.032250e-004, gbest=[0.0019386 -0.0099733]
Iter #68, Fbest=1.032250e-004, gbest=[0.0019386 -0.0099733]
Iter #69, Fbest=1.032250e-004, gbest=[0.0019386 -0.0099733]
Iter #70, Fbest=1.032250e-004, gbest=[0.0019386 -0.0099733]
Iter #71, Fbest=1.032250e-004, gbest=[0.0019386 -0.0099733]
Iter #72, Fbest=1.032250e-004, gbest=[0.0019386 -0.0099733]
Iter #73, Fbest=1.032250e-004, gbest=[0.0019386 -0.0099733]
	Enabling Starcraft Protoss carrier at iteration
	Sending Raptors
	FTL jump not required
Iter #74, Fbest=1.032250e-004, gbest=[0.0019386 -0.0099733]
Iter #75, Fbest=1.032250e-004, gbest=[0.0019386 -0.0099733]
Iter #76, Fbest=1.032250e-004, gbest=[0.0019386 -0.0099733]
Iter #77, Fbest=1.032250e-004, gbest=[0.0019386 -0.0099733]
Iter #78, Fbest=7.436902e-005, gbest=[0.0056679 -0.0064995]
Iter #79, Fbest=7.436902e-005, gbest=[0.0056679 -0.0064995]
Iter #80, Fbest=7.436902e-005, gbest=[0.0056679 -0.0064995]
Iter #81, Fbest=7.436902e-005, gbest=[0.0056679 -0.0064995]
Iter #82, Fbest=7.436902e-005, gbest=[0.0056679 -0.0064995]
Iter #83, Fbest=2.715326e-005, gbest=[-0.0002505 -0.0052049]
Iter #84, Fbest=5.570563e-006, gbest=[-0.0023154 0.0004577]
Iter #85, Fbest=5.570563e-006, gbest=[-0.0023154 0.0004577]
Iter #86, Fbest=1.018658e-006, gbest=[-0.0001812 -0.0009929]
Iter #87, Fbest=1.018658e-006, gbest=[-0.0001812 -0.0009929]
Iter #88, Fbest=8.830178e-007, gbest=[-0.0003732 -0.0008624]
Iter #89, Fbest=8.830178e-007, gbest=[-0.0003732 -0.0008624]
Iter #90, Fbest=7.097547e-007, gbest=[-0.0001583 -0.0008275]
Iter #91, Fbest=7.097547e-007, gbest=[-0.0001583 -0.0008275]
	Enabling Starcraft Protoss carrier at iteration
	Sending Raptors
	Gain =-2.278715e-006
	Enabling FTL jump
Iter #92, Fbest=4.348059e-008, gbest=[-0.0001884 -0.0000894]
Iter #93, Fbest=4.348059e-008, gbest=[-0.0001884 -0.0000894]
Iter #94, Fbest=4.348059e-008, gbest=[-0.0001884 -0.0000894]
Iter #95, Fbest=4.348059e-008, gbest=[-0.0001884 -0.0000894]
Iter #96, Fbest=4.348059e-008, gbest=[-0.0001884 -0.0000894]
Iter #97, Fbest=4.348059e-008, gbest=[-0.0001884 -0.0000894]
Iter #98, Fbest=4.348059e-008, gbest=[-0.0001884 -0.0000894]
Iter #99, Fbest=4.348059e-008, gbest=[-0.0001884 -0.0000894]
	Enabling Starcraft Protoss carrier at iteration
	Sending Raptors
	FTL jump not required
assert_checkalmostequal ( fopt , 0 , [], 1.e-1 );
assert_checkalmostequal ( xopt , zeros(1,D) , [], 1.e-1 );
//
// Try with an output function
function stop = myoutputfun ( i , fopt , xopt )
  sx = strcat(string(xopt)," ")
  mprintf("Iter %d, fopt=%e, xopt=[%s]\n",i,fopt,sx)
  stop = %f
  plot(i,fopt,"bo")
endfunction
h = scf();
xtitle("Objective function value vs Iteration","Iteration number","Objective function value");
grand('setsd',0);
[fopt,xopt,itopt]=PSO_bsg_starcraft_radius(script,bounds,speed,itmax,N,weights,c,..
    launchp,speedf,nraptor,radius,n_radius,myoutputfun);
Iter 1, fopt=4.783140e+001, xopt=[-4.4669777 -5.2799155]
Iter 2, fopt=2.549232e+001, xopt=[0.7540102 -4.9923729]
Iter 3, fopt=2.549232e+001, xopt=[0.7540102 -4.9923729]
Iter 4, fopt=2.380381e+001, xopt=[-1.2077328 -4.7270699]
Iter 5, fopt=2.228979e+001, xopt=[2.3611279 -4.0883816]
Iter 6, fopt=2.228979e+001, xopt=[2.3611279 -4.0883816]
Iter 7, fopt=2.228979e+001, xopt=[2.3611279 -4.0883816]
Iter 8, fopt=2.228979e+001, xopt=[2.3611279 -4.0883816]
Iter 9, fopt=2.228979e+001, xopt=[2.3611279 -4.0883816]
Iter 10, fopt=6.116186e+000, xopt=[-1.5816585 1.901195]
Iter 11, fopt=6.116186e+000, xopt=[-1.5816585 1.901195]
Iter 12, fopt=4.629761e+000, xopt=[-1.8552692 1.0898336]
Iter 13, fopt=4.629761e+000, xopt=[-1.8552692 1.0898336]
Iter 14, fopt=4.629761e+000, xopt=[-1.8552692 1.0898336]
Iter 15, fopt=2.395138e-001, xopt=[0.2689365 0.4088850]
Iter 16, fopt=2.395138e-001, xopt=[0.2689365 0.4088850]
Iter 17, fopt=2.395138e-001, xopt=[0.2689365 0.4088850]
Iter 18, fopt=2.395138e-001, xopt=[0.2689365 0.4088850]
Iter 19, fopt=2.395138e-001, xopt=[0.2689365 0.4088850]
Iter 20, fopt=2.395138e-001, xopt=[0.2689365 0.4088850]
Iter 21, fopt=2.395138e-001, xopt=[0.2689365 0.4088850]
Iter 22, fopt=2.395138e-001, xopt=[0.2689365 0.4088850]
Iter 23, fopt=2.395138e-001, xopt=[0.2689365 0.4088850]
Iter 24, fopt=2.395138e-001, xopt=[0.2689365 0.4088850]
Iter 25, fopt=2.395138e-001, xopt=[0.2689365 0.4088850]
Iter 26, fopt=2.395138e-001, xopt=[0.2689365 0.4088850]
Iter 27, fopt=2.395138e-001, xopt=[0.2689365 0.4088850]
Iter 28, fopt=2.395138e-001, xopt=[0.2689365 0.4088850]
Iter 29, fopt=2.395138e-001, xopt=[0.2689365 0.4088850]
Iter 30, fopt=2.395138e-001, xopt=[0.2689365 0.4088850]
Iter 31, fopt=2.395138e-001, xopt=[0.2689365 0.4088850]
Iter 32, fopt=2.395138e-001, xopt=[0.2689365 0.4088850]
Iter 33, fopt=2.395138e-001, xopt=[0.2689365 0.4088850]
Iter 34, fopt=2.395138e-001, xopt=[0.2689365 0.4088850]
Iter 35, fopt=2.395138e-001, xopt=[0.2689365 0.4088850]
Iter 36, fopt=2.395138e-001, xopt=[0.2689365 0.4088850]
Iter 37, fopt=2.395138e-001, xopt=[0.2689365 0.4088850]
Iter 38, fopt=2.395138e-001, xopt=[0.2689365 0.4088850]
Iter 39, fopt=2.215267e-001, xopt=[0.1570309 -0.4436981]
Iter 40, fopt=2.215267e-001, xopt=[0.1570309 -0.4436981]
Iter 41, fopt=2.215267e-001, xopt=[0.1570309 -0.4436981]
Iter 42, fopt=1.040698e-003, xopt=[-0.0068863 0.0315163]
Iter 43, fopt=1.040698e-003, xopt=[-0.0068863 0.0315163]
Iter 44, fopt=1.040698e-003, xopt=[-0.0068863 0.0315163]
Iter 45, fopt=1.040698e-003, xopt=[-0.0068863 0.0315163]
Iter 46, fopt=1.040698e-003, xopt=[-0.0068863 0.0315163]
Iter 47, fopt=1.040698e-003, xopt=[-0.0068863 0.0315163]
Iter 48, fopt=1.040698e-003, xopt=[-0.0068863 0.0315163]
Iter 49, fopt=1.040698e-003, xopt=[-0.0068863 0.0315163]
Iter 50, fopt=1.040698e-003, xopt=[-0.0068863 0.0315163]
Iter 51, fopt=1.040698e-003, xopt=[-0.0068863 0.0315163]
Iter 52, fopt=9.445550e-004, xopt=[-0.0077713 0.0297349]
Iter 53, fopt=9.445550e-004, xopt=[-0.0077713 0.0297349]
Iter 54, fopt=9.445550e-004, xopt=[-0.0077713 0.0297349]
Iter 55, fopt=9.445550e-004, xopt=[-0.0077713 0.0297349]
Iter 56, fopt=9.445550e-004, xopt=[-0.0077713 0.0297349]
Iter 57, fopt=3.482407e-004, xopt=[-0.0046372 0.0180759]
Iter 58, fopt=3.482407e-004, xopt=[-0.0046372 0.0180759]
Iter 59, fopt=3.482407e-004, xopt=[-0.0046372 0.0180759]
Iter 60, fopt=1.032250e-004, xopt=[0.0019386 -0.0099733]
Iter 61, fopt=1.032250e-004, xopt=[0.0019386 -0.0099733]
Iter 62, fopt=1.032250e-004, xopt=[0.0019386 -0.0099733]
Iter 63, fopt=1.032250e-004, xopt=[0.0019386 -0.0099733]
Iter 64, fopt=1.032250e-004, xopt=[0.0019386 -0.0099733]
Iter 65, fopt=1.032250e-004, xopt=[0.0019386 -0.0099733]
Iter 66, fopt=1.032250e-004, xopt=[0.0019386 -0.0099733]
Iter 67, fopt=1.032250e-004, xopt=[0.0019386 -0.0099733]
Iter 68, fopt=1.032250e-004, xopt=[0.0019386 -0.0099733]
Iter 69, fopt=1.032250e-004, xopt=[0.0019386 -0.0099733]
Iter 70, fopt=1.032250e-004, xopt=[0.0019386 -0.0099733]
Iter 71, fopt=1.032250e-004, xopt=[0.0019386 -0.0099733]
Iter 72, fopt=1.032250e-004, xopt=[0.0019386 -0.0099733]
Iter 73, fopt=1.032250e-004, xopt=[0.0019386 -0.0099733]
Iter 74, fopt=1.032250e-004, xopt=[0.0019386 -0.0099733]
Iter 75, fopt=1.032250e-004, xopt=[0.0019386 -0.0099733]
Iter 76, fopt=1.032250e-004, xopt=[0.0019386 -0.0099733]
Iter 77, fopt=1.032250e-004, xopt=[0.0019386 -0.0099733]
Iter 78, fopt=7.436902e-005, xopt=[0.0056679 -0.0064995]
Iter 79, fopt=7.436902e-005, xopt=[0.0056679 -0.0064995]
Iter 80, fopt=7.436902e-005, xopt=[0.0056679 -0.0064995]
Iter 81, fopt=7.436902e-005, xopt=[0.0056679 -0.0064995]
Iter 82, fopt=7.436902e-005, xopt=[0.0056679 -0.0064995]
Iter 83, fopt=2.715326e-005, xopt=[-0.0002505 -0.0052049]
Iter 84, fopt=5.570563e-006, xopt=[-0.0023154 0.0004577]
Iter 85, fopt=5.570563e-006, xopt=[-0.0023154 0.0004577]
Iter 86, fopt=1.018658e-006, xopt=[-0.0001812 -0.0009929]
Iter 87, fopt=1.018658e-006, xopt=[-0.0001812 -0.0009929]
Iter 88, fopt=8.830178e-007, xopt=[-0.0003732 -0.0008624]
Iter 89, fopt=8.830178e-007, xopt=[-0.0003732 -0.0008624]
Iter 90, fopt=7.097547e-007, xopt=[-0.0001583 -0.0008275]
Iter 91, fopt=7.097547e-007, xopt=[-0.0001583 -0.0008275]
Iter 92, fopt=4.348059e-008, xopt=[-0.0001884 -0.0000894]
Iter 93, fopt=4.348059e-008, xopt=[-0.0001884 -0.0000894]
Iter 94, fopt=4.348059e-008, xopt=[-0.0001884 -0.0000894]
Iter 95, fopt=4.348059e-008, xopt=[-0.0001884 -0.0000894]
Iter 96, fopt=4.348059e-008, xopt=[-0.0001884 -0.0000894]
Iter 97, fopt=4.348059e-008, xopt=[-0.0001884 -0.0000894]
Iter 98, fopt=4.348059e-008, xopt=[-0.0001884 -0.0000894]
Iter 99, fopt=4.348059e-008, xopt=[-0.0001884 -0.0000894]
assert_checkalmostequal ( fopt , 0 , [], 1.e-1 );
assert_checkalmostequal ( xopt , zeros(1,D) , [], 1.e-1 );
close(h);
//
// Try with an output function, as a list
function stop = myoutputfun2 ( i , fopt , xopt , h )
  sx = strcat(string(xopt)," ")
  mprintf("Iter %d, fopt=%e, xopt=[%s]\n",i,fopt,sx)
  stop = %f
  plot(xopt(1),xopt(2),"bo")
endfunction
function f=scriptV(x1,x2)
    f=x1.^2 + x2.^2
endfunction
h = scf();
xtitle("Optimum vs Iteration","X1","X2");
x1=linspace(-10,10,100);
x2=x1;
[ XX1 , XX2 ]= meshgrid (x1 , x2 );
Z = scriptV ( XX1 , XX2 );
contour(x1,x2,scriptV,[0.1 1 5 10 50 100]);
grand('setsd',0); 
[fopt,xopt,itopt]=PSO_bsg_starcraft_radius(script,bounds,speed,itmax,N,weights,c,..
    launchp,speedf,nraptor,radius,n_radius,list(myoutputfun2,h));
Iter 1, fopt=4.783140e+001, xopt=[-4.4669777 -5.2799155]
Iter 2, fopt=2.549232e+001, xopt=[0.7540102 -4.9923729]
Iter 3, fopt=2.549232e+001, xopt=[0.7540102 -4.9923729]
Iter 4, fopt=2.380381e+001, xopt=[-1.2077328 -4.7270699]
Iter 5, fopt=2.228979e+001, xopt=[2.3611279 -4.0883816]
Iter 6, fopt=2.228979e+001, xopt=[2.3611279 -4.0883816]
Iter 7, fopt=2.228979e+001, xopt=[2.3611279 -4.0883816]
Iter 8, fopt=2.228979e+001, xopt=[2.3611279 -4.0883816]
Iter 9, fopt=2.228979e+001, xopt=[2.3611279 -4.0883816]
Iter 10, fopt=6.116186e+000, xopt=[-1.5816585 1.901195]
Iter 11, fopt=6.116186e+000, xopt=[-1.5816585 1.901195]
Iter 12, fopt=4.629761e+000, xopt=[-1.8552692 1.0898336]
Iter 13, fopt=4.629761e+000, xopt=[-1.8552692 1.0898336]
Iter 14, fopt=4.629761e+000, xopt=[-1.8552692 1.0898336]
Iter 15, fopt=2.395138e-001, xopt=[0.2689365 0.4088850]
Iter 16, fopt=2.395138e-001, xopt=[0.2689365 0.4088850]
Iter 17, fopt=2.395138e-001, xopt=[0.2689365 0.4088850]
Iter 18, fopt=2.395138e-001, xopt=[0.2689365 0.4088850]
Iter 19, fopt=2.395138e-001, xopt=[0.2689365 0.4088850]
Iter 20, fopt=2.395138e-001, xopt=[0.2689365 0.4088850]
Iter 21, fopt=2.395138e-001, xopt=[0.2689365 0.4088850]
Iter 22, fopt=2.395138e-001, xopt=[0.2689365 0.4088850]
Iter 23, fopt=2.395138e-001, xopt=[0.2689365 0.4088850]
Iter 24, fopt=2.395138e-001, xopt=[0.2689365 0.4088850]
Iter 25, fopt=2.395138e-001, xopt=[0.2689365 0.4088850]
Iter 26, fopt=2.395138e-001, xopt=[0.2689365 0.4088850]
Iter 27, fopt=2.395138e-001, xopt=[0.2689365 0.4088850]
Iter 28, fopt=2.395138e-001, xopt=[0.2689365 0.4088850]
Iter 29, fopt=2.395138e-001, xopt=[0.2689365 0.4088850]
Iter 30, fopt=2.395138e-001, xopt=[0.2689365 0.4088850]
Iter 31, fopt=2.395138e-001, xopt=[0.2689365 0.4088850]
Iter 32, fopt=2.395138e-001, xopt=[0.2689365 0.4088850]
Iter 33, fopt=2.395138e-001, xopt=[0.2689365 0.4088850]
Iter 34, fopt=2.395138e-001, xopt=[0.2689365 0.4088850]
Iter 35, fopt=2.395138e-001, xopt=[0.2689365 0.4088850]
Iter 36, fopt=2.395138e-001, xopt=[0.2689365 0.4088850]
Iter 37, fopt=2.395138e-001, xopt=[0.2689365 0.4088850]
Iter 38, fopt=2.395138e-001, xopt=[0.2689365 0.4088850]
Iter 39, fopt=2.215267e-001, xopt=[0.1570309 -0.4436981]
Iter 40, fopt=2.215267e-001, xopt=[0.1570309 -0.4436981]
Iter 41, fopt=2.215267e-001, xopt=[0.1570309 -0.4436981]
Iter 42, fopt=1.040698e-003, xopt=[-0.0068863 0.0315163]
Iter 43, fopt=1.040698e-003, xopt=[-0.0068863 0.0315163]
Iter 44, fopt=1.040698e-003, xopt=[-0.0068863 0.0315163]
Iter 45, fopt=1.040698e-003, xopt=[-0.0068863 0.0315163]
Iter 46, fopt=1.040698e-003, xopt=[-0.0068863 0.0315163]
Iter 47, fopt=1.040698e-003, xopt=[-0.0068863 0.0315163]
Iter 48, fopt=1.040698e-003, xopt=[-0.0068863 0.0315163]
Iter 49, fopt=1.040698e-003, xopt=[-0.0068863 0.0315163]
Iter 50, fopt=1.040698e-003, xopt=[-0.0068863 0.0315163]
Iter 51, fopt=1.040698e-003, xopt=[-0.0068863 0.0315163]
Iter 52, fopt=9.445550e-004, xopt=[-0.0077713 0.0297349]
Iter 53, fopt=9.445550e-004, xopt=[-0.0077713 0.0297349]
Iter 54, fopt=9.445550e-004, xopt=[-0.0077713 0.0297349]
Iter 55, fopt=9.445550e-004, xopt=[-0.0077713 0.0297349]
Iter 56, fopt=9.445550e-004, xopt=[-0.0077713 0.0297349]
Iter 57, fopt=3.482407e-004, xopt=[-0.0046372 0.0180759]
Iter 58, fopt=3.482407e-004, xopt=[-0.0046372 0.0180759]
Iter 59, fopt=3.482407e-004, xopt=[-0.0046372 0.0180759]
Iter 60, fopt=1.032250e-004, xopt=[0.0019386 -0.0099733]
Iter 61, fopt=1.032250e-004, xopt=[0.0019386 -0.0099733]
Iter 62, fopt=1.032250e-004, xopt=[0.0019386 -0.0099733]
Iter 63, fopt=1.032250e-004, xopt=[0.0019386 -0.0099733]
Iter 64, fopt=1.032250e-004, xopt=[0.0019386 -0.0099733]
Iter 65, fopt=1.032250e-004, xopt=[0.0019386 -0.0099733]
Iter 66, fopt=1.032250e-004, xopt=[0.0019386 -0.0099733]
Iter 67, fopt=1.032250e-004, xopt=[0.0019386 -0.0099733]
Iter 68, fopt=1.032250e-004, xopt=[0.0019386 -0.0099733]
Iter 69, fopt=1.032250e-004, xopt=[0.0019386 -0.0099733]
Iter 70, fopt=1.032250e-004, xopt=[0.0019386 -0.0099733]
Iter 71, fopt=1.032250e-004, xopt=[0.0019386 -0.0099733]
Iter 72, fopt=1.032250e-004, xopt=[0.0019386 -0.0099733]
Iter 73, fopt=1.032250e-004, xopt=[0.0019386 -0.0099733]
Iter 74, fopt=1.032250e-004, xopt=[0.0019386 -0.0099733]
Iter 75, fopt=1.032250e-004, xopt=[0.0019386 -0.0099733]
Iter 76, fopt=1.032250e-004, xopt=[0.0019386 -0.0099733]
Iter 77, fopt=1.032250e-004, xopt=[0.0019386 -0.0099733]
Iter 78, fopt=7.436902e-005, xopt=[0.0056679 -0.0064995]
Iter 79, fopt=7.436902e-005, xopt=[0.0056679 -0.0064995]
Iter 80, fopt=7.436902e-005, xopt=[0.0056679 -0.0064995]
Iter 81, fopt=7.436902e-005, xopt=[0.0056679 -0.0064995]
Iter 82, fopt=7.436902e-005, xopt=[0.0056679 -0.0064995]
Iter 83, fopt=2.715326e-005, xopt=[-0.0002505 -0.0052049]
Iter 84, fopt=5.570563e-006, xopt=[-0.0023154 0.0004577]
Iter 85, fopt=5.570563e-006, xopt=[-0.0023154 0.0004577]
Iter 86, fopt=1.018658e-006, xopt=[-0.0001812 -0.0009929]
Iter 87, fopt=1.018658e-006, xopt=[-0.0001812 -0.0009929]
Iter 88, fopt=8.830178e-007, xopt=[-0.0003732 -0.0008624]
Iter 89, fopt=8.830178e-007, xopt=[-0.0003732 -0.0008624]
Iter 90, fopt=7.097547e-007, xopt=[-0.0001583 -0.0008275]
Iter 91, fopt=7.097547e-007, xopt=[-0.0001583 -0.0008275]
Iter 92, fopt=4.348059e-008, xopt=[-0.0001884 -0.0000894]
Iter 93, fopt=4.348059e-008, xopt=[-0.0001884 -0.0000894]
Iter 94, fopt=4.348059e-008, xopt=[-0.0001884 -0.0000894]
Iter 95, fopt=4.348059e-008, xopt=[-0.0001884 -0.0000894]
Iter 96, fopt=4.348059e-008, xopt=[-0.0001884 -0.0000894]
Iter 97, fopt=4.348059e-008, xopt=[-0.0001884 -0.0000894]
Iter 98, fopt=4.348059e-008, xopt=[-0.0001884 -0.0000894]
Iter 99, fopt=4.348059e-008, xopt=[-0.0001884 -0.0000894]
assert_checkalmostequal ( fopt , 0 , [], 1.e-1 );
assert_checkalmostequal ( xopt , zeros(1,D) , [], 1.e-1 );
close(h);
//
// Try with default options (except itmax, which default is too large for unit tests).
grand('setsd',0);
[fopt,xopt,itopt]=PSO_bsg_starcraft_radius(script,bounds,speed,itmax); 
assert_checkalmostequal ( fopt , 0 , [], 1.e-1 );
assert_checkalmostequal ( xopt , zeros(1,D) , [], 1.e-1 );
//
// Try to set only the verbose option to ON.
grand('setsd',0); 
verbose = 1;
[fopt,xopt,itopt]=PSO_bsg_starcraft_radius(script,bounds,speed,itmax,[],[],[],[],[],[],[],[],verbose);
Iter #1, Fbest=4.783140e+001, gbest=[-4.4669777 -5.2799155]
WARNING: save_graphichandle: handle no more valid ignored.
	Enabling Starcraft Protoss carrier at iteration
	Sending Raptors
	Gain =-2.233908e+001
	Enabling FTL jump
Iter #2, Fbest=2.549232e+001, gbest=[0.7540102 -4.9923729]
WARNING: save_graphichandle: handle no more valid ignored.
Iter #3, Fbest=2.549232e+001, gbest=[0.7540102 -4.9923729]
WARNING: save_graphichandle: handle no more valid ignored.
Iter #4, Fbest=2.380381e+001, gbest=[-1.2077328 -4.7270699]
WARNING: save_graphichandle: handle no more valid ignored.
Iter #5, Fbest=2.228979e+001, gbest=[2.3611279 -4.0883816]
WARNING: save_graphichandle: handle no more valid ignored.
Iter #6, Fbest=2.228979e+001, gbest=[2.3611279 -4.0883816]
WARNING: save_graphichandle: handle no more valid ignored.
Iter #7, Fbest=2.228979e+001, gbest=[2.3611279 -4.0883816]
WARNING: save_graphichandle: handle no more valid ignored.
Iter #8, Fbest=2.228979e+001, gbest=[2.3611279 -4.0883816]
WARNING: save_graphichandle: handle no more valid ignored.
Iter #9, Fbest=2.228979e+001, gbest=[2.3611279 -4.0883816]
WARNING: save_graphichandle: handle no more valid ignored.
Iter #10, Fbest=6.116186e+000, gbest=[-1.5816585 1.901195]
WARNING: save_graphichandle: handle no more valid ignored.
Iter #11, Fbest=6.116186e+000, gbest=[-1.5816585 1.901195]
WARNING: save_graphichandle: handle no more valid ignored.
Iter #12, Fbest=4.629761e+000, gbest=[-1.8552692 1.0898336]
WARNING: save_graphichandle: handle no more valid ignored.
	Enabling Starcraft Protoss carrier at iteration
	Sending Raptors
	FTL jump not required
Iter #13, Fbest=4.629761e+000, gbest=[-1.8552692 1.0898336]
WARNING: save_graphichandle: handle no more valid ignored.
Iter #14, Fbest=4.629761e+000, gbest=[-1.8552692 1.0898336]
WARNING: save_graphichandle: handle no more valid ignored.
Iter #15, Fbest=2.395138e-001, gbest=[0.2689365 0.4088850]
WARNING: save_graphichandle: handle no more valid ignored.
Iter #16, Fbest=2.395138e-001, gbest=[0.2689365 0.4088850]
WARNING: save_graphichandle: handle no more valid ignored.
Iter #17, Fbest=2.395138e-001, gbest=[0.2689365 0.4088850]
WARNING: save_graphichandle: handle no more valid ignored.
Iter #18, Fbest=2.395138e-001, gbest=[0.2689365 0.4088850]
WARNING: save_graphichandle: handle no more valid ignored.
Iter #19, Fbest=2.395138e-001, gbest=[0.2689365 0.4088850]
WARNING: save_graphichandle: handle no more valid ignored.
Iter #20, Fbest=2.395138e-001, gbest=[0.2689365 0.4088850]
WARNING: save_graphichandle: handle no more valid ignored.
	Enabling Starcraft Protoss carrier at iteration
	Sending Raptors
	FTL jump not required
Iter #21, Fbest=2.395138e-001, gbest=[0.2689365 0.4088850]
WARNING: save_graphichandle: handle no more valid ignored.
Iter #22, Fbest=2.395138e-001, gbest=[0.2689365 0.4088850]
WARNING: save_graphichandle: handle no more valid ignored.
	Enabling Starcraft Protoss carrier at iteration
	Sending Raptors
	FTL jump not required
Iter #23, Fbest=2.395138e-001, gbest=[0.2689365 0.4088850]
WARNING: save_graphichandle: handle no more valid ignored.
Iter #24, Fbest=2.395138e-001, gbest=[0.2689365 0.4088850]
WARNING: save_graphichandle: handle no more valid ignored.
Iter #25, Fbest=2.395138e-001, gbest=[0.2689365 0.4088850]
WARNING: save_graphichandle: handle no more valid ignored.
Iter #26, Fbest=2.395138e-001, gbest=[0.2689365 0.4088850]
WARNING: save_graphichandle: handle no more valid ignored.
Iter #27, Fbest=2.395138e-001, gbest=[0.2689365 0.4088850]
WARNING: save_graphichandle: handle no more valid ignored.
Iter #28, Fbest=2.395138e-001, gbest=[0.2689365 0.4088850]
WARNING: save_graphichandle: handle no more valid ignored.
	Enabling Starcraft Protoss carrier at iteration
	Sending Raptors
	FTL jump not required
Iter #29, Fbest=2.395138e-001, gbest=[0.2689365 0.4088850]
WARNING: save_graphichandle: handle no more valid ignored.
Iter #30, Fbest=2.395138e-001, gbest=[0.2689365 0.4088850]
WARNING: save_graphichandle: handle no more valid ignored.
Iter #31, Fbest=2.395138e-001, gbest=[0.2689365 0.4088850]
WARNING: save_graphichandle: handle no more valid ignored.
Iter #32, Fbest=2.395138e-001, gbest=[0.2689365 0.4088850]
WARNING: save_graphichandle: handle no more valid ignored.
Iter #33, Fbest=2.395138e-001, gbest=[0.2689365 0.4088850]
WARNING: save_graphichandle: handle no more valid ignored.
Iter #34, Fbest=2.395138e-001, gbest=[0.2689365 0.4088850]
WARNING: save_graphichandle: handle no more valid ignored.
Iter #35, Fbest=2.395138e-001, gbest=[0.2689365 0.4088850]
WARNING: save_graphichandle: handle no more valid ignored.
Iter #36, Fbest=2.395138e-001, gbest=[0.2689365 0.4088850]
WARNING: save_graphichandle: handle no more valid ignored.
Iter #37, Fbest=2.395138e-001, gbest=[0.2689365 0.4088850]
WARNING: save_graphichandle: handle no more valid ignored.
Iter #38, Fbest=2.395138e-001, gbest=[0.2689365 0.4088850]
WARNING: save_graphichandle: handle no more valid ignored.
Iter #39, Fbest=2.215267e-001, gbest=[0.1570309 -0.4436981]
WARNING: save_graphichandle: handle no more valid ignored.
Iter #40, Fbest=2.215267e-001, gbest=[0.1570309 -0.4436981]
WARNING: save_graphichandle: handle no more valid ignored.
Iter #41, Fbest=2.215267e-001, gbest=[0.1570309 -0.4436981]
WARNING: save_graphichandle: handle no more valid ignored.
	Enabling Starcraft Protoss carrier at iteration
	Sending Raptors
	Gain =-7.050116e-001
	Enabling FTL jump
Iter #42, Fbest=1.040698e-003, gbest=[-0.0068863 0.0315163]
WARNING: save_graphichandle: handle no more valid ignored.
Iter #43, Fbest=1.040698e-003, gbest=[-0.0068863 0.0315163]
WARNING: save_graphichandle: handle no more valid ignored.
Iter #44, Fbest=1.040698e-003, gbest=[-0.0068863 0.0315163]
WARNING: save_graphichandle: handle no more valid ignored.
Iter #45, Fbest=1.040698e-003, gbest=[-0.0068863 0.0315163]
WARNING: save_graphichandle: handle no more valid ignored.
Iter #46, Fbest=1.040698e-003, gbest=[-0.0068863 0.0315163]
WARNING: save_graphichandle: handle no more valid ignored.
Iter #47, Fbest=1.040698e-003, gbest=[-0.0068863 0.0315163]
WARNING: save_graphichandle: handle no more valid ignored.
Iter #48, Fbest=1.040698e-003, gbest=[-0.0068863 0.0315163]
WARNING: save_graphichandle: handle no more valid ignored.
Iter #49, Fbest=1.040698e-003, gbest=[-0.0068863 0.0315163]
WARNING: save_graphichandle: handle no more valid ignored.
Iter #50, Fbest=1.040698e-003, gbest=[-0.0068863 0.0315163]
WARNING: save_graphichandle: handle no more valid ignored.
Iter #51, Fbest=1.040698e-003, gbest=[-0.0068863 0.0315163]
WARNING: save_graphichandle: handle no more valid ignored.
Iter #52, Fbest=9.445550e-004, gbest=[-0.0077713 0.0297349]
WARNING: save_graphichandle: handle no more valid ignored.
Iter #53, Fbest=9.445550e-004, gbest=[-0.0077713 0.0297349]
WARNING: save_graphichandle: handle no more valid ignored.
Iter #54, Fbest=9.445550e-004, gbest=[-0.0077713 0.0297349]
WARNING: save_graphichandle: handle no more valid ignored.
Iter #55, Fbest=9.445550e-004, gbest=[-0.0077713 0.0297349]
WARNING: save_graphichandle: handle no more valid ignored.
Iter #56, Fbest=9.445550e-004, gbest=[-0.0077713 0.0297349]
WARNING: save_graphichandle: handle no more valid ignored.
Iter #57, Fbest=3.482407e-004, gbest=[-0.0046372 0.0180759]
WARNING: save_graphichandle: handle no more valid ignored.
Iter #58, Fbest=3.482407e-004, gbest=[-0.0046372 0.0180759]
WARNING: save_graphichandle: handle no more valid ignored.
Iter #59, Fbest=3.482407e-004, gbest=[-0.0046372 0.0180759]
WARNING: save_graphichandle: handle no more valid ignored.
Iter #60, Fbest=1.032250e-004, gbest=[0.0019386 -0.0099733]
WARNING: save_graphichandle: handle no more valid ignored.
Iter #61, Fbest=1.032250e-004, gbest=[0.0019386 -0.0099733]
WARNING: save_graphichandle: handle no more valid ignored.
Iter #62, Fbest=1.032250e-004, gbest=[0.0019386 -0.0099733]
WARNING: save_graphichandle: handle no more valid ignored.
Iter #63, Fbest=1.032250e-004, gbest=[0.0019386 -0.0099733]
WARNING: save_graphichandle: handle no more valid ignored.
Iter #64, Fbest=1.032250e-004, gbest=[0.0019386 -0.0099733]
WARNING: save_graphichandle: handle no more valid ignored.
Iter #65, Fbest=1.032250e-004, gbest=[0.0019386 -0.0099733]
WARNING: save_graphichandle: handle no more valid ignored.
Iter #66, Fbest=1.032250e-004, gbest=[0.0019386 -0.0099733]
WARNING: save_graphichandle: handle no more valid ignored.
Iter #67, Fbest=1.032250e-004, gbest=[0.0019386 -0.0099733]
WARNING: save_graphichandle: handle no more valid ignored.
Iter #68, Fbest=1.032250e-004, gbest=[0.0019386 -0.0099733]
WARNING: save_graphichandle: handle no more valid ignored.
Iter #69, Fbest=1.032250e-004, gbest=[0.0019386 -0.0099733]
WARNING: save_graphichandle: handle no more valid ignored.
Iter #70, Fbest=1.032250e-004, gbest=[0.0019386 -0.0099733]
WARNING: save_graphichandle: handle no more valid ignored.
Iter #71, Fbest=1.032250e-004, gbest=[0.0019386 -0.0099733]
WARNING: save_graphichandle: handle no more valid ignored.
Iter #72, Fbest=1.032250e-004, gbest=[0.0019386 -0.0099733]
WARNING: save_graphichandle: handle no more valid ignored.
Iter #73, Fbest=1.032250e-004, gbest=[0.0019386 -0.0099733]
WARNING: save_graphichandle: handle no more valid ignored.
	Enabling Starcraft Protoss carrier at iteration
	Sending Raptors
	FTL jump not required
Iter #74, Fbest=1.032250e-004, gbest=[0.0019386 -0.0099733]
WARNING: save_graphichandle: handle no more valid ignored.
Iter #75, Fbest=1.032250e-004, gbest=[0.0019386 -0.0099733]
WARNING: save_graphichandle: handle no more valid ignored.
Iter #76, Fbest=1.032250e-004, gbest=[0.0019386 -0.0099733]
WARNING: save_graphichandle: handle no more valid ignored.
Iter #77, Fbest=1.032250e-004, gbest=[0.0019386 -0.0099733]
WARNING: save_graphichandle: handle no more valid ignored.
Iter #78, Fbest=7.436902e-005, gbest=[0.0056679 -0.0064995]
WARNING: save_graphichandle: handle no more valid ignored.
Iter #79, Fbest=7.436902e-005, gbest=[0.0056679 -0.0064995]
WARNING: save_graphichandle: handle no more valid ignored.
Iter #80, Fbest=7.436902e-005, gbest=[0.0056679 -0.0064995]
WARNING: save_graphichandle: handle no more valid ignored.
Iter #81, Fbest=7.436902e-005, gbest=[0.0056679 -0.0064995]
WARNING: save_graphichandle: handle no more valid ignored.
Iter #82, Fbest=7.436902e-005, gbest=[0.0056679 -0.0064995]
WARNING: save_graphichandle: handle no more valid ignored.
Iter #83, Fbest=2.715326e-005, gbest=[-0.0002505 -0.0052049]
WARNING: save_graphichandle: handle no more valid ignored.
Iter #84, Fbest=5.570563e-006, gbest=[-0.0023154 0.0004577]
WARNING: save_graphichandle: handle no more valid ignored.
Iter #85, Fbest=5.570563e-006, gbest=[-0.0023154 0.0004577]
WARNING: save_graphichandle: handle no more valid ignored.
Iter #86, Fbest=1.018658e-006, gbest=[-0.0001812 -0.0009929]
WARNING: save_graphichandle: handle no more valid ignored.
Iter #87, Fbest=1.018658e-006, gbest=[-0.0001812 -0.0009929]
WARNING: save_graphichandle: handle no more valid ignored.
Iter #88, Fbest=8.830178e-007, gbest=[-0.0003732 -0.0008624]
WARNING: save_graphichandle: handle no more valid ignored.
Iter #89, Fbest=8.830178e-007, gbest=[-0.0003732 -0.0008624]
WARNING: save_graphichandle: handle no more valid ignored.
Iter #90, Fbest=7.097547e-007, gbest=[-0.0001583 -0.0008275]
WARNING: save_graphichandle: handle no more valid ignored.
Iter #91, Fbest=7.097547e-007, gbest=[-0.0001583 -0.0008275]
WARNING: save_graphichandle: handle no more valid ignored.
	Enabling Starcraft Protoss carrier at iteration
	Sending Raptors
	Gain =-2.278715e-006
	Enabling FTL jump
Iter #92, Fbest=4.348059e-008, gbest=[-0.0001884 -0.0000894]
WARNING: save_graphichandle: handle no more valid ignored.
Iter #93, Fbest=4.348059e-008, gbest=[-0.0001884 -0.0000894]
WARNING: save_graphichandle: handle no more valid ignored.
Iter #94, Fbest=4.348059e-008, gbest=[-0.0001884 -0.0000894]
WARNING: save_graphichandle: handle no more valid ignored.
Iter #95, Fbest=4.348059e-008, gbest=[-0.0001884 -0.0000894]
WARNING: save_graphichandle: handle no more valid ignored.
Iter #96, Fbest=4.348059e-008, gbest=[-0.0001884 -0.0000894]
WARNING: save_graphichandle: handle no more valid ignored.
Iter #97, Fbest=4.348059e-008, gbest=[-0.0001884 -0.0000894]
WARNING: save_graphichandle: handle no more valid ignored.
Iter #98, Fbest=4.348059e-008, gbest=[-0.0001884 -0.0000894]
WARNING: save_graphichandle: handle no more valid ignored.
Iter #99, Fbest=4.348059e-008, gbest=[-0.0001884 -0.0000894]
WARNING: save_graphichandle: handle no more valid ignored.
	Enabling Starcraft Protoss carrier at iteration
	Sending Raptors
	FTL jump not required
assert_checkalmostequal ( fopt , 0 , [], 1.e-1 );
assert_checkalmostequal ( xopt , zeros(1,D) , [], 1.e-1 );
