// Copyright (C) 2015 - Michael Baudin
//
// This file must be used under the terms of the GNU Lesser General Public License license :
// http://www.gnu.org/copyleft/lesser.html
x=linspace(-0.99,0.99,10);
y=chebyshev_weight(x);
exact=[
    7.08881205008335424  
    1.56729031107337446  
    1.19736868017849929  
    1.05934343172574486  
    1.00610546328873451  
    1.00610546328873451  
    1.05934343172574486  
    1.19736868017849929  
    1.56729031107337446  
    7.08881205008335424  
];
assert_checkalmostequal(y',exact);
// Check integral : must be pi.
v=intg(-1,1,chebyshev_weight);
assert_checkalmostequal(v,%pi);
