PID1999827	PID250000	PID250010et250012	PID999920et1999825	PID999919	PID111111	PID200030et200032	PID7777777	PID8888888	POSITIONGACHE	TUBEFDT	Dx_201417	Dx_204471
1.500000e+000	1.500000e+000	2.000000e+000	3.000000e+000	4.000000e+000	1.500000e+000	3.000000e+000	8.000000e-001	8.000000e-001	1.000000e+000	1.000000e+000	2.170000e+003	2.130000e+003
4.000000e-001	4.000000e-001	1.000000e+000	1.500000e+000	2.000000e+000	4.000000e-001	1.000000e+000	8.000000e-001	8.000000e-001	1.000000e+000	1.000000e+000	2.120000e+003	2.070000e+003
4.000000e-001	4.000000e-001	1.000000e+000	1.500000e+000	5.000000e+000	4.000000e-001	5.000000e+000	8.000000e-001	8.000000e-001	1.000000e+000	1.000000e+000	2.140000e+003	2.090000e+003
4.000000e-001	4.000000e-001	1.000000e+000	4.000000e+000	2.000000e+000	4.000000e-001	1.000000e+000	8.000000e-001	8.000000e-001	2.000000e+000	1.000000e+000	2.140000e+003	2.080000e+003
4.000000e-001	5.000000e+000	4.000000e+000	1.500000e+000	2.000000e+000	4.000000e-001	5.000000e+000	8.000000e-001	8.000000e-001	2.000000e+000	1.000000e+000	2.190000e+003	2.050000e+003
5.000000e+000	4.000000e-001	1.000000e+000	4.000000e+000	2.000000e+000	4.000000e-001	1.000000e+000	8.000000e-001	8.000000e-001	3.000000e+000	1.000000e+000	2.150000e+003	2.080000e+003
5.000000e+000	5.000000e+000	4.000000e+000	1.500000e+000	5.000000e+000	4.000000e-001	1.000000e+000	8.000000e-001	8.000000e-001	3.000000e+000	1.000000e+000	2.170000e+003	2.090000e+003
4.000000e-001	4.000000e-001	4.000000e+000	1.500000e+000	2.000000e+000	1.900000e+000	1.000000e+000	8.000000e-001	8.000000e-001	1.000000e+000	1.000000e+000	2.140000e+003	2.070000e+003
4.000000e-001	5.000000e+000	1.000000e+000	4.000000e+000	5.000000e+000	1.900000e+000	1.000000e+000	8.000000e-001	8.000000e-001	1.000000e+000	1.000000e+000	2.190000e+003	2.140000e+003
5.000000e+000	4.000000e-001	1.000000e+000	1.500000e+000	2.000000e+000	1.900000e+000	1.000000e+000	8.000000e-001	8.000000e-001	2.000000e+000	1.000000e+000	2.140000e+003	2.060000e+003
5.000000e+000	4.000000e-001	1.000000e+000	1.500000e+000	5.000000e+000	1.900000e+000	5.000000e+000	8.000000e-001	8.000000e-001	2.000000e+000	1.000000e+000	2.160000e+003	2.090000e+003
4.000000e-001	4.000000e-001	4.000000e+000	1.500000e+000	2.000000e+000	1.900000e+000	1.000000e+000	8.000000e-001	8.000000e-001	3.000000e+000	1.000000e+000	2.160000e+003	2.070000e+003
4.000000e-001	5.000000e+000	1.000000e+000	4.000000e+000	2.000000e+000	1.900000e+000	5.000000e+000	8.000000e-001	8.000000e-001	3.000000e+000	1.000000e+000	2.190000e+003	2.110000e+003
5.000000e+000	4.000000e-001	4.000000e+000	4.000000e+000	2.000000e+000	3.500000e+000	5.000000e+000	8.000000e-001	8.000000e-001	1.000000e+000	1.000000e+000	2.160000e+003	2.100000e+003
4.000000e-001	5.000000e+000	1.000000e+000	1.500000e+000	2.000000e+000	3.500000e+000	1.000000e+000	8.000000e-001	8.000000e-001	2.000000e+000	1.000000e+000	2.180000e+003	2.080000e+003
4.000000e-001	4.000000e-001	1.000000e+000	1.500000e+000	5.000000e+000	3.500000e+000	1.000000e+000	8.000000e-001	8.000000e-001	3.000000e+000	1.000000e+000	2.150000e+003	2.090000e+003
5.000000e+000	5.000000e+000	1.000000e+000	1.500000e+000	2.000000e+000	5.000000e+000	1.000000e+000	8.000000e-001	8.000000e-001	1.000000e+000	1.000000e+000	2.180000e+003	2.090000e+003
4.000000e-001	4.000000e-001	4.000000e+000	4.000000e+000	5.000000e+000	5.000000e+000	1.000000e+000	8.000000e-001	8.000000e-001	2.000000e+000	1.000000e+000	2.140000e+003	2.100000e+003
4.000000e-001	4.000000e-001	1.000000e+000	1.500000e+000	2.000000e+000	5.000000e+000	5.000000e+000	8.000000e-001	8.000000e-001	3.000000e+000	1.000000e+000	2.170000e+003	2.070000e+003
4.000000e-001	2.300000e+000	1.000000e+000	2.200000e+000	4.700000e+000	4.000000e-001	1.000000e+000	8.000000e-001	8.000000e-001	1.000000e+000	1.000000e+000	2.160000e+003	2.120000e+003
4.000000e-001	2.500000e+000	1.000000e+000	1.800000e+000	4.600000e+000	1.600000e+000	1.000000e+000	8.000000e-001	8.000000e-001	1.000000e+000	1.000000e+000	2.180000e+003	2.110000e+003
4.000000e-001	2.300000e+000	1.000000e+000	3.800000e+000	4.800000e+000	4.000000e-001	1.000000e+000	8.000000e-001	8.000000e-001	1.000000e+000	1.000000e+000	2.160000e+003	2.130000e+003
4.000000e-001	2.700000e+000	1.000000e+000	3.700000e+000	4.800000e+000	4.000000e-001	1.000000e+000	8.000000e-001	8.000000e-001	1.000000e+000	1.000000e+000	2.170000e+003	2.130000e+003
4.000000e-001	2.800000e+000	1.000000e+000	3.700000e+000	4.500000e+000	1.100000e+000	1.000000e+000	8.000000e-001	8.000000e-001	1.000000e+000	1.000000e+000	2.180000e+003	2.130000e+003
4.000000e-001	2.800000e+000	1.100000e+000	3.700000e+000	4.800000e+000	4.000000e-001	1.000000e+000	8.000000e-001	8.000000e-001	1.000000e+000	1.000000e+000	2.170000e+003	2.130000e+003
5.000000e-001	2.300000e+000	1.200000e+000	3.900000e+000	4.800000e+000	4.000000e-001	1.000000e+000	8.000000e-001	8.000000e-001	1.000000e+000	1.000000e+000	2.160000e+003	2.130000e+003
4.000000e-001	3.800000e+000	1.000000e+000	3.400000e+000	4.700000e+000	4.000000e-001	1.000000e+000	8.000000e-001	8.000000e-001	1.000000e+000	1.000000e+000	2.180000e+003	2.140000e+003
2.200000e+000	2.200000e+000	1.600000e+000	2.700000e+000	3.900000e+000	1.100000e+000	1.000000e+000	8.000000e-001	8.000000e-001	1.000000e+000	1.000000e+000	2.170000e+003	2.130000e+003
4.000000e-001	1.100000e+000	1.000000e+000	2.300000e+000	4.700000e+000	2.500000e+000	1.000000e+000	8.000000e-001	8.000000e-001	2.000000e+000	1.000000e+000	2.160000e+003	2.110000e+003
4.000000e-001	1.000000e+000	1.200000e+000	2.600000e+000	4.800000e+000	2.100000e+000	1.000000e+000	8.000000e-001	8.000000e-001	2.000000e+000	1.000000e+000	2.160000e+003	2.120000e+003
4.000000e-001	2.900000e+000	1.000000e+000	1.700000e+000	4.700000e+000	4.000000e-001	1.000000e+000	8.000000e-001	8.000000e-001	2.000000e+000	1.000000e+000	2.170000e+003	2.100000e+003
3.700000e+000	1.000000e+000	1.000000e+000	1.800000e+000	3.600000e+000	1.800000e+000	1.000000e+000	8.000000e-001	8.000000e-001	2.000000e+000	1.000000e+000	2.160000e+003	2.110000e+003
1.800000e+000	1.300000e+000	1.000000e+000	1.700000e+000	4.200000e+000	2.900000e+000	1.000000e+000	8.000000e-001	8.000000e-001	2.000000e+000	1.000000e+000	2.170000e+003	2.110000e+003
2.900000e+000	1.100000e+000	1.000000e+000	1.800000e+000	3.900000e+000	1.700000e+000	1.000000e+000	8.000000e-001	8.000000e-001	2.000000e+000	1.000000e+000	2.160000e+003	2.110000e+003
4.000000e-001	2.900000e+000	1.000000e+000	2.000000e+000	4.600000e+000	2.700000e+000	1.000000e+000	8.000000e-001	8.000000e-001	2.000000e+000	1.000000e+000	2.190000e+003	2.110000e+003
4.000000e-001	3.000000e+000	1.000000e+000	2.600000e+000	4.700000e+000	4.000000e-001	1.000000e+000	8.000000e-001	8.000000e-001	2.000000e+000	1.000000e+000	2.180000e+003	2.120000e+003
4.000000e-001	2.800000e+000	1.000000e+000	2.800000e+000	4.700000e+000	4.000000e-001	1.000000e+000	8.000000e-001	8.000000e-001	2.000000e+000	1.000000e+000	2.180000e+003	2.120000e+003
4.000000e-001	2.400000e+000	1.000000e+000	2.500000e+000	4.500000e+000	4.400000e+000	1.000000e+000	8.000000e-001	8.000000e-001	2.000000e+000	1.000000e+000	2.190000e+003	2.120000e+003
2.000000e+000	3.700000e+000	2.000000e+000	2.200000e+000	3.200000e+000	2.600000e+000	1.200000e+000	8.000000e-001	8.000000e-001	2.000000e+000	1.000000e+000	2.190000e+003	2.110000e+003
3.900000e+000	4.000000e+000	1.000000e+000	3.000000e+000	3.400000e+000	3.300000e+000	1.000000e+000	8.000000e-001	8.000000e-001	2.000000e+000	1.000000e+000	2.190000e+003	2.130000e+003
4.000000e-001	3.000000e+000	1.000000e+000	1.500000e+000	4.600000e+000	2.400000e+000	1.000000e+000	8.000000e-001	8.000000e-001	3.000000e+000	1.000000e+000	2.190000e+003	2.090000e+003
4.000000e-001	3.600000e+000	1.000000e+000	1.500000e+000	4.500000e+000	5.000000e+000	1.000000e+000	8.000000e-001	8.000000e-001	3.000000e+000	1.000000e+000	2.190000e+003	2.100000e+003
4.000000e-001	3.000000e+000	1.000000e+000	2.600000e+000	4.600000e+000	2.300000e+000	1.000000e+000	8.000000e-001	8.000000e-001	3.000000e+000	1.000000e+000	2.190000e+003	2.120000e+003
4.000000e-001	5.000000e+000	1.000000e+000	1.500000e+000	4.700000e+000	2.600000e+000	1.000000e+000	8.000000e-001	8.000000e-001	3.000000e+000	1.000000e+000	2.180000e+003	2.080000e+003
4.000000e-001	3.700000e+000	1.000000e+000	2.400000e+000	4.500000e+000	5.000000e+000	1.000000e+000	8.000000e-001	8.000000e-001	3.000000e+000	1.000000e+000	2.190000e+003	2.120000e+003
4.000000e-001	3.600000e+000	1.000000e+000	3.000000e+000	4.700000e+000	1.500000e+000	1.000000e+000	8.000000e-001	8.000000e-001	3.000000e+000	1.000000e+000	2.190000e+003	2.120000e+003
4.000000e-001	3.200000e+000	1.000000e+000	3.500000e+000	4.700000e+000	1.400000e+000	1.000000e+000	8.000000e-001	8.000000e-001	3.000000e+000	1.000000e+000	2.190000e+003	2.130000e+003
4.000000e-001	3.100000e+000	1.000000e+000	4.000000e+000	4.800000e+000	4.000000e-001	1.000000e+000	8.000000e-001	8.000000e-001	3.000000e+000	1.000000e+000	2.180000e+003	2.130000e+003
4.100000e+000	2.000000e+000	1.000000e+000	2.300000e+000	3.500000e+000	4.000000e-001	1.000000e+000	8.000000e-001	8.000000e-001	3.000000e+000	1.000000e+000	2.180000e+003	2.120000e+003
1.200000e+000	2.900000e+000	1.000000e+000	2.200000e+000	4.200000e+000	5.000000e+000	1.000000e+000	8.000000e-001	8.000000e-001	3.000000e+000	1.000000e+000	2.190000e+003	2.120000e+003
2.500000e+000	3.000000e+000	1.000000e+000	2.000000e+000	3.900000e+000	3.300000e+000	1.000000e+000	8.000000e-001	8.000000e-001	3.000000e+000	1.000000e+000	2.190000e+003	2.110000e+003
4.000000e-001	4.800000e+000	1.000000e+000	3.800000e+000	4.700000e+000	3.600000e+000	1.000000e+000	8.000000e-001	8.000000e-001	3.000000e+000	1.000000e+000	2.190000e+003	2.140000e+003
4.000000e-001	5.000000e+000	1.000000e+000	4.000000e+000	4.800000e+000	2.100000e+000	1.000000e+000	8.000000e-001	8.000000e-001	3.000000e+000	1.000000e+000	2.180000e+003	2.130000e+003
5.000000e+000	2.900000e+000	1.000000e+000	1.500000e+000	3.800000e+000	5.000000e+000	1.000000e+000	8.000000e-001	8.000000e-001	3.000000e+000	1.000000e+000	2.190000e+003	2.100000e+003
1.400000e+000	4.100000e+000	1.000000e+000	4.000000e+000	4.500000e+000	4.000000e-001	1.200000e+000	8.000000e-001	8.000000e-001	3.000000e+000	1.000000e+000	2.180000e+003	2.130000e+003
7.000000e-001	4.900000e+000	3.700000e+000	3.600000e+000	4.000000e+000	5.000000e+000	1.100000e+000	8.000000e-001	8.000000e-001	1.000000e+000	1.000000e+000	2.190000e+003	2.140000e+003
4.700000e+000	2.400000e+000	3.300000e+000	2.700000e+000	3.600000e+000	3.800000e+000	1.200000e+000	8.000000e-001	8.000000e-001	3.000000e+000	1.000000e+000	2.190000e+003	2.120000e+003
5.000000e+000	4.800000e+000	2.100000e+000	1.500000e+000	2.100000e+000	2.900000e+000	2.300000e+000	8.000000e-001	8.000000e-001	3.000000e+000	1.000000e+000	2.180000e+003	2.080000e+003
4.000000e+000	4.700000e+000	1.600000e+000	2.100000e+000	2.900000e+000	2.100000e+000	2.100000e+000	8.000000e-001	8.000000e-001	3.000000e+000	1.000000e+000	2.190000e+003	2.100000e+003
1.600000e+000	4.900000e+000	3.100000e+000	2.500000e+000	2.400000e+000	3.400000e+000	2.600000e+000	8.000000e-001	8.000000e-001	1.000000e+000	1.000000e+000	2.190000e+003	2.120000e+003
1.500000e+000	4.800000e+000	2.600000e+000	2.600000e+000	3.100000e+000	3.400000e+000	3.000000e+000	8.000000e-001	8.000000e-001	2.000000e+000	1.000000e+000	2.190000e+003	2.110000e+003
2.300000e+000	4.500000e+000	3.300000e+000	4.000000e+000	2.000000e+000	1.600000e+000	2.700000e+000	8.000000e-001	8.000000e-001	3.000000e+000	1.000000e+000	2.190000e+003	2.120000e+003
4.600000e+000	3.600000e+000	2.100000e+000	2.000000e+000	2.600000e+000	4.400000e+000	3.400000e+000	8.000000e-001	8.000000e-001	3.000000e+000	1.000000e+000	2.190000e+003	2.110000e+003
4.100000e+000	2.600000e+000	1.400000e+000	3.200000e+000	2.000000e+000	5.000000e-001	4.300000e+000	8.000000e-001	8.000000e-001	3.000000e+000	1.000000e+000	2.180000e+003	2.120000e+003
4.000000e-001	2.000000e+000	1.600000e+000	2.600000e+000	4.700000e+000	2.400000e+000	1.000000e+000	8.000000e-001	8.000000e-001	1.000000e+000	1.000000e+000	2.170000e+003	2.130000e+003
4.000000e-001	2.700000e+000	1.200000e+000	3.500000e+000	4.400000e+000	4.000000e-001	1.000000e+000	8.000000e-001	8.000000e-001	1.000000e+000	1.000000e+000	2.170000e+003	2.130000e+003
4.000000e-001	2.900000e+000	1.400000e+000	2.500000e+000	4.400000e+000	2.500000e+000	1.100000e+000	8.000000e-001	8.000000e-001	1.000000e+000	1.000000e+000	2.190000e+003	2.120000e+003
4.000000e-001	2.900000e+000	1.100000e+000	2.900000e+000	4.700000e+000	2.000000e+000	1.000000e+000	8.000000e-001	8.000000e-001	1.000000e+000	1.000000e+000	2.180000e+003	2.130000e+003
4.000000e-001	3.100000e+000	2.000000e+000	2.600000e+000	4.400000e+000	3.200000e+000	1.000000e+000	8.000000e-001	8.000000e-001	1.000000e+000	1.000000e+000	2.190000e+003	2.120000e+003
4.000000e-001	2.800000e+000	1.500000e+000	2.700000e+000	4.600000e+000	2.700000e+000	1.200000e+000	8.000000e-001	8.000000e-001	1.000000e+000	1.000000e+000	2.190000e+003	2.130000e+003
9.000000e-001	2.500000e+000	1.000000e+000	1.900000e+000	4.600000e+000	3.600000e+000	1.300000e+000	8.000000e-001	8.000000e-001	1.000000e+000	1.000000e+000	2.190000e+003	2.120000e+003
9.000000e-001	2.600000e+000	1.300000e+000	2.100000e+000	4.300000e+000	3.800000e+000	1.300000e+000	8.000000e-001	8.000000e-001	1.000000e+000	1.000000e+000	2.190000e+003	2.120000e+003
4.000000e-001	3.200000e+000	1.700000e+000	3.000000e+000	4.400000e+000	1.900000e+000	1.400000e+000	8.000000e-001	8.000000e-001	1.000000e+000	1.000000e+000	2.190000e+003	2.130000e+003
1.500000e+000	2.400000e+000	1.000000e+000	2.300000e+000	4.400000e+000	1.900000e+000	1.400000e+000	8.000000e-001	8.000000e-001	1.000000e+000	1.000000e+000	2.180000e+003	2.120000e+003
2.000000e+000	1.900000e+000	1.000000e+000	2.600000e+000	3.900000e+000	3.200000e+000	1.600000e+000	8.000000e-001	8.000000e-001	1.000000e+000	1.000000e+000	2.180000e+003	2.130000e+003
1.200000e+000	2.900000e+000	1.100000e+000	2.100000e+000	4.100000e+000	4.100000e+000	1.600000e+000	8.000000e-001	8.000000e-001	1.000000e+000	1.000000e+000	2.190000e+003	2.120000e+003
4.000000e-001	3.300000e+000	2.100000e+000	3.500000e+000	4.200000e+000	1.500000e+000	1.500000e+000	8.000000e-001	8.000000e-001	1.000000e+000	1.000000e+000	2.190000e+003	2.130000e+003
4.000000e-001	1.600000e+000	1.000000e+000	2.200000e+000	4.900000e+000	1.600000e+000	1.000000e+000	8.000000e-001	8.000000e-001	2.000000e+000	1.000000e+000	2.170000e+003	2.120000e+003
4.000000e-001	1.600000e+000	1.000000e+000	2.600000e+000	4.500000e+000	8.000000e-001	1.000000e+000	8.000000e-001	8.000000e-001	2.000000e+000	1.000000e+000	2.160000e+003	2.120000e+003
4.000000e-001	2.400000e+000	2.200000e+000	3.900000e+000	4.800000e+000	7.000000e-001	1.100000e+000	8.000000e-001	8.000000e-001	2.000000e+000	1.000000e+000	2.170000e+003	2.130000e+003
4.000000e-001	2.900000e+000	1.100000e+000	2.500000e+000	4.400000e+000	2.700000e+000	1.200000e+000	8.000000e-001	8.000000e-001	2.000000e+000	1.000000e+000	2.190000e+003	2.120000e+003
8.000000e-001	3.000000e+000	1.000000e+000	2.600000e+000	4.300000e+000	1.900000e+000	1.400000e+000	8.000000e-001	8.000000e-001	2.000000e+000	1.000000e+000	2.190000e+003	2.120000e+003
4.000000e-001	3.400000e+000	1.600000e+000	2.700000e+000	4.200000e+000	3.300000e+000	1.300000e+000	8.000000e-001	8.000000e-001	2.000000e+000	1.000000e+000	2.190000e+003	2.120000e+003
6.000000e-001	2.700000e+000	1.000000e+000	2.500000e+000	4.600000e+000	1.800000e+000	1.000000e+000	8.000000e-001	8.000000e-001	2.000000e+000	1.000000e+000	2.190000e+003	2.120000e+003
7.000000e-001	2.700000e+000	1.000000e+000	2.600000e+000	4.500000e+000	1.300000e+000	1.000000e+000	8.000000e-001	8.000000e-001	2.000000e+000	1.000000e+000	2.180000e+003	2.120000e+003
4.000000e-001	3.100000e+000	1.600000e+000	3.600000e+000	4.300000e+000	6.000000e-001	1.200000e+000	8.000000e-001	8.000000e-001	2.000000e+000	1.000000e+000	2.180000e+003	2.130000e+003
4.000000e-001	2.900000e+000	1.200000e+000	2.800000e+000	4.400000e+000	1.900000e+000	1.000000e+000	8.000000e-001	8.000000e-001	2.000000e+000	1.000000e+000	2.190000e+003	2.120000e+003
4.000000e-001	3.100000e+000	1.100000e+000	2.500000e+000	4.500000e+000	3.000000e+000	1.000000e+000	8.000000e-001	8.000000e-001	2.000000e+000	1.000000e+000	2.190000e+003	2.120000e+003
4.000000e-001	2.900000e+000	1.000000e+000	2.700000e+000	4.500000e+000	4.100000e+000	1.000000e+000	8.000000e-001	8.000000e-001	2.000000e+000	1.000000e+000	2.190000e+003	2.130000e+003
1.400000e+000	2.700000e+000	1.000000e+000	2.300000e+000	4.400000e+000	2.800000e+000	1.000000e+000	8.000000e-001	8.000000e-001	2.000000e+000	1.000000e+000	2.190000e+003	2.120000e+003
4.000000e-001	2.800000e+000	1.000000e+000	3.300000e+000	3.800000e+000	4.000000e-001	1.000000e+000	8.000000e-001	8.000000e-001	2.000000e+000	1.000000e+000	2.180000e+003	2.120000e+003
4.000000e-001	3.500000e+000	1.300000e+000	3.600000e+000	4.400000e+000	1.500000e+000	1.100000e+000	8.000000e-001	8.000000e-001	2.000000e+000	1.000000e+000	2.190000e+003	2.130000e+003
4.000000e-001	4.500000e+000	1.000000e+000	3.200000e+000	4.400000e+000	2.500000e+000	1.100000e+000	8.000000e-001	8.000000e-001	2.000000e+000	1.000000e+000	2.190000e+003	2.130000e+003
4.000000e-001	9.000000e-001	1.000000e+000	3.000000e+000	4.800000e+000	4.000000e-001	1.000000e+000	8.000000e-001	8.000000e-001	3.000000e+000	1.000000e+000	2.160000e+003	2.110000e+003
4.000000e-001	1.100000e+000	1.000000e+000	2.800000e+000	5.000000e+000	6.000000e-001	1.000000e+000	8.000000e-001	8.000000e-001	3.000000e+000	1.000000e+000	2.160000e+003	2.120000e+003
5.000000e-001	1.700000e+000	1.000000e+000	2.600000e+000	4.600000e+000	4.000000e-001	1.000000e+000	8.000000e-001	8.000000e-001	3.000000e+000	1.000000e+000	2.170000e+003	2.120000e+003
4.000000e-001	1.600000e+000	1.100000e+000	2.400000e+000	4.500000e+000	2.900000e+000	1.000000e+000	8.000000e-001	8.000000e-001	3.000000e+000	1.000000e+000	2.180000e+003	2.120000e+003
4.000000e-001	1.700000e+000	1.000000e+000	2.400000e+000	4.500000e+000	2.500000e+000	1.000000e+000	8.000000e-001	8.000000e-001	3.000000e+000	1.000000e+000	2.180000e+003	2.120000e+003
4.000000e-001	2.000000e+000	1.000000e+000	2.800000e+000	4.500000e+000	4.000000e-001	1.000000e+000	8.000000e-001	8.000000e-001	3.000000e+000	1.000000e+000	2.170000e+003	2.120000e+003
4.000000e-001	3.200000e+000	1.000000e+000	3.400000e+000	4.700000e+000	4.000000e-001	1.000000e+000	8.000000e-001	8.000000e-001	3.000000e+000	1.000000e+000	2.180000e+003	2.130000e+003
9.000000e-001	2.100000e+000	1.300000e+000	3.000000e+000	4.600000e+000	4.000000e-001	1.000000e+000	8.000000e-001	8.000000e-001	3.000000e+000	1.000000e+000	2.170000e+003	2.130000e+003
4.000000e-001	3.200000e+000	1.300000e+000	3.500000e+000	4.400000e+000	7.000000e-001	1.000000e+000	8.000000e-001	8.000000e-001	3.000000e+000	1.000000e+000	2.180000e+003	2.120000e+003
4.000000e-001	3.600000e+000	1.000000e+000	2.900000e+000	4.400000e+000	2.900000e+000	1.000000e+000	8.000000e-001	8.000000e-001	3.000000e+000	1.000000e+000	2.190000e+003	2.120000e+003
6.000000e-001	3.300000e+000	1.000000e+000	3.000000e+000	4.400000e+000	1.300000e+000	1.000000e+000	8.000000e-001	8.000000e-001	3.000000e+000	1.000000e+000	2.190000e+003	2.120000e+003
4.000000e-001	3.300000e+000	1.200000e+000	3.100000e+000	4.800000e+000	1.300000e+000	1.100000e+000	8.000000e-001	8.000000e-001	3.000000e+000	1.000000e+000	2.180000e+003	2.130000e+003
1.600000e+000	2.700000e+000	1.000000e+000	2.700000e+000	4.300000e+000	5.000000e-001	1.000000e+000	8.000000e-001	8.000000e-001	3.000000e+000	1.000000e+000	2.180000e+003	2.130000e+003
4.000000e-001	3.300000e+000	1.600000e+000	3.800000e+000	4.300000e+000	6.000000e-001	1.200000e+000	8.000000e-001	8.000000e-001	3.000000e+000	1.000000e+000	2.180000e+003	2.130000e+003
4.000000e-001	3.600000e+000	1.200000e+000	3.500000e+000	4.800000e+000	8.000000e-001	1.100000e+000	8.000000e-001	8.000000e-001	3.000000e+000	1.000000e+000	2.180000e+003	2.130000e+003
4.000000e-001	1.500000e+000	1.000000e+000	2.000000e+000	5.000000e+000	2.200000e+000	1.000000e+000	8.000000e-001	8.000000e-001	1.000000e+000	1.000000e+000	2.170000e+003	2.120000e+003
4.000000e-001	9.000000e-001	1.000000e+000	2.400000e+000	5.000000e+000	4.000000e-001	1.000000e+000	8.000000e-001	8.000000e-001	1.000000e+000	1.000000e+000	2.130000e+003	2.120000e+003
4.000000e-001	8.000000e-001	1.000000e+000	3.400000e+000	5.000000e+000	4.000000e-001	1.000000e+000	8.000000e-001	8.000000e-001	1.000000e+000	1.000000e+000	2.130000e+003	2.120000e+003
4.000000e-001	9.000000e-001	1.000000e+000	3.500000e+000	5.000000e+000	9.000000e-001	1.000000e+000	8.000000e-001	8.000000e-001	1.000000e+000	1.000000e+000	2.140000e+003	2.120000e+003
4.000000e-001	1.000000e+000	1.000000e+000	2.300000e+000	5.000000e+000	4.000000e-001	1.000000e+000	8.000000e-001	8.000000e-001	1.000000e+000	1.000000e+000	2.130000e+003	2.120000e+003
4.000000e-001	1.000000e+000	1.000000e+000	3.000000e+000	5.000000e+000	4.000000e-001	1.000000e+000	8.000000e-001	8.000000e-001	1.000000e+000	1.000000e+000	2.130000e+003	2.120000e+003
4.000000e-001	1.000000e+000	1.000000e+000	3.200000e+000	5.000000e+000	4.000000e-001	1.000000e+000	8.000000e-001	8.000000e-001	1.000000e+000	1.000000e+000	2.130000e+003	2.120000e+003
4.000000e-001	1.100000e+000	1.000000e+000	2.700000e+000	5.000000e+000	4.000000e-001	1.000000e+000	8.000000e-001	8.000000e-001	1.000000e+000	1.000000e+000	2.140000e+003	2.120000e+003
4.000000e-001	1.100000e+000	1.000000e+000	3.000000e+000	5.000000e+000	4.000000e-001	1.000000e+000	8.000000e-001	8.000000e-001	1.000000e+000	1.000000e+000	2.140000e+003	2.120000e+003
4.000000e-001	1.300000e+000	1.000000e+000	3.000000e+000	5.000000e+000	8.000000e-001	1.000000e+000	8.000000e-001	8.000000e-001	1.000000e+000	1.000000e+000	2.150000e+003	2.130000e+003
4.000000e-001	1.200000e+000	1.000000e+000	3.000000e+000	5.000000e+000	4.000000e-001	1.000000e+000	8.000000e-001	8.000000e-001	1.000000e+000	1.000000e+000	2.140000e+003	2.120000e+003
5.000000e-001	1.200000e+000	1.000000e+000	2.300000e+000	5.000000e+000	4.000000e-001	1.000000e+000	8.000000e-001	8.000000e-001	1.000000e+000	1.000000e+000	2.140000e+003	2.120000e+003
4.000000e-001	1.200000e+000	1.000000e+000	3.100000e+000	5.000000e+000	4.000000e-001	1.000000e+000	8.000000e-001	8.000000e-001	1.000000e+000	1.000000e+000	2.140000e+003	2.120000e+003
5.000000e-001	1.200000e+000	1.000000e+000	2.400000e+000	5.000000e+000	4.000000e-001	1.000000e+000	8.000000e-001	8.000000e-001	1.000000e+000	1.000000e+000	2.140000e+003	2.120000e+003
4.000000e-001	1.300000e+000	1.000000e+000	3.000000e+000	5.000000e+000	6.000000e-001	1.000000e+000	8.000000e-001	8.000000e-001	1.000000e+000	1.000000e+000	2.150000e+003	2.130000e+003
4.000000e-001	1.500000e+000	1.000000e+000	3.100000e+000	5.000000e+000	4.000000e-001	1.000000e+000	8.000000e-001	8.000000e-001	1.000000e+000	1.000000e+000	2.150000e+003	2.130000e+003
4.000000e-001	1.700000e+000	1.000000e+000	2.400000e+000	5.000000e+000	4.000000e-001	1.000000e+000	8.000000e-001	8.000000e-001	2.000000e+000	1.000000e+000	2.160000e+003	2.120000e+003
4.000000e-001	2.000000e+000	1.000000e+000	2.500000e+000	4.900000e+000	4.000000e-001	1.000000e+000	8.000000e-001	8.000000e-001	2.000000e+000	1.000000e+000	2.170000e+003	2.120000e+003
4.000000e-001	2.100000e+000	1.000000e+000	2.500000e+000	4.800000e+000	4.000000e-001	1.000000e+000	8.000000e-001	8.000000e-001	2.000000e+000	1.000000e+000	2.170000e+003	2.120000e+003
4.000000e-001	2.300000e+000	1.000000e+000	2.700000e+000	4.400000e+000	4.000000e-001	1.000000e+000	8.000000e-001	8.000000e-001	2.000000e+000	1.000000e+000	2.170000e+003	2.120000e+003
4.000000e-001	2.200000e+000	1.000000e+000	2.500000e+000	4.700000e+000	4.000000e-001	1.000000e+000	8.000000e-001	8.000000e-001	2.000000e+000	1.000000e+000	2.170000e+003	2.120000e+003
4.000000e-001	2.400000e+000	1.000000e+000	2.700000e+000	4.300000e+000	4.000000e-001	1.000000e+000	8.000000e-001	8.000000e-001	2.000000e+000	1.000000e+000	2.170000e+003	2.120000e+003
4.000000e-001	2.300000e+000	1.000000e+000	2.600000e+000	4.500000e+000	4.000000e-001	1.000000e+000	8.000000e-001	8.000000e-001	2.000000e+000	1.000000e+000	2.170000e+003	2.120000e+003
4.000000e-001	2.300000e+000	1.000000e+000	2.500000e+000	4.600000e+000	4.000000e-001	1.000000e+000	8.000000e-001	8.000000e-001	2.000000e+000	1.000000e+000	2.170000e+003	2.120000e+003
4.000000e-001	2.000000e+000	1.000000e+000	2.500000e+000	5.000000e+000	4.000000e-001	1.000000e+000	8.000000e-001	8.000000e-001	2.000000e+000	1.000000e+000	2.170000e+003	2.130000e+003
4.000000e-001	2.300000e+000	1.000000e+000	2.600000e+000	4.600000e+000	4.000000e-001	1.000000e+000	8.000000e-001	8.000000e-001	2.000000e+000	1.000000e+000	2.170000e+003	2.120000e+003
4.000000e-001	2.900000e+000	1.000000e+000	3.100000e+000	4.300000e+000	4.000000e-001	1.000000e+000	8.000000e-001	8.000000e-001	3.000000e+000	1.000000e+000	2.180000e+003	2.120000e+003
4.000000e-001	3.000000e+000	1.000000e+000	3.100000e+000	4.300000e+000	4.000000e-001	1.000000e+000	8.000000e-001	8.000000e-001	3.000000e+000	1.000000e+000	2.180000e+003	2.120000e+003
4.000000e-001	3.300000e+000	1.000000e+000	3.200000e+000	4.200000e+000	4.000000e-001	1.000000e+000	8.000000e-001	8.000000e-001	3.000000e+000	1.000000e+000	2.180000e+003	2.120000e+003
4.000000e-001	3.300000e+000	1.000000e+000	3.400000e+000	4.200000e+000	4.000000e-001	1.000000e+000	8.000000e-001	8.000000e-001	3.000000e+000	1.000000e+000	2.180000e+003	2.120000e+003
4.000000e-001	3.300000e+000	1.000000e+000	3.200000e+000	4.400000e+000	4.000000e-001	1.000000e+000	8.000000e-001	8.000000e-001	3.000000e+000	1.000000e+000	2.180000e+003	2.120000e+003
4.000000e-001	3.200000e+000	1.000000e+000	3.400000e+000	4.300000e+000	4.000000e-001	1.000000e+000	8.000000e-001	8.000000e-001	3.000000e+000	1.000000e+000	2.180000e+003	2.120000e+003
4.000000e-001	2.800000e+000	1.000000e+000	3.000000e+000	5.000000e+000	4.000000e-001	1.000000e+000	8.000000e-001	8.000000e-001	3.000000e+000	1.000000e+000	2.180000e+003	2.130000e+003
4.000000e-001	2.600000e+000	1.000000e+000	3.200000e+000	5.000000e+000	4.000000e-001	1.000000e+000	8.000000e-001	8.000000e-001	3.000000e+000	1.000000e+000	2.180000e+003	2.120000e+003
4.000000e-001	3.300000e+000	1.000000e+000	3.400000e+000	4.300000e+000	4.000000e-001	1.000000e+000	8.000000e-001	8.000000e-001	3.000000e+000	1.000000e+000	2.180000e+003	2.120000e+003
4.000000e-001	3.400000e+000	1.000000e+000	3.000000e+000	4.500000e+000	1.300000e+000	1.000000e+000	8.000000e-001	8.000000e-001	3.000000e+000	1.000000e+000	2.190000e+003	2.120000e+003
4.000000e-001	3.200000e+000	1.000000e+000	3.400000e+000	4.400000e+000	4.000000e-001	2.200000e+000	8.000000e-001	8.000000e-001	3.000000e+000	1.000000e+000	2.180000e+003	2.130000e+003
5.000000e+000	5.000000e+000	1.000000e+000	1.500000e+000	2.000000e+000	4.000000e-001	1.000000e+000	1.500000e+000	1.500000e+000	1.000000e+000	1.000000e+000	2.156079e+003	2.031417e+003
5.000000e+000	5.000000e+000	1.000000e+000	1.500000e+000	2.000000e+000	4.000000e-001	1.000000e+000	1.500000e+000	1.500000e+000	2.000000e+000	1.000000e+000	2.161408e+003	2.050080e+003
5.000000e+000	5.000000e+000	4.000000e+000	4.000000e+000	2.000000e+000	4.000000e-001	1.000000e+000	8.000000e-001	8.000000e-001	3.000000e+000	1.000000e+000	2.173614e+003	2.112554e+003
4.000000e-001	1.600000e+000	1.000000e+000	2.200000e+000	4.900000e+000	1.600000e+000	1.500000e+000	8.000000e-001	8.000000e-001	2.000000e+000	1.000000e+000	2.170000e+003	2.120000e+003
4.000000e-001	1.600000e+000	1.000000e+000	2.200000e+000	4.900000e+000	1.600000e+000	2.000000e+000	8.000000e-001	8.000000e-001	2.000000e+000	1.000000e+000	2.170000e+003	2.120000e+003
4.000000e-001	1.800000e+000	1.000000e+000	2.100000e+000	4.500000e+000	4.000000e-001	1.000000e+000	8.000000e-001	8.000000e-001	1.000000e+000	1.000000e+000	2.160000e+003	2.120000e+003
4.000000e-001	1.800000e+000	1.000000e+000	2.200000e+000	4.500000e+000	4.000000e-001	1.000000e+000	8.000000e-001	8.000000e-001	1.000000e+000	1.000000e+000	2.160000e+003	2.120000e+003
4.000000e-001	1.800000e+000	1.000000e+000	2.200000e+000	4.500000e+000	9.000000e-001	1.000000e+000	8.000000e-001	8.000000e-001	1.000000e+000	1.000000e+000	2.160000e+003	2.120000e+003
4.000000e-001	1.900000e+000	1.000000e+000	2.500000e+000	4.400000e+000	4.000000e-001	1.000000e+000	8.000000e-001	8.000000e-001	1.000000e+000	1.000000e+000	2.160000e+003	2.120000e+003
4.000000e-001	2.000000e+000	1.000000e+000	2.600000e+000	4.100000e+000	6.000000e-001	1.000000e+000	8.000000e-001	8.000000e-001	1.000000e+000	1.000000e+000	2.160000e+003	2.120000e+003
4.000000e-001	1.600000e+000	1.000000e+000	2.300000e+000	5.000000e+000	1.300000e+000	1.000000e+000	8.000000e-001	8.000000e-001	1.000000e+000	1.000000e+000	2.160000e+003	2.120000e+003
4.000000e-001	1.700000e+000	1.000000e+000	2.000000e+000	4.900000e+000	2.900000e+000	1.000000e+000	8.000000e-001	8.000000e-001	1.000000e+000	1.000000e+000	2.170000e+003	2.120000e+003
4.000000e-001	1.700000e+000	1.000000e+000	2.000000e+000	4.800000e+000	2.200000e+000	1.100000e+000	8.000000e-001	8.000000e-001	1.000000e+000	1.000000e+000	2.170000e+003	2.120000e+003
4.000000e-001	1.700000e+000	1.000000e+000	2.100000e+000	4.800000e+000	3.100000e+000	1.000000e+000	8.000000e-001	8.000000e-001	1.000000e+000	1.000000e+000	2.170000e+003	2.120000e+003
4.000000e-001	1.700000e+000	1.000000e+000	2.500000e+000	4.700000e+000	1.800000e+000	1.000000e+000	8.000000e-001	8.000000e-001	1.000000e+000	1.000000e+000	2.170000e+003	2.130000e+003
4.000000e-001	1.800000e+000	1.000000e+000	2.900000e+000	4.600000e+000	7.000000e-001	1.000000e+000	8.000000e-001	8.000000e-001	1.000000e+000	1.000000e+000	2.160000e+003	2.130000e+003
4.000000e-001	2.200000e+000	1.000000e+000	2.500000e+000	4.300000e+000	1.600000e+000	1.400000e+000	8.000000e-001	8.000000e-001	2.000000e+000	1.000000e+000	2.180000e+003	2.120000e+003
4.000000e-001	2.200000e+000	1.000000e+000	2.500000e+000	4.300000e+000	2.200000e+000	1.500000e+000	8.000000e-001	8.000000e-001	2.000000e+000	1.000000e+000	2.180000e+003	2.120000e+003
4.000000e-001	2.300000e+000	1.000000e+000	2.500000e+000	4.200000e+000	2.600000e+000	2.000000e+000	8.000000e-001	8.000000e-001	2.000000e+000	1.000000e+000	2.180000e+003	2.120000e+003
4.000000e-001	2.400000e+000	1.000000e+000	2.300000e+000	4.200000e+000	2.600000e+000	2.200000e+000	8.000000e-001	8.000000e-001	2.000000e+000	1.000000e+000	2.190000e+003	2.120000e+003
4.000000e-001	2.400000e+000	1.000000e+000	2.500000e+000	4.100000e+000	2.800000e+000	2.200000e+000	8.000000e-001	8.000000e-001	2.000000e+000	1.000000e+000	2.190000e+003	2.120000e+003
4.000000e-001	2.400000e+000	1.000000e+000	2.500000e+000	4.100000e+000	2.500000e+000	2.300000e+000	8.000000e-001	8.000000e-001	2.000000e+000	1.000000e+000	2.190000e+003	2.120000e+003
4.000000e-001	2.400000e+000	1.000000e+000	2.500000e+000	4.100000e+000	2.600000e+000	2.300000e+000	8.000000e-001	8.000000e-001	2.000000e+000	1.000000e+000	2.190000e+003	2.120000e+003
4.000000e-001	2.400000e+000	1.000000e+000	2.500000e+000	4.100000e+000	2.700000e+000	2.300000e+000	8.000000e-001	8.000000e-001	2.000000e+000	1.000000e+000	2.190000e+003	2.120000e+003
4.000000e-001	3.000000e+000	1.000000e+000	3.200000e+000	4.000000e+000	4.000000e-001	2.200000e+000	8.000000e-001	8.000000e-001	3.000000e+000	1.000000e+000	2.180000e+003	2.120000e+003
4.000000e-001	3.000000e+000	1.000000e+000	3.000000e+000	4.100000e+000	1.100000e+000	2.200000e+000	8.000000e-001	8.000000e-001	3.000000e+000	1.000000e+000	2.190000e+003	2.120000e+003
4.000000e-001	3.000000e+000	1.000000e+000	2.800000e+000	3.700000e+000	2.100000e+000	2.400000e+000	8.000000e-001	8.000000e-001	3.000000e+000	1.000000e+000	2.190000e+003	2.120000e+003
4.000000e-001	3.100000e+000	1.000000e+000	2.800000e+000	4.000000e+000	2.200000e+000	2.600000e+000	8.000000e-001	8.000000e-001	3.000000e+000	1.000000e+000	2.190000e+003	2.120000e+003
4.000000e-001	3.100000e+000	1.000000e+000	2.800000e+000	3.900000e+000	2.200000e+000	2.700000e+000	8.000000e-001	8.000000e-001	3.000000e+000	1.000000e+000	2.190000e+003	2.120000e+003
4.000000e-001	3.100000e+000	1.000000e+000	2.800000e+000	3.900000e+000	2.500000e+000	2.700000e+000	8.000000e-001	8.000000e-001	3.000000e+000	1.000000e+000	2.190000e+003	2.120000e+003
4.000000e-001	3.200000e+000	1.000000e+000	2.900000e+000	3.300000e+000	2.200000e+000	3.200000e+000	8.000000e-001	8.000000e-001	3.000000e+000	1.000000e+000	2.190000e+003	2.110000e+003
4.000000e-001	1.600000e+000	1.000000e+000	2.200000e+000	4.400000e+000	1.400000e+000	1.000000e+000	8.000000e-001	8.000000e-001	1.000000e+000	1.000000e+000	2.160000e+003	2.120000e+003
4.000000e-001	1.500000e+000	1.000000e+000	2.200000e+000	4.200000e+000	1.900000e+000	1.000000e+000	8.000000e-001	8.000000e-001	1.000000e+000	1.000000e+000	2.160000e+003	2.120000e+003
4.000000e-001	1.500000e+000	1.000000e+000	2.200000e+000	4.300000e+000	2.000000e+000	1.000000e+000	8.000000e-001	8.000000e-001	1.000000e+000	1.000000e+000	2.160000e+003	2.120000e+003
4.000000e-001	1.500000e+000	1.000000e+000	2.200000e+000	4.400000e+000	2.000000e+000	1.000000e+000	8.000000e-001	8.000000e-001	1.000000e+000	1.000000e+000	2.160000e+003	2.120000e+003
4.000000e-001	1.500000e+000	1.000000e+000	2.200000e+000	4.400000e+000	1.700000e+000	1.000000e+000	8.000000e-001	8.000000e-001	1.000000e+000	1.000000e+000	2.160000e+003	2.120000e+003
4.000000e-001	1.500000e+000	1.000000e+000	2.200000e+000	4.400000e+000	1.600000e+000	1.000000e+000	8.000000e-001	8.000000e-001	1.000000e+000	1.000000e+000	2.160000e+003	2.120000e+003
4.000000e-001	1.500000e+000	1.000000e+000	2.200000e+000	4.400000e+000	1.500000e+000	1.000000e+000	8.000000e-001	8.000000e-001	1.000000e+000	1.000000e+000	2.160000e+003	2.120000e+003
4.000000e-001	1.500000e+000	1.000000e+000	2.200000e+000	4.500000e+000	2.000000e+000	1.000000e+000	8.000000e-001	8.000000e-001	1.000000e+000	1.000000e+000	2.160000e+003	2.120000e+003
4.000000e-001	1.500000e+000	1.000000e+000	2.200000e+000	4.500000e+000	1.900000e+000	1.000000e+000	8.000000e-001	8.000000e-001	1.000000e+000	1.000000e+000	2.160000e+003	2.120000e+003
4.000000e-001	1.500000e+000	1.000000e+000	2.200000e+000	4.500000e+000	1.800000e+000	1.000000e+000	8.000000e-001	8.000000e-001	1.000000e+000	1.000000e+000	2.160000e+003	2.120000e+003
4.000000e-001	1.800000e+000	1.000000e+000	2.200000e+000	4.500000e+000	1.800000e+000	1.400000e+000	8.000000e-001	8.000000e-001	2.000000e+000	1.000000e+000	2.180000e+003	2.120000e+003
4.000000e-001	1.800000e+000	1.000000e+000	2.300000e+000	4.500000e+000	1.700000e+000	1.400000e+000	8.000000e-001	8.000000e-001	2.000000e+000	1.000000e+000	2.170000e+003	2.120000e+003
4.000000e-001	1.900000e+000	1.000000e+000	2.300000e+000	4.500000e+000	2.000000e+000	1.400000e+000	8.000000e-001	8.000000e-001	2.000000e+000	1.000000e+000	2.180000e+003	2.120000e+003
4.000000e-001	1.900000e+000	1.000000e+000	2.300000e+000	4.500000e+000	1.900000e+000	1.400000e+000	8.000000e-001	8.000000e-001	2.000000e+000	1.000000e+000	2.180000e+003	2.120000e+003
4.000000e-001	1.900000e+000	1.000000e+000	2.300000e+000	4.500000e+000	1.800000e+000	1.400000e+000	8.000000e-001	8.000000e-001	2.000000e+000	1.000000e+000	2.180000e+003	2.120000e+003
4.000000e-001	1.900000e+000	1.000000e+000	2.300000e+000	4.500000e+000	1.600000e+000	1.400000e+000	8.000000e-001	8.000000e-001	2.000000e+000	1.000000e+000	2.180000e+003	2.120000e+003
4.000000e-001	1.900000e+000	1.000000e+000	2.300000e+000	4.500000e+000	1.400000e+000	1.400000e+000	8.000000e-001	8.000000e-001	2.000000e+000	1.000000e+000	2.170000e+003	2.120000e+003
4.000000e-001	1.900000e+000	1.000000e+000	2.300000e+000	4.600000e+000	1.200000e+000	1.400000e+000	8.000000e-001	8.000000e-001	2.000000e+000	1.000000e+000	2.170000e+003	2.120000e+003
4.000000e-001	1.700000e+000	1.000000e+000	2.100000e+000	4.400000e+000	1.800000e+000	1.100000e+000	8.000000e-001	8.000000e-001	2.000000e+000	1.000000e+000	2.170000e+003	2.120000e+003
4.000000e-001	1.800000e+000	1.000000e+000	2.100000e+000	4.500000e+000	2.200000e+000	1.100000e+000	8.000000e-001	8.000000e-001	2.000000e+000	1.000000e+000	2.180000e+003	2.120000e+003
4.000000e-001	1.800000e+000	1.100000e+000	2.100000e+000	4.400000e+000	2.200000e+000	1.100000e+000	8.000000e-001	8.000000e-001	2.000000e+000	1.000000e+000	2.180000e+003	2.120000e+003
4.000000e-001	1.800000e+000	1.000000e+000	2.200000e+000	4.500000e+000	1.900000e+000	1.100000e+000	8.000000e-001	8.000000e-001	2.000000e+000	1.000000e+000	2.170000e+003	2.120000e+003
4.000000e-001	2.900000e+000	1.000000e+000	3.000000e+000	4.000000e+000	9.000000e-001	2.200000e+000	8.000000e-001	8.000000e-001	3.000000e+000	1.000000e+000	2.180000e+003	2.120000e+003
4.000000e-001	3.100000e+000	1.000000e+000	3.000000e+000	4.000000e+000	1.200000e+000	2.100000e+000	8.000000e-001	8.000000e-001	3.000000e+000	1.000000e+000	2.190000e+003	2.120000e+003
4.000000e-001	2.900000e+000	1.000000e+000	3.000000e+000	4.000000e+000	8.000000e-001	2.000000e+000	8.000000e-001	8.000000e-001	3.000000e+000	1.000000e+000	2.180000e+003	2.120000e+003
4.000000e-001	3.000000e+000	1.000000e+000	3.000000e+000	4.100000e+000	8.000000e-001	1.900000e+000	8.000000e-001	8.000000e-001	3.000000e+000	1.000000e+000	2.180000e+003	2.120000e+003
4.000000e-001	1.500000e+000	1.000000e+000	1.900000e+000	4.500000e+000	2.500000e+000	1.000000e+000	8.000000e-001	8.000000e-001	1.000000e+000	1.000000e+000	2.170000e+003	2.120000e+003
4.000000e-001	1.800000e+000	1.000000e+000	2.200000e+000	4.400000e+000	1.800000e+000	1.000000e+000	8.000000e-001	8.000000e-001	2.000000e+000	1.000000e+000	2.170000e+003	2.120000e+003
4.000000e-001	1.900000e+000	1.000000e+000	2.200000e+000	4.400000e+000	1.500000e+000	1.000000e+000	8.000000e-001	8.000000e-001	2.000000e+000	1.000000e+000	2.170000e+003	2.120000e+003
4.000000e-001	2.800000e+000	1.000000e+000	3.000000e+000	4.200000e+000	1.600000e+000	1.600000e+000	8.000000e-001	8.000000e-001	3.000000e+000	1.000000e+000	2.190000e+003	2.120000e+003
4.000000e-001	1.600000e+000	1.000000e+000	2.200000e+000	4.400000e+000	1.400000e+000	1.000000e+000	8.000000e-001	8.000000e-001	4.000000e+000	1.000000e+000	2.170000e+003	2.120000e+003
4.000000e-001	1.500000e+000	1.000000e+000	2.000000e+000	5.000000e+000	2.200000e+000	1.000000e+000	8.000000e-001	8.000000e-001	4.000000e+000	1.000000e+000	2.170000e+003	2.120000e+003
4.000000e-001	1.800000e+000	1.000000e+000	2.200000e+000	4.500000e+000	9.000000e-001	1.000000e+000	8.000000e-001	8.000000e-001	4.000000e+000	1.000000e+000	2.170000e+003	2.120000e+003
2.100000e+000	3.400000e+000	1.500000e+000	2.900000e+000	3.500000e+000	2.600000e+000	2.600000e+000	8.000000e-001	8.000000e-001	1.000000e+000	1.000000e+000	2.190080e+003	2.127639e+003
2.000000e+000	3.700000e+000	2.000000e+000	2.500000e+000	3.400000e+000	3.100000e+000	2.800000e+000	8.000000e-001	8.000000e-001	1.000000e+000	1.000000e+000	2.189892e+003	2.121357e+003
7.000000e-001	3.500000e+000	2.300000e+000	3.500000e+000	4.600000e+000	2.300000e+000	2.900000e+000	8.000000e-001	8.000000e-001	1.000000e+000	1.000000e+000	2.188907e+003	2.132778e+003
1.500000e+000	3.900000e+000	2.000000e+000	3.200000e+000	3.700000e+000	2.900000e+000	2.800000e+000	8.000000e-001	8.000000e-001	1.000000e+000	1.000000e+000	2.190854e+003	2.131773e+003
1.000000e+000	3.400000e+000	2.800000e+000	3.600000e+000	3.900000e+000	2.500000e+000	3.000000e+000	8.000000e-001	8.000000e-001	1.000000e+000	1.000000e+000	2.189137e+003	2.131167e+003
2.000000e+000	3.800000e+000	2.300000e+000	3.200000e+000	3.400000e+000	3.500000e+000	3.000000e+000	8.000000e-001	8.000000e-001	1.000000e+000	1.000000e+000	2.190645e+003	2.131821e+003
1.800000e+000	3.500000e+000	2.600000e+000	3.000000e+000	3.800000e+000	1.900000e+000	3.200000e+000	8.000000e-001	8.000000e-001	1.000000e+000	1.000000e+000	2.188164e+003	2.129738e+003
1.600000e+000	5.000000e+000	2.700000e+000	2.800000e+000	3.200000e+000	2.100000e+000	3.300000e+000	8.000000e-001	8.000000e-001	1.000000e+000	1.000000e+000	2.191866e+003	2.117315e+003
4.700000e+000	4.700000e+000	3.200000e+000	3.200000e+000	2.600000e+000	4.000000e-001	3.600000e+000	8.000000e-001	8.000000e-001	3.000000e+000	1.000000e+000	2.185171e+003	2.120535e+003
4.800000e+000	4.800000e+000	3.400000e+000	3.500000e+000	2.400000e+000	4.000000e-001	3.600000e+000	8.000000e-001	8.000000e-001	3.000000e+000	1.000000e+000	2.185365e+003	2.122452e+003
4.600000e+000	4.600000e+000	3.200000e+000	3.300000e+000	2.500000e+000	4.000000e-001	3.800000e+000	8.000000e-001	8.000000e-001	3.000000e+000	1.000000e+000	2.185408e+003	2.121520e+003
4.100000e+000	4.300000e+000	2.900000e+000	3.000000e+000	3.100000e+000	6.000000e-001	3.900000e+000	8.000000e-001	8.000000e-001	3.000000e+000	1.000000e+000	2.185204e+003	2.123424e+003
3.700000e+000	3.800000e+000	2.500000e+000	3.000000e+000	3.200000e+000	1.200000e+000	4.100000e+000	8.000000e-001	8.000000e-001	3.000000e+000	1.000000e+000	2.186027e+003	2.124716e+003
3.600000e+000	3.000000e+000	2.100000e+000	2.900000e+000	3.500000e+000	2.500000e+000	4.300000e+000	8.000000e-001	8.000000e-001	3.000000e+000	1.000000e+000	2.185772e+003	2.128075e+003
4.000000e+000	4.100000e+000	2.800000e+000	3.000000e+000	3.100000e+000	9.000000e-001	4.000000e+000	8.000000e-001	8.000000e-001	3.000000e+000	1.000000e+000	2.185640e+003	2.123404e+003
3.300000e+000	3.300000e+000	2.100000e+000	2.900000e+000	3.500000e+000	2.400000e+000	4.300000e+000	8.000000e-001	8.000000e-001	3.000000e+000	1.000000e+000	2.186223e+003	2.128208e+003
2.900000e+000	3.500000e+000	2.100000e+000	3.100000e+000	3.500000e+000	2.000000e+000	4.300000e+000	8.000000e-001	8.000000e-001	3.000000e+000	1.000000e+000	2.186498e+003	2.128691e+003
3.300000e+000	3.400000e+000	2.100000e+000	3.000000e+000	3.400000e+000	2.300000e+000	4.300000e+000	8.000000e-001	8.000000e-001	3.000000e+000	1.000000e+000	2.186496e+003	2.128266e+003
3.400000e+000	3.500000e+000	2.200000e+000	2.900000e+000	3.400000e+000	2.200000e+000	4.300000e+000	8.000000e-001	8.000000e-001	3.000000e+000	1.000000e+000	2.186594e+003	2.127109e+003
3.100000e+000	3.300000e+000	2.100000e+000	3.100000e+000	3.600000e+000	2.100000e+000	4.300000e+000	8.000000e-001	8.000000e-001	3.000000e+000	1.000000e+000	2.186002e+003	2.130182e+003
3.200000e+000	3.600000e+000	2.800000e+000	2.600000e+000	2.900000e+000	1.800000e+000	3.900000e+000	8.000000e-001	8.000000e-001	2.000000e+000	1.000000e+000	2.187428e+003	2.121022e+003
1.300000e+000	5.000000e+000	3.100000e+000	3.200000e+000	3.200000e+000	1.300000e+000	4.000000e+000	8.000000e-001	8.000000e-001	2.000000e+000	1.000000e+000	2.190378e+003	2.120275e+003
3.500000e+000	3.400000e+000	2.900000e+000	3.000000e+000	2.900000e+000	1.700000e+000	3.800000e+000	8.000000e-001	8.000000e-001	2.000000e+000	1.000000e+000	2.187090e+003	2.126534e+003
3.500000e+000	3.800000e+000	2.900000e+000	3.100000e+000	2.900000e+000	2.100000e+000	4.300000e+000	8.000000e-001	8.000000e-001	2.000000e+000	1.000000e+000	2.188736e+003	2.127555e+003
4.400000e+000	2.900000e+000	3.400000e+000	3.900000e+000	2.600000e+000	1.600000e+000	4.100000e+000	8.000000e-001	8.000000e-001	2.000000e+000	1.000000e+000	2.185095e+003	2.130125e+003
2.200000e+000	4.900000e+000	3.200000e+000	3.300000e+000	2.900000e+000	1.500000e+000	4.400000e+000	8.000000e-001	8.000000e-001	2.000000e+000	1.000000e+000	2.189439e+003	2.123600e+003
3.500000e+000	2.600000e+000	2.700000e+000	4.000000e+000	3.600000e+000	2.800000e+000	4.400000e+000	8.000000e-001	8.000000e-001	2.000000e+000	1.000000e+000	2.186586e+003	2.135248e+003
4.000000e+000	4.900000e+000	2.900000e+000	3.300000e+000	2.700000e+000	1.800000e+000	4.500000e+000	8.000000e-001	8.000000e-001	2.000000e+000	1.000000e+000	2.189221e+003	2.125006e+003
4.100000e+000	4.200000e+000	3.700000e+000	3.800000e+000	2.300000e+000	1.300000e+000	4.400000e+000	8.000000e-001	8.000000e-001	2.000000e+000	1.000000e+000	2.187737e+003	2.127118e+003
4.400000e+000	4.200000e+000	3.800000e+000	3.800000e+000	2.400000e+000	6.000000e-001	4.500000e+000	8.000000e-001	8.000000e-001	2.000000e+000	1.000000e+000	2.186608e+003	2.127050e+003
4.000000e-001	4.000000e+000	1.000000e+000	2.800000e+000	4.100000e+000	1.200000e+000	1.600000e+000	8.000000e-001	8.000000e-001	1.000000e+000	1.000000e+000	2.190387e+003	2.123407e+003
4.000000e-001	4.000000e+000	1.000000e+000	3.200000e+000	4.100000e+000	1.200000e+000	1.700000e+000	8.000000e-001	8.000000e-001	1.000000e+000	1.000000e+000	2.191573e+003	2.130275e+003
1.600000e+000	2.100000e+000	1.000000e+000	2.700000e+000	4.100000e+000	2.800000e+000	2.000000e+000	8.000000e-001	8.000000e-001	1.000000e+000	1.000000e+000	2.180836e+003	2.129977e+003
1.800000e+000	2.100000e+000	1.000000e+000	2.500000e+000	4.000000e+000	2.600000e+000	2.100000e+000	8.000000e-001	8.000000e-001	1.000000e+000	1.000000e+000	2.180912e+003	2.127199e+003
1.700000e+000	3.100000e+000	1.100000e+000	2.700000e+000	3.800000e+000	2.400000e+000	2.500000e+000	8.000000e-001	8.000000e-001	1.000000e+000	1.000000e+000	2.189224e+003	2.124759e+003
1.800000e+000	2.600000e+000	1.000000e+000	2.800000e+000	4.200000e+000	2.300000e+000	2.600000e+000	8.000000e-001	8.000000e-001	1.000000e+000	1.000000e+000	2.185927e+003	2.128181e+003
4.800000e+000	1.700000e+000	1.000000e+000	3.100000e+000	3.800000e+000	1.300000e+000	2.700000e+000	8.000000e-001	8.000000e-001	2.000000e+000	1.000000e+000	2.175099e+003	2.130653e+003
3.800000e+000	1.600000e+000	1.400000e+000	3.200000e+000	3.500000e+000	2.000000e+000	2.800000e+000	8.000000e-001	8.000000e-001	2.000000e+000	1.000000e+000	2.174733e+003	2.127840e+003
4.000000e+000	1.700000e+000	1.500000e+000	3.200000e+000	3.400000e+000	2.200000e+000	2.700000e+000	8.000000e-001	8.000000e-001	2.000000e+000	1.000000e+000	2.176412e+003	2.128482e+003
3.900000e+000	1.600000e+000	1.400000e+000	3.200000e+000	3.500000e+000	2.200000e+000	2.800000e+000	8.000000e-001	8.000000e-001	2.000000e+000	1.000000e+000	2.175172e+003	2.127900e+003
4.000000e+000	1.700000e+000	1.500000e+000	3.300000e+000	3.400000e+000	2.200000e+000	2.700000e+000	8.000000e-001	8.000000e-001	2.000000e+000	1.000000e+000	2.176425e+003	2.128643e+003
4.000000e+000	1.700000e+000	1.600000e+000	3.300000e+000	3.400000e+000	2.100000e+000	2.700000e+000	8.000000e-001	8.000000e-001	2.000000e+000	1.000000e+000	2.176159e+003	2.128264e+003
3.900000e+000	1.700000e+000	1.500000e+000	3.200000e+000	3.400000e+000	2.200000e+000	2.800000e+000	8.000000e-001	8.000000e-001	2.000000e+000	1.000000e+000	2.176418e+003	2.128167e+003
4.000000e+000	1.800000e+000	1.600000e+000	3.300000e+000	3.400000e+000	2.200000e+000	2.700000e+000	8.000000e-001	8.000000e-001	2.000000e+000	1.000000e+000	2.177676e+003	2.129248e+003
4.000000e+000	1.600000e+000	1.600000e+000	3.300000e+000	3.400000e+000	2.100000e+000	3.100000e+000	8.000000e-001	8.000000e-001	2.000000e+000	1.000000e+000	2.175212e+003	2.127626e+003
4.100000e+000	1.300000e+000	1.400000e+000	4.000000e+000	3.800000e+000	2.300000e+000	2.500000e+000	8.000000e-001	8.000000e-001	3.000000e+000	1.000000e+000	2.173349e+003	2.124203e+003
4.100000e+000	1.300000e+000	1.400000e+000	4.000000e+000	3.700000e+000	1.800000e+000	2.600000e+000	8.000000e-001	8.000000e-001	3.000000e+000	1.000000e+000	2.172946e+003	2.122774e+003
4.000000e+000	1.300000e+000	1.700000e+000	4.000000e+000	3.900000e+000	2.100000e+000	2.400000e+000	8.000000e-001	8.000000e-001	3.000000e+000	1.000000e+000	2.172933e+003	2.125120e+003
4.600000e+000	1.400000e+000	1.400000e+000	4.000000e+000	3.600000e+000	1.900000e+000	2.500000e+000	8.000000e-001	8.000000e-001	3.000000e+000	1.000000e+000	2.173677e+003	2.123272e+003
4.100000e+000	1.300000e+000	1.400000e+000	4.000000e+000	3.800000e+000	2.000000e+000	2.600000e+000	8.000000e-001	8.000000e-001	3.000000e+000	1.000000e+000	2.173050e+003	2.123776e+003
4.600000e+000	1.800000e+000	1.000000e+000	3.300000e+000	3.500000e+000	2.500000e+000	2.700000e+000	8.000000e-001	8.000000e-001	3.000000e+000	1.000000e+000	2.180665e+003	2.123738e+003
4.100000e+000	1.200000e+000	1.700000e+000	4.000000e+000	3.900000e+000	2.200000e+000	2.700000e+000	8.000000e-001	8.000000e-001	3.000000e+000	1.000000e+000	2.171747e+003	2.123563e+003
4.000000e+000	1.300000e+000	1.700000e+000	4.000000e+000	3.900000e+000	2.100000e+000	2.700000e+000	8.000000e-001	8.000000e-001	3.000000e+000	1.000000e+000	2.173129e+003	2.125128e+003
5.000000e+000	1.500000e+000	2.200000e+000	4.000000e+000	3.500000e+000	2.300000e+000	2.600000e+000	8.000000e-001	8.000000e-001	3.000000e+000	1.000000e+000	2.175586e+003	2.124640e+003
4.200000e+000	1.400000e+000	1.900000e+000	4.000000e+000	3.800000e+000	2.400000e+000	2.800000e+000	8.000000e-001	8.000000e-001	3.000000e+000	1.000000e+000	2.174695e+003	2.126079e+003
4.000000e-001	2.800000e+000	1.400000e+000	2.900000e+000	4.600000e+000	4.300000e+000	1.700000e+000	8.000000e-001	8.000000e-001	1.000000e+000	1.000000e+000	2.189507e+003	2.130967e+003
5.000000e-001	2.700000e+000	1.700000e+000	2.900000e+000	4.600000e+000	3.900000e+000	1.800000e+000	8.000000e-001	8.000000e-001	1.000000e+000	1.000000e+000	2.187789e+003	2.128465e+003
4.000000e-001	3.600000e+000	1.600000e+000	2.800000e+000	4.700000e+000	5.000000e+000	2.100000e+000	8.000000e-001	8.000000e-001	1.000000e+000	1.000000e+000	2.192067e+003	2.136432e+003
4.000000e-001	3.400000e+000	1.900000e+000	3.100000e+000	4.500000e+000	4.200000e+000	2.200000e+000	8.000000e-001	8.000000e-001	1.000000e+000	1.000000e+000	2.191294e+003	2.131498e+003
8.000000e-001	3.200000e+000	1.600000e+000	2.800000e+000	4.500000e+000	5.000000e+000	2.100000e+000	8.000000e-001	8.000000e-001	1.000000e+000	1.000000e+000	2.190870e+003	2.133467e+003
4.000000e-001	3.800000e+000	1.900000e+000	3.000000e+000	4.400000e+000	4.700000e+000	2.400000e+000	8.000000e-001	8.000000e-001	1.000000e+000	1.000000e+000	2.191790e+003	2.136479e+003
4.000000e-001	3.700000e+000	2.000000e+000	3.400000e+000	4.200000e+000	2.900000e+000	2.500000e+000	8.000000e-001	8.000000e-001	1.000000e+000	1.000000e+000	2.190925e+003	2.136038e+003
1.000000e+000	3.300000e+000	1.800000e+000	2.800000e+000	4.400000e+000	4.700000e+000	2.200000e+000	8.000000e-001	8.000000e-001	1.000000e+000	1.000000e+000	2.191156e+003	2.135026e+003
1.200000e+000	3.000000e+000	1.700000e+000	2.900000e+000	4.300000e+000	4.500000e+000	2.200000e+000	8.000000e-001	8.000000e-001	1.000000e+000	1.000000e+000	2.189132e+003	2.131051e+003
1.800000e+000	2.400000e+000	1.700000e+000	3.100000e+000	4.400000e+000	2.800000e+000	3.200000e+000	8.000000e-001	8.000000e-001	2.000000e+000	1.000000e+000	2.184647e+003	2.131646e+003
2.100000e+000	2.400000e+000	1.900000e+000	3.300000e+000	4.300000e+000	2.900000e+000	3.300000e+000	8.000000e-001	8.000000e-001	2.000000e+000	1.000000e+000	2.184591e+003	2.133640e+003
2.300000e+000	2.600000e+000	2.000000e+000	3.300000e+000	4.200000e+000	3.200000e+000	3.400000e+000	8.000000e-001	8.000000e-001	2.000000e+000	1.000000e+000	2.186345e+003	2.133281e+003
2.000000e+000	2.700000e+000	2.000000e+000	3.400000e+000	4.300000e+000	3.200000e+000	3.400000e+000	8.000000e-001	8.000000e-001	2.000000e+000	1.000000e+000	2.186914e+003	2.133301e+003
2.400000e+000	2.700000e+000	1.900000e+000	3.100000e+000	4.000000e+000	3.200000e+000	3.600000e+000	8.000000e-001	8.000000e-001	2.000000e+000	1.000000e+000	2.186742e+003	2.132284e+003
2.800000e+000	2.600000e+000	2.000000e+000	2.900000e+000	3.800000e+000	3.000000e+000	3.700000e+000	8.000000e-001	8.000000e-001	2.000000e+000	1.000000e+000	2.186088e+003	2.130202e+003
2.600000e+000	2.600000e+000	2.100000e+000	3.400000e+000	4.000000e+000	3.300000e+000	3.700000e+000	8.000000e-001	8.000000e-001	2.000000e+000	1.000000e+000	2.186420e+003	2.133102e+003
2.600000e+000	2.600000e+000	2.000000e+000	3.300000e+000	3.900000e+000	3.200000e+000	3.900000e+000	8.000000e-001	8.000000e-001	2.000000e+000	1.000000e+000	2.186404e+003	2.132475e+003
4.400000e+000	2.200000e+000	2.400000e+000	3.700000e+000	3.800000e+000	3.200000e+000	2.700000e+000	8.000000e-001	8.000000e-001	3.000000e+000	1.000000e+000	2.182338e+003	2.132542e+003
3.800000e+000	2.700000e+000	2.100000e+000	2.800000e+000	3.600000e+000	3.000000e+000	3.200000e+000	8.000000e-001	8.000000e-001	3.000000e+000	1.000000e+000	2.184992e+003	2.127368e+003
1.300000e+000	3.400000e+000	1.800000e+000	3.700000e+000	4.200000e+000	3.300000e+000	3.600000e+000	8.000000e-001	8.000000e-001	3.000000e+000	1.000000e+000	2.186283e+003	2.131479e+003
4.000000e+000	2.200000e+000	2.200000e+000	3.900000e+000	3.900000e+000	3.200000e+000	3.100000e+000	8.000000e-001	8.000000e-001	3.000000e+000	1.000000e+000	2.182552e+003	2.134614e+003
1.400000e+000	3.400000e+000	1.800000e+000	3.800000e+000	4.200000e+000	3.000000e+000	3.600000e+000	8.000000e-001	8.000000e-001	3.000000e+000	1.000000e+000	2.186267e+003	2.132237e+003
4.300000e+000	2.100000e+000	2.100000e+000	3.900000e+000	4.100000e+000	3.300000e+000	3.100000e+000	8.000000e-001	8.000000e-001	3.000000e+000	1.000000e+000	2.181799e+003	2.133500e+003
3.800000e+000	2.900000e+000	2.300000e+000	2.900000e+000	3.300000e+000	2.800000e+000	3.600000e+000	8.000000e-001	8.000000e-001	3.000000e+000	1.000000e+000	2.185304e+003	2.125797e+003
3.000000e+000	2.500000e+000	2.200000e+000	3.900000e+000	4.200000e+000	3.300000e+000	3.100000e+000	8.000000e-001	8.000000e-001	3.000000e+000	1.000000e+000	2.184034e+003	2.135188e+003
2.700000e+000	3.100000e+000	1.900000e+000	3.000000e+000	3.800000e+000	2.800000e+000	3.700000e+000	8.000000e-001	8.000000e-001	3.000000e+000	1.000000e+000	2.185997e+003	2.130218e+003
1.300000e+000	3.500000e+000	1.800000e+000	3.600000e+000	4.200000e+000	2.900000e+000	3.800000e+000	8.000000e-001	8.000000e-001	3.000000e+000	1.000000e+000	2.186407e+003	2.131789e+003
2.900000e+000	2.500000e+000	2.200000e+000	4.000000e+000	3.900000e+000	3.100000e+000	3.400000e+000	8.000000e-001	8.000000e-001	3.000000e+000	1.000000e+000	2.184038e+003	2.134478e+003
4.000000e+000	2.300000e+000	2.500000e+000	4.000000e+000	3.800000e+000	3.100000e+000	3.300000e+000	8.000000e-001	8.000000e-001	3.000000e+000	1.000000e+000	2.183218e+003	2.135183e+003
5.000000e+000	2.500000e+000	1.000000e+000	2.600000e+000	3.300000e+000	3.800000e+000	2.800000e+000	8.000000e-001	8.000000e-001	2.000000e+000	1.000000e+000	2.187871e+003	2.123358e+003
4.300000e+000	3.100000e+000	1.000000e+000	1.900000e+000	3.600000e+000	2.700000e+000	3.100000e+000	8.000000e-001	8.000000e-001	2.000000e+000	1.000000e+000	2.189389e+003	2.112282e+003
4.000000e-001	4.600000e+000	1.900000e+000	2.900000e+000	4.000000e+000	2.700000e+000	3.700000e+000	8.000000e-001	8.000000e-001	2.000000e+000	1.000000e+000	2.191322e+003	2.124717e+003
5.000000e+000	2.600000e+000	1.100000e+000	2.600000e+000	3.300000e+000	3.600000e+000	3.000000e+000	8.000000e-001	8.000000e-001	2.000000e+000	1.000000e+000	2.187813e+003	2.123900e+003
5.000000e+000	2.400000e+000	1.000000e+000	2.800000e+000	3.300000e+000	3.000000e+000	3.100000e+000	8.000000e-001	8.000000e-001	2.000000e+000	1.000000e+000	2.186422e+003	2.125196e+003
5.000000e+000	2.600000e+000	1.000000e+000	4.000000e+000	3.400000e+000	3.200000e+000	2.500000e+000	8.000000e-001	8.000000e-001	2.000000e+000	1.000000e+000	2.188521e+003	2.130933e+003
5.000000e+000	2.800000e+000	1.000000e+000	2.500000e+000	3.200000e+000	3.100000e+000	3.300000e+000	8.000000e-001	8.000000e-001	2.000000e+000	1.000000e+000	2.189894e+003	2.122568e+003
4.800000e+000	2.400000e+000	1.200000e+000	2.700000e+000	3.300000e+000	3.900000e+000	3.300000e+000	8.000000e-001	8.000000e-001	2.000000e+000	1.000000e+000	2.185916e+003	2.125023e+003
4.000000e-001	4.600000e+000	2.300000e+000	3.400000e+000	3.900000e+000	2.500000e+000	3.700000e+000	8.000000e-001	8.000000e-001	2.000000e+000	1.000000e+000	2.191019e+003	2.132556e+003
4.200000e+000	3.000000e+000	1.200000e+000	4.000000e+000	3.500000e+000	2.500000e+000	2.600000e+000	8.000000e-001	8.000000e-001	3.000000e+000	1.000000e+000	2.187369e+003	2.130144e+003
4.000000e+000	2.900000e+000	1.000000e+000	3.300000e+000	3.600000e+000	2.800000e+000	3.000000e+000	8.000000e-001	8.000000e-001	3.000000e+000	1.000000e+000	2.188827e+003	2.129621e+003
5.000000e+000	3.200000e+000	1.500000e+000	3.600000e+000	3.200000e+000	1.800000e+000	2.700000e+000	8.000000e-001	8.000000e-001	3.000000e+000	1.000000e+000	2.186207e+003	2.127445e+003
4.300000e+000	3.200000e+000	1.000000e+000	3.700000e+000	3.400000e+000	2.400000e+000	2.800000e+000	8.000000e-001	8.000000e-001	3.000000e+000	1.000000e+000	2.188932e+003	2.128866e+003
4.200000e+000	3.100000e+000	1.000000e+000	3.300000e+000	3.500000e+000	2.400000e+000	3.000000e+000	8.000000e-001	8.000000e-001	3.000000e+000	1.000000e+000	2.189198e+003	2.129137e+003
4.800000e+000	3.000000e+000	1.500000e+000	4.000000e+000	3.300000e+000	2.100000e+000	2.600000e+000	8.000000e-001	8.000000e-001	3.000000e+000	1.000000e+000	2.186108e+003	2.128740e+003
4.300000e+000	2.800000e+000	1.000000e+000	3.400000e+000	3.600000e+000	3.000000e+000	3.000000e+000	8.000000e-001	8.000000e-001	3.000000e+000	1.000000e+000	2.188232e+003	2.129777e+003
5.000000e+000	3.200000e+000	1.600000e+000	3.500000e+000	3.200000e+000	1.600000e+000	2.800000e+000	8.000000e-001	8.000000e-001	3.000000e+000	1.000000e+000	2.185633e+003	2.127256e+003
4.800000e+000	3.000000e+000	1.400000e+000	3.700000e+000	3.400000e+000	2.600000e+000	2.700000e+000	8.000000e-001	8.000000e-001	3.000000e+000	1.000000e+000	2.187025e+003	2.129147e+003
1.600000e+000	2.300000e+000	1.000000e+000	1.600000e+000	4.600000e+000	3.800000e+000	1.800000e+000	8.000000e-001	8.000000e-001	1.000000e+000	1.000000e+000	2.183366e+003	2.112878e+003
9.000000e-001	2.900000e+000	1.000000e+000	1.500000e+000	4.600000e+000	3.200000e+000	2.200000e+000	8.000000e-001	8.000000e-001	1.000000e+000	1.000000e+000	2.186946e+003	2.097674e+003
1.100000e+000	2.600000e+000	1.000000e+000	1.600000e+000	4.600000e+000	3.600000e+000	2.100000e+000	8.000000e-001	8.000000e-001	1.000000e+000	1.000000e+000	2.186326e+003	2.109525e+003
4.000000e-001	2.900000e+000	1.000000e+000	2.300000e+000	4.700000e+000	3.000000e+000	2.500000e+000	8.000000e-001	8.000000e-001	1.000000e+000	1.000000e+000	2.188236e+003	2.120507e+003
1.500000e+000	2.300000e+000	1.000000e+000	1.900000e+000	4.600000e+000	3.600000e+000	1.900000e+000	8.000000e-001	8.000000e-001	1.000000e+000	1.000000e+000	2.183013e+003	2.119462e+003


