 
getf SCI/util/testexamples.sci
 
reinit_for_test()
 
%U=mopen('SCI/tests/automatic_tests/grep_data.ref','rb');
 
txt = ['find matches of a string in a vector of strings';
  'search position of a character string in an other string';
  'Compare Strings'];
 
 
%ans = grep(txt, 'strings');
 
if load_ref('%ans') then   bugmes();quit;end,
 
 
%ans = grep(txt, ['strings','Strings']);
 
if load_ref('%ans') then   bugmes();quit;end,
 
 
 
[r,w] = grep(txt, ['strings','Strings']);
 
if load_ref('w') then   bugmes();quit;end,
 
if load_ref('r') then   bugmes();quit;end,
 
 
 
xdel_run(winsid());
 
 
mclose(%U);
 
