 
getf SCI/util/testexamples.sci
 
reinit_for_test()
 
%U=mopen('SCI/tests/automatic_tests/rankqr_data.ref','rb');
 
A = rand(5, 3) * rand(3, 7);
 
[Q,R,JPVT,RANK,SVAL] = rankqr(A, %eps);
 
if load_ref('SVAL') then   bugmes();quit;end,
 
if load_ref('RANK') then   bugmes();quit;end,
 
if load_ref('JPVT') then   bugmes();quit;end,
 
if load_ref('R') then   bugmes();quit;end,
 
if load_ref('Q') then   bugmes();quit;end,
 
 
xdel_run(winsid());
 
 
mclose(%U);
 
