 
getf SCI/util/testexamples.sci
 
reinit_for_test()
 
%U=mopen('SCI/tests/automatic_tests/tan_data.ref','rb');
 
x = [1,%i,-1,-%i];
 
if load_ref('x') then   bugmes();quit;end,
 
 
%ans = tan(x);
 
if load_ref('%ans') then   bugmes();quit;end,
 
 
%ans = sin(x)0./ cos(x);
 
if load_ref('%ans') then   bugmes();quit;end,
 
 
xdel_run(winsid());
 
 
mclose(%U);
 
