 
getf SCI/util/testexamples.sci
 
reinit_for_test()
 
%U=mopen('SCI/tests/automatic_tests/triu_data.ref','rb');
 
s = poly(0, 's');
 
%ans = triu([s,s;s,1]);
 
if load_ref('%ans') then   bugmes();quit;end,
 
 
%ans = triu([1/s,1/s;1/s,1]);
 
if load_ref('%ans') then   bugmes();quit;end,
 
 
xdel_run(winsid());
 
 
mclose(%U);
 
