 
getf SCI/util/testexamples.sci
 
reinit_for_test()
 
%U=mopen('SCI/tests/automatic_tests/waitbar_data.ref','rb');
 
winId = waitbar('This is an example');
 
realtimeinit(0.3);
 
for j = 0:0.1:1,
  realtime(3 * j);
  waitbar(j, winId);
end,
 
winclose(winId);
 
xdel_run(winsid());
 
 
mclose(%U);
 
