 
getf SCI/util/testexamples.sci
 
reinit_for_test()
 
%U=mopen('SCI/tests/graphical_tests/delete_data.ref','rb');
 
 
%ans = set('figure_style', 'new');
 
if load_ref('%ans') then   bugmes();quit;end,
 
// select entity based graphics
 
subplot(211);
 
t = 1:10;%ans = plot2d(t, t.^2);
 
if load_ref('%ans') then   bugmes();quit;end,
 
 
subplot(223);
 
plot3d();

Demo of plot3d()
========================================
t=-%pi:0.3:%pi;plot3d(t,t,sin(t)'*cos(t),35,45,'X@Y@Z',[2,2,4]);

 
subplot(224);
 
plot2d();

Demo of plot2d()
========================================
x=(0:0.1:2*%pi)';plot2d(x,[sin(x),sin(2*x),sin(3*x)],style=[-1,-2,3],rect=[0,-2,2*%pi,2]);

 
xfrect(1, 0, 3, 1);
 
a = get('current_axes');
 
if load_ref('a') then   bugmes();quit;end,
 
 
delete();//delete the graphics object newly created
 
delete(a('children'));//delete all children of the current axes
 
delete(a);//delete the axes
 
delete('all');//delete all the graphics objects of the figure
 
 
xdel_run(winsid());
 
 
mclose(%U);
 
