 
getf SCI/util/testexamples.sci
 
reinit_for_test()
 
%U=mopen('SCI/tests/automatic_tests/winclose_data.ref','rb');
 
//CREATE SOME WINDOWS
 
win1 = waitbar('This is an example');
 
win2 = waitbar('HELLO!');
 
;
 
winclose([win1,win2]);
 
xdel_run(winsid());
 
 
mclose(%U);
 
