 
getf SCI/util/testexamples.sci
 
reinit_for_test()
 
%U=mopen('SCI/tests/graphical_tests/graycolormap_data.ref','rb');
 
%ans = xset('colormap', graycolormap(32));
 
if load_ref('%ans') then   bugmes();quit;end,
 
 
%ans = plot3d1();

Demo of plot3d1()
========================================
t=-%pi:0.3:%pi;plot3d1(t,t,sin(t)'*cos(t),35,45,'X@Y@Z',[2,2,4]);

 
if load_ref('%ans') then   bugmes();quit;end,
 
 
xdel_run(winsid());
 
 
mclose(%U);
 
