 
getf SCI/util/testexamples.sci
 
reinit_for_test()
 
%U=mopen('SCI/tests/graphical_tests/findABCD_data.ref','rb');
 
//generate data from a given linear system
 
A = [0.5,0.1,-0.1,0.2;
  0.1,0,-0.1,-0.1;
  -0.4,-0.6,-0.7,-0.1;
  0.8,0,-0.6,-0.6];
 
B = [0.8;0.1;1;-1];
 
C = [1,2,-1,0];
 
SYS = syslin(0.1, A, B, C);
 
nsmp = 100;
 
U = prbs_a(nsmp, nsmp/5);
 
Y = flts(U, SYS) + 0.3 * rand(1, nsmp, 'normal');
 
 
 
// Compute R
 
S = 15;
 
[R,N1,SVAL] = findR(S, Y', U');
 
N = 3;
 
SYS1 = findABCD(S, N, 1, R);SYS1('dt') = 0.1;
 
 
SYS1('X0') = inistate(SYS1, Y', U');
 
 
Y1 = flts(U, SYS1);
 
xbasc_run();%ans = plot2d((1:nsmp)', [Y',Y1']);
 
if load_ref('%ans') then   bugmes();quit;end,
 
 
 
xdel_run(winsid());
 
 
mclose(%U);
 
