 
getf SCI/util/testexamples.sci
 
reinit_for_test()
 
%U=mopen('SCI/tests/graphical_tests/chart_data.ref','rb');
 
s = poly(0, 's');
 
if load_ref('s') then   bugmes();quit;end,
 
 
h = syslin('c', (s^2 + 2 * 0.9 * 10 * s + 100)/(s^2 + 2 * 0.3 * 10.1 * s + 102.01));
 
if load_ref('h') then   bugmes();quit;end,
 
 
%ans = black(h, 0.01, 100, '(s^2+2*0.9*10*s+100)/(s^2+2*0.3*10.1*s+102.01)');
 
if load_ref('%ans') then   bugmes();quit;end,
 
 
chart(list(1, 0, 2, 3));
 
 
%ans = xbasc_run();
 
if load_ref('%ans') then   bugmes();quit;end,
 
 
h1 = h * syslin('c', (s^2 + 2 * 0.1 * 15.1 * s + 228.01)/(s^2 + 2 * 0.9 * 15 * s + 225));
 
if load_ref('h1') then   bugmes();quit;end,
 
 
%ans = black([h1;h], 0.01, 100, ['h1';'h']);
 
if load_ref('%ans') then   bugmes();quit;end,
 
 
chart([-8,-6,-4], [80,120], list(1, 0));
 
xdel_run(winsid());
 
 
mclose(%U);
 
