%!PS-Adobe-2.0 EPSF-2.0
%%BoundingBox:  0 0 300 212
%%
%%Scilab Postscript File (1995-1997 J.Ph Chancelier)
%%EndComments
/saved save def 
/$pictdict 100 dict def
$pictdict begin

/dogrey
{ /Arraybox exch def
	/Arraygrey exch def
	/nargs exch def 
	/func exch cvx def
	Arraybox 0 nargs getinterval Arraygrey 0 get func 
	1 1 Arraygrey length 1 sub 
	{/i exch def
	Arraybox i nargs mul nargs getinterval 
	Arraygrey i get func
	}for
} def
%--------------------------------------------
% [x y width height] nivgris drawbox 
% si niv gris > 1.0 alors on fait un stroke 
% sans closepath 
%--------------------------------------------

/drawpoly
	{/glev exch def /Ar exch def
	newpath
	Ar 0 get Ar 1 get moveto 
	2 2 Ar length 1 sub 
	{/i exch def
	Ar i get Ar i 1 add get absolu {lineto} {rlineto} ifelse
	}for
	glev -1 le 
	{ % filling the polygon with current pattern ( gray or color)
	  closepath gsave glev neg 1 sub WhiteLev 2 add lmin 0 lmax Setgray eofill grestore }
	{ glev 1 ge 
	   { % drawing the polygon with current dash style or color 
	     % XXXXX : a voir c'est pas clair il faudrait sauver 
	     % and filling it with other color (glev) 
	     closepath gsave glev 1 sub WhiteLev 2 add lmin 0 lmax Setgray 
		 eofill grestore stroke }
	   {% drawing the polygon with current style 
	    closeflag {closepath} if stroke} 
	ifelse }
	ifelse 
} def 


/drawbox 
	{/glev exch def /Ar exch def 
	/x Ar 0 get def /y Ar 1 get def 
	/w Ar 2 get def /h Ar 3 get def 
	newpath
	x y moveto
	x w add y lineto
	x w add y h add lineto
	x y h add lineto
	glev 1 ge 
	{ % filling 
	 closepath gsave glev 1 sub WhiteLev 2 add lmin 0 lmax Setgray eofill 
		grestore}
	{ 
	  % drawing 
	  glev -1 le 
	  {
    	  closepath gsave glev neg 1 sub WhiteLev 2 add lmin 0 lmax Setgray
		 stroke grestore  }
	  { closepath stroke} ifelse 
	} ifelse
} def 

%--------------------------------------------
% [x y width height] clearzone
%--------------------------------------------
/clearzone
        {/Ar exch def
        /x Ar 0 get def /y Ar 1 get def
        /w Ar 2 get def /h Ar 3 get def
        newpath
        x y moveto
        x w add y lineto
        x w add y h add lineto
        x y h add lineto
	closepath WhiteLev 2 add Setcolor  eofill grestore
} def

%------------------------------------------------------
% polyline stroke or polygon fill or both 
%------------------------------------------------------
/absolu true def 
/closeflag false def 

/lmin { /y exch def /x exch def x y le { x  } {  y  } ifelse } def
/lmax { /y exch def /x exch def x y le { y } {  x } ifelse } def 


/drawpoly
	{/glev exch def /Ar exch def
	newpath
	Ar 0 get Ar 1 get moveto 
	2 2 Ar length 1 sub 
	{/i exch def
	Ar i get Ar i 1 add get absolu {lineto} {rlineto} ifelse
	}for
	glev -1 le 
	{ % filling the polygon with current pattern ( gray or color)
	  closepath gsave glev neg 1 sub WhiteLev 2 add lmin 0 lmax Setgray eofill grestore }
	{ glev 1 ge 
	   { % drawing the polygon with current dash style or color 
	     % XXXXX : a voir c'est pas clair il faudrait sauver 
	     % and filling it with other color (glev) 
	     closepath gsave glev 1 sub WhiteLev 2 add lmin 0 lmax Setgray 
		 eofill grestore stroke }
	   {% drawing the polygon with current style 
	    closeflag {closepath} if stroke} 
	ifelse }
	ifelse 
} def 

%------------------------------------------------------
% segments non connectes 
%------------------------------------------------------

/drawsegs
	{/glev exch def /Ar exch def
	newpath
	Ar 0 get Ar 1 get moveto Ar 2 get Ar 3 get lineto 
	gsave glev Setgray stroke grestore
	4 4 Ar length 3 sub 
	{/i exch def
	newpath 
	Ar i get Ar i 1 add get moveto
	Ar i 2 add get Ar i 3 add get lineto 
	gsave glev Setgray stroke grestore
	}for
} def 


%------------------------------------------------------
% unconected arrows
%-----------------------------------------------------

/drawarrows
	{/arsize10 exch def /Ar exch def
	Ar 0 get  Ar 1 get Ar 2 get Ar 3 get arsize10 drawarrow
	4 4 Ar length 3 sub 
	{/i exch def
	Ar i get Ar i 1 add get  Ar i 2 add get  Ar i 3 add get arsize10 
	drawarrow
	}for
} def 
		
/cos20 20 cos def
/sin20 20 sin def

/drawarrow                                
  { 
      /arsize exch 10 div def 
      /tipy exch def /tipx exch def       
      /taily exch def /tailx exch def
      /dx tipx tailx sub  def               
      /dy tipy taily sub  def               
      newpath tipx tipy moveto tailx taily lineto stroke   
      /norme dx dx mul dy dy mul add sqrt def 
      norme 1.e-8 ge 
	{
	 arsize dx mul norme div /dx1 exch def 
	 arsize dy mul norme div /dy1 exch def 
	 /depx tipx cos20 dx1 mul add def 
	/depy  tipy cos20 dy1 mul add def 
	newpath depx depy moveto 
	cos20 neg dx1 mul sin20 dy1 mul sub depx add
	sin20 dx1  mul cos20 dy1 mul sub depy add lineto 
	cos20 neg dx1 mul sin20 dy1 mul add  depx add
	sin20 neg dx1 mul cos20 dy1 mul sub depy add lineto closepath 
	fill
	} {} ifelse 
  } def


%------------------------------------------------------
% cercle ou portions de cercle 
% attention argument (x y w h angl1*64 angl2*64 )
% devrait tracer une ellipse a modifier donc 
%------------------------------------------------------

/fillarc
	{/glev exch def /Ar exch def
	/cx Ar 0 get Ar 2 get 2 div add def 
	/cy Ar 1 get Ar 3 get 2 div add def 
	/hom Ar 3 get Ar 2 get div def 
	/Cmsave1 matrix def Cmsave1 currentmatrix pop
	%-- on change de transformation pour faire homothetie en (x,y) 
	cx cy [1 0 0 hom 0 0 ] transform
	/t1 exch neg cy add def 
	/t2 exch neg cx add def 
	[1 0 0 hom t2 t1 ] concat 
	glev WhiteLev le
	{ % filling 
	newpath
	cx cy moveto 
	cx cy Ar 2 get 2 div Ar 5 get Ar 4 get add  64 div neg
	 Ar 4 get 64 div neg  arc closepath
	gsave glev Setgray eofill grestore}
	{
	%drawing with current dash or color unclosed path 
	newpath
	cx cy Ar 2 get 2 div Ar 5 get Ar 4 get add 64 div neg Ar 4 get 64 div neg arc
	  stroke} ifelse 
	Cmsave1 setmatrix } def 

/drawarc
	{/glev exch def /Ar exch def
	/cx Ar 0 get Ar 2 get 2 div add def 
	/cy Ar 1 get Ar 3 get 2 div add def 
	/hom Ar 3 get Ar 2 get div def 
	/Cmsave1 matrix def Cmsave1 currentmatrix pop
	%-- on change de transformation pour faire homothetie en (x,y) 
	cx cy [1 0 0 hom 0 0 ] transform
	/t1 exch neg cy add def 
	/t2 exch neg cx add def 
	[1 0 0 hom t2 t1 ] concat 
	newpath
	cx cy Ar 2 get 2 div Ar 5 get Ar 4 get add 64 div neg Ar 4 get 64 div neg arc
	closepath glev Setgray stroke
	Cmsave1 setmatrix } def 

%------------------------------------------------------
% centred hard mark 
%------------------------------------------------------

% x y str ShowCString 
% on fait un show mais string est centre autour du point (x,y) 

/ShowCString { /str exch def /y exch def /x exch def 
 newpath 
 x y moveto 
 str true charpath flattenpath pathbbox 
 /y2 exch def /x2 exch def /y1 exch def /x1 exch def 
 x 2 mul x2 x1 add 2 div sub 
 y 2 mul y2 y1 add 2 div sub moveto str show 
 } def 

/drawpolymark {/glev exch def /Ar exch def 
	Ar 0 get Ar 1 get HardMark ShowCString 
	2 2 Ar length 1 sub 
	{/i exch def
	Ar i get Ar i 1 add get HardMark ShowCString
	}for
} def 

%---------------------------------------------------
% chaines de caracteres 
%---------------------------------------------------
/FBox {/Ar exch def /rot exch def /str exch def /y exch def /x exch def 
 newpath Ar 0 get Ar 1 get moveto 
	/sina rot sin def /cosa rot cos def 
	/-sina sina neg def 
	[cosa -sina sina cosa 0 0 ] CtmModif
 Ar 2 get 0 rlineto 0 Ar 3 get neg rlineto Ar 2 get neg 0 rlineto 
 0 Ar 3 get  rlineto  stroke CtmRestore 
 x y str rot ShowRotate 
 } def 

% x y str ang Showrotate 
% inverse du sens trigo 

/ShowRotate { /ang exch def /str exch def 
	/y exch def /x exch def 
	x y moveto 
	/sina ang sin def /cosa ang cos def 
	/-sina 0 sina sub def 
	[cosa -sina sina cosa 0 0 ] CtmModif
	str show 
	CtmRestore 
} def 

/HardMark (0) def 

%(Chaine de caracteres) x y flag angle [arfbox] Show

/Show { /Ar exch def 
	/rot exch def /flag exch def /y exch def /x exch def /str exch def 
	flag 1 eq 
	{x y str rot Ar FBox}
	{x y str rot ShowRotate } ifelse} def 

/L {/y2 exch def /x2 exch def /y1 exch def /x1 exch def 
    newpath x1 y1 moveto x2 y2 lineto stroke } def 

%---------------------------------------------------------
% drawing an axis 
% angle [nsep1,nsep2] ,[siz1,siz2,coeff] [x0,y0] drawaxis",
%---------------------------------------------------------

/drawaxis {/XX exch def /Arsize exch def /Arsep exch def /ang exch def 
	/Cmsave1 matrix def Cmsave1 currentmatrix pop
	/sina ang sin def /cosa ang cos def /-sina sina neg def 
	/x XX 0 get def /y XX 1 get def
	%-- on change de transformation pour tourner autour de (x,y) 
	x y [cosa sina -sina cosa 0 0 ] transform
	/t1 exch neg y add def 
	/t2 exch neg x add def 
	[cosa sina -sina cosa t2 t1 ] concat 
	newpath x y moveto 0 Arsize 1 get Arsize 2 get mul rlineto
	stroke 
	0 1 Arsep 1 get 1 sub
	{
	 % i don't want the value of the for indice 
	 pop
	newpath 
	x y moveto 
	0 1 Arsep 0 get 1 sub
		{
		 % i don't want the value of the for indice 
		 pop
		 Arsize 0 get 0  rlineto
		 0 Arsize 1 get rlineto 
	 	0 Arsize 1 get  neg rlineto }
		for 
	currentpoint /y exch def /x exch def 
	stroke 
	newpath x y moveto 0 Arsize 1 get Arsize 2 get mul rlineto
	stroke }
	for 
	Cmsave1 setmatrix } def 

%---------------------------------------------------------
% change and restore CTM
%---------------------------------------------------------

/CtmModif {
	/arg exch def 
	/Cmsave matrix def 
	Cmsave currentmatrix pop
	[1 0 0 -1 0 0 ] concat 
	arg concat 
} def 

/CtmRestore { Cmsave setmatrix } def 

/Thickness { /th exch def th 0 le {/th 0.1 def} if th setlinewidth} def 

/WhiteLev 15 def

/Setgray { WhiteLev div setgray} def 

/fillsolid { 0 setgray } def 

%--------------------------------------
% clip zones ( rectangle ) 
%-------------------------------------

/setclipzone {initclip 
	/h exch def /w exch def /y exch def /x exch def 
	newpath x y moveto w 0 rlineto 0 h rlineto w neg 0 rlineto 
	0 h neg rlineto closepath clip} def 

%------------------
% to change the position of a picture 
%------------------
/cm{28.346457 mul}def

/DesPosi { /YH exch def /XW exch def /YP exch def /XP exch def 
	XP cm YP cm neg translate 
	XW cm 6000 div YH cm 4240 div  scale } def 

0 setlinecap 
2 setlinejoin 
1 setlinewidth

%-- Color database 
/ColorR [0.000000 0.000000 0.000000 0.529412 0.498039 0.133333 0.000000 0.878431 0.000000 1.000000 1.000000 1.000000 0.933333 1.000000 1.000000 0.960784 1.000000 ] def
/ColorG [0.000000 0.000000 0.000000 0.807843 1.000000 0.545098 1.000000 1.000000 1.000000 0.647059 0.000000 0.000000 0.509804 1.000000 0.843137 0.960784 1.000000 ] def
/ColorB [0.000000 0.501961 1.000000 0.921569 0.831373 0.133333 0.000000 1.000000 1.000000 0.000000 0.000000 1.000000 0.933333 0.000000 0.000000 0.862745 1.000000 ] def

/Setcolor {/i exch def ColorR i get ColorG i get ColorB i get setrgbcolor } def

% to multiply all the fontsizes by a factor  scf
/scf 1.0 def


% changing fonts encoding 

/Courier findfont
dup length dict begin
  {1 index /FID ne {def} {pop pop} ifelse} forall
  /Encoding ISOLatin1Encoding def
  currentdict
  end
/Courier exch definefont pop

/Times-Roman findfont
dup length dict begin
  {1 index /FID ne {def} {pop pop} ifelse} forall
  /Encoding ISOLatin1Encoding def
  currentdict
  end
/Times-Roman exch definefont pop

/Times-Bold findfont
dup length dict begin
  {1 index /FID ne {def} {pop pop} ifelse} forall
  /Encoding ISOLatin1Encoding def
  currentdict
  end
/Times-Bold exch definefont pop


/Times-BoldItalic findfont
dup length dict begin
  {1 index /FID ne {def} {pop pop} ifelse} forall
  /Encoding ISOLatin1Encoding def
  currentdict
  end
/Times-BoldItalic exch definefont pop


%------ End Main Program ------%
% XP YP XW YW DesPosi in the following code 
% will output the picture in the rectangle defined by 
% upper left point (XP,YP) wide :XW Height: YW
% the coordinates are given in centimeter and 
% are the (0,0) point is the down-left point of the paper 


/ColorR [0.000000 
0.000000 0.000000 0.000000 1.000000 1.000000 1.000000 1.000000 0.000000 0.000000 0.000000 
0.529412 0.000000 0.000000 0.000000 0.000000 0.000000 0.000000 0.564706 0.690196 0.815686 
0.564706 0.690196 0.815686 0.501961 0.627451 0.752941 1.000000 1.000000 1.000000 1.000000 
1.000000 0.0 1.0] def
/ColorG [0.000000 
0.000000 1.000000 1.000000 0.000000 0.000000 0.000000 1.000000 0.000000 0.000000 0.000000 
0.807843 0.564706 0.690196 0.815686 0.564706 0.690196 0.815686 0.000000 0.000000 0.000000 
0.000000 0.000000 0.000000 0.188235 0.250980 0.376471 0.501961 0.627451 0.752941 0.878431 
0.843137 0.0 1.0] def
/ColorB [0.000000 
1.000000 0.000000 1.000000 0.000000 1.000000 0.000000 1.000000 0.564706 0.690196 0.815686 
1.000000 0.000000 0.000000 0.000000 0.564706 0.690196 0.815686 0.000000 0.000000 0.000000 
0.564706 0.690196 0.815686 0.000000 0.000000 0.000000 0.501961 0.627451 0.752941 0.878431 
0.000000 0.0 1.0] def
% Dessin en bas a gauche de taille 3000,2120
[0.5 10 div 0 0 0.5 10 div neg  0 2120 10 div] concat
% Init driver 
5 Thickness
% 3 setalufunction
-1 -1 200000 200000 setclipzone
[] 0 setdash
/Times-Roman findfont 100 scf mul scalefont setfont
fillsolid
[] 0 setdash
0 Setcolor
%--use color 1 
fillsolid
[] 0 setdash
0 Setcolor
/WhiteLev 31 def
/Setgray {/i exch def ColorR i get ColorG i get ColorB i get setrgbcolor } def 
/Setcolor {/i exch def ColorR i get ColorG i get ColorB i get setrgbcolor } def 
%--end use color 1 
% End init driver 
/WhiteLev 31 def
/Times-Roman findfont 100 scf mul scalefont setfont
5 Thickness
-1 -1 200000 200000 setclipzone
0 Setcolor
0 Setcolor
 (drawbox) 4 [ 0]
[750 530 4500 3180 
] dogrey 
0 Setcolor
(0) 722 3906 0  0.00 [722 3816 57 120] Show
 (drawsegs) 4 [ 0]
[750 3710 750 3773 
] dogrey 
0 Setcolor
 (drawsegs) 4 [ 0]
[975 3710 975 3741 
] dogrey 
0 Setcolor
(2) 1172 3906 0  0.00 [1172 3816 57 120] Show
 (drawsegs) 4 [ 0]
[1200 3710 1200 3773 
] dogrey 
0 Setcolor
 (drawsegs) 4 [ 0]
[1425 3710 1425 3741 
] dogrey 
0 Setcolor
(4) 1622 3906 0  0.00 [1622 3816 57 120] Show
 (drawsegs) 4 [ 0]
[1650 3710 1650 3773 
] dogrey 
0 Setcolor
 (drawsegs) 4 [ 0]
[1875 3710 1875 3741 
] dogrey 
0 Setcolor
(6) 2072 3906 0  0.00 [2072 3816 57 120] Show
 (drawsegs) 4 [ 0]
[2100 3710 2100 3773 
] dogrey 
0 Setcolor
 (drawsegs) 4 [ 0]
[2325 3710 2325 3741 
] dogrey 
0 Setcolor
(8) 2522 3906 0  0.00 [2522 3816 57 120] Show
 (drawsegs) 4 [ 0]
[2550 3710 2550 3773 
] dogrey 
0 Setcolor
 (drawsegs) 4 [ 0]
[2775 3710 2775 3741 
] dogrey 
0 Setcolor
(10) 2943 3906 0  0.00 [2943 3816 114 120] Show
 (drawsegs) 4 [ 0]
[3000 3710 3000 3773 
] dogrey 
0 Setcolor
 (drawsegs) 4 [ 0]
[3225 3710 3225 3741 
] dogrey 
0 Setcolor
(12) 3393 3906 0  0.00 [3393 3816 114 120] Show
 (drawsegs) 4 [ 0]
[3450 3710 3450 3773 
] dogrey 
0 Setcolor
 (drawsegs) 4 [ 0]
[3675 3710 3675 3741 
] dogrey 
0 Setcolor
(14) 3843 3906 0  0.00 [3843 3816 114 120] Show
 (drawsegs) 4 [ 0]
[3900 3710 3900 3773 
] dogrey 
0 Setcolor
 (drawsegs) 4 [ 0]
[4125 3710 4125 3741 
] dogrey 
0 Setcolor
(16) 4293 3906 0  0.00 [4293 3816 114 120] Show
 (drawsegs) 4 [ 0]
[4350 3710 4350 3773 
] dogrey 
0 Setcolor
 (drawsegs) 4 [ 0]
[4575 3710 4575 3741 
] dogrey 
0 Setcolor
(18) 4743 3906 0  0.00 [4743 3816 114 120] Show
 (drawsegs) 4 [ 0]
[4800 3710 4800 3773 
] dogrey 
0 Setcolor
 (drawsegs) 4 [ 0]
[5025 3710 5025 3741 
] dogrey 
0 Setcolor
(20) 5193 3906 0  0.00 [5193 3816 114 120] Show
 (drawsegs) 4 [ 0]
[5250 3710 5250 3773 
] dogrey 
0 Setcolor
(0) 621 3770 0  0.00 [621 3680 57 120] Show
 (drawsegs) 4 [ 0]
[750 3710 690 3710 
] dogrey 
0 Setcolor
 (drawsegs) 4 [ 0]
[750 3551 720 3551 
] dogrey 
0 Setcolor
(0.1) 506 3452 0  0.00 [506 3362 172 120] Show
 (drawsegs) 4 [ 0]
[750 3392 690 3392 
] dogrey 
0 Setcolor
 (drawsegs) 4 [ 0]
[750 3233 720 3233 
] dogrey 
0 Setcolor
(0.2) 506 3134 0  0.00 [506 3044 172 120] Show
 (drawsegs) 4 [ 0]
[750 3074 690 3074 
] dogrey 
0 Setcolor
 (drawsegs) 4 [ 0]
[750 2915 720 2915 
] dogrey 
0 Setcolor
(0.3) 506 2816 0  0.00 [506 2726 172 120] Show
 (drawsegs) 4 [ 0]
[750 2756 690 2756 
] dogrey 
0 Setcolor
 (drawsegs) 4 [ 0]
[750 2597 720 2597 
] dogrey 
0 Setcolor
(0.4) 506 2498 0  0.00 [506 2408 172 120] Show
 (drawsegs) 4 [ 0]
[750 2438 690 2438 
] dogrey 
0 Setcolor
 (drawsegs) 4 [ 0]
[750 2279 720 2279 
] dogrey 
0 Setcolor
(0.5) 506 2180 0  0.00 [506 2090 172 120] Show
 (drawsegs) 4 [ 0]
[750 2120 690 2120 
] dogrey 
0 Setcolor
 (drawsegs) 4 [ 0]
[750 1961 720 1961 
] dogrey 
0 Setcolor
(0.6) 506 1862 0  0.00 [506 1772 172 120] Show
 (drawsegs) 4 [ 0]
[750 1802 690 1802 
] dogrey 
0 Setcolor
 (drawsegs) 4 [ 0]
[750 1643 720 1643 
] dogrey 
0 Setcolor
(0.7) 506 1544 0  0.00 [506 1454 172 120] Show
 (drawsegs) 4 [ 0]
[750 1484 690 1484 
] dogrey 
0 Setcolor
 (drawsegs) 4 [ 0]
[750 1325 720 1325 
] dogrey 
0 Setcolor
(0.8) 506 1226 0  0.00 [506 1136 172 120] Show
 (drawsegs) 4 [ 0]
[750 1166 690 1166 
] dogrey 
0 Setcolor
 (drawsegs) 4 [ 0]
[750 1007 720 1007 
] dogrey 
0 Setcolor
(0.9) 506 908 0  0.00 [506 818 172 120] Show
 (drawsegs) 4 [ 0]
[750 848 690 848 
] dogrey 
0 Setcolor
 (drawsegs) 4 [ 0]
[750 689 720 689 
] dogrey 
0 Setcolor
(1.0) 506 590 0  0.00 [506 500 172 120] Show
 (drawsegs) 4 [ 0]
[750 530 690 530 
] dogrey 
0 Setcolor
0 Setcolor
750 530 4500 3180 setclipzone
0 Setcolor
/closeflag false def
 (drawpoly) 432 [ 0]
[750 530 752 530 755 530 757 530 759 530 761 530 764 530 766 530 768 530 770 530 
773 530 775 530 777 530 779 530 782 530 784 530 786 530 788 530 791 530 793 530 
795 530 797 530 800 530 802 530 804 530 806 530 809 530 811 530 813 530 815 530 
818 531 820 531 822 531 824 531 827 531 829 531 831 531 833 531 836 531 838 531 
840 531 842 531 845 531 847 531 849 531 851 531 854 531 856 531 858 531 860 531 
863 531 865 531 867 531 869 532 872 532 874 532 876 532 878 532 881 532 883 532 
885 532 887 532 890 532 892 532 894 532 896 532 899 532 901 532 903 532 905 533 
908 533 910 533 912 533 914 533 917 533 919 533 921 533 923 533 926 533 928 533 
930 533 932 533 935 534 937 534 939 534 941 534 944 534 946 534 948 534 950 534 
953 534 955 534 957 534 959 534 962 535 964 535 966 535 968 535 971 535 973 535 
975 535 977 535 980 535 982 535 984 535 986 536 989 536 991 536 993 536 995 536 
998 536 1000 536 1002 536 1004 536 1007 536 1009 536 1011 537 1013 537 1016 537 1018 537 
1020 537 1022 537 1025 537 1027 537 1029 537 1031 537 1034 538 1036 538 1038 538 1040 538 
1043 538 1045 538 1047 538 1049 538 1052 538 1054 538 1056 539 1058 539 1061 539 1063 539 
1065 539 1067 539 1070 539 1072 539 1074 539 1076 539 1079 539 1081 540 1083 540 1085 540 
1088 540 1090 540 1092 540 1094 540 1097 540 1099 540 1101 540 1103 541 1106 541 1108 541 
1110 541 1112 541 1115 541 1117 541 1119 541 1121 541 1124 541 1126 541 1128 542 1130 542 
1133 542 1135 542 1137 542 1139 542 1142 542 1144 542 1146 542 1148 542 1151 542 1153 543 
1155 543 1157 543 1160 543 1162 543 1164 543 1166 543 1169 543 1171 543 1173 543 1175 543 
1178 543 1180 543 1182 544 1184 544 1187 544 1189 544 1191 544 1193 544 1196 544 1198 544 
1200 544 1202 544 1205 544 1207 544 1209 544 1211 544 1214 544 1216 544 1218 545 1220 545 
1223 545 1225 545 1227 545 1229 545 1232 545 1234 545 
] dogrey 
 (drawpoly) 432 [0]
[1236 545 1238 545 1241 545 1243 545 1245 545 1247 545 1250 545 1252 545 1254 545 1256 545 
1259 545 1261 545 1263 545 1265 545 1268 545 1270 546 1272 546 1274 546 1277 546 1279 546 
1281 546 1283 546 1286 546 1288 546 1290 546 1292 546 1295 546 1297 546 1299 546 1301 546 
1304 546 1306 546 1308 546 1310 546 1313 546 1315 546 1317 546 1319 546 1322 546 1324 546 
1326 546 1328 546 1331 546 1333 546 1335 546 1337 546 1340 546 1342 546 1344 546 1346 546 
1349 546 1351 546 1353 546 1355 545 1358 545 1360 545 1362 545 1364 545 1367 545 1369 545 
1371 545 1373 545 1376 545 1378 545 1380 545 1382 545 1385 545 1387 545 1389 545 1391 545 
1394 545 1396 545 1398 545 1400 545 1403 544 1405 544 1407 544 1409 544 1412 544 1414 544 
1416 544 1418 544 1421 544 1423 544 1425 544 1427 544 1430 544 1432 543 1434 543 1436 543 
1439 543 1441 543 1443 543 1445 543 1448 543 1450 543 1452 543 1454 543 1457 542 1459 542 
1461 542 1463 542 1466 542 1468 542 1470 542 1472 542 1475 542 1477 541 1479 541 1481 541 
1484 541 1486 541 1488 541 1490 541 1493 541 1495 541 1497 540 1499 540 1502 540 1504 540 
1506 540 1508 540 1511 540 1513 540 1515 539 1517 539 1520 539 1522 539 1524 539 1526 539 
1529 539 1531 539 1533 538 1535 538 1538 538 1540 538 1542 538 1544 538 1547 538 1549 537 
1551 537 1553 537 1556 537 1558 537 1560 537 1562 537 1565 536 1567 536 1569 536 1571 536 
1574 536 1576 536 1578 536 1580 536 1583 535 1585 535 1587 535 1589 535 1592 535 1594 535 
1596 535 1598 534 1601 534 1603 534 1605 534 1607 534 1610 534 1612 534 1614 534 1616 533 
1619 533 1621 533 1623 533 1625 533 1628 533 1630 533 1632 533 1634 532 1637 532 1639 532 
1641 532 1643 532 1646 532 1648 532 1650 532 1652 532 1655 532 1657 531 1659 531 1661 531 
1664 531 1666 531 1668 531 1670 531 1673 531 1675 531 1677 531 1679 531 1682 531 1684 531 
1686 530 1688 530 1691 530 1693 530 1695 530 1697 530 1700 530 1702 530 1704 530 1706 530 
1709 530 1711 530 1713 530 1715 530 1718 530 1720 530 
] dogrey 
 (drawpoly) 432 [0]
[1722 530 1724 530 1727 530 1729 530 1731 530 1733 530 1736 530 1738 530 1740 530 1742 530 
1745 530 1747 530 1749 530 1751 530 1754 530 1756 530 1758 530 1760 531 1763 531 1765 531 
1767 531 1769 531 1772 531 1774 531 1776 531 1778 531 1781 531 1783 531 1785 532 1787 532 
1790 532 1792 532 1794 532 1796 532 1799 532 1801 533 1803 533 1805 533 1808 533 1810 533 
1812 533 1814 534 1817 534 1819 534 1821 534 1823 534 1826 534 1828 535 1830 535 1832 535 
1835 535 1837 536 1839 536 1841 536 1844 536 1846 536 1848 537 1850 537 1853 537 1855 537 
1857 538 1859 538 1862 538 1864 538 1866 539 1868 539 1871 539 1873 539 1875 539 1877 540 
1880 540 1882 540 1884 540 1886 541 1889 541 1891 541 1893 541 1895 542 1898 542 1900 542 
1902 542 1904 543 1907 543 1909 543 1911 543 1913 543 1916 544 1918 544 1920 544 1922 544 
1925 544 1927 545 1929 545 1931 545 1934 545 1936 545 1938 545 1940 545 1943 545 1945 546 
1947 546 1949 546 1952 546 1954 546 1956 546 1958 546 1961 546 1963 546 1965 546 1967 546 
1970 546 1972 546 1974 545 1976 545 1979 545 1981 545 1983 545 1985 545 1988 544 1990 544 
1992 544 1994 544 1997 543 1999 543 2001 543 2003 542 2006 542 2008 542 2010 541 2012 541 
2015 540 2017 540 2019 539 2021 539 2024 538 2026 538 2028 537 2030 537 2033 536 2035 536 
2037 535 2039 535 2042 534 2044 534 2046 533 2048 533 2051 532 2053 532 2055 531 2057 531 
2060 531 2062 530 2064 530 2066 530 2069 530 2071 530 2073 530 2075 530 2078 531 2080 531 
2082 532 2084 533 2087 534 2089 535 2091 537 2093 539 2096 541 2098 543 2100 546 2102 549 
2105 552 2107 556 2109 561 2111 566 2114 571 2116 577 2118 584 2120 592 2123 600 2125 609 
2127 619 2129 630 2132 641 2134 654 2136 668 2138 683 2141 700 2143 717 2145 736 2147 756 
2150 778 2152 801 2154 826 2156 852 2159 881 2161 910 2163 942 2165 975 2168 1010 2170 1046 
2172 1084 2174 1124 2177 1166 2179 1209 2181 1254 2183 1300 2186 1348 2188 1397 2190 1447 2192 1498 
2195 1551 2197 1604 2199 1658 2201 1712 2204 1767 2206 1823 
] dogrey 
 (drawpoly) 432 [0]
[2208 1878 2210 1934 2213 1990 2215 2046 2217 2101 2219 2156 2222 2211 2224 2265 2226 2318 2228 2371 
2231 2423 2233 2474 2235 2524 2237 2574 2240 2622 2242 2669 2244 2715 2246 2761 2249 2805 2251 2847 
2253 2889 2255 2930 2258 2970 2260 3008 2262 3045 2264 3082 2267 3117 2269 3151 2271 3184 2273 3216 
2276 3247 2278 3277 2280 3306 2282 3335 2285 3362 2287 3388 2289 3414 2291 3438 2294 3462 2296 3485 
2298 3507 2300 3529 2303 3549 2305 3569 2307 3589 2309 3607 2312 3625 2314 3642 2316 3659 2318 3675 
2321 3691 2323 3706 2325 3700 2327 3686 2330 3672 2332 3660 2334 3647 2336 3635 2339 3624 2341 3612 
2343 3602 2345 3591 2348 3582 2350 3572 2352 3563 2354 3554 2357 3546 2359 3538 2361 3530 2363 3522 
2366 3515 2368 3508 2370 3501 2372 3495 2375 3489 2377 3483 2379 3478 2381 3472 2384 3467 2386 3462 
2388 3458 2390 3453 2393 3449 2395 3445 2397 3441 2399 3437 2402 3434 2404 3431 2406 3428 2408 3425 
2411 3422 2413 3419 2415 3417 2417 3414 2420 3412 2422 3410 2424 3408 2426 3406 2429 3405 2431 3403 
2433 3402 2435 3400 2438 3399 2440 3398 2442 3397 2444 3396 2447 3395 2449 3395 2451 3394 2453 3393 
2456 3393 2458 3393 2460 3392 2462 3392 2465 3392 2467 3392 2469 3392 2471 3392 2474 3392 2476 3393 
2478 3393 2480 3393 2483 3394 2485 3394 2487 3395 2489 3395 2492 3396 2494 3397 2496 3398 2498 3398 
2501 3399 2503 3400 2505 3401 2507 3402 2510 3403 2512 3404 2514 3405 2516 3406 2519 3408 2521 3409 
2523 3410 2525 3411 2528 3413 2530 3414 2532 3416 2534 3417 2537 3418 2539 3420 2541 3421 2543 3423 
2546 3425 2548 3426 2550 3428 2552 3429 2555 3431 2557 3433 2559 3434 2561 3436 2564 3438 2566 3440 
2568 3441 2570 3443 2573 3445 2575 3447 2577 3449 2579 3450 2582 3452 2584 3454 2586 3456 2588 3458 
2591 3460 2593 3462 2595 3464 2597 3466 2600 3468 2602 3469 2604 3471 2606 3473 2609 3475 2611 3477 
2613 3479 2615 3481 2618 3483 2620 3485 2622 3487 2624 3490 2627 3492 2629 3494 2631 3496 2633 3498 
2636 3500 2638 3502 2640 3504 2642 3506 2645 3508 2647 3510 2649 3512 2651 3514 2654 3516 2656 3518 
2658 3520 2660 3522 2663 3525 2665 3527 2667 3529 2669 3531 2672 3533 2674 3535 2676 3537 2678 3539 
2681 3541 2683 3543 2685 3545 2687 3547 2690 3549 2692 3551 
] dogrey 
 (drawpoly) 432 [0]
[2694 3554 2696 3556 2699 3558 2701 3560 2703 3562 2705 3564 2708 3566 2710 3568 2712 3570 2714 3572 
2717 3574 2719 3576 2721 3578 2723 3580 2726 3582 2728 3584 2730 3586 2732 3588 2735 3590 2737 3592 
2739 3594 2741 3596 2744 3598 2746 3600 2748 3602 2750 3604 2753 3606 2755 3608 2757 3610 2759 3612 
2762 3614 2764 3616 2766 3618 2768 3620 2771 3622 2773 3624 2775 3625 2777 3627 2780 3629 2782 3631 
2784 3633 2786 3635 2789 3637 2791 3639 2793 3641 2795 3642 2798 3644 2800 3646 2802 3648 2804 3650 
2807 3652 2809 3653 2811 3655 2813 3657 2816 3659 2818 3661 2820 3663 2822 3664 2825 3666 2827 3668 
2829 3670 2831 3671 2834 3673 2836 3675 2838 3677 2840 3678 2843 3680 2845 3682 2847 3684 2849 3685 
2852 3687 2854 3689 2856 3690 2858 3692 2861 3694 2863 3696 2865 3697 2867 3699 2870 3701 2872 3702 
2874 3704 2876 3705 2879 3707 2881 3709 2883 3710 2885 3708 2888 3706 2890 3705 2892 3703 2894 3702 
2897 3700 2899 3698 2901 3697 2903 3695 2906 3694 2908 3692 2910 3691 2912 3689 2915 3688 2917 3686 
2919 3685 2921 3683 2924 3682 2926 3680 2928 3679 2930 3677 2933 3676 2935 3674 2937 3673 2939 3671 
2942 3670 2944 3668 2946 3667 2948 3665 2951 3664 2953 3663 2955 3661 2957 3660 2960 3658 2962 3657 
2964 3655 2966 3654 2969 3653 2971 3651 2973 3650 2975 3649 2978 3647 2980 3646 2982 3645 2984 3643 
2987 3642 2989 3641 2991 3639 2993 3638 2996 3637 2998 3635 3000 3634 3002 3633 3005 3631 3007 3630 
3009 3629 3011 3628 3014 3626 3016 3625 3018 3624 3020 3623 3023 3621 3025 3620 3027 3619 3029 3618 
3032 3616 3034 3615 3036 3614 3038 3613 3041 3612 3043 3610 3045 3609 3047 3608 3050 3607 3052 3606 
3054 3605 3056 3603 3059 3602 3061 3601 3063 3600 3065 3599 3068 3598 3070 3596 3072 3595 3074 3594 
3077 3593 3079 3592 3081 3591 3083 3590 3086 3589 3088 3588 3090 3587 3092 3586 3095 3584 3097 3583 
3099 3582 3101 3581 3104 3580 3106 3579 3108 3578 3110 3577 3113 3576 3115 3575 3117 3574 3119 3573 
3122 3572 3124 3571 3126 3570 3128 3569 3131 3568 3133 3567 3135 3566 3137 3565 3140 3564 3142 3563 
3144 3562 3146 3561 3149 3560 3151 3559 3153 3558 3155 3557 3158 3556 3160 3555 3162 3555 3164 3554 
3167 3553 3169 3552 3171 3551 3173 3550 3176 3549 3178 3548 
] dogrey 
 (drawpoly) 432 [0]
[3180 3547 3182 3546 3185 3546 3187 3545 3189 3544 3191 3543 3194 3542 3196 3541 3198 3540 3200 3539 
3203 3539 3205 3538 3207 3537 3209 3536 3212 3535 3214 3534 3216 3534 3218 3533 3221 3532 3223 3531 
3225 3530 3227 3530 3230 3529 3232 3528 3234 3527 3236 3526 3239 3526 3241 3525 3243 3524 3245 3523 
3248 3522 3250 3522 3252 3521 3254 3520 3257 3519 3259 3519 3261 3518 3263 3517 3266 3516 3268 3516 
3270 3515 3272 3514 3275 3513 3277 3513 3279 3512 3281 3511 3284 3511 3286 3510 3288 3509 3290 3509 
3293 3508 3295 3507 3297 3506 3299 3506 3302 3505 3304 3504 3306 3504 3308 3503 3311 3502 3313 3502 
3315 3501 3317 3500 3320 3500 3322 3499 3324 3498 3326 3498 3329 3497 3331 3496 3333 3496 3335 3495 
3338 3495 3340 3494 3342 3493 3344 3493 3347 3492 3349 3491 3351 3491 3353 3490 3356 3490 3358 3489 
3360 3488 3362 3488 3365 3487 3367 3487 3369 3486 3371 3485 3374 3485 3376 3484 3378 3484 3380 3483 
3383 3483 3385 3482 3387 3481 3389 3481 3392 3480 3394 3480 3396 3479 3398 3479 3401 3478 3403 3478 
3405 3477 3407 3476 3410 3476 3412 3475 3414 3475 3416 3474 3419 3474 3421 3473 3423 3473 3425 3472 
3428 3472 3430 3471 3432 3471 3434 3470 3437 3470 3439 3469 3441 3469 3443 3468 3446 3468 3448 3467 
3450 3467 3452 3466 3455 3466 3457 3465 3459 3465 3461 3464 3464 3464 3466 3463 3468 3463 3470 3462 
3473 3462 3475 3462 3477 3461 3479 3461 3482 3460 3484 3460 3486 3459 3488 3459 3491 3458 3493 3458 
3495 3458 3497 3457 3500 3457 3502 3456 3504 3456 3506 3455 3509 3455 3511 3454 3513 3454 3515 3454 
3518 3453 3520 3453 3522 3452 3524 3452 3527 3452 3529 3451 3531 3451 3533 3450 3536 3450 3538 3450 
3540 3449 3542 3449 3545 3448 3547 3448 3549 3448 3551 3447 3554 3447 3556 3446 3558 3446 3560 3446 
3563 3445 3565 3445 3567 3445 3569 3444 3572 3444 3574 3443 3576 3443 3578 3443 3581 3442 3583 3442 
3585 3442 3587 3441 3590 3441 3592 3441 3594 3440 3596 3440 3599 3440 3601 3439 3603 3439 3605 3439 
3608 3438 3610 3438 3612 3438 3614 3437 3617 3437 3619 3437 3621 3436 3623 3436 3626 3436 3628 3435 
3630 3435 3632 3435 3635 3434 3637 3434 3639 3434 3641 3433 3644 3433 3646 3433 3648 3432 3650 3432 
3653 3432 3655 3432 3657 3431 3659 3431 3662 3431 3664 3430 
] dogrey 
 (drawpoly) 432 [0]
[3666 3430 3668 3430 3671 3430 3673 3429 3675 3429 3677 3429 3680 3428 3682 3428 3684 3428 3686 3428 
3689 3427 3691 3427 3693 3427 3695 3426 3698 3426 3700 3426 3702 3426 3704 3425 3707 3425 3709 3425 
3711 3425 3713 3424 3716 3424 3718 3424 3720 3424 3722 3423 3725 3423 3727 3423 3729 3423 3731 3422 
3734 3422 3736 3422 3738 3422 3740 3421 3743 3421 3745 3421 3747 3421 3749 3420 3752 3420 3754 3420 
3756 3420 3758 3419 3761 3419 3763 3419 3765 3419 3767 3419 3770 3418 3772 3418 3774 3418 3776 3418 
3779 3417 3781 3417 3783 3417 3785 3417 3788 3417 3790 3416 3792 3416 3794 3416 3797 3416 3799 3416 
3801 3415 3803 3415 3806 3415 3808 3415 3810 3415 3812 3414 3815 3414 3817 3414 3819 3414 3821 3414 
3824 3413 3826 3413 3828 3413 3830 3413 3833 3413 3835 3412 3837 3412 3839 3412 3842 3412 3844 3412 
3846 3412 3848 3411 3851 3411 3853 3411 3855 3411 3857 3411 3860 3410 3862 3410 3864 3410 3866 3410 
3869 3410 3871 3410 3873 3409 3875 3409 3878 3409 3880 3409 3882 3409 3884 3409 3887 3408 3889 3408 
3891 3408 3893 3408 3896 3408 3898 3408 3900 3408 3902 3407 3905 3407 3907 3407 3909 3407 3911 3407 
3914 3407 3916 3406 3918 3406 3920 3406 3923 3406 3925 3406 3927 3406 3929 3406 3932 3405 3934 3405 
3936 3405 3938 3405 3941 3405 3943 3405 3945 3405 3947 3404 3950 3404 3952 3404 3954 3404 3956 3404 
3959 3404 3961 3404 3963 3404 3965 3403 3968 3403 3970 3403 3972 3403 3974 3403 3977 3403 3979 3403 
3981 3403 3983 3402 3986 3402 3988 3402 3990 3402 3992 3402 3995 3402 3997 3402 3999 3402 4001 3402 
4004 3401 4006 3401 4008 3401 4010 3401 4013 3401 4015 3401 4017 3401 4019 3401 4022 3401 4024 3400 
4026 3400 4028 3400 4031 3400 4033 3400 4035 3400 4037 3400 4040 3400 4042 3400 4044 3400 4046 3399 
4049 3399 4051 3399 4053 3399 4055 3399 4058 3399 4060 3399 4062 3399 4064 3399 4067 3399 4069 3399 
4071 3398 4073 3398 4076 3398 4078 3398 4080 3398 4082 3398 4085 3398 4087 3398 4089 3398 4091 3398 
4094 3398 4096 3398 4098 3397 4100 3397 4103 3397 4105 3397 4107 3397 4109 3397 4112 3397 4114 3397 
4116 3397 4118 3397 4121 3397 4123 3397 4125 3397 4127 3396 4130 3396 4132 3396 4134 3396 4136 3396 
4139 3396 4141 3396 4143 3396 4145 3396 4148 3396 4150 3396 
] dogrey 
 (drawpoly) 432 [0]
[4152 3396 4154 3396 4157 3396 4159 3396 4161 3395 4163 3395 4166 3395 4168 3395 4170 3395 4172 3395 
4175 3395 4177 3395 4179 3395 4181 3395 4184 3395 4186 3395 4188 3395 4190 3395 4193 3395 4195 3395 
4197 3395 4199 3395 4202 3394 4204 3394 4206 3394 4208 3394 4211 3394 4213 3394 4215 3394 4217 3394 
4220 3394 4222 3394 4224 3394 4226 3394 4229 3394 4231 3394 4233 3394 4235 3394 4238 3394 4240 3394 
4242 3394 4244 3394 4247 3394 4249 3394 4251 3394 4253 3393 4256 3393 4258 3393 4260 3393 4262 3393 
4265 3393 4267 3393 4269 3393 4271 3393 4274 3393 4276 3393 4278 3393 4280 3393 4283 3393 4285 3393 
4287 3393 4289 3393 4292 3393 4294 3393 4296 3393 4298 3393 4301 3393 4303 3393 4305 3393 4307 3393 
4310 3393 4312 3393 4314 3393 4316 3393 4319 3393 4321 3393 4323 3393 4325 3393 4328 3393 4330 3393 
4332 3392 4334 3392 4337 3392 4339 3392 4341 3392 4343 3392 4346 3392 4348 3392 4350 3392 4352 3392 
4355 3392 4357 3392 4359 3392 4361 3392 4364 3392 4366 3392 4368 3392 4370 3392 4373 3392 4375 3392 
4377 3392 4379 3392 4382 3392 4384 3392 4386 3392 4388 3392 4391 3392 4393 3392 4395 3392 4397 3392 
4400 3392 4402 3392 4404 3392 4406 3392 4409 3392 4411 3392 4413 3392 4415 3392 4418 3392 4420 3392 
4422 3392 4424 3392 4427 3392 4429 3392 4431 3392 4433 3392 4436 3392 4438 3392 4440 3392 4442 3392 
4445 3392 4447 3392 4449 3392 4451 3392 4454 3392 4456 3392 4458 3392 4460 3392 4463 3392 4465 3392 
4467 3392 4469 3392 4472 3392 4474 3392 4476 3392 4478 3392 4481 3392 4483 3392 4485 3392 4487 3392 
4490 3392 4492 3392 4494 3392 4496 3392 4499 3392 4501 3392 4503 3392 4505 3392 4508 3392 4510 3392 
4512 3392 4514 3392 4517 3392 4519 3392 4521 3392 4523 3392 4526 3392 4528 3392 4530 3392 4532 3392 
4535 3392 4537 3392 4539 3392 4541 3392 4544 3392 4546 3392 4548 3392 4550 3392 4553 3392 4555 3392 
4557 3392 4559 3392 4562 3392 4564 3392 4566 3392 4568 3392 4571 3393 4573 3393 4575 3393 4577 3393 
4580 3393 4582 3393 4584 3393 4586 3393 4589 3393 4591 3393 4593 3393 4595 3393 4598 3393 4600 3393 
4602 3393 4604 3393 4607 3393 4609 3393 4611 3393 4613 3393 4616 3393 4618 3393 4620 3393 4622 3393 
4625 3393 4627 3393 4629 3393 4631 3393 4634 3393 4636 3393 
] dogrey 
 (drawpoly) 432 [0]
[4638 3393 4640 3393 4643 3393 4645 3393 4647 3393 4649 3393 4652 3393 4654 3393 4656 3393 4658 3393 
4661 3393 4663 3393 4665 3393 4667 3394 4670 3394 4672 3394 4674 3394 4676 3394 4679 3394 4681 3394 
4683 3394 4685 3394 4688 3394 4690 3394 4692 3394 4694 3394 4697 3394 4699 3394 4701 3394 4703 3394 
4706 3394 4708 3394 4710 3394 4712 3394 4715 3394 4717 3394 4719 3394 4721 3394 4724 3394 4726 3394 
4728 3394 4730 3394 4733 3394 4735 3394 4737 3395 4739 3395 4742 3395 4744 3395 4746 3395 4748 3395 
4751 3395 4753 3395 4755 3395 4757 3395 4760 3395 4762 3395 4764 3395 4766 3395 4769 3395 4771 3395 
4773 3395 4775 3395 4778 3395 4780 3395 4782 3395 4784 3395 4787 3395 4789 3395 4791 3395 4793 3395 
4796 3396 4798 3396 4800 3396 4802 3396 4805 3396 4807 3396 4809 3396 4811 3396 4814 3396 4816 3396 
4818 3396 4820 3396 4823 3396 4825 3396 4827 3396 4829 3396 4832 3396 4834 3396 4836 3396 4838 3396 
4841 3396 4843 3396 4845 3396 4847 3396 4850 3397 4852 3397 4854 3397 4856 3397 4859 3397 4861 3397 
4863 3397 4865 3397 4868 3397 4870 3397 4872 3397 4874 3397 4877 3397 4879 3397 4881 3397 4883 3397 
4886 3397 4888 3397 4890 3397 4892 3397 4895 3397 4897 3398 4899 3398 4901 3398 4904 3398 4906 3398 
4908 3398 4910 3398 4913 3398 4915 3398 4917 3398 4919 3398 4922 3398 4924 3398 4926 3398 4928 3398 
4931 3398 4933 3398 4935 3398 4937 3398 4940 3398 4942 3399 4944 3399 4946 3399 4949 3399 4951 3399 
4953 3399 4955 3399 4958 3399 4960 3399 4962 3399 4964 3399 4967 3399 4969 3399 4971 3399 4973 3399 
4976 3399 4978 3399 4980 3399 4982 3399 4985 3399 4987 3400 4989 3400 4991 3400 4994 3400 4996 3400 
4998 3400 5000 3400 5003 3400 5005 3400 5007 3400 5009 3400 5012 3400 5014 3400 5016 3400 5018 3400 
5021 3400 5023 3400 5025 3400 5027 3401 5030 3401 5032 3401 5034 3401 5036 3401 5039 3401 5041 3401 
5043 3401 5045 3401 5048 3401 5050 3401 5052 3401 5054 3401 5057 3401 5059 3401 5061 3401 5063 3401 
5066 3401 5068 3402 5070 3402 5072 3402 5075 3402 5077 3402 5079 3402 5081 3402 5084 3402 5086 3402 
5088 3402 5090 3402 5093 3402 5095 3402 5097 3402 5099 3402 5102 3402 5104 3402 5106 3403 5108 3403 
5111 3403 5113 3403 5115 3403 5117 3403 5120 3403 5122 3403 
] dogrey 
 (drawpoly) 114 [0]
[5124 3403 5126 3403 5129 3403 5131 3403 5133 3403 5135 3403 5138 3403 5140 3403 5142 3403 5144 3404 
5147 3404 5149 3404 5151 3404 5153 3404 5156 3404 5158 3404 5160 3404 5162 3404 5165 3404 5167 3404 
5169 3404 5171 3404 5174 3404 5176 3404 5178 3404 5180 3405 5183 3405 5185 3405 5187 3405 5189 3405 
5192 3405 5194 3405 5196 3405 5198 3405 5201 3405 5203 3405 5205 3405 5207 3405 5210 3405 5212 3405 
5214 3405 5216 3406 5219 3406 5221 3406 5223 3406 5225 3406 5228 3406 5230 3406 5232 3406 5234 3406 
5237 3406 5239 3406 5241 3406 5243 3406 5246 3406 5248 3406 5250 3407 
] dogrey 
0 Setcolor
/absolu true def
0 Setcolor
-1 -1 200000 200000 setclipzone
 showpage

 end saved restore 

