%!PS-Adobe-2.0 EPSF-2.0
%%BoundingBox:  0 0 300 212
%%
%%Scilab Postscript File (1995-1997 J.Ph Chancelier)
%%EndComments
/saved save def 
/$pictdict 100 dict def
$pictdict begin

/dogrey
{ /Arraybox exch def
	/Arraygrey exch def
	/nargs exch def 
	/func exch cvx def
	Arraybox 0 nargs getinterval Arraygrey 0 get func 
	1 1 Arraygrey length 1 sub 
	{/i exch def
	Arraybox i nargs mul nargs getinterval 
	Arraygrey i get func
	}for
} def
%--------------------------------------------
% [x y width height] nivgris drawbox 
% si niv gris > 1.0 alors on fait un stroke 
% sans closepath 
%--------------------------------------------

/drawpoly
	{/glev exch def /Ar exch def
	newpath
	Ar 0 get Ar 1 get moveto 
	2 2 Ar length 1 sub 
	{/i exch def
	Ar i get Ar i 1 add get absolu {lineto} {rlineto} ifelse
	}for
	glev -1 le 
	{ % filling the polygon with current pattern ( gray or color)
	  closepath gsave glev neg 1 sub WhiteLev 2 add lmin 0 lmax Setgray eofill grestore }
	{ glev 1 ge 
	   { % drawing the polygon with current dash style or color 
	     % XXXXX : a voir c'est pas clair il faudrait sauver 
	     % and filling it with other color (glev) 
	     closepath gsave glev 1 sub WhiteLev 2 add lmin 0 lmax Setgray 
		 eofill grestore stroke }
	   {% drawing the polygon with current style 
	    closeflag {closepath} if stroke} 
	ifelse }
	ifelse 
} def 


/drawbox 
	{/glev exch def /Ar exch def 
	/x Ar 0 get def /y Ar 1 get def 
	/w Ar 2 get def /h Ar 3 get def 
	newpath
	x y moveto
	x w add y lineto
	x w add y h add lineto
	x y h add lineto
	glev 1 ge 
	{ % filling 
	 closepath gsave glev 1 sub WhiteLev 2 add lmin 0 lmax Setgray eofill 
		grestore}
	{ 
	  % drawing 
	  glev -1 le 
	  {
    	  closepath gsave glev neg 1 sub WhiteLev 2 add lmin 0 lmax Setgray
		 stroke grestore  }
	  { closepath stroke} ifelse 
	} ifelse
} def 

%--------------------------------------------
% [x y width height] clearzone
%--------------------------------------------
/clearzone
        {/Ar exch def
        /x Ar 0 get def /y Ar 1 get def
        /w Ar 2 get def /h Ar 3 get def
        newpath
        x y moveto
        x w add y lineto
        x w add y h add lineto
        x y h add lineto
	closepath WhiteLev 2 add Setcolor  eofill grestore
} def

%------------------------------------------------------
% polyline stroke or polygon fill or both 
%------------------------------------------------------
/absolu true def 
/closeflag false def 

/lmin { /y exch def /x exch def x y le { x  } {  y  } ifelse } def
/lmax { /y exch def /x exch def x y le { y } {  x } ifelse } def 


/drawpoly
	{/glev exch def /Ar exch def
	newpath
	Ar 0 get Ar 1 get moveto 
	2 2 Ar length 1 sub 
	{/i exch def
	Ar i get Ar i 1 add get absolu {lineto} {rlineto} ifelse
	}for
	glev -1 le 
	{ % filling the polygon with current pattern ( gray or color)
	  closepath gsave glev neg 1 sub WhiteLev 2 add lmin 0 lmax Setgray eofill grestore }
	{ glev 1 ge 
	   { % drawing the polygon with current dash style or color 
	     % XXXXX : a voir c'est pas clair il faudrait sauver 
	     % and filling it with other color (glev) 
	     closepath gsave glev 1 sub WhiteLev 2 add lmin 0 lmax Setgray 
		 eofill grestore stroke }
	   {% drawing the polygon with current style 
	    closeflag {closepath} if stroke} 
	ifelse }
	ifelse 
} def 

%------------------------------------------------------
% segments non connectes 
%------------------------------------------------------

/drawsegs
	{/glev exch def /Ar exch def
	newpath
	Ar 0 get Ar 1 get moveto Ar 2 get Ar 3 get lineto 
	gsave glev Setgray stroke grestore
	4 4 Ar length 3 sub 
	{/i exch def
	newpath 
	Ar i get Ar i 1 add get moveto
	Ar i 2 add get Ar i 3 add get lineto 
	gsave glev Setgray stroke grestore
	}for
} def 


%------------------------------------------------------
% unconected arrows
%-----------------------------------------------------

/drawarrows
	{/arsize10 exch def /Ar exch def
	Ar 0 get  Ar 1 get Ar 2 get Ar 3 get arsize10 drawarrow
	4 4 Ar length 3 sub 
	{/i exch def
	Ar i get Ar i 1 add get  Ar i 2 add get  Ar i 3 add get arsize10 
	drawarrow
	}for
} def 
		
/cos20 20 cos def
/sin20 20 sin def

/drawarrow                                
  { 
      /arsize exch 10 div def 
      /tipy exch def /tipx exch def       
      /taily exch def /tailx exch def
      /dx tipx tailx sub  def               
      /dy tipy taily sub  def               
      newpath tipx tipy moveto tailx taily lineto stroke   
      /norme dx dx mul dy dy mul add sqrt def 
      norme 1.e-8 ge 
	{
	 arsize dx mul norme div /dx1 exch def 
	 arsize dy mul norme div /dy1 exch def 
	 /depx tipx cos20 dx1 mul add def 
	/depy  tipy cos20 dy1 mul add def 
	newpath depx depy moveto 
	cos20 neg dx1 mul sin20 dy1 mul sub depx add
	sin20 dx1  mul cos20 dy1 mul sub depy add lineto 
	cos20 neg dx1 mul sin20 dy1 mul add  depx add
	sin20 neg dx1 mul cos20 dy1 mul sub depy add lineto closepath 
	fill
	} {} ifelse 
  } def


%------------------------------------------------------
% cercle ou portions de cercle 
% attention argument (x y w h angl1*64 angl2*64 )
% devrait tracer une ellipse a modifier donc 
%------------------------------------------------------

/fillarc
	{/glev exch def /Ar exch def
	/cx Ar 0 get Ar 2 get 2 div add def 
	/cy Ar 1 get Ar 3 get 2 div add def 
	/hom Ar 3 get Ar 2 get div def 
	/Cmsave1 matrix def Cmsave1 currentmatrix pop
	%-- on change de transformation pour faire homothetie en (x,y) 
	cx cy [1 0 0 hom 0 0 ] transform
	/t1 exch neg cy add def 
	/t2 exch neg cx add def 
	[1 0 0 hom t2 t1 ] concat 
	glev WhiteLev le
	{ % filling 
	newpath
	cx cy moveto 
	cx cy Ar 2 get 2 div Ar 5 get Ar 4 get add  64 div neg
	 Ar 4 get 64 div neg  arc closepath
	gsave glev Setgray eofill grestore}
	{
	%drawing with current dash or color unclosed path 
	newpath
	cx cy Ar 2 get 2 div Ar 5 get Ar 4 get add 64 div neg Ar 4 get 64 div neg arc
	  stroke} ifelse 
	Cmsave1 setmatrix } def 

/drawarc
	{/glev exch def /Ar exch def
	/cx Ar 0 get Ar 2 get 2 div add def 
	/cy Ar 1 get Ar 3 get 2 div add def 
	/hom Ar 3 get Ar 2 get div def 
	/Cmsave1 matrix def Cmsave1 currentmatrix pop
	%-- on change de transformation pour faire homothetie en (x,y) 
	cx cy [1 0 0 hom 0 0 ] transform
	/t1 exch neg cy add def 
	/t2 exch neg cx add def 
	[1 0 0 hom t2 t1 ] concat 
	newpath
	cx cy Ar 2 get 2 div Ar 5 get Ar 4 get add 64 div neg Ar 4 get 64 div neg arc
	closepath glev Setgray stroke
	Cmsave1 setmatrix } def 

%------------------------------------------------------
% centred hard mark 
%------------------------------------------------------

% x y str ShowCString 
% on fait un show mais string est centre autour du point (x,y) 

/ShowCString { /str exch def /y exch def /x exch def 
 newpath 
 x y moveto 
 str true charpath flattenpath pathbbox 
 /y2 exch def /x2 exch def /y1 exch def /x1 exch def 
 x 2 mul x2 x1 add 2 div sub 
 y 2 mul y2 y1 add 2 div sub moveto str show 
 } def 

/drawpolymark {/glev exch def /Ar exch def 
	Ar 0 get Ar 1 get HardMark ShowCString 
	2 2 Ar length 1 sub 
	{/i exch def
	Ar i get Ar i 1 add get HardMark ShowCString
	}for
} def 

%---------------------------------------------------
% chaines de caracteres 
%---------------------------------------------------
/FBox {/Ar exch def /rot exch def /str exch def /y exch def /x exch def 
 newpath Ar 0 get Ar 1 get moveto 
	/sina rot sin def /cosa rot cos def 
	/-sina sina neg def 
	[cosa -sina sina cosa 0 0 ] CtmModif
 Ar 2 get 0 rlineto 0 Ar 3 get neg rlineto Ar 2 get neg 0 rlineto 
 0 Ar 3 get  rlineto  stroke CtmRestore 
 x y str rot ShowRotate 
 } def 

% x y str ang Showrotate 
% inverse du sens trigo 

/ShowRotate { /ang exch def /str exch def 
	/y exch def /x exch def 
	x y moveto 
	/sina ang sin def /cosa ang cos def 
	/-sina 0 sina sub def 
	[cosa -sina sina cosa 0 0 ] CtmModif
	str show 
	CtmRestore 
} def 

/HardMark (0) def 

%(Chaine de caracteres) x y flag angle [arfbox] Show

/Show { /Ar exch def 
	/rot exch def /flag exch def /y exch def /x exch def /str exch def 
	flag 1 eq 
	{x y str rot Ar FBox}
	{x y str rot ShowRotate } ifelse} def 

/L {/y2 exch def /x2 exch def /y1 exch def /x1 exch def 
    newpath x1 y1 moveto x2 y2 lineto stroke } def 

%---------------------------------------------------------
% drawing an axis 
% angle [nsep1,nsep2] ,[siz1,siz2,coeff] [x0,y0] drawaxis",
%---------------------------------------------------------

/drawaxis {/XX exch def /Arsize exch def /Arsep exch def /ang exch def 
	/Cmsave1 matrix def Cmsave1 currentmatrix pop
	/sina ang sin def /cosa ang cos def /-sina sina neg def 
	/x XX 0 get def /y XX 1 get def
	%-- on change de transformation pour tourner autour de (x,y) 
	x y [cosa sina -sina cosa 0 0 ] transform
	/t1 exch neg y add def 
	/t2 exch neg x add def 
	[cosa sina -sina cosa t2 t1 ] concat 
	newpath x y moveto 0 Arsize 1 get Arsize 2 get mul rlineto
	stroke 
	0 1 Arsep 1 get 1 sub
	{
	 % i don't want the value of the for indice 
	 pop
	newpath 
	x y moveto 
	0 1 Arsep 0 get 1 sub
		{
		 % i don't want the value of the for indice 
		 pop
		 Arsize 0 get 0  rlineto
		 0 Arsize 1 get rlineto 
	 	0 Arsize 1 get  neg rlineto }
		for 
	currentpoint /y exch def /x exch def 
	stroke 
	newpath x y moveto 0 Arsize 1 get Arsize 2 get mul rlineto
	stroke }
	for 
	Cmsave1 setmatrix } def 

%---------------------------------------------------------
% change and restore CTM
%---------------------------------------------------------

/CtmModif {
	/arg exch def 
	/Cmsave matrix def 
	Cmsave currentmatrix pop
	[1 0 0 -1 0 0 ] concat 
	arg concat 
} def 

/CtmRestore { Cmsave setmatrix } def 

/Thickness { /th exch def th 0 le {/th 0.1 def} if th setlinewidth} def 

/WhiteLev 15 def

/Setgray { WhiteLev div setgray} def 

/fillsolid { 0 setgray } def 

%--------------------------------------
% clip zones ( rectangle ) 
%-------------------------------------

/setclipzone {initclip 
	/h exch def /w exch def /y exch def /x exch def 
	newpath x y moveto w 0 rlineto 0 h rlineto w neg 0 rlineto 
	0 h neg rlineto closepath clip} def 

%------------------
% to change the position of a picture 
%------------------
/cm{28.346457 mul}def

/DesPosi { /YH exch def /XW exch def /YP exch def /XP exch def 
	XP cm YP cm neg translate 
	XW cm 6000 div YH cm 4240 div  scale } def 

0 setlinecap 
2 setlinejoin 
1 setlinewidth

%-- Color database 
/ColorR [0.000000 0.000000 0.000000 0.529412 0.498039 0.133333 0.000000 0.878431 0.000000 1.000000 1.000000 1.000000 0.933333 1.000000 1.000000 0.960784 1.000000 ] def
/ColorG [0.000000 0.000000 0.000000 0.807843 1.000000 0.545098 1.000000 1.000000 1.000000 0.647059 0.000000 0.000000 0.509804 1.000000 0.843137 0.960784 1.000000 ] def
/ColorB [0.000000 0.501961 1.000000 0.921569 0.831373 0.133333 0.000000 1.000000 1.000000 0.000000 0.000000 1.000000 0.933333 0.000000 0.000000 0.862745 1.000000 ] def

/Setcolor {/i exch def ColorR i get ColorG i get ColorB i get setrgbcolor } def

% to multiply all the fontsizes by a factor  scf
/scf 1.0 def


% changing fonts encoding 

/Courier findfont
dup length dict begin
  {1 index /FID ne {def} {pop pop} ifelse} forall
  /Encoding ISOLatin1Encoding def
  currentdict
  end
/Courier exch definefont pop

/Times-Roman findfont
dup length dict begin
  {1 index /FID ne {def} {pop pop} ifelse} forall
  /Encoding ISOLatin1Encoding def
  currentdict
  end
/Times-Roman exch definefont pop

/Times-Bold findfont
dup length dict begin
  {1 index /FID ne {def} {pop pop} ifelse} forall
  /Encoding ISOLatin1Encoding def
  currentdict
  end
/Times-Bold exch definefont pop


/Times-BoldItalic findfont
dup length dict begin
  {1 index /FID ne {def} {pop pop} ifelse} forall
  /Encoding ISOLatin1Encoding def
  currentdict
  end
/Times-BoldItalic exch definefont pop


%------ End Main Program ------%
% XP YP XW YW DesPosi in the following code 
% will output the picture in the rectangle defined by 
% upper left point (XP,YP) wide :XW Height: YW
% the coordinates are given in centimeter and 
% are the (0,0) point is the down-left point of the paper 


/ColorR [0.000000 
0.000000 0.000000 0.000000 1.000000 1.000000 1.000000 1.000000 0.000000 0.000000 0.000000 
0.529412 0.000000 0.000000 0.000000 0.000000 0.000000 0.000000 0.564706 0.690196 0.815686 
0.564706 0.690196 0.815686 0.501961 0.627451 0.752941 1.000000 1.000000 1.000000 1.000000 
1.000000 0.0 1.0] def
/ColorG [0.000000 
0.000000 1.000000 1.000000 0.000000 0.000000 0.000000 1.000000 0.000000 0.000000 0.000000 
0.807843 0.564706 0.690196 0.815686 0.564706 0.690196 0.815686 0.000000 0.000000 0.000000 
0.000000 0.000000 0.000000 0.188235 0.250980 0.376471 0.501961 0.627451 0.752941 0.878431 
0.843137 0.0 1.0] def
/ColorB [0.000000 
1.000000 0.000000 1.000000 0.000000 1.000000 0.000000 1.000000 0.564706 0.690196 0.815686 
1.000000 0.000000 0.000000 0.000000 0.564706 0.690196 0.815686 0.000000 0.000000 0.000000 
0.564706 0.690196 0.815686 0.000000 0.000000 0.000000 0.501961 0.627451 0.752941 0.878431 
0.000000 0.0 1.0] def
% Dessin en bas a gauche de taille 3000,2120
[0.5 10 div 0 0 0.5 10 div neg  0 2120 10 div] concat
% Init driver 
5 Thickness
% 3 setalufunction
-1 -1 200000 200000 setclipzone
[] 0 setdash
/Times-Roman findfont 100 scf mul scalefont setfont
fillsolid
[] 0 setdash
0 Setcolor
%--use color 1 
fillsolid
[] 0 setdash
0 Setcolor
/WhiteLev 31 def
/Setgray {/i exch def ColorR i get ColorG i get ColorB i get setrgbcolor } def 
/Setcolor {/i exch def ColorR i get ColorG i get ColorB i get setrgbcolor } def 
%--end use color 1 
% End init driver 
/WhiteLev 31 def
/Times-Roman findfont 100 scf mul scalefont setfont
5 Thickness
-1 -1 200000 200000 setclipzone
0 Setcolor
0 Setcolor
 (drawbox) 4 [ 0]
[750 530 4500 3180 
] dogrey 
0 Setcolor
(0) 722 3906 0  0.00 [722 3816 57 120] Show
 (drawsegs) 4 [ 0]
[750 3710 750 3773 
] dogrey 
0 Setcolor
 (drawsegs) 4 [ 0]
[1200 3710 1200 3741 
] dogrey 
0 Setcolor
(1e3) 1564 3906 0  0.00 [1564 3816 172 120] Show
 (drawsegs) 4 [ 0]
[1650 3710 1650 3773 
] dogrey 
0 Setcolor
 (drawsegs) 4 [ 0]
[2100 3710 2100 3741 
] dogrey 
0 Setcolor
(2e3) 2464 3906 0  0.00 [2464 3816 172 120] Show
 (drawsegs) 4 [ 0]
[2550 3710 2550 3773 
] dogrey 
0 Setcolor
 (drawsegs) 4 [ 0]
[3000 3710 3000 3741 
] dogrey 
0 Setcolor
(3e3) 3364 3906 0  0.00 [3364 3816 172 120] Show
 (drawsegs) 4 [ 0]
[3450 3710 3450 3773 
] dogrey 
0 Setcolor
 (drawsegs) 4 [ 0]
[3900 3710 3900 3741 
] dogrey 
0 Setcolor
(4e3) 4264 3906 0  0.00 [4264 3816 172 120] Show
 (drawsegs) 4 [ 0]
[4350 3710 4350 3773 
] dogrey 
0 Setcolor
 (drawsegs) 4 [ 0]
[4800 3710 4800 3741 
] dogrey 
0 Setcolor
(5e3) 5164 3906 0  0.00 [5164 3816 172 120] Show
 (drawsegs) 4 [ 0]
[5250 3710 5250 3773 
] dogrey 
0 Setcolor
(-1.5) 449 3770 0  0.00 [449 3680 229 120] Show
 (drawsegs) 4 [ 0]
[750 3710 690 3710 
] dogrey 
0 Setcolor
 (drawsegs) 4 [ 0]
[750 3511 720 3511 
] dogrey 
0 Setcolor
(-1.1) 449 3373 0  0.00 [449 3283 229 120] Show
 (drawsegs) 4 [ 0]
[750 3313 690 3313 
] dogrey 
0 Setcolor
 (drawsegs) 4 [ 0]
[750 3114 720 3114 
] dogrey 
0 Setcolor
(-0.7) 449 2975 0  0.00 [449 2885 229 120] Show
 (drawsegs) 4 [ 0]
[750 2915 690 2915 
] dogrey 
0 Setcolor
 (drawsegs) 4 [ 0]
[750 2716 720 2716 
] dogrey 
0 Setcolor
(-0.3) 449 2578 0  0.00 [449 2488 229 120] Show
 (drawsegs) 4 [ 0]
[750 2518 690 2518 
] dogrey 
0 Setcolor
 (drawsegs) 4 [ 0]
[750 2319 720 2319 
] dogrey 
0 Setcolor
(0.1) 506 2180 0  0.00 [506 2090 172 120] Show
 (drawsegs) 4 [ 0]
[750 2120 690 2120 
] dogrey 
0 Setcolor
 (drawsegs) 4 [ 0]
[750 1921 720 1921 
] dogrey 
0 Setcolor
(0.5) 506 1783 0  0.00 [506 1693 172 120] Show
 (drawsegs) 4 [ 0]
[750 1723 690 1723 
] dogrey 
0 Setcolor
 (drawsegs) 4 [ 0]
[750 1524 720 1524 
] dogrey 
0 Setcolor
(0.9) 506 1385 0  0.00 [506 1295 172 120] Show
 (drawsegs) 4 [ 0]
[750 1325 690 1325 
] dogrey 
0 Setcolor
 (drawsegs) 4 [ 0]
[750 1126 720 1126 
] dogrey 
0 Setcolor
(1.3) 506 988 0  0.00 [506 898 172 120] Show
 (drawsegs) 4 [ 0]
[750 928 690 928 
] dogrey 
0 Setcolor
 (drawsegs) 4 [ 0]
[750 729 720 729 
] dogrey 
0 Setcolor
(1.7) 506 590 0  0.00 [506 500 172 120] Show
 (drawsegs) 4 [ 0]
[750 530 690 530 
] dogrey 
0 Setcolor
0 Setcolor
750 530 4500 3180 setclipzone
0 Setcolor
/closeflag false def
 (drawpoly) 6 [ 0]
[750 729 750 3710 5250 3710 
] dogrey 
0 Setcolor
/absolu true def
0 Setcolor
-1 -1 200000 200000 setclipzone
0 Setcolor
0 Setcolor
750 530 4500 3180 setclipzone
0 Setcolor
/closeflag false def
 (drawpoly) 432 [ 0]
[751 1226 752 1226 753 1228 754 1230 755 1233 755 1238 756 1243 757 1250 758 1257 759 1265 
760 1274 761 1284 762 1295 763 1307 764 1320 764 1334 765 1349 766 1364 767 1380 768 1397 
769 1415 770 1434 771 1454 772 1474 773 1495 773 1517 774 1539 775 1562 776 1586 777 1610 
778 1635 779 1661 780 1687 781 1714 782 1741 782 1768 783 1796 784 1825 785 1854 786 1883 
787 1912 788 1942 789 1972 790 2003 791 2033 791 2064 792 2095 793 2126 794 2157 795 2188 
796 2219 797 2251 798 2282 799 2313 800 2344 800 2375 801 2406 802 2436 803 2467 804 2497 
805 2526 806 2556 807 2585 808 2614 809 2642 809 2671 810 2698 811 2725 812 2752 813 2778 
814 2803 815 2828 816 2853 817 2877 818 2900 818 2922 819 2944 820 2965 821 2985 822 3005 
823 3023 824 3041 825 3058 826 3075 827 3090 827 3105 828 3119 829 3131 830 3143 831 3154 
832 3164 833 3174 834 3182 835 3189 836 3196 836 3201 837 3205 838 3209 839 3211 840 3213 
841 3213 842 3213 843 3211 844 3209 845 3205 845 3201 846 3196 847 3189 848 3182 849 3174 
850 3164 851 3154 852 3143 853 3131 854 3119 854 3105 855 3090 856 3075 857 3058 858 3041 
859 3023 860 3005 861 2985 862 2965 863 2944 863 2922 864 2900 865 2877 866 2853 867 2828 
868 2803 869 2778 870 2752 871 2725 872 2698 872 2671 873 2642 874 2614 875 2585 876 2556 
877 2526 878 2497 879 2467 880 2436 881 2406 881 2375 882 2344 883 2313 884 2282 885 2251 
886 2219 887 2188 888 2157 889 2126 890 2095 890 2064 891 2033 892 2003 893 1972 894 1942 
895 1912 896 1883 897 1854 898 1825 899 1796 899 1768 900 1741 901 1714 902 1687 903 1661 
904 1635 905 1610 906 1586 907 1562 908 1539 908 1517 909 1495 910 1474 911 1454 912 1434 
913 1415 914 1397 915 1380 916 1364 917 1349 917 1334 918 1320 919 1307 920 1295 921 1284 
922 1274 923 1265 924 1257 925 1250 926 1243 926 1238 927 1233 928 1230 929 1228 930 1226 
931 1226 932 1226 933 1228 934 1230 935 1233 935 1238 936 1243 937 1250 938 1257 939 1265 
940 1274 941 1284 942 1295 943 1307 944 1320 944 1334 
] dogrey 
 (drawpoly) 432 [0]
[945 1349 946 1364 947 1380 948 1397 949 1415 950 1434 951 1454 952 1474 953 1495 953 1517 
954 1539 955 1562 956 1586 957 1610 958 1635 959 1661 960 1687 961 1714 962 1741 962 1768 
963 1796 964 1825 965 1854 966 1883 967 1912 968 1942 969 1972 970 2003 971 2033 971 2064 
972 2095 973 2126 974 2157 975 2188 976 2219 977 2251 978 2282 979 2313 980 2344 980 2375 
981 2406 982 2436 983 2467 984 2497 985 2526 986 2556 987 2585 988 2614 989 2642 989 2671 
990 2698 991 2725 992 2752 993 2778 994 2803 995 2828 996 2853 997 2877 998 2900 998 2922 
999 2944 1000 2965 1001 2985 1002 3005 1003 3023 1004 3041 1005 3058 1006 3075 1007 3090 1007 3105 
1008 3119 1009 3131 1010 3143 1011 3154 1012 3164 1013 3174 1014 3182 1015 3189 1016 3196 1016 3201 
1017 3205 1018 3209 1019 3211 1020 3213 1021 3213 1022 3213 1023 3211 1024 3209 1025 3205 1025 3201 
1026 3196 1027 3189 1028 3182 1029 3174 1030 3164 1031 3154 1032 3143 1033 3131 1034 3119 1034 3105 
1035 3090 1036 3075 1037 3058 1038 3041 1039 3023 1040 3005 1041 2985 1042 2965 1043 2944 1043 2922 
1044 2900 1045 2877 1046 2853 1047 2828 1048 2803 1049 2778 1050 2752 1051 2725 1052 2698 1052 2671 
1053 2642 1054 2614 1055 2585 1056 2556 1057 2526 1058 2497 1059 2467 1060 2436 1061 2406 1061 2375 
1062 2344 1063 2313 1064 2282 1065 2251 1066 2219 1067 2188 1068 2157 1069 2126 1070 2095 1070 2064 
1071 2033 1072 2003 1073 1972 1074 1942 1075 1912 1076 1883 1077 1854 1078 1825 1079 1796 1079 1768 
1080 1741 1081 1714 1082 1687 1083 1661 1084 1635 1085 1610 1086 1586 1087 1562 1088 1539 1088 1517 
1089 1495 1090 1474 1091 1454 1092 1434 1093 1415 1094 1397 1095 1380 1096 1364 1097 1349 1097 1334 
1098 1320 1099 1307 1100 1295 1101 1284 1102 1274 1103 1265 1104 1257 1105 1250 1106 1243 1106 1238 
1107 1233 1108 1230 1109 1228 1110 1226 1111 1226 1112 1226 1113 1228 1114 1230 1115 1233 1115 1238 
1116 1243 1117 1250 1118 1257 1119 1265 1120 1274 1121 1284 1122 1295 1123 1307 1124 1320 1124 1334 
1125 1349 1126 1364 1127 1380 1128 1397 1129 1415 1130 1434 1131 1454 1132 1474 1133 1495 1133 1517 
1134 1539 1135 1562 1136 1586 1137 1610 1138 1635 1139 1661 
] dogrey 
 (drawpoly) 432 [0]
[1140 1687 1141 1714 1142 1741 1142 1768 1143 1796 1144 1825 1145 1854 1146 1883 1147 1912 1148 1942 
1149 1972 1150 2003 1151 2033 1151 2064 1152 2095 1153 2126 1154 2157 1155 2188 1156 2219 1157 2251 
1158 2282 1159 2313 1160 2344 1160 2375 1161 2406 1162 2436 1163 2467 1164 2497 1165 2526 1166 2556 
1167 2585 1168 2614 1169 2642 1169 2671 1170 2698 1171 2725 1172 2752 1173 2778 1174 2803 1175 2828 
1176 2853 1177 2877 1178 2900 1178 2922 1179 2944 1180 2965 1181 2985 1182 3005 1183 3023 1184 3041 
1185 3058 1186 3075 1187 3090 1187 3105 1188 3119 1189 3131 1190 3143 1191 3154 1192 3164 1193 3174 
1194 3182 1195 3189 1196 3196 1196 3201 1197 3205 1198 3209 1199 3211 1200 3213 1201 3213 1202 3213 
1203 3211 1204 3209 1205 3205 1205 3201 1206 3196 1207 3189 1208 3182 1209 3174 1210 3164 1211 3154 
1212 3143 1213 3131 1214 3119 1214 3105 1215 3090 1216 3075 1217 3058 1218 3041 1219 3023 1220 3005 
1221 2985 1222 2965 1223 2944 1223 2922 1224 2900 1225 2877 1226 2853 1227 2828 1228 2803 1229 2778 
1230 2752 1231 2725 1232 2698 1232 2671 1233 2642 1234 2614 1235 2585 1236 2556 1237 2526 1238 2497 
1239 2467 1240 2436 1241 2406 1241 2375 1242 2344 1243 2313 1244 2282 1245 2251 1246 2219 1247 2188 
1248 2157 1249 2126 1250 2095 1250 2064 1251 2033 1252 2003 1253 1972 1254 1942 1255 1912 1256 1883 
1257 1854 1258 1825 1259 1796 1259 1768 1260 1741 1261 1714 1262 1687 1263 1661 1264 1635 1265 1610 
1266 1586 1267 1562 1268 1539 1268 1517 1269 1495 1270 1474 1271 1454 1272 1434 1273 1415 1274 1397 
1275 1380 1276 1364 1277 1349 1277 1334 1278 1320 1279 1307 1280 1295 1281 1284 1282 1274 1283 1265 
1284 1257 1285 1250 1286 1243 1286 1238 1287 1233 1288 1230 1289 1228 1290 1226 1291 1226 1292 1226 
1293 1228 1294 1230 1295 1233 1295 1238 1296 1243 1297 1250 1298 1257 1299 1265 1300 1274 1301 1284 
1302 1295 1303 1307 1304 1320 1304 1334 1305 1349 1306 1364 1307 1380 1308 1397 1309 1415 1310 1434 
1311 1454 1312 1474 1313 1495 1313 1517 1314 1539 1315 1562 1316 1586 1317 1610 1318 1635 1319 1661 
1320 1687 1321 1714 1322 1741 1322 1768 1323 1796 1324 1825 1325 1854 1326 1883 1327 1912 1328 1942 
1329 1972 1330 2003 1331 2033 1331 2064 1332 2095 1333 2126 
] dogrey 
 (drawpoly) 432 [0]
[1334 2157 1335 2188 1336 2219 1337 2251 1338 2282 1339 2313 1340 2344 1340 2375 1341 2406 1342 2436 
1343 2467 1344 2497 1345 2526 1346 2556 1347 2585 1348 2614 1349 2642 1349 2671 1350 2698 1351 2725 
1352 2752 1353 2778 1354 2803 1355 2828 1356 2853 1357 2877 1358 2900 1358 2922 1359 2944 1360 2965 
1361 2985 1362 3005 1363 3023 1364 3041 1365 3058 1366 3075 1367 3090 1367 3105 1368 3119 1369 3131 
1370 3143 1371 3154 1372 3164 1373 3174 1374 3182 1375 3189 1376 3196 1376 3201 1377 3205 1378 3209 
1379 3211 1380 3213 1381 3213 1382 3213 1383 3211 1384 3209 1385 3205 1385 3201 1386 3196 1387 3189 
1388 3182 1389 3174 1390 3164 1391 3154 1392 3143 1393 3131 1394 3119 1394 3105 1395 3090 1396 3075 
1397 3058 1398 3041 1399 3023 1400 3005 1401 2985 1402 2965 1403 2944 1403 2922 1404 2900 1405 2877 
1406 2853 1407 2828 1408 2803 1409 2778 1410 2752 1411 2725 1412 2698 1412 2671 1413 2642 1414 2614 
1415 2585 1416 2556 1417 2526 1418 2497 1419 2467 1420 2436 1421 2406 1421 2375 1422 2344 1423 2313 
1424 2282 1425 2251 1426 2219 1427 2188 1428 2157 1429 2126 1430 2095 1430 2064 1431 2033 1432 2003 
1433 1972 1434 1942 1435 1912 1436 1883 1437 1854 1438 1825 1439 1796 1439 1768 1440 1741 1441 1714 
1442 1687 1443 1661 1444 1635 1445 1610 1446 1586 1447 1562 1448 1539 1448 1517 1449 1495 1450 1474 
1451 1454 1452 1434 1453 1415 1454 1397 1455 1380 1456 1364 1457 1349 1457 1334 1458 1320 1459 1307 
1460 1295 1461 1284 1462 1274 1463 1265 1464 1257 1465 1250 1466 1243 1466 1238 1467 1233 1468 1230 
1469 1228 1470 1226 1471 1226 1472 1226 1473 1228 1474 1230 1475 1233 1475 1238 1476 1243 1477 1250 
1478 1257 1479 1265 1480 1274 1481 1284 1482 1295 1483 1307 1484 1320 1484 1334 1485 1349 1486 1364 
1487 1380 1488 1397 1489 1415 1490 1434 1491 1454 1492 1474 1493 1495 1493 1517 1494 1539 1495 1562 
1496 1586 1497 1610 1498 1635 1499 1661 1500 1687 1501 1714 1502 1741 1502 1768 1503 1796 1504 1825 
1505 1854 1506 1883 1507 1912 1508 1942 1509 1972 1510 2003 1511 2033 1511 2064 1512 2095 1513 2126 
1514 2157 1515 2188 1516 2219 1517 2251 1518 2282 1519 2313 1520 2344 1520 2375 1521 2406 1522 2436 
1523 2467 1524 2497 1525 2526 1526 2556 1527 2585 1528 2614 
] dogrey 
 (drawpoly) 432 [0]
[1529 2642 1529 2671 1530 2698 1531 2725 1532 2752 1533 2778 1534 2803 1535 2828 1536 2853 1537 2877 
1538 2900 1538 2922 1539 2944 1540 2965 1541 2985 1542 3005 1543 3023 1544 3041 1545 3058 1546 3075 
1547 3090 1547 3105 1548 3119 1549 3131 1550 3143 1551 3154 1552 3164 1553 3174 1554 3182 1555 3189 
1556 3196 1556 3201 1557 3205 1558 3209 1559 3211 1560 3213 1561 3213 1562 3213 1563 3211 1564 3209 
1565 3205 1565 3201 1566 3196 1567 3189 1568 3182 1569 3174 1570 3164 1571 3154 1572 3143 1573 3131 
1574 3119 1574 3105 1575 3090 1576 3075 1577 3058 1578 3041 1579 3023 1580 3005 1581 2985 1582 2965 
1583 2944 1583 2922 1584 2900 1585 2877 1586 2853 1587 2828 1588 2803 1589 2778 1590 2752 1591 2725 
1592 2698 1592 2671 1593 2642 1594 2614 1595 2585 1596 2556 1597 2526 1598 2497 1599 2467 1600 2436 
1601 2406 1601 2375 1602 2344 1603 2313 1604 2282 1605 2251 1606 2219 1607 2188 1608 2157 1609 2126 
1610 2095 1610 2064 1611 2033 1612 2003 1613 1972 1614 1942 1615 1912 1616 1883 1617 1854 1618 1825 
1619 1796 1619 1768 1620 1741 1621 1714 1622 1687 1623 1661 1624 1635 1625 1610 1626 1586 1627 1562 
1628 1539 1628 1517 1629 1495 1630 1474 1631 1454 1632 1434 1633 1415 1634 1397 1635 1380 1636 1364 
1637 1349 1637 1334 1638 1320 1639 1307 1640 1295 1641 1284 1642 1274 1643 1265 1644 1257 1645 1250 
1646 1243 1646 1238 1647 1233 1648 1230 1649 1228 1650 1226 1651 1226 1652 1226 1653 1228 1654 1230 
1655 1233 1655 1238 1656 1243 1657 1250 1658 1257 1659 1265 1660 1274 1661 1284 1662 1295 1663 1307 
1664 1320 1664 1334 1665 1349 1666 1364 1667 1380 1668 1397 1669 1415 1670 1434 1671 1454 1672 1474 
1673 1495 1673 1517 1674 1539 1675 1562 1676 1586 1677 1610 1678 1635 1679 1661 1680 1687 1681 1714 
1682 1741 1682 1768 1683 1796 1684 1825 1685 1854 1686 1883 1687 1912 1688 1942 1689 1972 1690 2003 
1691 2033 1691 2064 1692 2095 1693 2126 1694 2157 1695 2188 1696 2219 1697 2251 1698 2282 1699 2313 
1700 2344 1700 2375 1701 2406 1702 2436 1703 2467 1704 2497 1705 2526 1706 2556 1707 2585 1708 2614 
1709 2642 1709 2671 1710 2698 1711 2725 1712 2752 1713 2778 1714 2803 1715 2828 1716 2853 1717 2877 
1718 2900 1718 2922 1719 2944 1720 2965 1721 2985 1722 3005 
] dogrey 
 (drawpoly) 432 [0]
[1723 3023 1724 3041 1725 3058 1726 3075 1727 3090 1727 3105 1728 3119 1729 3131 1730 3143 1731 3154 
1732 3164 1733 3174 1734 3182 1735 3189 1736 3196 1736 3201 1737 3205 1738 3209 1739 3211 1740 3213 
1741 3213 1742 3213 1743 3211 1744 3209 1745 3205 1745 3201 1746 3196 1747 3189 1748 3182 1749 3174 
1750 3164 1751 3154 1752 3143 1753 3131 1754 3119 1754 3105 1755 3090 1756 3075 1757 3058 1758 3041 
1759 3023 1760 3005 1761 2985 1762 2965 1763 2944 1763 2922 1764 2900 1765 2877 1766 2853 1767 2828 
1768 2803 1769 2778 1770 2752 1771 2725 1772 2698 1772 2671 1773 2642 1774 2614 1775 2585 1776 2556 
1777 2526 1778 2497 1779 2467 1780 2436 1781 2406 1781 2375 1782 2344 1783 2313 1784 2282 1785 2251 
1786 2219 1787 2188 1788 2157 1789 2126 1790 2095 1790 2064 1791 2033 1792 2003 1793 1972 1794 1942 
1795 1912 1796 1883 1797 1854 1798 1825 1799 1796 1799 1768 1800 1741 1801 1714 1802 1687 1803 1661 
1804 1635 1805 1610 1806 1586 1807 1562 1808 1539 1808 1517 1809 1495 1810 1474 1811 1454 1812 1434 
1813 1415 1814 1397 1815 1380 1816 1364 1817 1349 1817 1334 1818 1320 1819 1307 1820 1295 1821 1284 
1822 1274 1823 1265 1824 1257 1825 1250 1826 1243 1826 1238 1827 1233 1828 1230 1829 1228 1830 1226 
1831 1226 1832 1226 1833 1228 1834 1230 1835 1233 1835 1238 1836 1243 1837 1250 1838 1257 1839 1265 
1840 1274 1841 1284 1842 1295 1843 1307 1844 1320 1844 1334 1845 1349 1846 1364 1847 1380 1848 1397 
1849 1415 1850 1434 1851 1454 1852 1474 1853 1495 1853 1517 1854 1539 1855 1562 1856 1586 1857 1610 
1858 1635 1859 1661 1860 1687 1861 1714 1862 1741 1862 1768 1863 1796 1864 1825 1865 1854 1866 1883 
1867 1912 1868 1942 1869 1972 1870 2003 1871 2033 1871 2064 1872 2095 1873 2126 1874 2157 1875 2188 
1876 2219 1877 2251 1878 2282 1879 2313 1880 2344 1880 2375 1881 2406 1882 2436 1883 2467 1884 2497 
1885 2526 1886 2556 1887 2585 1888 2614 1889 2642 1889 2671 1890 2698 1891 2725 1892 2752 1893 2778 
1894 2803 1895 2828 1896 2853 1897 2877 1898 2900 1898 2922 1899 2944 1900 2965 1901 2985 1902 3005 
1903 3023 1904 3041 1905 3058 1906 3075 1907 3090 1907 3105 1908 3119 1909 3131 1910 3143 1911 3154 
1912 3164 1913 3174 1914 3182 1915 3189 1916 3196 1916 3201 
] dogrey 
 (drawpoly) 432 [0]
[1917 3205 1918 3209 1919 3211 1920 3213 1921 3213 1922 3213 1923 3211 1924 3209 1925 3205 1925 3201 
1926 3196 1927 3189 1928 3182 1929 3174 1930 3164 1931 3154 1932 3143 1933 3131 1934 3119 1934 3105 
1935 3090 1936 3075 1937 3058 1938 3041 1939 3023 1940 3005 1941 2985 1942 2965 1943 2944 1943 2922 
1944 2900 1945 2877 1946 2853 1947 2828 1948 2803 1949 2778 1950 2752 1951 2725 1952 2698 1952 2671 
1953 2642 1954 2614 1955 2585 1956 2556 1957 2526 1958 2497 1959 2467 1960 2436 1961 2406 1961 2375 
1962 2344 1963 2313 1964 2282 1965 2251 1966 2219 1967 2188 1968 2157 1969 2126 1970 2095 1970 2064 
1971 2033 1972 2003 1973 1972 1974 1942 1975 1912 1976 1883 1977 1854 1978 1825 1979 1796 1979 1768 
1980 1741 1981 1714 1982 1687 1983 1661 1984 1635 1985 1610 1986 1586 1987 1562 1988 1539 1988 1517 
1989 1495 1990 1474 1991 1454 1992 1434 1993 1415 1994 1397 1995 1380 1996 1364 1997 1349 1997 1334 
1998 1320 1999 1307 2000 1295 2001 1284 2002 1274 2003 1265 2004 1257 2005 1250 2006 1243 2006 1238 
2007 1233 2008 1230 2009 1228 2010 1226 2011 1226 2012 1226 2013 1228 2014 1230 2015 1233 2015 1238 
2016 1243 2017 1250 2018 1257 2019 1265 2020 1274 2021 1284 2022 1295 2023 1307 2024 1320 2024 1334 
2025 1349 2026 1364 2027 1380 2028 1397 2029 1415 2030 1434 2031 1454 2032 1474 2033 1495 2033 1517 
2034 1539 2035 1562 2036 1586 2037 1610 2038 1635 2039 1661 2040 1687 2041 1714 2042 1741 2042 1768 
2043 1796 2044 1825 2045 1854 2046 1883 2047 1912 2048 1942 2049 1972 2050 2003 2051 2033 2051 2064 
2052 2095 2053 2126 2054 2157 2055 2188 2056 2219 2057 2251 2058 2282 2059 2313 2060 2344 2060 2375 
2061 2406 2062 2436 2063 2467 2064 2497 2065 2526 2066 2556 2067 2585 2068 2614 2069 2642 2069 2671 
2070 2698 2071 2725 2072 2752 2073 2778 2074 2803 2075 2828 2076 2853 2077 2877 2078 2900 2078 2922 
2079 2944 2080 2965 2081 2985 2082 3005 2083 3023 2084 3041 2085 3058 2086 3075 2087 3090 2087 3105 
2088 3119 2089 3131 2090 3143 2091 3154 2092 3164 2093 3174 2094 3182 2095 3189 2096 3196 2096 3201 
2097 3205 2098 3209 2099 3211 2100 3213 2101 3213 2102 3213 2103 3211 2104 3209 2105 3205 2105 3201 
2106 3196 2107 3189 2108 3182 2109 3174 2110 3164 2111 3154 
] dogrey 
 (drawpoly) 432 [0]
[2112 3143 2113 3131 2114 3119 2114 3105 2115 3090 2116 3075 2117 3058 2118 3041 2119 3023 2120 3005 
2121 2985 2122 2965 2123 2944 2123 2922 2124 2900 2125 2877 2126 2853 2127 2828 2128 2803 2129 2778 
2130 2752 2131 2725 2132 2698 2132 2671 2133 2642 2134 2614 2135 2585 2136 2556 2137 2526 2138 2497 
2139 2467 2140 2436 2141 2406 2141 2375 2142 2344 2143 2313 2144 2282 2145 2251 2146 2219 2147 2188 
2148 2157 2149 2126 2150 2095 2150 2064 2151 2033 2152 2003 2153 1972 2154 1942 2155 1912 2156 1883 
2157 1854 2158 1825 2159 1796 2159 1768 2160 1741 2161 1714 2162 1687 2163 1661 2164 1635 2165 1610 
2166 1586 2167 1562 2168 1539 2168 1517 2169 1495 2170 1474 2171 1454 2172 1434 2173 1415 2174 1397 
2175 1380 2176 1364 2177 1349 2177 1334 2178 1320 2179 1307 2180 1295 2181 1284 2182 1274 2183 1265 
2184 1257 2185 1250 2186 1243 2186 1238 2187 1233 2188 1230 2189 1228 2190 1226 2191 1226 2192 1226 
2193 1228 2194 1230 2195 1233 2195 1238 2196 1243 2197 1250 2198 1257 2199 1265 2200 1274 2201 1284 
2202 1295 2203 1307 2204 1320 2204 1334 2205 1349 2206 1364 2207 1380 2208 1397 2209 1415 2210 1434 
2211 1454 2212 1474 2213 1495 2213 1517 2214 1539 2215 1562 2216 1586 2217 1610 2218 1635 2219 1661 
2220 1687 2221 1714 2222 1741 2222 1768 2223 1796 2224 1825 2225 1854 2226 1883 2227 1912 2228 1942 
2229 1972 2230 2003 2231 2033 2231 2064 2232 2095 2233 2126 2234 2157 2235 2188 2236 2219 2237 2251 
2238 2282 2239 2313 2240 2344 2240 2375 2241 2406 2242 2436 2243 2467 2244 2497 2245 2526 2246 2556 
2247 2585 2248 2614 2249 2642 2249 2671 2250 2698 2251 2725 2252 2752 2253 2778 2254 2803 2255 2828 
2256 2853 2257 2877 2258 2900 2258 2922 2259 2944 2260 2965 2261 2985 2262 3005 2263 3023 2264 3041 
2265 3058 2266 3075 2267 3090 2267 3105 2268 3119 2269 3131 2270 3143 2271 3154 2272 3164 2273 3174 
2274 3182 2275 3189 2276 3196 2276 3201 2277 3205 2278 3209 2279 3211 2280 3213 2281 3213 2282 3213 
2283 3211 2284 3209 2285 3205 2285 3201 2286 3196 2287 3189 2288 3182 2289 3174 2290 3164 2291 3154 
2292 3143 2293 3131 2294 3119 2294 3105 2295 3090 2296 3075 2297 3058 2298 3041 2299 3023 2300 3005 
2301 2985 2302 2965 2303 2944 2303 2922 2304 2900 2305 2877 
] dogrey 
 (drawpoly) 432 [0]
[2306 2853 2307 2828 2308 2803 2309 2778 2310 2752 2311 2725 2312 2698 2312 2671 2313 2642 2314 2614 
2315 2585 2316 2556 2317 2526 2318 2497 2319 2467 2320 2436 2321 2406 2321 2375 2322 2344 2323 2313 
2324 2282 2325 2251 2326 2219 2327 2188 2328 2157 2329 2126 2330 2095 2330 2064 2331 2033 2332 2003 
2333 1972 2334 1942 2335 1912 2336 1883 2337 1854 2338 1825 2339 1796 2339 1768 2340 1741 2341 1714 
2342 1687 2343 1661 2344 1635 2345 1610 2346 1586 2347 1562 2348 1539 2348 1517 2349 1495 2350 1474 
2351 1454 2352 1434 2353 1415 2354 1397 2355 1380 2356 1364 2357 1349 2357 1334 2358 1320 2359 1307 
2360 1295 2361 1284 2362 1274 2363 1265 2364 1257 2365 1250 2366 1243 2366 1238 2367 1233 2368 1230 
2369 1228 2370 1226 2371 1226 2372 1226 2373 1228 2374 1230 2375 1233 2375 1238 2376 1243 2377 1250 
2378 1257 2379 1265 2380 1274 2381 1284 2382 1295 2383 1307 2384 1320 2384 1334 2385 1349 2386 1364 
2387 1380 2388 1397 2389 1415 2390 1434 2391 1454 2392 1474 2393 1495 2393 1517 2394 1539 2395 1562 
2396 1586 2397 1610 2398 1635 2399 1661 2400 1687 2401 1714 2402 1741 2402 1768 2403 1796 2404 1825 
2405 1854 2406 1883 2407 1912 2408 1942 2409 1972 2410 2003 2411 2033 2411 2064 2412 2095 2413 2126 
2414 2157 2415 2188 2416 2219 2417 2251 2418 2282 2419 2313 2420 2344 2420 2375 2421 2406 2422 2436 
2423 2467 2424 2497 2425 2526 2426 2556 2427 2585 2428 2614 2429 2642 2429 2671 2430 2698 2431 2725 
2432 2752 2433 2778 2434 2803 2435 2828 2436 2853 2437 2877 2438 2900 2438 2922 2439 2944 2440 2965 
2441 2985 2442 3005 2443 3023 2444 3041 2445 3058 2446 3075 2447 3090 2447 3105 2448 3119 2449 3131 
2450 3143 2451 3154 2452 3164 2453 3174 2454 3182 2455 3189 2456 3196 2456 3201 2457 3205 2458 3209 
2459 3211 2460 3213 2461 3213 2462 3213 2463 3211 2464 3209 2465 3205 2465 3201 2466 3196 2467 3189 
2468 3182 2469 3174 2470 3164 2471 3154 2472 3143 2473 3131 2474 3119 2474 3105 2475 3090 2476 3075 
2477 3058 2478 3041 2479 3023 2480 3005 2481 2985 2482 2965 2483 2944 2483 2922 2484 2900 2485 2877 
2486 2853 2487 2828 2488 2803 2489 2778 2490 2752 2491 2725 2492 2698 2492 2671 2493 2642 2494 2614 
2495 2585 2496 2556 2497 2526 2498 2497 2499 2467 2500 2436 
] dogrey 
 (drawpoly) 432 [0]
[2501 2406 2501 2375 2502 2344 2503 2313 2504 2282 2505 2251 2506 2219 2507 2188 2508 2157 2509 2126 
2510 2095 2510 2064 2511 2033 2512 2003 2513 1972 2514 1942 2515 1912 2516 1883 2517 1854 2518 1825 
2519 1796 2519 1768 2520 1741 2521 1714 2522 1687 2523 1661 2524 1635 2525 1610 2526 1586 2527 1562 
2528 1539 2528 1517 2529 1495 2530 1474 2531 1454 2532 1434 2533 1415 2534 1397 2535 1380 2536 1364 
2537 1349 2537 1334 2538 1320 2539 1307 2540 1295 2541 1284 2542 1274 2543 1265 2544 1257 2545 1250 
2546 1243 2546 1238 2547 1233 2548 1230 2549 1228 2550 1226 2551 1226 2552 1226 2553 1228 2554 1230 
2555 1233 2555 1238 2556 1243 2557 1250 2558 1257 2559 1265 2560 1274 2561 1284 2562 1295 2563 1307 
2564 1320 2564 1334 2565 1349 2566 1364 2567 1380 2568 1397 2569 1415 2570 1434 2571 1454 2572 1474 
2573 1495 2573 1517 2574 1539 2575 1562 2576 1586 2577 1610 2578 1635 2579 1661 2580 1687 2581 1714 
2582 1741 2582 1768 2583 1796 2584 1825 2585 1854 2586 1883 2587 1912 2588 1942 2589 1972 2590 2003 
2591 2033 2591 2064 2592 2095 2593 2126 2594 2157 2595 2188 2596 2219 2597 2251 2598 2282 2599 2313 
2600 2344 2600 2375 2601 2406 2602 2436 2603 2467 2604 2497 2605 2526 2606 2556 2607 2585 2608 2614 
2609 2642 2609 2671 2610 2698 2611 2725 2612 2752 2613 2778 2614 2803 2615 2828 2616 2853 2617 2877 
2618 2900 2618 2922 2619 2944 2620 2965 2621 2985 2622 3005 2623 3023 2624 3041 2625 3058 2626 3075 
2627 3090 2627 3105 2628 3119 2629 3131 2630 3143 2631 3154 2632 3164 2633 3174 2634 3182 2635 3189 
2636 3196 2636 3201 2637 3205 2638 3209 2639 3211 2640 3213 2641 3213 2642 3213 2643 3211 2644 3209 
2645 3205 2645 3201 2646 3196 2647 3189 2648 3182 2649 3174 2650 3164 2651 3154 2652 3143 2653 3131 
2654 3119 2654 3105 2655 3090 2656 3075 2657 3058 2658 3041 2659 3023 2660 3005 2661 2985 2662 2965 
2663 2944 2663 2922 2664 2900 2665 2877 2666 2853 2667 2828 2668 2803 2669 2778 2670 2752 2671 2725 
2672 2698 2672 2671 2673 2642 2674 2614 2675 2585 2676 2556 2677 2526 2678 2497 2679 2467 2680 2436 
2681 2406 2681 2375 2682 2344 2683 2313 2684 2282 2685 2251 2686 2219 2687 2188 2688 2157 2689 2126 
2690 2095 2690 2064 2691 2033 2692 2003 2693 1972 2694 1942 
] dogrey 
 (drawpoly) 432 [0]
[2695 1912 2696 1883 2697 1854 2698 1825 2699 1796 2699 1768 2700 1741 2701 1714 2702 1687 2703 1661 
2704 1635 2705 1610 2706 1586 2707 1562 2708 1539 2708 1517 2709 1495 2710 1474 2711 1454 2712 1434 
2713 1415 2714 1397 2715 1380 2716 1364 2717 1349 2717 1334 2718 1320 2719 1307 2720 1295 2721 1284 
2722 1274 2723 1265 2724 1257 2725 1250 2726 1243 2726 1238 2727 1233 2728 1230 2729 1228 2730 1226 
2731 1226 2732 1226 2733 1228 2734 1230 2735 1233 2735 1238 2736 1243 2737 1250 2738 1257 2739 1265 
2740 1274 2741 1284 2742 1295 2743 1307 2744 1320 2744 1334 2745 1349 2746 1364 2747 1380 2748 1397 
2749 1415 2750 1434 2751 1454 2752 1474 2753 1495 2753 1517 2754 1539 2755 1562 2756 1586 2757 1610 
2758 1635 2759 1661 2760 1687 2761 1714 2762 1741 2762 1768 2763 1796 2764 1825 2765 1854 2766 1883 
2767 1912 2768 1942 2769 1972 2770 2003 2771 2033 2771 2064 2772 2095 2773 2126 2774 2157 2775 2188 
2776 2219 2777 2251 2778 2282 2779 2313 2780 2344 2780 2375 2781 2406 2782 2436 2783 2467 2784 2497 
2785 2526 2786 2556 2787 2585 2788 2614 2789 2642 2789 2671 2790 2698 2791 2725 2792 2752 2793 2778 
2794 2803 2795 2828 2796 2853 2797 2877 2798 2900 2798 2922 2799 2944 2800 2965 2801 2985 2802 3005 
2803 3023 2804 3041 2805 3058 2806 3075 2807 3090 2807 3105 2808 3119 2809 3131 2810 3143 2811 3154 
2812 3164 2813 3174 2814 3182 2815 3189 2816 3196 2816 3201 2817 3205 2818 3209 2819 3211 2820 3213 
2821 3213 2822 3213 2823 3211 2824 3209 2825 3205 2825 3201 2826 3196 2827 3189 2828 3182 2829 3174 
2830 3164 2831 3154 2832 3143 2833 3131 2834 3119 2834 3105 2835 3090 2836 3075 2837 3058 2838 3041 
2839 3023 2840 3005 2841 2985 2842 2965 2843 2944 2843 2922 2844 2900 2845 2877 2846 2853 2847 2828 
2848 2803 2849 2778 2850 2752 2851 2725 2852 2698 2852 2671 2853 2642 2854 2614 2855 2585 2856 2556 
2857 2526 2858 2497 2859 2467 2860 2436 2861 2406 2861 2375 2862 2344 2863 2313 2864 2282 2865 2251 
2866 2219 2867 2188 2868 2157 2869 2126 2870 2095 2870 2064 2871 2033 2872 2003 2873 1972 2874 1942 
2875 1912 2876 1883 2877 1854 2878 1825 2879 1796 2879 1768 2880 1741 2881 1714 2882 1687 2883 1661 
2884 1635 2885 1610 2886 1586 2887 1562 2888 1539 2888 1517 
] dogrey 
 (drawpoly) 432 [0]
[2889 1495 2890 1474 2891 1454 2892 1434 2893 1415 2894 1397 2895 1380 2896 1364 2897 1349 2897 1334 
2898 1320 2899 1307 2900 1295 2901 1284 2902 1274 2903 1265 2904 1257 2905 1250 2906 1243 2906 1238 
2907 1233 2908 1230 2909 1228 2910 1226 2911 1226 2912 1226 2913 1228 2914 1230 2915 1233 2915 1238 
2916 1243 2917 1250 2918 1257 2919 1265 2920 1274 2921 1284 2922 1295 2923 1307 2924 1320 2924 1334 
2925 1349 2926 1364 2927 1380 2928 1397 2929 1415 2930 1434 2931 1454 2932 1474 2933 1495 2933 1517 
2934 1539 2935 1562 2936 1586 2937 1610 2938 1635 2939 1661 2940 1687 2941 1714 2942 1741 2942 1768 
2943 1796 2944 1825 2945 1854 2946 1883 2947 1912 2948 1942 2949 1972 2950 2003 2951 2033 2951 2064 
2952 2095 2953 2126 2954 2157 2955 2188 2956 2219 2957 2251 2958 2282 2959 2313 2960 2344 2960 2375 
2961 2406 2962 2436 2963 2467 2964 2497 2965 2526 2966 2556 2967 2585 2968 2614 2969 2642 2969 2671 
2970 2698 2971 2725 2972 2752 2973 2778 2974 2803 2975 2828 2976 2853 2977 2877 2978 2900 2978 2922 
2979 2944 2980 2965 2981 2985 2982 3005 2983 3023 2984 3041 2985 3058 2986 3075 2987 3090 2987 3105 
2988 3119 2989 3131 2990 3143 2991 3154 2992 3164 2993 3174 2994 3182 2995 3189 2996 3196 2996 3201 
2997 3205 2998 3209 2999 3211 3000 3213 3001 3213 3002 3213 3003 3211 3004 3209 3005 3205 3005 3201 
3006 3196 3007 3189 3008 3182 3009 3174 3010 3164 3011 3154 3012 3143 3013 3131 3014 3119 3014 3105 
3015 3090 3016 3075 3017 3058 3018 3041 3019 3023 3020 3005 3021 2985 3022 2965 3023 2944 3023 2922 
3024 2900 3025 2877 3026 2853 3027 2828 3028 2803 3029 2778 3030 2752 3031 2725 3032 2698 3032 2671 
3033 2642 3034 2614 3035 2585 3036 2556 3037 2526 3038 2497 3039 2467 3040 2436 3041 2406 3041 2375 
3042 2344 3043 2313 3044 2282 3045 2251 3046 2219 3047 2188 3048 2157 3049 2126 3050 2095 3050 2064 
3051 2033 3052 2003 3053 1972 3054 1942 3055 1912 3056 1883 3057 1854 3058 1825 3059 1796 3059 1768 
3060 1741 3061 1714 3062 1687 3063 1661 3064 1635 3065 1610 3066 1586 3067 1562 3068 1539 3068 1517 
3069 1495 3070 1474 3071 1454 3072 1434 3073 1415 3074 1397 3075 1380 3076 1364 3077 1349 3077 1334 
3078 1320 3079 1307 3080 1295 3081 1284 3082 1274 3083 1265 
] dogrey 
 (drawpoly) 432 [0]
[3084 1257 3085 1250 3086 1243 3086 1238 3087 1233 3088 1230 3089 1228 3090 1226 3091 1226 3092 1226 
3093 1228 3094 1230 3095 1233 3095 1238 3096 1243 3097 1250 3098 1257 3099 1265 3100 1274 3101 1284 
3102 1295 3103 1307 3104 1320 3104 1334 3105 1349 3106 1364 3107 1380 3108 1397 3109 1415 3110 1434 
3111 1454 3112 1474 3113 1495 3113 1517 3114 1539 3115 1562 3116 1586 3117 1610 3118 1635 3119 1661 
3120 1687 3121 1714 3122 1741 3122 1768 3123 1796 3124 1825 3125 1854 3126 1883 3127 1912 3128 1942 
3129 1972 3130 2003 3131 2033 3131 2064 3132 2095 3133 2126 3134 2157 3135 2188 3136 2219 3137 2251 
3138 2282 3139 2313 3140 2344 3140 2375 3141 2406 3142 2436 3143 2467 3144 2497 3145 2526 3146 2556 
3147 2585 3148 2614 3149 2642 3149 2671 3150 2698 3151 2725 3152 2752 3153 2778 3154 2803 3155 2828 
3156 2853 3157 2877 3158 2900 3158 2922 3159 2944 3160 2965 3161 2985 3162 3005 3163 3023 3164 3041 
3165 3058 3166 3075 3167 3090 3167 3105 3168 3119 3169 3131 3170 3143 3171 3154 3172 3164 3173 3174 
3174 3182 3175 3189 3176 3196 3176 3201 3177 3205 3178 3209 3179 3211 3180 3213 3181 3213 3182 3213 
3183 3211 3184 3209 3185 3205 3185 3201 3186 3196 3187 3189 3188 3182 3189 3174 3190 3164 3191 3154 
3192 3143 3193 3131 3194 3119 3194 3105 3195 3090 3196 3075 3197 3058 3198 3041 3199 3023 3200 3005 
3201 2985 3202 2965 3203 2944 3203 2922 3204 2900 3205 2877 3206 2853 3207 2828 3208 2803 3209 2778 
3210 2752 3211 2725 3212 2698 3212 2671 3213 2642 3214 2614 3215 2585 3216 2556 3217 2526 3218 2497 
3219 2467 3220 2436 3221 2406 3221 2375 3222 2344 3223 2313 3224 2282 3225 2251 3226 2219 3227 2188 
3228 2157 3229 2126 3230 2095 3230 2064 3231 2033 3232 2003 3233 1972 3234 1942 3235 1912 3236 1883 
3237 1854 3238 1825 3239 1796 3239 1768 3240 1741 3241 1714 3242 1687 3243 1661 3244 1635 3245 1610 
3246 1586 3247 1562 3248 1539 3248 1517 3249 1495 3250 1474 3251 1454 3252 1434 3253 1415 3254 1397 
3255 1380 3256 1364 3257 1349 3257 1334 3258 1320 3259 1307 3260 1295 3261 1284 3262 1274 3263 1265 
3264 1257 3265 1250 3266 1243 3266 1238 3267 1233 3268 1230 3269 1228 3270 1226 3271 1226 3272 1226 
3273 1228 3274 1230 3275 1233 3275 1238 3276 1243 3277 1250 
] dogrey 
 (drawpoly) 432 [0]
[3278 1257 3279 1265 3280 1274 3281 1284 3282 1295 3283 1307 3284 1320 3284 1334 3285 1349 3286 1364 
3287 1380 3288 1397 3289 1415 3290 1434 3291 1454 3292 1474 3293 1495 3293 1517 3294 1539 3295 1562 
3296 1586 3297 1610 3298 1635 3299 1661 3300 1687 3301 1714 3302 1741 3302 1768 3303 1796 3304 1825 
3305 1854 3306 1883 3307 1912 3308 1942 3309 1972 3310 2003 3311 2033 3311 2064 3312 2095 3313 2126 
3314 2157 3315 2188 3316 2219 3317 2251 3318 2282 3319 2313 3320 2344 3320 2375 3321 2406 3322 2436 
3323 2467 3324 2497 3325 2526 3326 2556 3327 2585 3328 2614 3329 2642 3329 2671 3330 2698 3331 2725 
3332 2752 3333 2778 3334 2803 3335 2828 3336 2853 3337 2877 3338 2900 3338 2922 3339 2944 3340 2965 
3341 2985 3342 3005 3343 3023 3344 3041 3345 3058 3346 3075 3347 3090 3347 3105 3348 3119 3349 3131 
3350 3143 3351 3154 3352 3164 3353 3174 3354 3182 3355 3189 3356 3196 3356 3201 3357 3205 3358 3209 
3359 3211 3360 3213 3361 3213 3362 3213 3363 3211 3364 3209 3365 3205 3365 3201 3366 3196 3367 3189 
3368 3182 3369 3174 3370 3164 3371 3154 3372 3143 3373 3131 3374 3119 3374 3105 3375 3090 3376 3075 
3377 3058 3378 3041 3379 3023 3380 3005 3381 2985 3382 2965 3383 2944 3383 2922 3384 2900 3385 2877 
3386 2853 3387 2828 3388 2803 3389 2778 3390 2752 3391 2725 3392 2698 3392 2671 3393 2642 3394 2614 
3395 2585 3396 2556 3397 2526 3398 2497 3399 2467 3400 2436 3401 2406 3401 2375 3402 2344 3403 2313 
3404 2282 3405 2251 3406 2219 3407 2188 3408 2157 3409 2126 3410 2095 3410 2064 3411 2033 3412 2003 
3413 1972 3414 1942 3415 1912 3416 1883 3417 1854 3418 1825 3419 1796 3419 1768 3420 1741 3421 1714 
3422 1687 3423 1661 3424 1635 3425 1610 3426 1586 3427 1562 3428 1539 3428 1517 3429 1495 3430 1474 
3431 1454 3432 1434 3433 1415 3434 1397 3435 1380 3436 1364 3437 1349 3437 1334 3438 1320 3439 1307 
3440 1295 3441 1284 3442 1274 3443 1265 3444 1257 3445 1250 3446 1243 3446 1238 3447 1233 3448 1230 
3449 1228 3450 1226 3451 1226 3452 1226 3453 1228 3454 1230 3455 1233 3455 1238 3456 1243 3457 1250 
3458 1257 3459 1265 3460 1274 3461 1284 3462 1295 3463 1307 3464 1320 3464 1334 3465 1349 3466 1364 
3467 1380 3468 1397 3469 1415 3470 1434 3471 1454 3472 1474 
] dogrey 
 (drawpoly) 432 [0]
[3473 1495 3473 1517 3474 1539 3475 1562 3476 1586 3477 1610 3478 1635 3479 1661 3480 1687 3481 1714 
3482 1741 3482 1768 3483 1796 3484 1825 3485 1854 3486 1883 3487 1912 3488 1942 3489 1972 3490 2003 
3491 2033 3491 2064 3492 2095 3493 2126 3494 2157 3495 2188 3496 2219 3497 2251 3498 2282 3499 2313 
3500 2344 3500 2375 3501 2406 3502 2436 3503 2467 3504 2497 3505 2526 3506 2556 3507 2585 3508 2614 
3509 2642 3509 2671 3510 2698 3511 2725 3512 2752 3513 2778 3514 2803 3515 2828 3516 2853 3517 2877 
3518 2900 3518 2922 3519 2944 3520 2965 3521 2985 3522 3005 3523 3023 3524 3041 3525 3058 3526 3075 
3527 3090 3527 3105 3528 3119 3529 3131 3530 3143 3531 3154 3532 3164 3533 3174 3534 3182 3535 3189 
3536 3196 3536 3201 3537 3205 3538 3209 3539 3211 3540 3213 3541 3213 3542 3213 3543 3211 3544 3209 
3545 3205 3545 3201 3546 3196 3547 3189 3548 3182 3549 3174 3550 3164 3551 3154 3552 3143 3553 3131 
3554 3119 3554 3105 3555 3090 3556 3075 3557 3058 3558 3041 3559 3023 3560 3005 3561 2985 3562 2965 
3563 2944 3563 2922 3564 2900 3565 2877 3566 2853 3567 2828 3568 2803 3569 2778 3570 2752 3571 2725 
3572 2698 3572 2671 3573 2642 3574 2614 3575 2585 3576 2556 3577 2526 3578 2497 3579 2467 3580 2436 
3581 2406 3581 2375 3582 2344 3583 2313 3584 2282 3585 2251 3586 2219 3587 2188 3588 2157 3589 2126 
3590 2095 3590 2064 3591 2033 3592 2003 3593 1972 3594 1942 3595 1912 3596 1883 3597 1854 3598 1825 
3599 1796 3599 1768 3600 1741 3601 1714 3602 1687 3603 1661 3604 1635 3605 1610 3606 1586 3607 1562 
3608 1539 3608 1517 3609 1495 3610 1474 3611 1454 3612 1434 3613 1415 3614 1397 3615 1380 3616 1364 
3617 1349 3617 1334 3618 1320 3619 1307 3620 1295 3621 1284 3622 1274 3623 1265 3624 1257 3625 1250 
3626 1243 3626 1238 3627 1233 3628 1230 3629 1228 3630 1226 3631 1226 3632 1226 3633 1228 3634 1230 
3635 1233 3635 1238 3636 1243 3637 1250 3638 1257 3639 1265 3640 1274 3641 1284 3642 1295 3643 1307 
3644 1320 3644 1334 3645 1349 3646 1364 3647 1380 3648 1397 3649 1415 3650 1434 3651 1454 3652 1474 
3653 1495 3653 1517 3654 1539 3655 1562 3656 1586 3657 1610 3658 1635 3659 1661 3660 1687 3661 1714 
3662 1741 3662 1768 3663 1796 3664 1825 3665 1854 3666 1883 
] dogrey 
 (drawpoly) 432 [0]
[3667 1912 3668 1942 3669 1972 3670 2003 3671 2033 3671 2064 3672 2095 3673 2126 3674 2157 3675 2188 
3676 2219 3677 2251 3678 2282 3679 2313 3680 2344 3680 2375 3681 2406 3682 2436 3683 2467 3684 2497 
3685 2526 3686 2556 3687 2585 3688 2614 3689 2642 3689 2671 3690 2698 3691 2725 3692 2752 3693 2778 
3694 2803 3695 2828 3696 2853 3697 2877 3698 2900 3698 2922 3699 2944 3700 2965 3701 2985 3702 3005 
3703 3023 3704 3041 3705 3058 3706 3075 3707 3090 3707 3105 3708 3119 3709 3131 3710 3143 3711 3154 
3712 3164 3713 3174 3714 3182 3715 3189 3716 3196 3716 3201 3717 3205 3718 3209 3719 3211 3720 3213 
3721 3213 3722 3213 3723 3211 3724 3209 3725 3205 3725 3201 3726 3196 3727 3189 3728 3182 3729 3174 
3730 3164 3731 3154 3732 3143 3733 3131 3734 3119 3734 3105 3735 3090 3736 3075 3737 3058 3738 3041 
3739 3023 3740 3005 3741 2985 3742 2965 3743 2944 3743 2922 3744 2900 3745 2877 3746 2853 3747 2828 
3748 2803 3749 2778 3750 2752 3751 2725 3752 2698 3752 2671 3753 2642 3754 2614 3755 2585 3756 2556 
3757 2526 3758 2497 3759 2467 3760 2436 3761 2406 3761 2375 3762 2344 3763 2313 3764 2282 3765 2251 
3766 2219 3767 2188 3768 2157 3769 2126 3770 2095 3770 2064 3771 2033 3772 2003 3773 1972 3774 1942 
3775 1912 3776 1883 3777 1854 3778 1825 3779 1796 3779 1768 3780 1741 3781 1714 3782 1687 3783 1661 
3784 1635 3785 1610 3786 1586 3787 1562 3788 1539 3788 1517 3789 1495 3790 1474 3791 1454 3792 1434 
3793 1415 3794 1397 3795 1380 3796 1364 3797 1349 3797 1334 3798 1320 3799 1307 3800 1295 3801 1284 
3802 1274 3803 1265 3804 1257 3805 1250 3806 1243 3806 1238 3807 1233 3808 1230 3809 1228 3810 1226 
3811 1226 3812 1226 3813 1228 3814 1230 3815 1233 3815 1238 3816 1243 3817 1250 3818 1257 3819 1265 
3820 1274 3821 1284 3822 1295 3823 1307 3824 1320 3824 1334 3825 1349 3826 1364 3827 1380 3828 1397 
3829 1415 3830 1434 3831 1454 3832 1474 3833 1495 3833 1517 3834 1539 3835 1562 3836 1586 3837 1610 
3838 1635 3839 1661 3840 1687 3841 1714 3842 1741 3842 1768 3843 1796 3844 1825 3845 1854 3846 1883 
3847 1912 3848 1942 3849 1972 3850 2003 3851 2033 3851 2064 3852 2095 3853 2126 3854 2157 3855 2188 
3856 2219 3857 2251 3858 2282 3859 2313 3860 2344 3860 2375 
] dogrey 
 (drawpoly) 432 [0]
[3861 2406 3862 2436 3863 2467 3864 2497 3865 2526 3866 2556 3867 2585 3868 2614 3869 2642 3869 2671 
3870 2698 3871 2725 3872 2752 3873 2778 3874 2803 3875 2828 3876 2853 3877 2877 3878 2900 3878 2922 
3879 2944 3880 2965 3881 2985 3882 3005 3883 3023 3884 3041 3885 3058 3886 3075 3887 3090 3887 3105 
3888 3119 3889 3131 3890 3143 3891 3154 3892 3164 3893 3174 3894 3182 3895 3189 3896 3196 3896 3201 
3897 3205 3898 3209 3899 3211 3900 3213 3901 3213 3902 3213 3903 3211 3904 3209 3905 3205 3905 3201 
3906 3196 3907 3189 3908 3182 3909 3174 3910 3164 3911 3154 3912 3143 3913 3131 3914 3119 3914 3105 
3915 3090 3916 3075 3917 3058 3918 3041 3919 3023 3920 3005 3921 2985 3922 2965 3923 2944 3923 2922 
3924 2900 3925 2877 3926 2853 3927 2828 3928 2803 3929 2778 3930 2752 3931 2725 3932 2698 3932 2671 
3933 2642 3934 2614 3935 2585 3936 2556 3937 2526 3938 2497 3939 2467 3940 2436 3941 2406 3941 2375 
3942 2344 3943 2313 3944 2282 3945 2251 3946 2219 3947 2188 3948 2157 3949 2126 3950 2095 3950 2064 
3951 2033 3952 2003 3953 1972 3954 1942 3955 1912 3956 1883 3957 1854 3958 1825 3959 1796 3959 1768 
3960 1741 3961 1714 3962 1687 3963 1661 3964 1635 3965 1610 3966 1586 3967 1562 3968 1539 3968 1517 
3969 1495 3970 1474 3971 1454 3972 1434 3973 1415 3974 1397 3975 1380 3976 1364 3977 1349 3977 1334 
3978 1320 3979 1307 3980 1295 3981 1284 3982 1274 3983 1265 3984 1257 3985 1250 3986 1243 3986 1238 
3987 1233 3988 1230 3989 1228 3990 1226 3991 1226 3992 1226 3993 1228 3994 1230 3995 1233 3995 1238 
3996 1243 3997 1250 3998 1257 3999 1265 4000 1274 4001 1284 4002 1295 4003 1307 4004 1320 4004 1334 
4005 1349 4006 1364 4007 1380 4008 1397 4009 1415 4010 1434 4011 1454 4012 1474 4013 1495 4013 1517 
4014 1539 4015 1562 4016 1586 4017 1610 4018 1635 4019 1661 4020 1687 4021 1714 4022 1741 4022 1768 
4023 1796 4024 1825 4025 1854 4026 1883 4027 1912 4028 1942 4029 1972 4030 2003 4031 2033 4031 2064 
4032 2095 4033 2126 4034 2157 4035 2188 4036 2219 4037 2251 4038 2282 4039 2313 4040 2344 4040 2375 
4041 2406 4042 2436 4043 2467 4044 2497 4045 2526 4046 2556 4047 2585 4048 2614 4049 2642 4049 2671 
4050 2698 4051 2725 4052 2752 4053 2778 4054 2803 4055 2828 
] dogrey 
 (drawpoly) 432 [0]
[4056 2853 4057 2877 4058 2900 4058 2922 4059 2944 4060 2965 4061 2985 4062 3005 4063 3023 4064 3041 
4065 3058 4066 3075 4067 3090 4067 3105 4068 3119 4069 3131 4070 3143 4071 3154 4072 3164 4073 3174 
4074 3182 4075 3189 4076 3196 4076 3201 4077 3205 4078 3209 4079 3211 4080 3213 4081 3213 4082 3213 
4083 3211 4084 3209 4085 3205 4085 3201 4086 3196 4087 3189 4088 3182 4089 3174 4090 3164 4091 3154 
4092 3143 4093 3131 4094 3119 4094 3105 4095 3090 4096 3075 4097 3058 4098 3041 4099 3023 4100 3005 
4101 2985 4102 2965 4103 2944 4103 2922 4104 2900 4105 2877 4106 2853 4107 2828 4108 2803 4109 2778 
4110 2752 4111 2725 4112 2698 4112 2671 4113 2642 4114 2614 4115 2585 4116 2556 4117 2526 4118 2497 
4119 2467 4120 2436 4121 2406 4121 2375 4122 2344 4123 2313 4124 2282 4125 2251 4126 2219 4127 2188 
4128 2157 4129 2126 4130 2095 4130 2064 4131 2033 4132 2003 4133 1972 4134 1942 4135 1912 4136 1883 
4137 1854 4138 1825 4139 1796 4139 1768 4140 1741 4141 1714 4142 1687 4143 1661 4144 1635 4145 1610 
4146 1586 4147 1562 4148 1539 4148 1517 4149 1495 4150 1474 4151 1454 4152 1434 4153 1415 4154 1397 
4155 1380 4156 1364 4157 1349 4157 1334 4158 1320 4159 1307 4160 1295 4161 1284 4162 1274 4163 1265 
4164 1257 4165 1250 4166 1243 4166 1238 4167 1233 4168 1230 4169 1228 4170 1226 4171 1226 4172 1226 
4173 1228 4174 1230 4175 1233 4175 1238 4176 1243 4177 1250 4178 1257 4179 1265 4180 1274 4181 1284 
4182 1295 4183 1307 4184 1320 4184 1334 4185 1349 4186 1364 4187 1380 4188 1397 4189 1415 4190 1434 
4191 1454 4192 1474 4193 1495 4193 1517 4194 1539 4195 1562 4196 1586 4197 1610 4198 1635 4199 1661 
4200 1687 4201 1714 4202 1741 4202 1768 4203 1796 4204 1825 4205 1854 4206 1883 4207 1912 4208 1942 
4209 1972 4210 2003 4211 2033 4211 2064 4212 2095 4213 2126 4214 2157 4215 2188 4216 2219 4217 2251 
4218 2282 4219 2313 4220 2344 4220 2375 4221 2406 4222 2436 4223 2467 4224 2497 4225 2526 4226 2556 
4227 2585 4228 2614 4229 2642 4229 2671 4230 2698 4231 2725 4232 2752 4233 2778 4234 2803 4235 2828 
4236 2853 4237 2877 4238 2900 4238 2922 4239 2944 4240 2965 4241 2985 4242 3005 4243 3023 4244 3041 
4245 3058 4246 3075 4247 3090 4247 3105 4248 3119 4249 3131 
] dogrey 
 (drawpoly) 432 [0]
[4250 3143 4251 3154 4252 3164 4253 3174 4254 3182 4255 3189 4256 3196 4256 3201 4257 3205 4258 3209 
4259 3211 4260 3213 4261 3213 4262 3213 4263 3211 4264 3209 4265 3205 4265 3201 4266 3196 4267 3189 
4268 3182 4269 3174 4270 3164 4271 3154 4272 3143 4273 3131 4274 3119 4274 3105 4275 3090 4276 3075 
4277 3058 4278 3041 4279 3023 4280 3005 4281 2985 4282 2965 4283 2944 4283 2922 4284 2900 4285 2877 
4286 2853 4287 2828 4288 2803 4289 2778 4290 2752 4291 2725 4292 2698 4292 2671 4293 2642 4294 2614 
4295 2585 4296 2556 4297 2526 4298 2497 4299 2467 4300 2436 4301 2406 4301 2375 4302 2344 4303 2313 
4304 2282 4305 2251 4306 2219 4307 2188 4308 2157 4309 2126 4310 2095 4310 2064 4311 2033 4312 2003 
4313 1972 4314 1942 4315 1912 4316 1883 4317 1854 4318 1825 4319 1796 4319 1768 4320 1741 4321 1714 
4322 1687 4323 1661 4324 1635 4325 1610 4326 1586 4327 1562 4328 1539 4328 1517 4329 1495 4330 1474 
4331 1454 4332 1434 4333 1415 4334 1397 4335 1380 4336 1364 4337 1349 4337 1334 4338 1320 4339 1307 
4340 1295 4341 1284 4342 1274 4343 1265 4344 1257 4345 1250 4346 1243 4346 1238 4347 1233 4348 1230 
4349 1228 4350 1226 4351 1226 4352 1226 4353 1228 4354 1230 4355 1233 4355 1238 4356 1243 4357 1250 
4358 1257 4359 1265 4360 1274 4361 1284 4362 1295 4363 1307 4364 1320 4364 1334 4365 1349 4366 1364 
4367 1380 4368 1397 4369 1415 4370 1434 4371 1454 4372 1474 4373 1495 4373 1517 4374 1539 4375 1562 
4376 1586 4377 1610 4378 1635 4379 1661 4380 1687 4381 1714 4382 1741 4382 1768 4383 1796 4384 1825 
4385 1854 4386 1883 4387 1912 4388 1942 4389 1972 4390 2003 4391 2033 4391 2064 4392 2095 4393 2126 
4394 2157 4395 2188 4396 2219 4397 2251 4398 2282 4399 2313 4400 2344 4400 2375 4401 2406 4402 2436 
4403 2467 4404 2497 4405 2526 4406 2556 4407 2585 4408 2614 4409 2642 4409 2671 4410 2698 4411 2725 
4412 2752 4413 2778 4414 2803 4415 2828 4416 2853 4417 2877 4418 2900 4418 2922 4419 2944 4420 2965 
4421 2985 4422 3005 4423 3023 4424 3041 4425 3058 4426 3075 4427 3090 4427 3105 4428 3119 4429 3131 
4430 3143 4431 3154 4432 3164 4433 3174 4434 3182 4435 3189 4436 3196 4436 3201 4437 3205 4438 3209 
4439 3211 4440 3213 4441 3213 4442 3213 4443 3211 4444 3209 
] dogrey 
 (drawpoly) 432 [0]
[4445 3205 4445 3201 4446 3196 4447 3189 4448 3182 4449 3174 4450 3164 4451 3154 4452 3143 4453 3131 
4454 3119 4454 3105 4455 3090 4456 3075 4457 3058 4458 3041 4459 3023 4460 3005 4461 2985 4462 2965 
4463 2944 4463 2922 4464 2900 4465 2877 4466 2853 4467 2828 4468 2803 4469 2778 4470 2752 4471 2725 
4472 2698 4472 2671 4473 2642 4474 2614 4475 2585 4476 2556 4477 2526 4478 2497 4479 2467 4480 2436 
4481 2406 4481 2375 4482 2344 4483 2313 4484 2282 4485 2251 4486 2219 4487 2188 4488 2157 4489 2126 
4490 2095 4490 2064 4491 2033 4492 2003 4493 1972 4494 1942 4495 1912 4496 1883 4497 1854 4498 1825 
4499 1796 4499 1768 4500 1741 4501 1714 4502 1687 4503 1661 4504 1635 4505 1610 4506 1586 4507 1562 
4508 1539 4508 1517 4509 1495 4510 1474 4511 1454 4512 1434 4513 1415 4514 1397 4515 1380 4516 1364 
4517 1349 4517 1334 4518 1320 4519 1307 4520 1295 4521 1284 4522 1274 4523 1265 4524 1257 4525 1250 
4526 1243 4526 1238 4527 1233 4528 1230 4529 1228 4530 1226 4531 1226 4532 1226 4533 1228 4534 1230 
4535 1233 4535 1238 4536 1243 4537 1250 4538 1257 4539 1265 4540 1274 4541 1284 4542 1295 4543 1307 
4544 1320 4544 1334 4545 1349 4546 1364 4547 1380 4548 1397 4549 1415 4550 1434 4551 1454 4552 1474 
4553 1495 4553 1517 4554 1539 4555 1562 4556 1586 4557 1610 4558 1635 4559 1661 4560 1687 4561 1714 
4562 1741 4562 1768 4563 1796 4564 1825 4565 1854 4566 1883 4567 1912 4568 1942 4569 1972 4570 2003 
4571 2033 4571 2064 4572 2095 4573 2126 4574 2157 4575 2188 4576 2219 4577 2251 4578 2282 4579 2313 
4580 2344 4580 2375 4581 2406 4582 2436 4583 2467 4584 2497 4585 2526 4586 2556 4587 2585 4588 2614 
4589 2642 4589 2671 4590 2698 4591 2725 4592 2752 4593 2778 4594 2803 4595 2828 4596 2853 4597 2877 
4598 2900 4598 2922 4599 2944 4600 2965 4601 2985 4602 3005 4603 3023 4604 3041 4605 3058 4606 3075 
4607 3090 4607 3105 4608 3119 4609 3131 4610 3143 4611 3154 4612 3164 4613 3174 4614 3182 4615 3189 
4616 3196 4616 3201 4617 3205 4618 3209 4619 3211 4620 3213 4621 3213 4622 3213 4623 3211 4624 3209 
4625 3205 4625 3201 4626 3196 4627 3189 4628 3182 4629 3174 4630 3164 4631 3154 4632 3143 4633 3131 
4634 3119 4634 3105 4635 3090 4636 3075 4637 3058 4638 3041 
] dogrey 
 (drawpoly) 432 [0]
[4639 3023 4640 3005 4641 2985 4642 2965 4643 2944 4643 2922 4644 2900 4645 2877 4646 2853 4647 2828 
4648 2803 4649 2778 4650 2752 4651 2725 4652 2698 4652 2671 4653 2642 4654 2614 4655 2585 4656 2556 
4657 2526 4658 2497 4659 2467 4660 2436 4661 2406 4661 2375 4662 2344 4663 2313 4664 2282 4665 2251 
4666 2219 4667 2188 4668 2157 4669 2126 4670 2095 4670 2064 4671 2033 4672 2003 4673 1972 4674 1942 
4675 1912 4676 1883 4677 1854 4678 1825 4679 1796 4679 1768 4680 1741 4681 1714 4682 1687 4683 1661 
4684 1635 4685 1610 4686 1586 4687 1562 4688 1539 4688 1517 4689 1495 4690 1474 4691 1454 4692 1434 
4693 1415 4694 1397 4695 1380 4696 1364 4697 1349 4697 1334 4698 1320 4699 1307 4700 1295 4701 1284 
4702 1274 4703 1265 4704 1257 4705 1250 4706 1243 4706 1238 4707 1233 4708 1230 4709 1228 4710 1226 
4711 1226 4712 1226 4713 1228 4714 1230 4715 1233 4715 1238 4716 1243 4717 1250 4718 1257 4719 1265 
4720 1274 4721 1284 4722 1295 4723 1307 4724 1320 4724 1334 4725 1349 4726 1364 4727 1380 4728 1397 
4729 1415 4730 1434 4731 1454 4732 1474 4733 1495 4733 1517 4734 1539 4735 1562 4736 1586 4737 1610 
4738 1635 4739 1661 4740 1687 4741 1714 4742 1741 4742 1768 4743 1796 4744 1825 4745 1854 4746 1883 
4747 1912 4748 1942 4749 1972 4750 2003 4751 2033 4751 2064 4752 2095 4753 2126 4754 2157 4755 2188 
4756 2219 4757 2251 4758 2282 4759 2313 4760 2344 4760 2375 4761 2406 4762 2436 4763 2467 4764 2497 
4765 2526 4766 2556 4767 2585 4768 2614 4769 2642 4769 2671 4770 2698 4771 2725 4772 2752 4773 2778 
4774 2803 4775 2828 4776 2853 4777 2877 4778 2900 4778 2922 4779 2944 4780 2965 4781 2985 4782 3005 
4783 3023 4784 3041 4785 3058 4786 3075 4787 3090 4787 3105 4788 3119 4789 3131 4790 3143 4791 3154 
4792 3164 4793 3174 4794 3182 4795 3189 4796 3196 4796 3201 4797 3205 4798 3209 4799 3211 4800 3213 
4801 3213 4802 3213 4803 3211 4804 3209 4805 3205 4805 3201 4806 3196 4807 3189 4808 3182 4809 3174 
4810 3164 4811 3154 4812 3143 4813 3131 4814 3119 4814 3105 4815 3090 4816 3075 4817 3058 4818 3041 
4819 3023 4820 3005 4821 2985 4822 2965 4823 2944 4823 2922 4824 2900 4825 2877 4826 2853 4827 2828 
4828 2803 4829 2778 4830 2752 4831 2725 4832 2698 4832 2671 
] dogrey 
 (drawpoly) 432 [0]
[4833 2642 4834 2614 4835 2585 4836 2556 4837 2526 4838 2497 4839 2467 4840 2436 4841 2406 4841 2375 
4842 2344 4843 2313 4844 2282 4845 2251 4846 2219 4847 2188 4848 2157 4849 2126 4850 2095 4850 2064 
4851 2033 4852 2003 4853 1972 4854 1942 4855 1912 4856 1883 4857 1854 4858 1825 4859 1796 4859 1768 
4860 1741 4861 1714 4862 1687 4863 1661 4864 1635 4865 1610 4866 1586 4867 1562 4868 1539 4868 1517 
4869 1495 4870 1474 4871 1454 4872 1434 4873 1415 4874 1397 4875 1380 4876 1364 4877 1349 4877 1334 
4878 1320 4879 1307 4880 1295 4881 1284 4882 1274 4883 1265 4884 1257 4885 1250 4886 1243 4886 1238 
4887 1233 4888 1230 4889 1228 4890 1226 4891 1226 4892 1226 4893 1228 4894 1230 4895 1233 4895 1238 
4896 1243 4897 1250 4898 1257 4899 1265 4900 1274 4901 1284 4902 1295 4903 1307 4904 1320 4904 1334 
4905 1349 4906 1364 4907 1380 4908 1397 4909 1415 4910 1434 4911 1454 4912 1474 4913 1495 4913 1517 
4914 1539 4915 1562 4916 1586 4917 1610 4918 1635 4919 1661 4920 1687 4921 1714 4922 1741 4922 1768 
4923 1796 4924 1825 4925 1854 4926 1883 4927 1912 4928 1942 4929 1972 4930 2003 4931 2033 4931 2064 
4932 2095 4933 2126 4934 2157 4935 2188 4936 2219 4937 2251 4938 2282 4939 2313 4940 2344 4940 2375 
4941 2406 4942 2436 4943 2467 4944 2497 4945 2526 4946 2556 4947 2585 4948 2614 4949 2642 4949 2671 
4950 2698 4951 2725 4952 2752 4953 2778 4954 2803 4955 2828 4956 2853 4957 2877 4958 2900 4958 2922 
4959 2944 4960 2965 4961 2985 4962 3005 4963 3023 4964 3041 4965 3058 4966 3075 4967 3090 4967 3105 
4968 3119 4969 3131 4970 3143 4971 3154 4972 3164 4973 3174 4974 3182 4975 3189 4976 3196 4976 3201 
4977 3205 4978 3209 4979 3211 4980 3213 4981 3213 4982 3213 4983 3211 4984 3209 4985 3205 4985 3201 
4986 3196 4987 3189 4988 3182 4989 3174 4990 3164 4991 3154 4992 3143 4993 3131 4994 3119 4994 3105 
4995 3090 4996 3075 4997 3058 4998 3041 4999 3023 5000 3005 5001 2985 5002 2965 5003 2944 5003 2922 
5004 2900 5005 2877 5006 2853 5007 2828 5008 2803 5009 2778 5010 2752 5011 2725 5012 2698 5012 2671 
5013 2642 5014 2614 5015 2585 5016 2556 5017 2526 5018 2497 5019 2467 5020 2436 5021 2406 5021 2375 
5022 2344 5023 2313 5024 2282 5025 2251 5026 2219 5027 2188 
] dogrey 
 (drawpoly) 432 [0]
[5028 2157 5029 2126 5030 2095 5030 2064 5031 2033 5032 2003 5033 1972 5034 1942 5035 1912 5036 1883 
5037 1854 5038 1825 5039 1796 5039 1768 5040 1741 5041 1714 5042 1687 5043 1661 5044 1635 5045 1610 
5046 1586 5047 1562 5048 1539 5048 1517 5049 1495 5050 1474 5051 1454 5052 1434 5053 1415 5054 1397 
5055 1380 5056 1364 5057 1349 5057 1334 5058 1320 5059 1307 5060 1295 5061 1284 5062 1274 5063 1265 
5064 1257 5065 1250 5066 1243 5066 1238 5067 1233 5068 1230 5069 1228 5070 1226 5071 1226 5072 1226 
5073 1228 5074 1230 5075 1233 5075 1238 5076 1243 5077 1250 5078 1257 5079 1265 5080 1274 5081 1284 
5082 1295 5083 1307 5084 1320 5084 1334 5085 1349 5086 1364 5087 1380 5088 1397 5089 1415 5090 1434 
5091 1454 5092 1474 5093 1495 5093 1517 5094 1539 5095 1562 5096 1586 5097 1610 5098 1635 5099 1661 
5100 1687 5101 1714 5102 1741 5102 1768 5103 1796 5104 1825 5105 1854 5106 1883 5107 1912 5108 1942 
5109 1972 5110 2003 5111 2033 5111 2064 5112 2095 5113 2126 5114 2157 5115 2188 5116 2219 5117 2251 
5118 2282 5119 2313 5120 2344 5120 2375 5121 2406 5122 2436 5123 2467 5124 2497 5125 2526 5126 2556 
5127 2585 5128 2614 5129 2642 5129 2671 5130 2698 5131 2725 5132 2752 5133 2778 5134 2803 5135 2828 
5136 2853 5137 2877 5138 2900 5138 2922 5139 2944 5140 2965 5141 2985 5142 3005 5143 3023 5144 3041 
5145 3058 5146 3075 5147 3090 5147 3105 5148 3119 5149 3131 5150 3143 5151 3154 5152 3164 5153 3174 
5154 3182 5155 3189 5156 3196 5156 3201 5157 3205 5158 3209 5159 3211 5160 3213 5161 3213 5162 3213 
5163 3211 5164 3209 5165 3205 5165 3201 5166 3196 5167 3189 5168 3182 5169 3174 5170 3164 5171 3154 
5172 3143 5173 3131 5174 3119 5174 3105 5175 3090 5176 3075 5177 3058 5178 3041 5179 3023 5180 3005 
5181 2985 5182 2965 5183 2944 5183 2922 5184 2900 5185 2877 5186 2853 5187 2828 5188 2803 5189 2778 
5190 2752 5191 2725 5192 2698 5192 2671 5193 2642 5194 2614 5195 2585 5196 2556 5197 2526 5198 2497 
5199 2467 5200 2436 5201 2406 5201 2375 5202 2344 5203 2313 5204 2282 5205 2251 5206 2219 5207 2188 
5208 2157 5209 2126 5210 2095 5210 2064 5211 2033 5212 2003 5213 1972 5214 1942 5215 1912 5216 1883 
5217 1854 5218 1825 5219 1796 5219 1768 5220 1741 5221 1714 
] dogrey 
 (drawpoly) 64 [0]
[5222 1687 5223 1661 5224 1635 5225 1610 5226 1586 5227 1562 5228 1539 5228 1517 5229 1495 5230 1474 
5231 1454 5232 1434 5233 1415 5234 1397 5235 1380 5236 1364 5237 1349 5237 1334 5238 1320 5239 1307 
5240 1295 5241 1284 5242 1274 5243 1265 5244 1257 5245 1250 5246 1243 5246 1238 5247 1233 5248 1230 
5249 1228 5250 1226 
] dogrey 
0 Setcolor
/absolu true def
0 Setcolor
-1 -1 200000 200000 setclipzone
 showpage

 end saved restore 

