%!PS-Adobe-2.0 EPSF-2.0
%%BoundingBox:  0 0 300 212
%%
%%Scilab Postscript File (1995-1997 J.Ph Chancelier)
%%EndComments
/saved save def 
/$pictdict 100 dict def
$pictdict begin

/dogrey
{ /Arraybox exch def
	/Arraygrey exch def
	/nargs exch def 
	/func exch cvx def
	Arraybox 0 nargs getinterval Arraygrey 0 get func 
	1 1 Arraygrey length 1 sub 
	{/i exch def
	Arraybox i nargs mul nargs getinterval 
	Arraygrey i get func
	}for
} def
%--------------------------------------------
% [x y width height] nivgris drawbox 
% si niv gris > 1.0 alors on fait un stroke 
% sans closepath 
%--------------------------------------------

/drawpoly
	{/glev exch def /Ar exch def
	newpath
	Ar 0 get Ar 1 get moveto 
	2 2 Ar length 1 sub 
	{/i exch def
	Ar i get Ar i 1 add get absolu {lineto} {rlineto} ifelse
	}for
	glev -1 le 
	{ % filling the polygon with current pattern ( gray or color)
	  closepath gsave glev neg 1 sub WhiteLev 2 add lmin 0 lmax Setgray eofill grestore }
	{ glev 1 ge 
	   { % drawing the polygon with current dash style or color 
	     % XXXXX : a voir c'est pas clair il faudrait sauver 
	     % and filling it with other color (glev) 
	     closepath gsave glev 1 sub WhiteLev 2 add lmin 0 lmax Setgray 
		 eofill grestore stroke }
	   {% drawing the polygon with current style 
	    closeflag {closepath} if stroke} 
	ifelse }
	ifelse 
} def 


/drawbox 
	{/glev exch def /Ar exch def 
	/x Ar 0 get def /y Ar 1 get def 
	/w Ar 2 get def /h Ar 3 get def 
	newpath
	x y moveto
	x w add y lineto
	x w add y h add lineto
	x y h add lineto
	glev 1 ge 
	{ % filling 
	 closepath gsave glev 1 sub WhiteLev 2 add lmin 0 lmax Setgray eofill 
		grestore}
	{ 
	  % drawing 
	  glev -1 le 
	  {
    	  closepath gsave glev neg 1 sub WhiteLev 2 add lmin 0 lmax Setgray
		 stroke grestore  }
	  { closepath stroke} ifelse 
	} ifelse
} def 

%--------------------------------------------
% [x y width height] clearzone
%--------------------------------------------
/clearzone
        {/Ar exch def
        /x Ar 0 get def /y Ar 1 get def
        /w Ar 2 get def /h Ar 3 get def
        newpath
        x y moveto
        x w add y lineto
        x w add y h add lineto
        x y h add lineto
	closepath WhiteLev 2 add Setcolor  eofill grestore
} def

%------------------------------------------------------
% polyline stroke or polygon fill or both 
%------------------------------------------------------
/absolu true def 
/closeflag false def 

/lmin { /y exch def /x exch def x y le { x  } {  y  } ifelse } def
/lmax { /y exch def /x exch def x y le { y } {  x } ifelse } def 


/drawpoly
	{/glev exch def /Ar exch def
	newpath
	Ar 0 get Ar 1 get moveto 
	2 2 Ar length 1 sub 
	{/i exch def
	Ar i get Ar i 1 add get absolu {lineto} {rlineto} ifelse
	}for
	glev -1 le 
	{ % filling the polygon with current pattern ( gray or color)
	  closepath gsave glev neg 1 sub WhiteLev 2 add lmin 0 lmax Setgray eofill grestore }
	{ glev 1 ge 
	   { % drawing the polygon with current dash style or color 
	     % XXXXX : a voir c'est pas clair il faudrait sauver 
	     % and filling it with other color (glev) 
	     closepath gsave glev 1 sub WhiteLev 2 add lmin 0 lmax Setgray 
		 eofill grestore stroke }
	   {% drawing the polygon with current style 
	    closeflag {closepath} if stroke} 
	ifelse }
	ifelse 
} def 

%------------------------------------------------------
% segments non connectes 
%------------------------------------------------------

/drawsegs
	{/glev exch def /Ar exch def
	newpath
	Ar 0 get Ar 1 get moveto Ar 2 get Ar 3 get lineto 
	gsave glev Setgray stroke grestore
	4 4 Ar length 3 sub 
	{/i exch def
	newpath 
	Ar i get Ar i 1 add get moveto
	Ar i 2 add get Ar i 3 add get lineto 
	gsave glev Setgray stroke grestore
	}for
} def 


%------------------------------------------------------
% unconected arrows
%-----------------------------------------------------

/drawarrows
	{/arsize10 exch def /Ar exch def
	Ar 0 get  Ar 1 get Ar 2 get Ar 3 get arsize10 drawarrow
	4 4 Ar length 3 sub 
	{/i exch def
	Ar i get Ar i 1 add get  Ar i 2 add get  Ar i 3 add get arsize10 
	drawarrow
	}for
} def 
		
/cos20 20 cos def
/sin20 20 sin def

/drawarrow                                
  { 
      /arsize exch 10 div def 
      /tipy exch def /tipx exch def       
      /taily exch def /tailx exch def
      /dx tipx tailx sub  def               
      /dy tipy taily sub  def               
      newpath tipx tipy moveto tailx taily lineto stroke   
      /norme dx dx mul dy dy mul add sqrt def 
      norme 1.e-8 ge 
	{
	 arsize dx mul norme div /dx1 exch def 
	 arsize dy mul norme div /dy1 exch def 
	 /depx tipx cos20 dx1 mul add def 
	/depy  tipy cos20 dy1 mul add def 
	newpath depx depy moveto 
	cos20 neg dx1 mul sin20 dy1 mul sub depx add
	sin20 dx1  mul cos20 dy1 mul sub depy add lineto 
	cos20 neg dx1 mul sin20 dy1 mul add  depx add
	sin20 neg dx1 mul cos20 dy1 mul sub depy add lineto closepath 
	fill
	} {} ifelse 
  } def


%------------------------------------------------------
% cercle ou portions de cercle 
% attention argument (x y w h angl1*64 angl2*64 )
% devrait tracer une ellipse a modifier donc 
%------------------------------------------------------

/fillarc
	{/glev exch def /Ar exch def
	/cx Ar 0 get Ar 2 get 2 div add def 
	/cy Ar 1 get Ar 3 get 2 div add def 
	/hom Ar 3 get Ar 2 get div def 
	/Cmsave1 matrix def Cmsave1 currentmatrix pop
	%-- on change de transformation pour faire homothetie en (x,y) 
	cx cy [1 0 0 hom 0 0 ] transform
	/t1 exch neg cy add def 
	/t2 exch neg cx add def 
	[1 0 0 hom t2 t1 ] concat 
	glev WhiteLev le
	{ % filling 
	newpath
	cx cy moveto 
	cx cy Ar 2 get 2 div Ar 5 get Ar 4 get add  64 div neg
	 Ar 4 get 64 div neg  arc closepath
	gsave glev Setgray eofill grestore}
	{
	%drawing with current dash or color unclosed path 
	newpath
	cx cy Ar 2 get 2 div Ar 5 get Ar 4 get add 64 div neg Ar 4 get 64 div neg arc
	  stroke} ifelse 
	Cmsave1 setmatrix } def 

/drawarc
	{/glev exch def /Ar exch def
	/cx Ar 0 get Ar 2 get 2 div add def 
	/cy Ar 1 get Ar 3 get 2 div add def 
	/hom Ar 3 get Ar 2 get div def 
	/Cmsave1 matrix def Cmsave1 currentmatrix pop
	%-- on change de transformation pour faire homothetie en (x,y) 
	cx cy [1 0 0 hom 0 0 ] transform
	/t1 exch neg cy add def 
	/t2 exch neg cx add def 
	[1 0 0 hom t2 t1 ] concat 
	newpath
	cx cy Ar 2 get 2 div Ar 5 get Ar 4 get add 64 div neg Ar 4 get 64 div neg arc
	closepath glev Setgray stroke
	Cmsave1 setmatrix } def 

%------------------------------------------------------
% centred hard mark 
%------------------------------------------------------

% x y str ShowCString 
% on fait un show mais string est centre autour du point (x,y) 

/ShowCString { /str exch def /y exch def /x exch def 
 newpath 
 x y moveto 
 str true charpath flattenpath pathbbox 
 /y2 exch def /x2 exch def /y1 exch def /x1 exch def 
 x 2 mul x2 x1 add 2 div sub 
 y 2 mul y2 y1 add 2 div sub moveto str show 
 } def 

/drawpolymark {/glev exch def /Ar exch def 
	Ar 0 get Ar 1 get HardMark ShowCString 
	2 2 Ar length 1 sub 
	{/i exch def
	Ar i get Ar i 1 add get HardMark ShowCString
	}for
} def 

%---------------------------------------------------
% chaines de caracteres 
%---------------------------------------------------
/FBox {/Ar exch def /rot exch def /str exch def /y exch def /x exch def 
 newpath Ar 0 get Ar 1 get moveto 
	/sina rot sin def /cosa rot cos def 
	/-sina sina neg def 
	[cosa -sina sina cosa 0 0 ] CtmModif
 Ar 2 get 0 rlineto 0 Ar 3 get neg rlineto Ar 2 get neg 0 rlineto 
 0 Ar 3 get  rlineto  stroke CtmRestore 
 x y str rot ShowRotate 
 } def 

% x y str ang Showrotate 
% inverse du sens trigo 

/ShowRotate { /ang exch def /str exch def 
	/y exch def /x exch def 
	x y moveto 
	/sina ang sin def /cosa ang cos def 
	/-sina 0 sina sub def 
	[cosa -sina sina cosa 0 0 ] CtmModif
	str show 
	CtmRestore 
} def 

/HardMark (0) def 

%(Chaine de caracteres) x y flag angle [arfbox] Show

/Show { /Ar exch def 
	/rot exch def /flag exch def /y exch def /x exch def /str exch def 
	flag 1 eq 
	{x y str rot Ar FBox}
	{x y str rot ShowRotate } ifelse} def 

/L {/y2 exch def /x2 exch def /y1 exch def /x1 exch def 
    newpath x1 y1 moveto x2 y2 lineto stroke } def 

%---------------------------------------------------------
% drawing an axis 
% angle [nsep1,nsep2] ,[siz1,siz2,coeff] [x0,y0] drawaxis",
%---------------------------------------------------------

/drawaxis {/XX exch def /Arsize exch def /Arsep exch def /ang exch def 
	/Cmsave1 matrix def Cmsave1 currentmatrix pop
	/sina ang sin def /cosa ang cos def /-sina sina neg def 
	/x XX 0 get def /y XX 1 get def
	%-- on change de transformation pour tourner autour de (x,y) 
	x y [cosa sina -sina cosa 0 0 ] transform
	/t1 exch neg y add def 
	/t2 exch neg x add def 
	[cosa sina -sina cosa t2 t1 ] concat 
	newpath x y moveto 0 Arsize 1 get Arsize 2 get mul rlineto
	stroke 
	0 1 Arsep 1 get 1 sub
	{
	 % i don't want the value of the for indice 
	 pop
	newpath 
	x y moveto 
	0 1 Arsep 0 get 1 sub
		{
		 % i don't want the value of the for indice 
		 pop
		 Arsize 0 get 0  rlineto
		 0 Arsize 1 get rlineto 
	 	0 Arsize 1 get  neg rlineto }
		for 
	currentpoint /y exch def /x exch def 
	stroke 
	newpath x y moveto 0 Arsize 1 get Arsize 2 get mul rlineto
	stroke }
	for 
	Cmsave1 setmatrix } def 

%---------------------------------------------------------
% change and restore CTM
%---------------------------------------------------------

/CtmModif {
	/arg exch def 
	/Cmsave matrix def 
	Cmsave currentmatrix pop
	[1 0 0 -1 0 0 ] concat 
	arg concat 
} def 

/CtmRestore { Cmsave setmatrix } def 

/Thickness { /th exch def th 0 le {/th 0.1 def} if th setlinewidth} def 

/WhiteLev 15 def

/Setgray { WhiteLev div setgray} def 

/fillsolid { 0 setgray } def 

%--------------------------------------
% clip zones ( rectangle ) 
%-------------------------------------

/setclipzone {initclip 
	/h exch def /w exch def /y exch def /x exch def 
	newpath x y moveto w 0 rlineto 0 h rlineto w neg 0 rlineto 
	0 h neg rlineto closepath clip} def 

%------------------
% to change the position of a picture 
%------------------
/cm{28.346457 mul}def

/DesPosi { /YH exch def /XW exch def /YP exch def /XP exch def 
	XP cm YP cm neg translate 
	XW cm 6000 div YH cm 4240 div  scale } def 

0 setlinecap 
2 setlinejoin 
1 setlinewidth

%-- Color database 
/ColorR [0.000000 0.000000 0.000000 0.529412 0.498039 0.133333 0.000000 0.878431 0.000000 1.000000 1.000000 1.000000 0.933333 1.000000 1.000000 0.960784 1.000000 ] def
/ColorG [0.000000 0.000000 0.000000 0.807843 1.000000 0.545098 1.000000 1.000000 1.000000 0.647059 0.000000 0.000000 0.509804 1.000000 0.843137 0.960784 1.000000 ] def
/ColorB [0.000000 0.501961 1.000000 0.921569 0.831373 0.133333 0.000000 1.000000 1.000000 0.000000 0.000000 1.000000 0.933333 0.000000 0.000000 0.862745 1.000000 ] def

/Setcolor {/i exch def ColorR i get ColorG i get ColorB i get setrgbcolor } def

% to multiply all the fontsizes by a factor  scf
/scf 1.0 def


% changing fonts encoding 

/Courier findfont
dup length dict begin
  {1 index /FID ne {def} {pop pop} ifelse} forall
  /Encoding ISOLatin1Encoding def
  currentdict
  end
/Courier exch definefont pop

/Times-Roman findfont
dup length dict begin
  {1 index /FID ne {def} {pop pop} ifelse} forall
  /Encoding ISOLatin1Encoding def
  currentdict
  end
/Times-Roman exch definefont pop

/Times-Bold findfont
dup length dict begin
  {1 index /FID ne {def} {pop pop} ifelse} forall
  /Encoding ISOLatin1Encoding def
  currentdict
  end
/Times-Bold exch definefont pop


/Times-BoldItalic findfont
dup length dict begin
  {1 index /FID ne {def} {pop pop} ifelse} forall
  /Encoding ISOLatin1Encoding def
  currentdict
  end
/Times-BoldItalic exch definefont pop


%------ End Main Program ------%
% XP YP XW YW DesPosi in the following code 
% will output the picture in the rectangle defined by 
% upper left point (XP,YP) wide :XW Height: YW
% the coordinates are given in centimeter and 
% are the (0,0) point is the down-left point of the paper 


/ColorR [0.000000 
0.000000 0.000000 0.000000 1.000000 1.000000 1.000000 1.000000 0.000000 0.000000 0.000000 
0.529412 0.000000 0.000000 0.000000 0.000000 0.000000 0.000000 0.564706 0.690196 0.815686 
0.564706 0.690196 0.815686 0.501961 0.627451 0.752941 1.000000 1.000000 1.000000 1.000000 
1.000000 0.0 1.0] def
/ColorG [0.000000 
0.000000 1.000000 1.000000 0.000000 0.000000 0.000000 1.000000 0.000000 0.000000 0.000000 
0.807843 0.564706 0.690196 0.815686 0.564706 0.690196 0.815686 0.000000 0.000000 0.000000 
0.000000 0.000000 0.000000 0.188235 0.250980 0.376471 0.501961 0.627451 0.752941 0.878431 
0.843137 0.0 1.0] def
/ColorB [0.000000 
1.000000 0.000000 1.000000 0.000000 1.000000 0.000000 1.000000 0.564706 0.690196 0.815686 
1.000000 0.000000 0.000000 0.000000 0.564706 0.690196 0.815686 0.000000 0.000000 0.000000 
0.564706 0.690196 0.815686 0.000000 0.000000 0.000000 0.501961 0.627451 0.752941 0.878431 
0.000000 0.0 1.0] def
% Dessin en bas a gauche de taille 3000,2120
[0.5 10 div 0 0 0.5 10 div neg  0 2120 10 div] concat
% Init driver 
5 Thickness
% 3 setalufunction
-1 -1 200000 200000 setclipzone
[] 0 setdash
/Times-Roman findfont 100 scf mul scalefont setfont
fillsolid
[] 0 setdash
0 Setcolor
%--use color 1 
fillsolid
[] 0 setdash
0 Setcolor
/WhiteLev 31 def
/Setgray {/i exch def ColorR i get ColorG i get ColorB i get setrgbcolor } def 
/Setcolor {/i exch def ColorR i get ColorG i get ColorB i get setrgbcolor } def 
%--end use color 1 
% End init driver 
/WhiteLev 31 def
/Times-Roman findfont 100 scf mul scalefont setfont
5 Thickness
-1 -1 200000 200000 setclipzone
0 Setcolor
0 Setcolor
 (drawbox) 4 [ 0]
[750 530 4500 3180 
] dogrey 
0 Setcolor
(0) 722 3906 0  0.00 [722 3816 57 120] Show
 (drawsegs) 4 [ 0]
[750 3710 750 3773 
] dogrey 
0 Setcolor
 (drawsegs) 4 [ 0]
[1200 3710 1200 3741 
] dogrey 
0 Setcolor
(0.1) 1564 3906 0  0.00 [1564 3816 172 120] Show
 (drawsegs) 4 [ 0]
[1650 3710 1650 3773 
] dogrey 
0 Setcolor
 (drawsegs) 4 [ 0]
[2100 3710 2100 3741 
] dogrey 
0 Setcolor
(0.2) 2464 3906 0  0.00 [2464 3816 172 120] Show
 (drawsegs) 4 [ 0]
[2550 3710 2550 3773 
] dogrey 
0 Setcolor
 (drawsegs) 4 [ 0]
[3000 3710 3000 3741 
] dogrey 
0 Setcolor
(0.3) 3364 3906 0  0.00 [3364 3816 172 120] Show
 (drawsegs) 4 [ 0]
[3450 3710 3450 3773 
] dogrey 
0 Setcolor
 (drawsegs) 4 [ 0]
[3900 3710 3900 3741 
] dogrey 
0 Setcolor
(0.4) 4264 3906 0  0.00 [4264 3816 172 120] Show
 (drawsegs) 4 [ 0]
[4350 3710 4350 3773 
] dogrey 
0 Setcolor
 (drawsegs) 4 [ 0]
[4800 3710 4800 3741 
] dogrey 
0 Setcolor
(0.5) 5164 3906 0  0.00 [5164 3816 172 120] Show
 (drawsegs) 4 [ 0]
[5250 3710 5250 3773 
] dogrey 
0 Setcolor
(-8) 564 3770 0  0.00 [564 3680 114 120] Show
 (drawsegs) 4 [ 0]
[750 3710 690 3710 
] dogrey 
0 Setcolor
 (drawsegs) 4 [ 0]
[750 3533 720 3533 
] dogrey 
0 Setcolor
(-7) 564 3417 0  0.00 [564 3327 114 120] Show
 (drawsegs) 4 [ 0]
[750 3357 690 3357 
] dogrey 
0 Setcolor
 (drawsegs) 4 [ 0]
[750 3180 720 3180 
] dogrey 
0 Setcolor
(-6) 564 3063 0  0.00 [564 2973 114 120] Show
 (drawsegs) 4 [ 0]
[750 3003 690 3003 
] dogrey 
0 Setcolor
 (drawsegs) 4 [ 0]
[750 2827 720 2827 
] dogrey 
0 Setcolor
(-5) 564 2710 0  0.00 [564 2620 114 120] Show
 (drawsegs) 4 [ 0]
[750 2650 690 2650 
] dogrey 
0 Setcolor
 (drawsegs) 4 [ 0]
[750 2473 720 2473 
] dogrey 
0 Setcolor
(-4) 564 2357 0  0.00 [564 2267 114 120] Show
 (drawsegs) 4 [ 0]
[750 2297 690 2297 
] dogrey 
0 Setcolor
 (drawsegs) 4 [ 0]
[750 2120 720 2120 
] dogrey 
0 Setcolor
(-3) 564 2003 0  0.00 [564 1913 114 120] Show
 (drawsegs) 4 [ 0]
[750 1943 690 1943 
] dogrey 
0 Setcolor
 (drawsegs) 4 [ 0]
[750 1767 720 1767 
] dogrey 
0 Setcolor
(-2) 564 1650 0  0.00 [564 1560 114 120] Show
 (drawsegs) 4 [ 0]
[750 1590 690 1590 
] dogrey 
0 Setcolor
 (drawsegs) 4 [ 0]
[750 1413 720 1413 
] dogrey 
0 Setcolor
(-1) 564 1297 0  0.00 [564 1207 114 120] Show
 (drawsegs) 4 [ 0]
[750 1237 690 1237 
] dogrey 
0 Setcolor
 (drawsegs) 4 [ 0]
[750 1060 720 1060 
] dogrey 
0 Setcolor
(0) 621 943 0  0.00 [621 853 57 120] Show
 (drawsegs) 4 [ 0]
[750 883 690 883 
] dogrey 
0 Setcolor
 (drawsegs) 4 [ 0]
[750 707 720 707 
] dogrey 
0 Setcolor
(1) 621 590 0  0.00 [621 500 57 120] Show
 (drawsegs) 4 [ 0]
[750 530 690 530 
] dogrey 
0 Setcolor
0 Setcolor
750 530 4500 3180 setclipzone
0 Setcolor
/closeflag false def
 (drawpoly) 432 [ 0]
[750 3488 768 3471 785 3427 803 3369 821 3309 838 3255 856 3211 874 3177 891 3156 909 3146 
926 3148 944 3163 962 3189 979 3225 997 3269 1015 3317 1032 3363 1050 3394 1068 3401 1085 3381 
1103 3340 1121 3288 1138 3233 1156 3182 1174 3139 1191 3104 1209 3079 1226 3065 1244 3062 1262 3068 
1279 3083 1297 3106 1315 3133 1332 3161 1350 3183 1368 3193 1385 3187 1403 3165 1421 3129 1438 3087 
1456 3043 1474 3001 1491 2965 1509 2936 1526 2914 1544 2900 1562 2893 1579 2891 1597 2891 1615 2892 
1632 2889 1650 2880 1668 2864 1685 2843 1703 2821 1721 2804 1738 2804 1756 2835 1774 2934 1791 3261 
1809 3032 1826 2630 1844 2388 1862 2206 1879 2056 1897 1927 1915 1814 1932 1714 1950 1623 1968 1542 
1985 1468 2003 1401 2021 1340 2038 1284 2056 1234 2074 1188 2091 1147 2109 1110 2126 1076 2144 1046 
2162 1020 2179 996 2197 976 2215 958 2232 943 2250 930 2268 919 2285 909 2303 902 2321 896 
2338 892 2356 888 2374 886 2391 884 2409 883 2426 882 2444 882 2462 882 2479 882 2497 882 
2515 882 2532 882 2550 882 2568 882 2585 882 2603 882 2621 882 2638 882 2656 882 2674 882 
2691 882 2709 882 2726 882 2744 882 2762 882 2779 882 2797 882 2815 883 2832 883 2850 883 
2868 883 2885 883 2903 882 2921 882 2938 882 2956 882 2974 882 2991 882 3009 882 3026 882 
3044 882 3062 882 3079 882 3097 882 3115 883 3132 883 3150 883 3168 883 3185 883 3203 882 
3221 882 3238 882 3256 882 3274 882 3291 882 3309 882 3326 882 3344 882 3362 882 3379 882 
3397 882 3415 882 3432 882 3450 882 3468 882 3485 882 3503 882 3521 882 3538 882 3556 882 
3574 882 3591 883 3609 884 3626 886 3644 888 3662 892 3679 896 3697 902 3715 909 3732 919 
3750 930 3768 943 3785 958 3803 976 3821 996 3838 1020 3856 1046 3874 1076 3891 1110 3909 1147 
3926 1188 3944 1234 3962 1284 3979 1340 3997 1401 4015 1468 4032 1542 4050 1623 4068 1714 4085 1814 
4103 1927 4121 2056 4138 2206 4156 2388 4174 2630 4191 3032 4209 3261 4226 2934 4244 2835 4262 2804 
4279 2804 4297 2821 4315 2843 4332 2864 4350 2880 4368 2889 4385 2892 4403 2891 4421 2891 4438 2893 
4456 2900 4474 2914 4491 2936 4509 2965 4526 3001 4544 3043 
] dogrey 
 (drawpoly) 80 [0]
[4562 3087 4579 3129 4597 3165 4615 3187 4632 3193 4650 3183 4668 3161 4685 3133 4703 3106 4721 3083 
4738 3068 4756 3062 4774 3065 4791 3079 4809 3104 4826 3139 4844 3182 4862 3233 4879 3288 4897 3340 
4915 3381 4932 3401 4950 3394 4968 3363 4985 3317 5003 3269 5021 3225 5038 3189 5056 3163 5074 3148 
5091 3146 5109 3156 5126 3177 5144 3211 5162 3255 5179 3309 5197 3369 5215 3427 5232 3471 5250 3488 
] dogrey 
0 Setcolor
/absolu true def
0 Setcolor
-1 -1 200000 200000 setclipzone
 showpage

 end saved restore 

