%!PS-Adobe-2.0 EPSF-2.0
%%BoundingBox:  0 0 300 212
%%
%%Scilab Postscript File (1995-1997 J.Ph Chancelier)
%%EndComments
/saved save def 
/$pictdict 100 dict def
$pictdict begin

/dogrey
{ /Arraybox exch def
	/Arraygrey exch def
	/nargs exch def 
	/func exch cvx def
	Arraybox 0 nargs getinterval Arraygrey 0 get func 
	1 1 Arraygrey length 1 sub 
	{/i exch def
	Arraybox i nargs mul nargs getinterval 
	Arraygrey i get func
	}for
} def
%--------------------------------------------
% [x y width height] nivgris drawbox 
% si niv gris > 1.0 alors on fait un stroke 
% sans closepath 
%--------------------------------------------

/drawpoly
	{/glev exch def /Ar exch def
	newpath
	Ar 0 get Ar 1 get moveto 
	2 2 Ar length 1 sub 
	{/i exch def
	Ar i get Ar i 1 add get absolu {lineto} {rlineto} ifelse
	}for
	glev -1 le 
	{ % filling the polygon with current pattern ( gray or color)
	  closepath gsave glev neg 1 sub WhiteLev 2 add lmin 0 lmax Setgray eofill grestore }
	{ glev 1 ge 
	   { % drawing the polygon with current dash style or color 
	     % XXXXX : a voir c'est pas clair il faudrait sauver 
	     % and filling it with other color (glev) 
	     closepath gsave glev 1 sub WhiteLev 2 add lmin 0 lmax Setgray 
		 eofill grestore stroke }
	   {% drawing the polygon with current style 
	    closeflag {closepath} if stroke} 
	ifelse }
	ifelse 
} def 


/drawbox 
	{/glev exch def /Ar exch def 
	/x Ar 0 get def /y Ar 1 get def 
	/w Ar 2 get def /h Ar 3 get def 
	newpath
	x y moveto
	x w add y lineto
	x w add y h add lineto
	x y h add lineto
	glev 1 ge 
	{ % filling 
	 closepath gsave glev 1 sub WhiteLev 2 add lmin 0 lmax Setgray eofill 
		grestore}
	{ 
	  % drawing 
	  glev -1 le 
	  {
    	  closepath gsave glev neg 1 sub WhiteLev 2 add lmin 0 lmax Setgray
		 stroke grestore  }
	  { closepath stroke} ifelse 
	} ifelse
} def 

%--------------------------------------------
% [x y width height] clearzone
%--------------------------------------------
/clearzone
        {/Ar exch def
        /x Ar 0 get def /y Ar 1 get def
        /w Ar 2 get def /h Ar 3 get def
        newpath
        x y moveto
        x w add y lineto
        x w add y h add lineto
        x y h add lineto
	closepath WhiteLev 2 add Setcolor  eofill grestore
} def

%------------------------------------------------------
% polyline stroke or polygon fill or both 
%------------------------------------------------------
/absolu true def 
/closeflag false def 

/lmin { /y exch def /x exch def x y le { x  } {  y  } ifelse } def
/lmax { /y exch def /x exch def x y le { y } {  x } ifelse } def 


/drawpoly
	{/glev exch def /Ar exch def
	newpath
	Ar 0 get Ar 1 get moveto 
	2 2 Ar length 1 sub 
	{/i exch def
	Ar i get Ar i 1 add get absolu {lineto} {rlineto} ifelse
	}for
	glev -1 le 
	{ % filling the polygon with current pattern ( gray or color)
	  closepath gsave glev neg 1 sub WhiteLev 2 add lmin 0 lmax Setgray eofill grestore }
	{ glev 1 ge 
	   { % drawing the polygon with current dash style or color 
	     % XXXXX : a voir c'est pas clair il faudrait sauver 
	     % and filling it with other color (glev) 
	     closepath gsave glev 1 sub WhiteLev 2 add lmin 0 lmax Setgray 
		 eofill grestore stroke }
	   {% drawing the polygon with current style 
	    closeflag {closepath} if stroke} 
	ifelse }
	ifelse 
} def 

%------------------------------------------------------
% segments non connectes 
%------------------------------------------------------

/drawsegs
	{/glev exch def /Ar exch def
	newpath
	Ar 0 get Ar 1 get moveto Ar 2 get Ar 3 get lineto 
	gsave glev Setgray stroke grestore
	4 4 Ar length 3 sub 
	{/i exch def
	newpath 
	Ar i get Ar i 1 add get moveto
	Ar i 2 add get Ar i 3 add get lineto 
	gsave glev Setgray stroke grestore
	}for
} def 


%------------------------------------------------------
% unconected arrows
%-----------------------------------------------------

/drawarrows
	{/arsize10 exch def /Ar exch def
	Ar 0 get  Ar 1 get Ar 2 get Ar 3 get arsize10 drawarrow
	4 4 Ar length 3 sub 
	{/i exch def
	Ar i get Ar i 1 add get  Ar i 2 add get  Ar i 3 add get arsize10 
	drawarrow
	}for
} def 
		
/cos20 20 cos def
/sin20 20 sin def

/drawarrow                                
  { 
      /arsize exch 10 div def 
      /tipy exch def /tipx exch def       
      /taily exch def /tailx exch def
      /dx tipx tailx sub  def               
      /dy tipy taily sub  def               
      newpath tipx tipy moveto tailx taily lineto stroke   
      /norme dx dx mul dy dy mul add sqrt def 
      norme 1.e-8 ge 
	{
	 arsize dx mul norme div /dx1 exch def 
	 arsize dy mul norme div /dy1 exch def 
	 /depx tipx cos20 dx1 mul add def 
	/depy  tipy cos20 dy1 mul add def 
	newpath depx depy moveto 
	cos20 neg dx1 mul sin20 dy1 mul sub depx add
	sin20 dx1  mul cos20 dy1 mul sub depy add lineto 
	cos20 neg dx1 mul sin20 dy1 mul add  depx add
	sin20 neg dx1 mul cos20 dy1 mul sub depy add lineto closepath 
	fill
	} {} ifelse 
  } def


%------------------------------------------------------
% cercle ou portions de cercle 
% attention argument (x y w h angl1*64 angl2*64 )
% devrait tracer une ellipse a modifier donc 
%------------------------------------------------------

/fillarc
	{/glev exch def /Ar exch def
	/cx Ar 0 get Ar 2 get 2 div add def 
	/cy Ar 1 get Ar 3 get 2 div add def 
	/hom Ar 3 get Ar 2 get div def 
	/Cmsave1 matrix def Cmsave1 currentmatrix pop
	%-- on change de transformation pour faire homothetie en (x,y) 
	cx cy [1 0 0 hom 0 0 ] transform
	/t1 exch neg cy add def 
	/t2 exch neg cx add def 
	[1 0 0 hom t2 t1 ] concat 
	glev WhiteLev le
	{ % filling 
	newpath
	cx cy moveto 
	cx cy Ar 2 get 2 div Ar 5 get Ar 4 get add  64 div neg
	 Ar 4 get 64 div neg  arc closepath
	gsave glev Setgray eofill grestore}
	{
	%drawing with current dash or color unclosed path 
	newpath
	cx cy Ar 2 get 2 div Ar 5 get Ar 4 get add 64 div neg Ar 4 get 64 div neg arc
	  stroke} ifelse 
	Cmsave1 setmatrix } def 

/drawarc
	{/glev exch def /Ar exch def
	/cx Ar 0 get Ar 2 get 2 div add def 
	/cy Ar 1 get Ar 3 get 2 div add def 
	/hom Ar 3 get Ar 2 get div def 
	/Cmsave1 matrix def Cmsave1 currentmatrix pop
	%-- on change de transformation pour faire homothetie en (x,y) 
	cx cy [1 0 0 hom 0 0 ] transform
	/t1 exch neg cy add def 
	/t2 exch neg cx add def 
	[1 0 0 hom t2 t1 ] concat 
	newpath
	cx cy Ar 2 get 2 div Ar 5 get Ar 4 get add 64 div neg Ar 4 get 64 div neg arc
	closepath glev Setgray stroke
	Cmsave1 setmatrix } def 

%------------------------------------------------------
% centred hard mark 
%------------------------------------------------------

% x y str ShowCString 
% on fait un show mais string est centre autour du point (x,y) 

/ShowCString { /str exch def /y exch def /x exch def 
 newpath 
 x y moveto 
 str true charpath flattenpath pathbbox 
 /y2 exch def /x2 exch def /y1 exch def /x1 exch def 
 x 2 mul x2 x1 add 2 div sub 
 y 2 mul y2 y1 add 2 div sub moveto str show 
 } def 

/drawpolymark {/glev exch def /Ar exch def 
	Ar 0 get Ar 1 get HardMark ShowCString 
	2 2 Ar length 1 sub 
	{/i exch def
	Ar i get Ar i 1 add get HardMark ShowCString
	}for
} def 

%---------------------------------------------------
% chaines de caracteres 
%---------------------------------------------------
/FBox {/Ar exch def /rot exch def /str exch def /y exch def /x exch def 
 newpath Ar 0 get Ar 1 get moveto 
	/sina rot sin def /cosa rot cos def 
	/-sina sina neg def 
	[cosa -sina sina cosa 0 0 ] CtmModif
 Ar 2 get 0 rlineto 0 Ar 3 get neg rlineto Ar 2 get neg 0 rlineto 
 0 Ar 3 get  rlineto  stroke CtmRestore 
 x y str rot ShowRotate 
 } def 

% x y str ang Showrotate 
% inverse du sens trigo 

/ShowRotate { /ang exch def /str exch def 
	/y exch def /x exch def 
	x y moveto 
	/sina ang sin def /cosa ang cos def 
	/-sina 0 sina sub def 
	[cosa -sina sina cosa 0 0 ] CtmModif
	str show 
	CtmRestore 
} def 

/HardMark (0) def 

%(Chaine de caracteres) x y flag angle [arfbox] Show

/Show { /Ar exch def 
	/rot exch def /flag exch def /y exch def /x exch def /str exch def 
	flag 1 eq 
	{x y str rot Ar FBox}
	{x y str rot ShowRotate } ifelse} def 

/L {/y2 exch def /x2 exch def /y1 exch def /x1 exch def 
    newpath x1 y1 moveto x2 y2 lineto stroke } def 

%---------------------------------------------------------
% drawing an axis 
% angle [nsep1,nsep2] ,[siz1,siz2,coeff] [x0,y0] drawaxis",
%---------------------------------------------------------

/drawaxis {/XX exch def /Arsize exch def /Arsep exch def /ang exch def 
	/Cmsave1 matrix def Cmsave1 currentmatrix pop
	/sina ang sin def /cosa ang cos def /-sina sina neg def 
	/x XX 0 get def /y XX 1 get def
	%-- on change de transformation pour tourner autour de (x,y) 
	x y [cosa sina -sina cosa 0 0 ] transform
	/t1 exch neg y add def 
	/t2 exch neg x add def 
	[cosa sina -sina cosa t2 t1 ] concat 
	newpath x y moveto 0 Arsize 1 get Arsize 2 get mul rlineto
	stroke 
	0 1 Arsep 1 get 1 sub
	{
	 % i don't want the value of the for indice 
	 pop
	newpath 
	x y moveto 
	0 1 Arsep 0 get 1 sub
		{
		 % i don't want the value of the for indice 
		 pop
		 Arsize 0 get 0  rlineto
		 0 Arsize 1 get rlineto 
	 	0 Arsize 1 get  neg rlineto }
		for 
	currentpoint /y exch def /x exch def 
	stroke 
	newpath x y moveto 0 Arsize 1 get Arsize 2 get mul rlineto
	stroke }
	for 
	Cmsave1 setmatrix } def 

%---------------------------------------------------------
% change and restore CTM
%---------------------------------------------------------

/CtmModif {
	/arg exch def 
	/Cmsave matrix def 
	Cmsave currentmatrix pop
	[1 0 0 -1 0 0 ] concat 
	arg concat 
} def 

/CtmRestore { Cmsave setmatrix } def 

/Thickness { /th exch def th 0 le {/th 0.1 def} if th setlinewidth} def 

/WhiteLev 15 def

/Setgray { WhiteLev div setgray} def 

/fillsolid { 0 setgray } def 

%--------------------------------------
% clip zones ( rectangle ) 
%-------------------------------------

/setclipzone {initclip 
	/h exch def /w exch def /y exch def /x exch def 
	newpath x y moveto w 0 rlineto 0 h rlineto w neg 0 rlineto 
	0 h neg rlineto closepath clip} def 

%------------------
% to change the position of a picture 
%------------------
/cm{28.346457 mul}def

/DesPosi { /YH exch def /XW exch def /YP exch def /XP exch def 
	XP cm YP cm neg translate 
	XW cm 6000 div YH cm 4240 div  scale } def 

0 setlinecap 
2 setlinejoin 
1 setlinewidth

%-- Color database 
/ColorR [0.000000 0.000000 0.000000 0.529412 0.498039 0.133333 0.000000 0.878431 0.000000 1.000000 1.000000 1.000000 0.933333 1.000000 1.000000 0.960784 1.000000 ] def
/ColorG [0.000000 0.000000 0.000000 0.807843 1.000000 0.545098 1.000000 1.000000 1.000000 0.647059 0.000000 0.000000 0.509804 1.000000 0.843137 0.960784 1.000000 ] def
/ColorB [0.000000 0.501961 1.000000 0.921569 0.831373 0.133333 0.000000 1.000000 1.000000 0.000000 0.000000 1.000000 0.933333 0.000000 0.000000 0.862745 1.000000 ] def

/Setcolor {/i exch def ColorR i get ColorG i get ColorB i get setrgbcolor } def

% to multiply all the fontsizes by a factor  scf
/scf 1.0 def


% changing fonts encoding 

/Courier findfont
dup length dict begin
  {1 index /FID ne {def} {pop pop} ifelse} forall
  /Encoding ISOLatin1Encoding def
  currentdict
  end
/Courier exch definefont pop

/Times-Roman findfont
dup length dict begin
  {1 index /FID ne {def} {pop pop} ifelse} forall
  /Encoding ISOLatin1Encoding def
  currentdict
  end
/Times-Roman exch definefont pop

/Times-Bold findfont
dup length dict begin
  {1 index /FID ne {def} {pop pop} ifelse} forall
  /Encoding ISOLatin1Encoding def
  currentdict
  end
/Times-Bold exch definefont pop


/Times-BoldItalic findfont
dup length dict begin
  {1 index /FID ne {def} {pop pop} ifelse} forall
  /Encoding ISOLatin1Encoding def
  currentdict
  end
/Times-BoldItalic exch definefont pop


%------ End Main Program ------%
% XP YP XW YW DesPosi in the following code 
% will output the picture in the rectangle defined by 
% upper left point (XP,YP) wide :XW Height: YW
% the coordinates are given in centimeter and 
% are the (0,0) point is the down-left point of the paper 


/ColorR [0.000000 
0.000000 0.000000 0.000000 1.000000 1.000000 1.000000 1.000000 0.000000 0.000000 0.000000 
0.529412 0.000000 0.000000 0.000000 0.000000 0.000000 0.000000 0.564706 0.690196 0.815686 
0.564706 0.690196 0.815686 0.501961 0.627451 0.752941 1.000000 1.000000 1.000000 1.000000 
1.000000 0.0 1.0] def
/ColorG [0.000000 
0.000000 1.000000 1.000000 0.000000 0.000000 0.000000 1.000000 0.000000 0.000000 0.000000 
0.807843 0.564706 0.690196 0.815686 0.564706 0.690196 0.815686 0.000000 0.000000 0.000000 
0.000000 0.000000 0.000000 0.188235 0.250980 0.376471 0.501961 0.627451 0.752941 0.878431 
0.843137 0.0 1.0] def
/ColorB [0.000000 
1.000000 0.000000 1.000000 0.000000 1.000000 0.000000 1.000000 0.564706 0.690196 0.815686 
1.000000 0.000000 0.000000 0.000000 0.564706 0.690196 0.815686 0.000000 0.000000 0.000000 
0.564706 0.690196 0.815686 0.000000 0.000000 0.000000 0.501961 0.627451 0.752941 0.878431 
0.000000 0.0 1.0] def
% Dessin en bas a gauche de taille 3000,2120
[0.5 10 div 0 0 0.5 10 div neg  0 2120 10 div] concat
% Init driver 
5 Thickness
% 3 setalufunction
-1 -1 200000 200000 setclipzone
0 Setcolor
/Times-Roman findfont 100 scf mul scalefont setfont
fillsolid
[] 0 setdash
0 Setcolor
%--use color 1 
fillsolid
[] 0 setdash
0 Setcolor
/WhiteLev 31 def
/Setgray {/i exch def ColorR i get ColorG i get ColorB i get setrgbcolor } def 
/Setcolor {/i exch def ColorR i get ColorG i get ColorB i get setrgbcolor } def 
%--end use color 1 
% End init driver 
/WhiteLev 31 def
0 Setcolor
 (drawbox) 4 [ 0]
[750 530 4500 3180 
] dogrey 
0 Setcolor
(-3.14) 607 3906 0  0.00 [607 3816 287 120] Show
 (drawsegs) 4 [ 0]
[750 3710 750 3773 
] dogrey 
0 Setcolor
 (drawsegs) 4 [ 0]
[975 3710 975 3741 
] dogrey 
0 Setcolor
(-2.51) 1057 3906 0  0.00 [1057 3816 287 120] Show
 (drawsegs) 4 [ 0]
[1200 3710 1200 3773 
] dogrey 
0 Setcolor
 (drawsegs) 4 [ 0]
[1425 3710 1425 3741 
] dogrey 
0 Setcolor
(-1.88) 1507 3906 0  0.00 [1507 3816 287 120] Show
 (drawsegs) 4 [ 0]
[1650 3710 1650 3773 
] dogrey 
0 Setcolor
 (drawsegs) 4 [ 0]
[1875 3710 1875 3741 
] dogrey 
0 Setcolor
(-1.26) 1957 3906 0  0.00 [1957 3816 287 120] Show
 (drawsegs) 4 [ 0]
[2100 3710 2100 3773 
] dogrey 
0 Setcolor
 (drawsegs) 4 [ 0]
[2325 3710 2325 3741 
] dogrey 
0 Setcolor
(-0.63) 2407 3906 0  0.00 [2407 3816 287 120] Show
 (drawsegs) 4 [ 0]
[2550 3710 2550 3773 
] dogrey 
0 Setcolor
 (drawsegs) 4 [ 0]
[2775 3710 2775 3741 
] dogrey 
0 Setcolor
(0.00) 2886 3906 0  0.00 [2886 3816 229 120] Show
 (drawsegs) 4 [ 0]
[3000 3710 3000 3773 
] dogrey 
0 Setcolor
 (drawsegs) 4 [ 0]
[3225 3710 3225 3741 
] dogrey 
0 Setcolor
(0.63) 3336 3906 0  0.00 [3336 3816 229 120] Show
 (drawsegs) 4 [ 0]
[3450 3710 3450 3773 
] dogrey 
0 Setcolor
 (drawsegs) 4 [ 0]
[3675 3710 3675 3741 
] dogrey 
0 Setcolor
(1.26) 3786 3906 0  0.00 [3786 3816 229 120] Show
 (drawsegs) 4 [ 0]
[3900 3710 3900 3773 
] dogrey 
0 Setcolor
 (drawsegs) 4 [ 0]
[4125 3710 4125 3741 
] dogrey 
0 Setcolor
(1.88) 4236 3906 0  0.00 [4236 3816 229 120] Show
 (drawsegs) 4 [ 0]
[4350 3710 4350 3773 
] dogrey 
0 Setcolor
 (drawsegs) 4 [ 0]
[4575 3710 4575 3741 
] dogrey 
0 Setcolor
(2.51) 4686 3906 0  0.00 [4686 3816 229 120] Show
 (drawsegs) 4 [ 0]
[4800 3710 4800 3773 
] dogrey 
0 Setcolor
 (drawsegs) 4 [ 0]
[5025 3710 5025 3741 
] dogrey 
0 Setcolor
(3.14) 5136 3906 0  0.00 [5136 3816 229 120] Show
 (drawsegs) 4 [ 0]
[5250 3710 5250 3773 
] dogrey 
0 Setcolor
(-0.125) 334 3770 0  0.00 [334 3680 344 120] Show
 (drawsegs) 4 [ 0]
[750 3710 690 3710 
] dogrey 
0 Setcolor
 (drawsegs) 4 [ 0]
[750 3551 720 3551 
] dogrey 
0 Setcolor
(0.000) 391 3452 0  0.00 [391 3362 287 120] Show
 (drawsegs) 4 [ 0]
[750 3392 690 3392 
] dogrey 
0 Setcolor
 (drawsegs) 4 [ 0]
[750 3233 720 3233 
] dogrey 
0 Setcolor
(0.125) 391 3134 0  0.00 [391 3044 287 120] Show
 (drawsegs) 4 [ 0]
[750 3074 690 3074 
] dogrey 
0 Setcolor
 (drawsegs) 4 [ 0]
[750 2915 720 2915 
] dogrey 
0 Setcolor
(0.250) 391 2816 0  0.00 [391 2726 287 120] Show
 (drawsegs) 4 [ 0]
[750 2756 690 2756 
] dogrey 
0 Setcolor
 (drawsegs) 4 [ 0]
[750 2597 720 2597 
] dogrey 
0 Setcolor
(0.375) 391 2498 0  0.00 [391 2408 287 120] Show
 (drawsegs) 4 [ 0]
[750 2438 690 2438 
] dogrey 
0 Setcolor
 (drawsegs) 4 [ 0]
[750 2279 720 2279 
] dogrey 
0 Setcolor
(0.500) 391 2180 0  0.00 [391 2090 287 120] Show
 (drawsegs) 4 [ 0]
[750 2120 690 2120 
] dogrey 
0 Setcolor
 (drawsegs) 4 [ 0]
[750 1961 720 1961 
] dogrey 
0 Setcolor
(0.625) 391 1862 0  0.00 [391 1772 287 120] Show
 (drawsegs) 4 [ 0]
[750 1802 690 1802 
] dogrey 
0 Setcolor
 (drawsegs) 4 [ 0]
[750 1643 720 1643 
] dogrey 
0 Setcolor
(0.750) 391 1544 0  0.00 [391 1454 287 120] Show
 (drawsegs) 4 [ 0]
[750 1484 690 1484 
] dogrey 
0 Setcolor
 (drawsegs) 4 [ 0]
[750 1325 720 1325 
] dogrey 
0 Setcolor
(0.875) 391 1226 0  0.00 [391 1136 287 120] Show
 (drawsegs) 4 [ 0]
[750 1166 690 1166 
] dogrey 
0 Setcolor
 (drawsegs) 4 [ 0]
[750 1007 720 1007 
] dogrey 
0 Setcolor
(1.000) 391 908 0  0.00 [391 818 287 120] Show
 (drawsegs) 4 [ 0]
[750 848 690 848 
] dogrey 
0 Setcolor
 (drawsegs) 4 [ 0]
[750 689 720 689 
] dogrey 
0 Setcolor
(1.125) 391 590 0  0.00 [391 500 287 120] Show
 (drawsegs) 4 [ 0]
[750 530 690 530 
] dogrey 
0 Setcolor
0 Setcolor
750 530 4500 3180 setclipzone
0 Setcolor
/closeflag false def
 (drawpoly) 402 [ 0]
[750 848 772 848 795 848 818 848 840 848 863 848 885 848 908 848 930 848 952 848 
975 848 997 848 1020 848 1043 848 1065 848 1088 848 1110 848 1133 848 1155 848 1177 848 
1200 848 1223 848 1245 848 1268 848 1290 848 1313 848 1335 3392 1358 3392 1380 3392 1403 3392 
1425 3392 1448 3392 1470 3392 1493 3392 1515 3392 1538 3392 1560 3392 1583 3392 1605 3392 1628 3392 
1650 3392 1673 3392 1695 3392 1718 3392 1740 3392 1763 3392 1785 3392 1808 3392 1830 3392 1853 3392 
1875 3392 1898 3392 1920 3392 1943 3392 1965 3392 1988 3392 2010 3392 2033 3392 2055 3392 2078 3392 
2100 3392 2123 3392 2145 3392 2168 3392 2190 3392 2213 3392 2235 3392 2258 3392 2280 3392 2303 3392 
2325 3392 2348 3392 2370 3392 2393 3392 2415 3392 2438 3392 2460 3392 2483 3392 2505 3392 2528 3392 
2550 3392 2573 3392 2595 3392 2618 3392 2640 3392 2663 3392 2685 3392 2708 3392 2730 3392 2753 3392 
2775 3392 2798 3392 2820 3392 2843 3392 2865 3392 2888 3392 2910 3392 2933 3392 2955 3392 2978 3392 
3000 3392 3023 3392 3045 3392 3068 3392 3090 3392 3113 3392 3135 3392 3158 3392 3180 3392 3203 3392 
3225 3392 3248 3392 3270 3392 3293 3392 3315 3392 3338 3392 3360 3392 3383 3392 3405 3392 3428 3392 
3450 3392 3473 3392 3495 3392 3518 3392 3540 3392 3563 3392 3585 3392 3608 3392 3630 3392 3653 3392 
3675 3392 3698 3392 3720 3392 3743 3392 3765 3392 3788 3392 3810 3392 3833 3392 3855 3392 3878 3392 
3900 3392 3923 3392 3945 3392 3967 3392 3990 3392 4013 3392 4035 3392 4058 3392 4080 3392 4103 3392 
4125 3392 4148 3392 4170 3392 4193 3392 4215 3392 4238 3392 4260 3392 4283 3392 4305 3392 4328 3392 
4350 3392 4373 3392 4395 3392 4418 3392 4440 3392 4463 3392 4485 3392 4508 3392 4530 3392 4553 3392 
4575 3392 4598 3392 4620 3392 4643 3392 4665 3392 4688 848 4710 848 4733 848 4755 848 4778 848 
4800 848 4823 848 4845 848 4868 848 4890 848 4913 848 4935 848 4958 848 4980 848 5003 848 
5025 848 5048 848 5070 848 5093 848 5115 848 5138 848 5160 848 5183 848 5205 848 5228 848 
5250 848 
] dogrey 
0 Setcolor
/absolu true def
0 Setcolor
-1 -1 200000 200000 setclipzone
 showpage

 end saved restore 

