<?xml version="1.0" encoding="UTF-8" standalone="no"?>
<svg xmlns="http://www.w3.org/2000/svg"
     xmlns:xlink="http://www.w3.org/1999/xlink"
     width="610px" height="460px" viewBox="0 0 610 460">
<title>Graphic window number 100002</title>
<desc>
Creator: GL2PS 1.3.2, (C) 1999-2006 Christophe Geuzaine (geuz@geuz.org)
For: Scilab
CreationDate: Thu Nov 19 10:22:05 2009
</desc>
<defs>
</defs>
<polygon fill="#ffffff" points="0,0 610,0 610,460 0,460"/>
<g>
<polygon fill="#ffffff" points="76.25,402.5 533.75,57.5 76.25,57.5"/>
<polygon fill="#ffffff" points="76.25,402.5 533.75,402.5 533.75,57.5"/>
<polygon fill="#ffffff" points="76.25,402.5 533.75,402.5 533.75,402.5"/>
<polygon fill="#ffffff" points="76.25,402.5 76.25,57.5 76.25,57.5"/>
<polygon fill="#ffffff" points="76.25,402.5 533.75,402.5 76.25,402.5"/>
<polygon fill="#ffffff" points="76.25,402.5 76.25,57.5 76.25,402.5"/>
<text fill="#000000" x="480" y="419" transform="rotate(-0, 480, 419)" font-size="10" font-family="SansSerif" font-style="normal" font-weight="normal">0.8</text>
<text fill="#000000" x="434" y="419" transform="rotate(-0, 434, 419)" font-size="10" font-family="SansSerif" font-style="normal" font-weight="normal">0.6</text>
<text fill="#000000" x="389" y="419" transform="rotate(-0, 389, 419)" font-size="10" font-family="SansSerif" font-style="normal" font-weight="normal">0.4</text>
<text fill="#000000" x="343" y="419" transform="rotate(-0, 343, 419)" font-size="10" font-family="SansSerif" font-style="normal" font-weight="normal">0.2</text>
<text fill="#000000" x="297" y="419" transform="rotate(-0, 297, 419)" font-size="10" font-family="SansSerif" font-style="normal" font-weight="normal">0.0</text>
<text fill="#000000" x="250" y="419" transform="rotate(-0, 250, 419)" font-size="10" font-family="SansSerif" font-style="normal" font-weight="normal">-0.2</text>
<text fill="#000000" x="204" y="419" transform="rotate(-0, 204, 419)" font-size="10" font-family="SansSerif" font-style="normal" font-weight="normal">-0.4</text>
<text fill="#000000" x="158" y="419" transform="rotate(-0, 158, 419)" font-size="10" font-family="SansSerif" font-style="normal" font-weight="normal">-0.6</text>
<text fill="#000000" x="113" y="419" transform="rotate(-0, 113, 419)" font-size="10" font-family="SansSerif" font-style="normal" font-weight="normal">-0.8</text>
<text fill="#000000" x="67" y="419" transform="rotate(-0, 67, 419)" font-size="10" font-family="SansSerif" font-style="normal" font-weight="normal">-1.0</text>
<text fill="#000000" x="52" y="62" transform="rotate(-0, 52, 62)" font-size="10" font-family="SansSerif" font-style="normal" font-weight="normal">0.8</text>
<text fill="#000000" x="52" y="106" transform="rotate(-0, 52, 106)" font-size="10" font-family="SansSerif" font-style="normal" font-weight="normal">0.7</text>
<text fill="#000000" x="52" y="149" transform="rotate(-0, 52, 149)" font-size="10" font-family="SansSerif" font-style="normal" font-weight="normal">0.6</text>
<text fill="#000000" x="52" y="192" transform="rotate(-0, 52, 192)" font-size="10" font-family="SansSerif" font-style="normal" font-weight="normal">0.5</text>
<text fill="#000000" x="52" y="235" transform="rotate(-0, 52, 235)" font-size="10" font-family="SansSerif" font-style="normal" font-weight="normal">0.4</text>
<text fill="#000000" x="52" y="278" transform="rotate(-0, 52, 278)" font-size="10" font-family="SansSerif" font-style="normal" font-weight="normal">0.3</text>
<text fill="#000000" x="52" y="321" transform="rotate(-0, 52, 321)" font-size="10" font-family="SansSerif" font-style="normal" font-weight="normal">0.2</text>
<text fill="#000000" x="53" y="364" transform="rotate(-0, 53, 364)" font-size="10" font-family="SansSerif" font-style="normal" font-weight="normal">0.1</text>
<text fill="#000000" x="52" y="407" transform="rotate(-0, 52, 407)" font-size="10" font-family="SansSerif" font-style="normal" font-weight="normal">0.0</text>
<text fill="#000000" x="526" y="419" transform="rotate(-0, 526, 419)" font-size="10" font-family="SansSerif" font-style="normal" font-weight="normal">1.0</text>
<polyline fill="none" stroke="#000000" stroke-width="1" points="510.875,402.5 510.875,405.605"/>
<polyline fill="none" stroke="#000000" stroke-width="1" points="419.375,402.5 419.375,405.605"/>
<polyline fill="none" stroke="#000000" stroke-width="1" points="373.625,402.5 373.625,405.605"/>
<polyline fill="none" stroke="#000000" stroke-width="1" points="327.875,402.5 327.875,405.605"/>
<polyline fill="none" stroke="#000000" stroke-width="1" points="282.125,402.5 282.125,405.605"/>
<polyline fill="none" stroke="#000000" stroke-width="1" points="236.375,402.5 236.375,405.605"/>
<polyline fill="none" stroke="#000000" stroke-width="1" points="190.625,402.5 190.625,405.605"/>
<polyline fill="none" stroke="#000000" stroke-width="1" points="144.875,402.5 144.875,405.605"/>
<polyline fill="none" stroke="#000000" stroke-width="1" points="99.125,402.5 99.125,405.605"/>
<polyline fill="none" stroke="#000000" stroke-width="1" points="533.75,402.5 533.75,407.675"/>
<polyline fill="none" stroke="#000000" stroke-width="1" points="488,402.5 488,407.675"/>
<polyline fill="none" stroke="#000000" stroke-width="1" points="442.25,402.5 442.25,407.675"/>
<polyline fill="none" stroke="#000000" stroke-width="1" points="396.5,402.5 396.5,407.675"/>
<polyline fill="none" stroke="#000000" stroke-width="1" points="350.75,402.5 350.75,407.675"/>
<polyline fill="none" stroke="#000000" stroke-width="1" points="305,402.5 305,407.675"/>
<polyline fill="none" stroke="#000000" stroke-width="1" points="259.25,402.5 259.25,407.675"/>
<polyline fill="none" stroke="#000000" stroke-width="1" points="213.5,402.5 213.5,407.675"/>
<polyline fill="none" stroke="#000000" stroke-width="1" points="167.75,402.5 167.75,407.675"/>
<polyline fill="none" stroke="#000000" stroke-width="1" points="122,402.5 122,407.675"/>
<polyline fill="none" stroke="#000000" stroke-width="1" points="76.25,402.5 76.25,407.675"/>
<polyline fill="none" stroke="#000000" stroke-width="1" points="76.25,402.5 533.75,402.5"/>
<polyline fill="none" stroke="#000000" stroke-width="1" points="76.25,79.0625 72.1372,79.0625"/>
<polyline fill="none" stroke="#000000" stroke-width="1" points="76.25,122.188 72.1372,122.188"/>
<polyline fill="none" stroke="#000000" stroke-width="1" points="76.25,165.313 72.1372,165.313"/>
<polyline fill="none" stroke="#000000" stroke-width="1" points="76.25,208.438 72.1372,208.438"/>
<polyline fill="none" stroke="#000000" stroke-width="1" points="76.25,251.563 72.1372,251.563"/>
<polyline fill="none" stroke="#000000" stroke-width="1" points="76.25,294.688 72.1372,294.688"/>
<polyline fill="none" stroke="#000000" stroke-width="1" points="76.25,337.813 72.1372,337.813"/>
<polyline fill="none" stroke="#000000" stroke-width="1" points="76.25,380.938 72.1372,380.938"/>
<polyline fill="none" stroke="#000000" stroke-width="1" points="76.25,57.5 69.395,57.5"/>
<polyline fill="none" stroke="#000000" stroke-width="1" points="76.25,100.625 69.395,100.625"/>
<polyline fill="none" stroke="#000000" stroke-width="1" points="76.25,143.75 69.395,143.75"/>
<polyline fill="none" stroke="#000000" stroke-width="1" points="76.25,186.875 69.395,186.875"/>
<polyline fill="none" stroke="#000000" stroke-width="1" points="76.25,230 69.395,230"/>
<polyline fill="none" stroke="#000000" stroke-width="1" points="76.25,273.125 69.395,273.125"/>
<polyline fill="none" stroke="#000000" stroke-width="1" points="76.25,316.25 69.395,316.25"/>
<polyline fill="none" stroke="#000000" stroke-width="1" points="76.25,359.375 69.395,359.375"/>
<polyline fill="none" stroke="#000000" stroke-width="1" points="76.25,402.5 69.395,402.5"/>
<polyline fill="none" stroke="#000000" stroke-width="1" points="76.25,402.5 76.25,57.5"/>
<polyline fill="none" stroke="#000000" stroke-width="1" points="465.125,402.5 465.125,405.605"/>
<polyline fill="none" stroke="#000000" stroke-width="1" points="259.136,402.5 259.136,163.907 268.231,163.907 268.231,402.5 268.231,218.133 277.328,218.133 277.328,402.5 277.328,283.204 286.424,283.204 286.424,402.5 286.424,207.288 295.52,207.288 295.52,402.5 295.52,163.907 304.616,163.907 304.616,402.5 304.616,228.978 313.712,228.978 313.712,402.5 313.712,120.527 322.808,120.527 322.808,402.5 322.808,185.598 331.904,185.598 331.904,402.5 331.904,142.217 341,142.217 341,402.5 341,185.598 350.097,185.598 350.097,402.5 350.097,207.288 359.193,207.288 359.193,402.5 359.193,153.062 368.289,153.062 368.289,402.5 368.289,207.288 377.385,207.288 377.385,402.5 377.385,174.752 386.481,174.752 386.481,402.5"/>
<polyline fill="none" stroke="#000000" stroke-width="1" points="131.79,272.358 140.886,272.358"/>
<polyline fill="none" stroke="#000000" stroke-width="1" points="386.481,185.598 395.577,185.598 395.577,402.5 395.577,207.288 404.673,207.288 404.673,402.5 404.673,239.823"/>
<polyline fill="none" stroke="#000000" stroke-width="1" points="259.136,185.598 259.136,402.5"/>
<polyline fill="none" stroke="#000000" stroke-width="1" points="413.77,239.823 413.77,402.5 413.77,174.752 422.865,174.752 422.865,402.5 422.865,131.372 431.961,131.372 431.961,402.5 431.961,120.527 441.058,120.527 441.058,402.5 441.058,174.752 450.154,174.752 450.154,402.5 450.154,218.133 459.25,218.133 459.25,402.5 459.25,185.598 468.346,185.598 468.346,402.5 468.346,153.062 477.442,153.062 477.442,402.5 477.442,131.372 486.538,131.372 486.538,402.5 486.538,174.752 495.634,174.752 495.634,402.5 495.634,163.907 504.73,163.907 504.73,402.5 504.73,153.062 513.827,153.062 513.827,402.5 513.827,174.752 522.922,174.752 522.922,402.5 522.922,163.907 532.019,163.907 532.019,402.5"/>
<polyline fill="none" stroke="#000000" stroke-width="1" points="250.04,185.598 259.136,185.598"/>
<polyline fill="none" stroke="#000000" stroke-width="1" points="250.04,402.5 250.04,185.598"/>
<polyline fill="none" stroke="#000000" stroke-width="1" points="250.04,250.668 250.04,402.5"/>
<polyline fill="none" stroke="#000000" stroke-width="1" points="240.943,250.668 250.04,250.668"/>
<polyline fill="none" stroke="#000000" stroke-width="1" points="240.943,402.5 240.943,250.668"/>
<polyline fill="none" stroke="#000000" stroke-width="1" points="240.943,228.978 240.943,402.5"/>
<polyline fill="none" stroke="#000000" stroke-width="1" points="231.847,228.978 240.943,228.978"/>
<polyline fill="none" stroke="#000000" stroke-width="1" points="231.847,402.5 231.847,228.978"/>
<polyline fill="none" stroke="#000000" stroke-width="1" points="231.847,120.527 231.847,402.5"/>
<polyline fill="none" stroke="#000000" stroke-width="1" points="222.751,120.527 231.847,120.527"/>
<polyline fill="none" stroke="#000000" stroke-width="1" points="222.751,402.5 222.751,120.527"/>
<polyline fill="none" stroke="#000000" stroke-width="1" points="222.751,218.133 222.751,402.5"/>
<polyline fill="none" stroke="#000000" stroke-width="1" points="213.655,218.133 222.751,218.133"/>
<polyline fill="none" stroke="#000000" stroke-width="1" points="213.655,402.5 213.655,218.133"/>
<polyline fill="none" stroke="#000000" stroke-width="1" points="213.655,174.752 213.655,402.5"/>
<polyline fill="none" stroke="#000000" stroke-width="1" points="204.559,174.752 213.655,174.752"/>
<polyline fill="none" stroke="#000000" stroke-width="1" points="204.559,402.5 204.559,174.752"/>
<polyline fill="none" stroke="#000000" stroke-width="1" points="204.559,250.668 204.559,402.5"/>
<polyline fill="none" stroke="#000000" stroke-width="1" points="131.79,402.5 131.79,272.358"/>
<polyline fill="none" stroke="#000000" stroke-width="1" points="131.79,218.133 131.79,402.5"/>
<polyline fill="none" stroke="#000000" stroke-width="1" points="122.694,218.133 131.79,218.133"/>
<polyline fill="none" stroke="#000000" stroke-width="1" points="122.694,402.5 122.694,218.133"/>
<polyline fill="none" stroke="#000000" stroke-width="1" points="122.694,153.062 122.694,402.5"/>
<polyline fill="none" stroke="#000000" stroke-width="1" points="113.598,153.062 122.694,153.062"/>
<polyline fill="none" stroke="#000000" stroke-width="1" points="113.598,402.5 113.598,153.062"/>
<polyline fill="none" stroke="#000000" stroke-width="1" points="113.598,163.907 113.598,402.5"/>
<polyline fill="none" stroke="#000000" stroke-width="1" points="104.502,163.907 113.598,163.907"/>
<polyline fill="none" stroke="#000000" stroke-width="1" points="195.463,250.668 204.559,250.668"/>
<polyline fill="none" stroke="#000000" stroke-width="1" points="195.463,402.5 195.463,250.668"/>
<polyline fill="none" stroke="#000000" stroke-width="1" points="195.463,163.907 195.463,402.5"/>
<polyline fill="none" stroke="#000000" stroke-width="1" points="186.367,163.907 195.463,163.907"/>
<polyline fill="none" stroke="#000000" stroke-width="1" points="186.367,402.5 186.367,163.907 186.367,402.5"/>
<polyline fill="none" stroke="#000000" stroke-width="1" points="177.271,163.907 186.367,163.907"/>
<polyline fill="none" stroke="#000000" stroke-width="1" points="177.271,402.5 177.271,163.907"/>
<polyline fill="none" stroke="#000000" stroke-width="1" points="177.271,153.062 177.271,402.5"/>
<polyline fill="none" stroke="#000000" stroke-width="1" points="168.174,153.062 177.271,153.062"/>
<polyline fill="none" stroke="#000000" stroke-width="1" points="168.174,402.5 168.174,153.062"/>
<polyline fill="none" stroke="#000000" stroke-width="1" points="168.174,185.598 168.174,402.5"/>
<polyline fill="none" stroke="#000000" stroke-width="1" points="159.078,185.598 168.174,185.598"/>
<polyline fill="none" stroke="#000000" stroke-width="1" points="159.078,402.5 159.078,185.598"/>
<polyline fill="none" stroke="#000000" stroke-width="1" points="159.078,87.9912 159.078,402.5"/>
<polyline fill="none" stroke="#000000" stroke-width="1" points="149.982,87.9912 159.078,87.9912"/>
<polyline fill="none" stroke="#000000" stroke-width="1" points="149.982,402.5 149.982,87.9912"/>
<polyline fill="none" stroke="#000000" stroke-width="1" points="149.982,207.288 149.982,402.5"/>
<polyline fill="none" stroke="#000000" stroke-width="1" points="140.886,207.288 149.982,207.288"/>
<polyline fill="none" stroke="#000000" stroke-width="1" points="140.886,402.5 140.886,207.288"/>
<polyline fill="none" stroke="#000000" stroke-width="1" points="404.673,239.823 413.77,239.823"/>
<polyline fill="none" stroke="#000000" stroke-width="1" points="140.886,272.358 140.886,402.5"/>
<polyline fill="none" stroke="#000000" stroke-width="1" points="104.502,402.5 104.502,163.907"/>
<polyline fill="none" stroke="#000000" stroke-width="1" points="104.502,239.823 104.502,402.5"/>
<polyline fill="none" stroke="#000000" stroke-width="1" points="95.4058,239.823 104.502,239.823"/>
<polyline fill="none" stroke="#000000" stroke-width="1" points="95.4058,402.5 95.4058,239.823"/>
<polyline fill="none" stroke="#000000" stroke-width="1" points="95.4058,218.133 95.4058,402.5"/>
<polyline fill="none" stroke="#000000" stroke-width="1" points="86.3096,218.133 95.4058,218.133"/>
<polyline fill="none" stroke="#000000" stroke-width="1" points="86.3096,402.5 86.3096,218.133"/>
<polyline fill="none" stroke="#000000" stroke-width="1" points="86.3096,239.823 86.3096,402.5"/>
<polyline fill="none" stroke="#000000" stroke-width="1" points="77.2134,239.823 86.3096,239.823"/>
<polyline fill="none" stroke="#000000" stroke-width="1" points="77.2134,402.5 77.2134,239.823"/>
<polyline fill="none" stroke="#000000" stroke-width="1" points="386.481,402.5 386.481,185.598"/>
<text fill="#000000" x="232" y="48" transform="rotate(0, 232, 48)" font-size="10" font-family="SansSerif" font-style="normal" font-weight="normal">Variable #1 : Uniforme,-1.0,1.0</text>
</g>
</svg>
