// Copyright (C) 2008-2009 - INRIA - Michael Baudin
//
// This file must be used under the terms of the GNU Lesser General Public License license :
// http://www.gnu.org/copyleft/lesser.html
// Test the initialization of the seed.
nisp_initseed ( 0 );
