// Copyright (C) 2012 - Michael Baudin
//
// This file must be used under the terms of the GNU Lesser General Public License license :
// http://www.gnu.org/copyleft/lesser.html
// <-- Non-regression test for bug 863 -->
//
// <-- URL -->
// http://forge.scilab.org/index.php/p/nisp/issues/863/
//
// <-- Short Description -->
// polychaos_sasummary fails.
function y = Ishigami (x)
  a = 7; b = 0.1;
  y(1) = sin(x(1)) + a * sin(x(2))**2 + b * x(3)**4 * sin(x(1));
  y(2) = 2. * y(1);
endfunction
// 4.1 Représentation des paramètres incertains
srvu = setrandvar_new();
for i=1:3
  vu(i) = randvar_new("Uniforme", -%pi, +%pi);
  setrandvar_addrandvar ( srvu, vu(i));
end
setrandvar_getlog(srvu)
***********************************************
Nisp(RandomVariable::GetLog) for RandomVariable
Uniforme : -3.14159 : 3.14159
***********************************************
***********************************************
Nisp(RandomVariable::GetLog) for RandomVariable
Uniforme : -3.14159 : 3.14159
***********************************************
***********************************************
Nisp(RandomVariable::GetLog) for RandomVariable
Uniforme : -3.14159 : 3.14159
***********************************************
 ans  =
 
    0.  
nx = setrandvar_getdimension ( srvu ); 
// Représentation des variables stochastiques
srvx = setrandvar_new(nx);
setrandvar_getlog(srvx)
***********************************************
Nisp(RandomVariable::GetLog) for RandomVariable
Uniforme : 0 : 1
***********************************************
***********************************************
Nisp(RandomVariable::GetLog) for RandomVariable
Uniforme : 0 : 1
***********************************************
***********************************************
Nisp(RandomVariable::GetLog) for RandomVariable
Uniforme : 0 : 1
***********************************************
 ans  =
 
    1.  
ny = 2;
pc = polychaos_new ( srvx , ny );
// 4.3 Plan d'expériences numériques
degre = 6;
planx = setrandvar_buildsample(srvx,"Petras",degre);
np = setrandvar_getsize(srvx);
planu = setrandvar_buildsample( srvu , srvx );
// 4.4 Réalisation du plan d'expériences numériques
np = setrandvar_getsize(srvx);
polychaos_setsizetarget(pc, np);
for k=1:np
  inputdata = planu(k,:);
  outputdata = Ishigami(inputdata);
  polychaos_settarget(pc,k,outputdata');
end
// 4.5 Calcul des coefficients
polychaos_setdegree(pc,degre);
polychaos_computeexp(pc,srvx,"Integration");
polychaos_sasummary(pc);
Mean     = [3.5 7]
Variance = [13.665937 54.663747]
First order sensitivity indices
  Output #1
    Variable X1 = 0.3178770
    Variable X2 = 0.4396106
    Variable X3 = 0.0000013
  Output #2
    Variable X1 = 0.3178770
    Variable X2 = 0.4396106
    Variable X3 = 0.0000013
Total sensitivity indices
  Output #1
    Variable X1 = 0.5577417
    Variable X2 = 0.4451802
    Variable X3 = 0.2398661
  Output #2
    Variable X1 = 0.5577417
    Variable X2 = 0.4451802
    Variable X3 = 0.2398661
Functional ANOVA:
1 0 0  : 0.317877
0 1 0  : 0.439611
1 1 0  : 0.00264642
0 0 1  : 1.27214e-006
1 0 1  : 0.236942
0 1 1  : 0.00264642
1 1 1  : 0.000276832
polychaos_destroy(pc);
for i=1:3
  randvar_destroy(vu(i));
end
setrandvar_destroy(srvu);
setrandvar_destroy(srvx);
