# Type         : Petras
# Simulations  : 97
# Variables    : 2
# DegreMax     : 8
# PDF          : Uniforme 0 1
# PDF          : Uniforme 0 1

  5.00000000e-01  5.00000000e-01 -4.93490305e-02
  5.00000000e-01  8.87298335e-01 -3.08339275e-02
  5.00000000e-01  1.12701665e-01 -3.08339275e-02
  5.00000000e-01  7.17121875e-01  6.33875358e-04
  5.00000000e-01  2.82878125e-01  6.33875358e-04
  5.00000000e-01  9.80245634e-01  8.26290181e-06
  5.00000000e-01  1.97543656e-02  8.26290181e-06
  5.00000000e-01  6.11693343e-01  4.87015241e-02
  5.00000000e-01  3.88306657e-01  4.87015241e-02
  5.00000000e-01  8.10551473e-01  3.81137576e-02
  5.00000000e-01  1.89448527e-01  3.81137576e-02
  5.00000000e-01  9.44229616e-01  2.06504878e-02
  5.00000000e-01  5.57703836e-02  2.06504878e-02
  5.00000000e-01  9.96915982e-01  3.77815992e-03
  5.00000000e-01  3.08401839e-03  3.77815992e-03
  8.87298335e-01  5.00000000e-01 -3.08339275e-02
  1.12701665e-01  5.00000000e-01 -3.08339275e-02
  8.87298335e-01  8.87298335e-01 -1.92209905e-02
  8.87298335e-01  1.12701665e-01 -1.92209905e-02
  1.12701665e-01  8.87298335e-01 -1.92209905e-02
  1.12701665e-01  1.12701665e-01 -1.92209905e-02
  8.87298335e-01  7.17121875e-01 -9.41961124e-04
  8.87298335e-01  2.82878125e-01 -9.41961124e-04
  1.12701665e-01  7.17121875e-01 -9.41961124e-04
  1.12701665e-01  2.82878125e-01 -9.41961124e-04
  8.87298335e-01  9.80245634e-01 -3.43726755e-04
  8.87298335e-01  1.97543656e-02 -3.43726755e-04
  1.12701665e-01  9.80245634e-01 -3.43726755e-04
  1.12701665e-01  1.97543656e-02 -3.43726755e-04
  8.87298335e-01  6.11693343e-01  3.04384526e-02
  8.87298335e-01  3.88306657e-01  3.04384526e-02
  1.12701665e-01  6.11693343e-01  3.04384526e-02
  1.12701665e-01  3.88306657e-01  3.04384526e-02
  8.87298335e-01  8.10551473e-01  2.38210985e-02
  8.87298335e-01  1.89448527e-01  2.38210985e-02
  1.12701665e-01  8.10551473e-01  2.38210985e-02
  1.12701665e-01  1.89448527e-01  2.38210985e-02
  8.87298335e-01  9.44229616e-01  1.29065549e-02
  8.87298335e-01  5.57703836e-02  1.29065549e-02
  1.12701665e-01  9.44229616e-01  1.29065549e-02
  1.12701665e-01  5.57703836e-02  1.29065549e-02
  8.87298335e-01  9.96915982e-01  2.36134995e-03
  8.87298335e-01  3.08401839e-03  2.36134995e-03
  1.12701665e-01  9.96915982e-01  2.36134995e-03
  1.12701665e-01  3.08401839e-03  2.36134995e-03
  7.17121875e-01  5.00000000e-01  6.33875358e-04
  2.82878125e-01  5.00000000e-01  6.33875358e-04
  9.80245634e-01  5.00000000e-01  8.26290181e-06
  1.97543656e-02  5.00000000e-01  8.26290181e-06
  7.17121875e-01  8.87298335e-01 -9.41961124e-04
  7.17121875e-01  1.12701665e-01 -9.41961124e-04
  2.82878125e-01  8.87298335e-01 -9.41961124e-04
  2.82878125e-01  1.12701665e-01 -9.41961124e-04
  9.80245634e-01  8.87298335e-01 -3.43726755e-04
  9.80245634e-01  1.12701665e-01 -3.43726755e-04
  1.97543656e-02  8.87298335e-01 -3.43726755e-04
  1.97543656e-02  1.12701665e-01 -3.43726755e-04
  7.17121875e-01  7.17121875e-01  4.02799711e-02
  7.17121875e-01  2.82878125e-01  4.02799711e-02
  2.82878125e-01  7.17121875e-01  4.02799711e-02
  2.82878125e-01  2.82878125e-01  4.02799711e-02
  7.17121875e-01  9.80245634e-01  1.05021846e-02
  7.17121875e-01  1.97543656e-02  1.05021846e-02
  2.82878125e-01  9.80245634e-01  1.05021846e-02
  2.82878125e-01  1.97543656e-02  1.05021846e-02
  9.80245634e-01  7.17121875e-01  1.05021846e-02
  9.80245634e-01  2.82878125e-01  1.05021846e-02
  1.97543656e-02  7.17121875e-01  1.05021846e-02
  1.97543656e-02  2.82878125e-01  1.05021846e-02
  9.80245634e-01  9.80245634e-01  2.73823141e-03
  9.80245634e-01  1.97543656e-02  2.73823141e-03
  1.97543656e-02  9.80245634e-01  2.73823141e-03
  1.97543656e-02  1.97543656e-02  2.73823141e-03
  6.11693343e-01  5.00000000e-01  4.87015241e-02
  3.88306657e-01  5.00000000e-01  4.87015241e-02
  8.10551473e-01  5.00000000e-01  3.81137576e-02
  1.89448527e-01  5.00000000e-01  3.81137576e-02
  9.44229616e-01  5.00000000e-01  2.06504878e-02
  5.57703836e-02  5.00000000e-01  2.06504878e-02
  9.96915982e-01  5.00000000e-01  3.77815992e-03
  3.08401839e-03  5.00000000e-01  3.77815992e-03
  6.11693343e-01  8.87298335e-01  3.04384526e-02
  6.11693343e-01  1.12701665e-01  3.04384526e-02
  3.88306657e-01  8.87298335e-01  3.04384526e-02
  3.88306657e-01  1.12701665e-01  3.04384526e-02
  8.10551473e-01  8.87298335e-01  2.38210985e-02
  8.10551473e-01  1.12701665e-01  2.38210985e-02
  1.89448527e-01  8.87298335e-01  2.38210985e-02
  1.89448527e-01  1.12701665e-01  2.38210985e-02
  9.44229616e-01  8.87298335e-01  1.29065549e-02
  9.44229616e-01  1.12701665e-01  1.29065549e-02
  5.57703836e-02  8.87298335e-01  1.29065549e-02
  5.57703836e-02  1.12701665e-01  1.29065549e-02
  9.96915982e-01  8.87298335e-01  2.36134995e-03
  9.96915982e-01  1.12701665e-01  2.36134995e-03
  3.08401839e-03  8.87298335e-01  2.36134995e-03
  3.08401839e-03  1.12701665e-01  2.36134995e-03
