// Test for issue 1598
// http://forge.scilab.org/index.php/p/netcdf4/issues/1598/
scinetcdf_path = getSciNetCDFPath();
exec(fullfile(scinetcdf_path, "tests/test_utils.sci"));
filepath = getncfilename();
nccreate(filepath, "var", "Dimensions", list("dim", 5));
ncwrite(filepath, "var",  [1:5]');
