// test high level function ncread() on simple_nc4 file
// read only data of grp1, cannot read grp2 compound data with ncread()
scinetcdf_path = getSciNetCDFPath();
exec(fullfile(scinetcdf_path, "tests/test_utils.sci"));
filepath = fullfile(scinetcdf_path, "tests/nonreg_tests/data/simple_nc4.nc");
grp1_data = ncread(filepath, "grp1/data");
expected_grp1_data = int32(matrix([0:71], 12, 6)');
assert_checkequal(grp1_data, expected_grp1_data);
