%ignore viVPrintf;
%ignore viVSPrintf;
%ignore viVScanf;
%ignore viVSScanf;
%ignore viVQueryf;
%ignore viPrintf;
%ignore viSPrintf;
%ignore viScanf;
%ignore viSScanf;
%ignore viQueryf;
%ignore viPxiReserveTriggers;
%ignore viVxiServantResponse;
