// -------------------------------------------------------------------------
// moc - Matlab/Octave Compatibility toolbox
// Copyright (C) 2010-2014  Holger Nahrstaedt
//
// This program is free software; you can redistribute it and/or modify
// it under the terms of the GNU General Public License as published by
// the Free Software Foundation; either version 3 of the License, or
// (at your option) any later version.
//
// This program is distributed in the hope that it will be useful,
// but WITHOUT ANY WARRANTY; without even the implied warranty of
// MERCHANTABILITY or FITNESS FOR A PARTICULAR PURPOSE.  See the
// GNU General Public License for more details.
//
// You should have received a copy of the GNU General Public License
// along with this program; if not, write to the Free Software
// Foundation, Inc., 59 Temple Place, Suite 330, Boston, MA  02111-1307  USA
//-------------------------------------------------------------------------
//
//  <-- NO CHECK ERROR OUTPUT -->
//
//test
ri = moc_randi (10, 1000, 1);
assert_checkequal (ri, fix (ri));
assert_checkequal (min (ri), 1);
assert_checkequal (max (ri), 10);
assert_checkequal (size (ri,1), 1000);
assert_checkequal (size (ri,2), 1);
//assert_checkequal (class (ri), "double");
//test
// ri = randi ([-5, 10], 1000, 1, "int8");
// assert (ri, fix (ri));
// assert (min (ri), int8 (-5));
// assert (max (ri), int8 (10));
// assert (class (ri), "int8");
//
assert_checkequal (size (moc_randi (10, 3,1,2)), [3, 1, 2])
 ans  =
 
  T  
