// =============================================================================
// Scilab ( http://www.scilab.org/ ) - This file is part of Scilab
// Copyright (C) ????-2008 - INRIA - Serge STEER <serge.steer@inria.fr>
// Copyright (C) ????-2008 - INRIA - Claude GOMEZ <claude.gomez@inria.fr>
//
//  This file is distributed under the same license as the Scilab package.
// =============================================================================
// unit tests for line_graph function
// =============================================================================
ta=[1 1 2 4 4 5 6 7 2 3 5 1];
he=[2 6 3 6 7 8 8 8 4 7 3 5];
g=make_graph('foo',0,8,ta,he);
g('node_x')=[281  284  360  185  405  182  118  45];
g('node_y')=[262  179  130  154  368  248  64  309];
show_graph(g);
g1=line_graph(g);
show_graph(g1,'new');
