GRAPH TYPE (0 = UNDIRECTED, 1 = DIRECTED) :
1
NUMBER OF ARCS :
284
NUMBER OF NODES :
100
****************************************
DESCRIPTION OF ARCS :
ARC #, TAIL NODE #, HEAD NODE #
COST, MIN CAP, MAX CAP, LENGTH, Q WEIGHT, Q ORIGIN, WEIGHT

1 69 35
0.000000e+00 0.000000e+00 9.400000e+01 4.000000e+01 0.000000e+00 0.000000e+00 0.000000e+00 0.000000e+00
2 35 91
0.000000e+00 0.000000e+00 8.100000e+01 4.000000e+01 0.000000e+00 0.000000e+00 0.000000e+00 0.000000e+00
3 91 69
1.000000e+01 0.000000e+00 7.600000e+01 5.656854e+01 0.000000e+00 0.000000e+00 0.000000e+00 0.000000e+00
4 40 23
1.000000e+01 0.000000e+00 5.800000e+01 8.944272e+01 0.000000e+00 0.000000e+00 0.000000e+00 0.000000e+00
5 23 35
1.000000e+01 0.000000e+00 1.800000e+01 1.200000e+02 0.000000e+00 0.000000e+00 0.000000e+00 0.000000e+00
6 35 40
6.000000e+00 0.000000e+00 3.600000e+01 1.131371e+02 0.000000e+00 0.000000e+00 0.000000e+00 0.000000e+00
7 50 91
1.000000e+01 0.000000e+00 2.700000e+01 1.442221e+02 0.000000e+00 0.000000e+00 0.000000e+00 0.000000e+00
8 91 18
1.000000e+00 0.000000e+00 8.000000e+00 1.264911e+02 0.000000e+00 0.000000e+00 0.000000e+00 0.000000e+00
9 18 50
0.000000e+00 0.000000e+00 6.800000e+01 8.944272e+01 0.000000e+00 0.000000e+00 0.000000e+00 0.000000e+00
10 74 35
3.000000e+00 0.000000e+00 1.300000e+01 1.649242e+02 0.000000e+00 0.000000e+00 0.000000e+00 0.000000e+00
11 69 74
8.000000e+00 0.000000e+00 9.500000e+01 1.600000e+02 0.000000e+00 0.000000e+00 0.000000e+00 0.000000e+00
12 73 96
3.000000e+00 0.000000e+00 8.000000e+01 4.000000e+01 0.000000e+00 0.000000e+00 0.000000e+00 0.000000e+00
13 96 74
1.000000e+01 0.000000e+00 4.100000e+01 8.944272e+01 0.000000e+00 0.000000e+00 0.000000e+00 0.000000e+00
14 74 73
2.000000e+00 0.000000e+00 8.800000e+01 5.656854e+01 0.000000e+00 0.000000e+00 0.000000e+00 0.000000e+00
15 74 40
1.000000e+01 0.000000e+00 2.000000e+01 1.442221e+02 0.000000e+00 0.000000e+00 0.000000e+00 0.000000e+00
16 23 91
8.000000e+00 0.000000e+00 9.400000e+01 1.264911e+02 0.000000e+00 0.000000e+00 0.000000e+00 0.000000e+00
17 47 10
1.000000e+00 0.000000e+00 8.100000e+01 4.000000e+01 0.000000e+00 0.000000e+00 0.000000e+00 0.000000e+00
18 10 23
1.000000e+01 0.000000e+00 5.800000e+01 5.656854e+01 0.000000e+00 0.000000e+00 0.000000e+00 0.000000e+00
19 23 47
8.000000e+00 0.000000e+00 8.100000e+01 4.000000e+01 0.000000e+00 0.000000e+00 0.000000e+00 0.000000e+00
20 100 23
3.000000e+00 0.000000e+00 4.300000e+01 8.000000e+01 0.000000e+00 0.000000e+00 0.000000e+00 0.000000e+00
21 40 100
6.000000e+00 0.000000e+00 8.800000e+01 4.000000e+01 0.000000e+00 0.000000e+00 0.000000e+00 0.000000e+00
22 40 11
1.000000e+01 0.000000e+00 3.700000e+01 1.200000e+02 0.000000e+00 0.000000e+00 0.000000e+00 0.000000e+00
23 11 100
5.000000e+00 0.000000e+00 2.900000e+01 1.264911e+02 0.000000e+00 0.000000e+00 0.000000e+00 0.000000e+00
24 23 18
1.000000e+00 0.000000e+00 7.400000e+01 8.000000e+01 0.000000e+00 0.000000e+00 0.000000e+00 0.000000e+00
25 10 76
1.000000e+01 0.000000e+00 8.400000e+01 4.000000e+01 0.000000e+00 0.000000e+00 0.000000e+00 0.000000e+00
26 76 18
1.000000e+01 0.000000e+00 2.200000e+01 8.944272e+01 0.000000e+00 0.000000e+00 0.000000e+00 0.000000e+00
27 18 10
1.000000e+01 0.000000e+00 9.400000e+01 5.656854e+01 0.000000e+00 0.000000e+00 0.000000e+00 0.000000e+00
28 72 23
5.000000e+00 0.000000e+00 1.800000e+01 5.656854e+01 0.000000e+00 0.000000e+00 0.000000e+00 0.000000e+00
29 100 72
1.000000e+01 0.000000e+00 6.000000e+00 5.656854e+01 0.000000e+00 0.000000e+00 0.000000e+00 0.000000e+00
30 3 47
1.000000e+01 0.000000e+00 1.000000e+00 8.000000e+01 0.000000e+00 0.000000e+00 0.000000e+00 0.000000e+00
31 47 72
4.000000e+00 0.000000e+00 3.300000e+01 4.000000e+01 0.000000e+00 0.000000e+00 0.000000e+00 0.000000e+00
32 72 3
1.000000e+01 0.000000e+00 7.300000e+01 8.944272e+01 0.000000e+00 0.000000e+00 0.000000e+00 0.000000e+00
33 50 38
8.000000e+00 0.000000e+00 8.400000e+01 5.656854e+01 0.000000e+00 0.000000e+00 0.000000e+00 0.000000e+00
34 38 91
5.000000e+00 0.000000e+00 4.200000e+01 1.649242e+02 0.000000e+00 0.000000e+00 0.000000e+00 0.000000e+00
35 83 38
4.000000e+00 0.000000e+00 1.100000e+01 8.944272e+01 0.000000e+00 0.000000e+00 0.000000e+00 0.000000e+00
36 50 83
0.000000e+00 0.000000e+00 6.700000e+01 4.000000e+01 0.000000e+00 0.000000e+00 0.000000e+00 0.000000e+00
37 96 40
1.000000e+01 0.000000e+00 4.600000e+01 1.264911e+02 0.000000e+00 0.000000e+00 0.000000e+00 0.000000e+00
38 12 73
1.000000e+01 0.000000e+00 3.000000e+01 1.600000e+02 0.000000e+00 0.000000e+00 0.000000e+00 0.000000e+00
39 74 12
6.000000e+00 0.000000e+00 2.600000e+01 2.039608e+02 0.000000e+00 0.000000e+00 0.000000e+00 0.000000e+00
40 60 72
4.000000e+00 0.000000e+00 8.000000e+00 5.656854e+01 0.000000e+00 0.000000e+00 0.000000e+00 0.000000e+00
41 72 28
1.000000e+01 0.000000e+00 9.800000e+01 8.000000e+01 0.000000e+00 0.000000e+00 0.000000e+00 0.000000e+00
42 28 60
8.000000e+00 0.000000e+00 4.000000e+01 5.656854e+01 0.000000e+00 0.000000e+00 0.000000e+00 0.000000e+00
43 76 92
1.000000e+00 0.000000e+00 1.100000e+01 8.944272e+01 0.000000e+00 0.000000e+00 0.000000e+00 0.000000e+00
44 92 18
8.000000e+00 0.000000e+00 3.200000e+01 1.264911e+02 0.000000e+00 0.000000e+00 0.000000e+00 0.000000e+00
45 96 11
1.000000e+01 0.000000e+00 2.700000e+01 4.000000e+01 0.000000e+00 0.000000e+00 0.000000e+00 0.000000e+00
46 81 96
7.000000e+00 0.000000e+00 9.200000e+01 8.000000e+01 0.000000e+00 0.000000e+00 0.000000e+00 0.000000e+00
47 73 81
1.000000e+01 0.000000e+00 7.800000e+01 8.944272e+01 0.000000e+00 0.000000e+00 0.000000e+00 0.000000e+00
48 38 69
1.000000e+01 0.000000e+00 7.600000e+01 2.154066e+02 0.000000e+00 0.000000e+00 0.000000e+00 0.000000e+00
49 18 83
1.000000e+01 0.000000e+00 7.500000e+01 8.000000e+01 0.000000e+00 0.000000e+00 0.000000e+00 0.000000e+00
50 30 38
1.000000e+01 0.000000e+00 5.800000e+01 1.649242e+02 0.000000e+00 0.000000e+00 0.000000e+00 0.000000e+00
51 83 30
2.000000e+00 0.000000e+00 1.800000e+01 8.000000e+01 0.000000e+00 0.000000e+00 0.000000e+00 0.000000e+00
52 11 28
8.000000e+00 0.000000e+00 3.000000e+00 1.131371e+02 0.000000e+00 0.000000e+00 0.000000e+00 0.000000e+00
53 28 100
1.000000e+01 0.000000e+00 3.400000e+01 5.656854e+01 0.000000e+00 0.000000e+00 0.000000e+00 0.000000e+00
54 85 45
1.000000e+00 0.000000e+00 2.600000e+01 4.000000e+01 0.000000e+00 0.000000e+00 0.000000e+00 0.000000e+00
55 45 11
0.000000e+00 0.000000e+00 9.200000e+01 5.656854e+01 0.000000e+00 0.000000e+00 0.000000e+00 0.000000e+00
56 11 85
1.000000e+01 0.000000e+00 7.800000e+01 4.000000e+01 0.000000e+00 0.000000e+00 0.000000e+00 0.000000e+00
57 78 28
0.000000e+00 0.000000e+00 7.600000e+01 4.000000e+01 0.000000e+00 0.000000e+00 0.000000e+00 0.000000e+00
58 11 78
3.000000e+00 0.000000e+00 2.400000e+01 8.944272e+01 0.000000e+00 0.000000e+00 0.000000e+00 0.000000e+00
59 47 76
1.000000e+01 0.000000e+00 3.500000e+01 5.656854e+01 0.000000e+00 0.000000e+00 0.000000e+00 0.000000e+00
60 3 6
8.000000e+00 0.000000e+00 7.200000e+01 4.000000e+01 0.000000e+00 0.000000e+00 0.000000e+00 0.000000e+00
61 6 76
3.000000e+00 0.000000e+00 4.400000e+01 4.000000e+01 0.000000e+00 0.000000e+00 0.000000e+00 0.000000e+00
62 76 3
1.000000e+01 0.000000e+00 8.900000e+01 5.656854e+01 0.000000e+00 0.000000e+00 0.000000e+00 0.000000e+00
63 60 3
6.000000e+00 0.000000e+00 2.000000e+01 8.944272e+01 0.000000e+00 0.000000e+00 0.000000e+00 0.000000e+00
64 67 60
5.000000e+00 0.000000e+00 6.400000e+01 5.656854e+01 0.000000e+00 0.000000e+00 0.000000e+00 0.000000e+00
65 60 80
1.000000e+01 0.000000e+00 4.500000e+01 4.000000e+01 0.000000e+00 0.000000e+00 0.000000e+00 0.000000e+00
66 80 67
4.000000e+00 0.000000e+00 1.000000e+01 4.000000e+01 0.000000e+00 0.000000e+00 0.000000e+00 0.000000e+00
67 78 80
1.000000e+01 0.000000e+00 6.700000e+01 5.656854e+01 0.000000e+00 0.000000e+00 0.000000e+00 0.000000e+00
68 80 28
0.000000e+00 0.000000e+00 8.600000e+01 4.000000e+01 0.000000e+00 0.000000e+00 0.000000e+00 0.000000e+00
69 45 78
1.000000e+01 0.000000e+00 4.200000e+01 8.944272e+01 0.000000e+00 0.000000e+00 0.000000e+00 0.000000e+00
70 96 85
0.000000e+00 0.000000e+00 2.800000e+01 5.656854e+01 0.000000e+00 0.000000e+00 0.000000e+00 0.000000e+00
71 81 64
1.000000e+01 0.000000e+00 2.600000e+01 8.944272e+01 0.000000e+00 0.000000e+00 0.000000e+00 0.000000e+00
72 64 85
1.000000e+01 0.000000e+00 2.500000e+01 8.944272e+01 0.000000e+00 0.000000e+00 0.000000e+00 0.000000e+00
73 85 81
2.000000e+00 0.000000e+00 9.100000e+01 5.656854e+01 0.000000e+00 0.000000e+00 0.000000e+00 0.000000e+00
74 77 67
6.000000e+00 0.000000e+00 3.800000e+01 5.656854e+01 0.000000e+00 0.000000e+00 0.000000e+00 0.000000e+00
75 80 77
1.000000e+01 0.000000e+00 7.100000e+01 4.000000e+01 0.000000e+00 0.000000e+00 0.000000e+00 0.000000e+00
76 48 6
1.000000e+01 0.000000e+00 5.500000e+01 5.656854e+01 0.000000e+00 0.000000e+00 0.000000e+00 0.000000e+00
77 3 48
7.000000e+00 0.000000e+00 5.100000e+01 4.000000e+01 0.000000e+00 0.000000e+00 0.000000e+00 0.000000e+00
78 6 92
1.000000e+01 0.000000e+00 8.300000e+01 8.000000e+01 0.000000e+00 0.000000e+00 0.000000e+00 0.000000e+00
79 48 53
1.000000e+01 0.000000e+00 4.300000e+01 5.656854e+01 0.000000e+00 0.000000e+00 0.000000e+00 0.000000e+00
80 53 6
1.000000e+01 0.000000e+00 2.800000e+01 8.000000e+01 0.000000e+00 0.000000e+00 0.000000e+00 0.000000e+00
81 45 77
1.000000e+01 0.000000e+00 7.300000e+01 1.131371e+02 0.000000e+00 0.000000e+00 0.000000e+00 0.000000e+00
82 77 78
1.000000e+01 0.000000e+00 5.400000e+01 4.000000e+01 0.000000e+00 0.000000e+00 0.000000e+00 0.000000e+00
83 64 16
1.000000e+01 0.000000e+00 4.800000e+01 8.944272e+01 0.000000e+00 0.000000e+00 0.000000e+00 0.000000e+00
84 16 45
7.000000e+00 0.000000e+00 7.000000e+01 8.944272e+01 0.000000e+00 0.000000e+00 0.000000e+00 0.000000e+00
85 45 64
3.000000e+00 0.000000e+00 8.500000e+01 8.000000e+01 0.000000e+00 0.000000e+00 0.000000e+00 0.000000e+00
86 16 77
1.000000e+01 0.000000e+00 5.700000e+01 1.200000e+02 0.000000e+00 0.000000e+00 0.000000e+00 0.000000e+00
87 18 30
1.000000e+00 0.000000e+00 8.100000e+01 1.131371e+02 0.000000e+00 0.000000e+00 0.000000e+00 0.000000e+00
88 29 38
1.000000e+01 0.000000e+00 2.200000e+01 2.433105e+02 0.000000e+00 0.000000e+00 0.000000e+00 0.000000e+00
89 30 29
1.000000e+01 0.000000e+00 5.000000e+00 8.000000e+01 0.000000e+00 0.000000e+00 0.000000e+00 0.000000e+00
90 12 33
6.000000e+00 0.000000e+00 1.000000e+00 8.000000e+01 0.000000e+00 0.000000e+00 0.000000e+00 0.000000e+00
91 33 81
1.000000e+01 0.000000e+00 3.300000e+01 8.944272e+01 0.000000e+00 0.000000e+00 0.000000e+00 0.000000e+00
92 81 12
1.000000e+01 0.000000e+00 2.600000e+01 8.944272e+01 0.000000e+00 0.000000e+00 0.000000e+00 0.000000e+00
93 67 48
4.000000e+00 0.000000e+00 9.200000e+01 1.264911e+02 0.000000e+00 0.000000e+00 0.000000e+00 0.000000e+00
94 48 60
0.000000e+00 0.000000e+00 7.800000e+01 1.131371e+02 0.000000e+00 0.000000e+00 0.000000e+00 0.000000e+00
95 26 75
6.000000e+00 0.000000e+00 5.900000e+01 5.656854e+01 0.000000e+00 0.000000e+00 0.000000e+00 0.000000e+00
96 75 67
1.000000e+01 0.000000e+00 4.800000e+01 8.944272e+01 0.000000e+00 0.000000e+00 0.000000e+00 0.000000e+00
97 67 26
4.000000e+00 0.000000e+00 6.900000e+01 4.000000e+01 0.000000e+00 0.000000e+00 0.000000e+00 0.000000e+00
98 92 30
0.000000e+00 0.000000e+00 8.500000e+01 5.656854e+01 0.000000e+00 0.000000e+00 0.000000e+00 0.000000e+00
99 19 29
1.000000e+01 0.000000e+00 7.700000e+01 4.000000e+01 0.000000e+00 0.000000e+00 0.000000e+00 0.000000e+00
100 29 92
6.000000e+00 0.000000e+00 4.100000e+01 5.656854e+01 0.000000e+00 0.000000e+00 0.000000e+00 0.000000e+00
101 92 19
1.000000e+01 0.000000e+00 7.100000e+01 4.000000e+01 0.000000e+00 0.000000e+00 0.000000e+00 0.000000e+00
102 68 53
1.000000e+01 0.000000e+00 1.400000e+01 4.000000e+01 0.000000e+00 0.000000e+00 0.000000e+00 0.000000e+00
103 48 68
4.000000e+00 0.000000e+00 9.500000e+01 4.000000e+01 0.000000e+00 0.000000e+00 0.000000e+00 0.000000e+00
104 77 26
1.000000e+01 0.000000e+00 3.900000e+01 4.000000e+01 0.000000e+00 0.000000e+00 0.000000e+00 0.000000e+00
105 77 79
1.000000e+01 0.000000e+00 8.800000e+01 8.944272e+01 0.000000e+00 0.000000e+00 0.000000e+00 0.000000e+00
106 79 26
1.000000e+00 0.000000e+00 6.200000e+01 8.000000e+01 0.000000e+00 0.000000e+00 0.000000e+00 0.000000e+00
107 6 19
5.000000e+00 0.000000e+00 5.200000e+01 8.944272e+01 0.000000e+00 0.000000e+00 0.000000e+00 0.000000e+00
108 53 19
1.000000e+01 0.000000e+00 8.300000e+01 8.944272e+01 0.000000e+00 0.000000e+00 0.000000e+00 0.000000e+00
109 33 59
1.000000e+01 0.000000e+00 5.600000e+01 1.649242e+02 0.000000e+00 0.000000e+00 0.000000e+00 0.000000e+00
110 59 64
1.000000e+01 0.000000e+00 4.800000e+01 1.200000e+02 0.000000e+00 0.000000e+00 0.000000e+00 0.000000e+00
111 64 33
1.000000e+00 0.000000e+00 9.000000e+00 5.656854e+01 0.000000e+00 0.000000e+00 0.000000e+00 0.000000e+00
112 63 20
3.000000e+00 0.000000e+00 9.600000e+01 1.649242e+02 0.000000e+00 0.000000e+00 0.000000e+00 0.000000e+00
113 20 29
0.000000e+00 0.000000e+00 8.000000e+01 3.622154e+02 0.000000e+00 0.000000e+00 0.000000e+00 0.000000e+00
114 29 63
0.000000e+00 0.000000e+00 7.600000e+01 2.000000e+02 0.000000e+00 0.000000e+00 0.000000e+00 0.000000e+00
115 32 48
6.000000e+00 0.000000e+00 2.400000e+01 5.656854e+01 0.000000e+00 0.000000e+00 0.000000e+00 0.000000e+00
116 67 32
4.000000e+00 0.000000e+00 5.000000e+00 1.131371e+02 0.000000e+00 0.000000e+00 0.000000e+00 0.000000e+00
117 58 65
1.000000e+01 0.000000e+00 3.300000e+01 1.264911e+02 0.000000e+00 0.000000e+00 0.000000e+00 0.000000e+00
118 65 99
1.000000e+01 0.000000e+00 9.300000e+01 1.264911e+02 0.000000e+00 0.000000e+00 0.000000e+00 0.000000e+00
119 99 58
4.000000e+00 0.000000e+00 7.800000e+01 1.788854e+02 0.000000e+00 0.000000e+00 0.000000e+00 0.000000e+00
120 32 68
0.000000e+00 0.000000e+00 2.300000e+01 4.000000e+01 0.000000e+00 0.000000e+00 0.000000e+00 0.000000e+00
121 58 68
1.000000e+01 0.000000e+00 6.500000e+01 8.944272e+01 0.000000e+00 0.000000e+00 0.000000e+00 0.000000e+00
122 32 58
8.000000e+00 0.000000e+00 5.400000e+01 5.656854e+01 0.000000e+00 0.000000e+00 0.000000e+00 0.000000e+00
123 53 25
1.000000e+00 0.000000e+00 8.400000e+01 8.000000e+01 0.000000e+00 0.000000e+00 0.000000e+00 0.000000e+00
124 25 19
1.000000e+01 0.000000e+00 4.300000e+01 4.000000e+01 0.000000e+00 0.000000e+00 0.000000e+00 0.000000e+00
125 99 68
1.000000e+01 0.000000e+00 1.100000e+01 2.000000e+02 0.000000e+00 0.000000e+00 0.000000e+00 0.000000e+00
126 16 79
1.000000e+01 0.000000e+00 9.700000e+01 5.656854e+01 0.000000e+00 0.000000e+00 0.000000e+00 0.000000e+00
127 59 16
1.000000e+01 0.000000e+00 4.000000e+01 5.656854e+01 0.000000e+00 0.000000e+00 0.000000e+00 0.000000e+00
128 79 75
1.000000e+01 0.000000e+00 7.000000e+01 5.656854e+01 0.000000e+00 0.000000e+00 0.000000e+00 0.000000e+00
129 95 34
8.000000e+00 0.000000e+00 8.500000e+01 5.656854e+01 0.000000e+00 0.000000e+00 0.000000e+00 0.000000e+00
130 34 51
3.000000e+00 0.000000e+00 2.200000e+01 5.656854e+01 0.000000e+00 0.000000e+00 0.000000e+00 0.000000e+00
131 51 95
1.000000e+01 0.000000e+00 3.400000e+01 8.000000e+01 0.000000e+00 0.000000e+00 0.000000e+00 0.000000e+00
132 75 58
7.000000e+00 0.000000e+00 2.800000e+01 1.442221e+02 0.000000e+00 0.000000e+00 0.000000e+00 0.000000e+00
133 58 67
1.000000e+01 0.000000e+00 7.400000e+01 1.264911e+02 0.000000e+00 0.000000e+00 0.000000e+00 0.000000e+00
134 59 34
1.000000e+01 0.000000e+00 8.500000e+01 4.000000e+01 0.000000e+00 0.000000e+00 0.000000e+00 0.000000e+00
135 95 59
1.000000e+00 0.000000e+00 5.700000e+01 4.000000e+01 0.000000e+00 0.000000e+00 0.000000e+00 0.000000e+00
136 25 29
1.000000e+01 0.000000e+00 1.800000e+01 5.656854e+01 0.000000e+00 0.000000e+00 0.000000e+00 0.000000e+00
137 94 29
1.000000e+01 0.000000e+00 6.300000e+01 8.944272e+01 0.000000e+00 0.000000e+00 0.000000e+00 0.000000e+00
138 25 94
0.000000e+00 0.000000e+00 8.700000e+01 4.000000e+01 0.000000e+00 0.000000e+00 0.000000e+00 0.000000e+00
139 95 79
1.000000e+01 0.000000e+00 4.200000e+01 4.000000e+01 0.000000e+00 0.000000e+00 0.000000e+00 0.000000e+00
140 16 95
1.000000e+01 0.000000e+00 8.800000e+01 4.000000e+01 0.000000e+00 0.000000e+00 0.000000e+00 0.000000e+00
141 51 79
1.000000e+01 0.000000e+00 3.700000e+01 8.944272e+01 0.000000e+00 0.000000e+00 0.000000e+00 0.000000e+00
142 86 65
1.000000e+01 0.000000e+00 7.000000e+01 8.000000e+01 0.000000e+00 0.000000e+00 0.000000e+00 0.000000e+00
143 58 86
0.000000e+00 0.000000e+00 4.400000e+01 5.656854e+01 0.000000e+00 0.000000e+00 0.000000e+00 0.000000e+00
144 53 94
1.000000e+01 0.000000e+00 1.000000e+01 8.944272e+01 0.000000e+00 0.000000e+00 0.000000e+00 0.000000e+00
145 99 94
1.000000e+01 0.000000e+00 9.700000e+01 2.000000e+02 0.000000e+00 0.000000e+00 0.000000e+00 0.000000e+00
146 53 99
1.000000e+01 0.000000e+00 4.000000e+01 2.039608e+02 0.000000e+00 0.000000e+00 0.000000e+00 0.000000e+00
147 33 34
1.000000e+01 0.000000e+00 7.000000e+01 2.039608e+02 0.000000e+00 0.000000e+00 0.000000e+00 0.000000e+00
148 51 75
1.000000e+01 0.000000e+00 4.400000e+01 8.944272e+01 0.000000e+00 0.000000e+00 0.000000e+00 0.000000e+00
149 44 34
0.000000e+00 0.000000e+00 6.800000e+01 2.039608e+02 0.000000e+00 0.000000e+00 0.000000e+00 0.000000e+00
150 33 44
8.000000e+00 0.000000e+00 5.600000e+01 4.000000e+02 0.000000e+00 0.000000e+00 0.000000e+00 0.000000e+00
151 2 58
7.000000e+00 0.000000e+00 5.100000e+01 8.944272e+01 0.000000e+00 0.000000e+00 0.000000e+00 0.000000e+00
152 75 2
1.000000e+01 0.000000e+00 4.900000e+01 1.264911e+02 0.000000e+00 0.000000e+00 0.000000e+00 0.000000e+00
153 2 65
2.000000e+00 0.000000e+00 3.000000e+01 8.944272e+01 0.000000e+00 0.000000e+00 0.000000e+00 0.000000e+00
154 86 2
1.000000e+01 0.000000e+00 8.000000e+00 4.000000e+01 0.000000e+00 0.000000e+00 0.000000e+00 0.000000e+00
155 51 5
1.000000e+01 0.000000e+00 6.800000e+01 1.131371e+02 0.000000e+00 0.000000e+00 0.000000e+00 0.000000e+00
156 5 75
0.000000e+00 0.000000e+00 4.600000e+01 1.200000e+02 0.000000e+00 0.000000e+00 0.000000e+00 0.000000e+00
157 37 5
5.000000e+00 0.000000e+00 3.000000e+01 1.264911e+02 0.000000e+00 0.000000e+00 0.000000e+00 0.000000e+00
158 51 37
4.000000e+00 0.000000e+00 7.300000e+01 5.656854e+01 0.000000e+00 0.000000e+00 0.000000e+00 0.000000e+00
159 66 65
1.000000e+01 0.000000e+00 1.500000e+01 8.944272e+01 0.000000e+00 0.000000e+00 0.000000e+00 0.000000e+00
160 2 66
1.000000e+01 0.000000e+00 3.600000e+01 5.656854e+01 0.000000e+00 0.000000e+00 0.000000e+00 0.000000e+00
161 5 2
1.000000e+01 0.000000e+00 7.000000e+00 4.000000e+01 0.000000e+00 0.000000e+00 0.000000e+00 0.000000e+00
162 66 5
1.000000e+01 0.000000e+00 2.000000e+00 4.000000e+01 0.000000e+00 0.000000e+00 0.000000e+00 0.000000e+00
163 37 66
1.000000e+00 0.000000e+00 3.200000e+01 1.442221e+02 0.000000e+00 0.000000e+00 0.000000e+00 0.000000e+00
164 34 37
3.000000e+00 0.000000e+00 7.300000e+01 8.000000e+01 0.000000e+00 0.000000e+00 0.000000e+00 0.000000e+00
165 44 37
6.000000e+00 0.000000e+00 1.500000e+01 1.264911e+02 0.000000e+00 0.000000e+00 0.000000e+00 0.000000e+00
166 44 66
1.000000e+01 0.000000e+00 4.000000e+00 1.649242e+02 0.000000e+00 0.000000e+00 0.000000e+00 0.000000e+00
167 43 55
1.000000e+01 0.000000e+00 0.000000e+00 1.264911e+02 0.000000e+00 0.000000e+00 0.000000e+00 0.000000e+00
168 55 65
1.000000e+01 0.000000e+00 9.900000e+01 1.131371e+02 0.000000e+00 0.000000e+00 0.000000e+00 0.000000e+00
169 65 43
1.000000e+01 0.000000e+00 1.900000e+01 5.656854e+01 0.000000e+00 0.000000e+00 0.000000e+00 0.000000e+00
170 94 63
1.000000e+01 0.000000e+00 9.400000e+01 1.264911e+02 0.000000e+00 0.000000e+00 0.000000e+00 0.000000e+00
171 46 20
1.000000e+00 0.000000e+00 1.800000e+01 1.131371e+02 0.000000e+00 0.000000e+00 0.000000e+00 0.000000e+00
172 63 46
1.000000e+01 0.000000e+00 9.300000e+01 8.944272e+01 0.000000e+00 0.000000e+00 0.000000e+00 0.000000e+00
173 99 63
5.000000e+00 0.000000e+00 1.800000e+01 1.649242e+02 0.000000e+00 0.000000e+00 0.000000e+00 0.000000e+00
174 41 46
4.000000e+00 0.000000e+00 3.500000e+01 1.200000e+02 0.000000e+00 0.000000e+00 0.000000e+00 0.000000e+00
175 46 99
1.000000e+01 0.000000e+00 9.200000e+01 1.264911e+02 0.000000e+00 0.000000e+00 0.000000e+00 0.000000e+00
176 99 41
1.000000e+01 0.000000e+00 3.800000e+01 4.000000e+01 0.000000e+00 0.000000e+00 0.000000e+00 0.000000e+00
177 66 43
1.000000e+01 0.000000e+00 1.200000e+01 8.944272e+01 0.000000e+00 0.000000e+00 0.000000e+00 0.000000e+00
178 8 43
1.000000e+01 0.000000e+00 2.000000e+00 5.656854e+01 0.000000e+00 0.000000e+00 0.000000e+00 0.000000e+00
179 43 22
1.000000e+01 0.000000e+00 3.300000e+01 4.000000e+01 0.000000e+00 0.000000e+00 0.000000e+00 0.000000e+00
180 22 8
0.000000e+00 0.000000e+00 6.000000e+00 4.000000e+01 0.000000e+00 0.000000e+00 0.000000e+00 0.000000e+00
181 66 22
6.000000e+00 0.000000e+00 1.000000e+00 8.000000e+01 0.000000e+00 0.000000e+00 0.000000e+00 0.000000e+00
182 44 22
1.000000e+01 0.000000e+00 6.700000e+01 1.649242e+02 0.000000e+00 0.000000e+00 0.000000e+00 0.000000e+00
183 55 99
1.000000e+01 0.000000e+00 4.600000e+01 5.656854e+01 0.000000e+00 0.000000e+00 0.000000e+00 0.000000e+00
184 70 41
4.000000e+00 0.000000e+00 6.900000e+01 5.656854e+01 0.000000e+00 0.000000e+00 0.000000e+00 0.000000e+00
185 41 55
1.000000e+01 0.000000e+00 1.400000e+01 4.000000e+01 0.000000e+00 0.000000e+00 0.000000e+00 0.000000e+00
186 55 70
2.000000e+00 0.000000e+00 9.500000e+01 8.944272e+01 0.000000e+00 0.000000e+00 0.000000e+00 0.000000e+00
187 1 55
0.000000e+00 0.000000e+00 8.000000e+01 1.649242e+02 0.000000e+00 0.000000e+00 0.000000e+00 0.000000e+00
188 43 1
1.000000e+01 0.000000e+00 4.100000e+01 8.944272e+01 0.000000e+00 0.000000e+00 0.000000e+00 0.000000e+00
189 39 49
1.000000e+01 0.000000e+00 1.100000e+01 5.656854e+01 0.000000e+00 0.000000e+00 0.000000e+00 0.000000e+00
190 49 20
6.000000e+00 0.000000e+00 9.700000e+01 4.000000e+01 0.000000e+00 0.000000e+00 0.000000e+00 0.000000e+00
191 20 39
1.000000e+01 0.000000e+00 1.900000e+01 8.944272e+01 0.000000e+00 0.000000e+00 0.000000e+00 0.000000e+00
192 8 1
4.000000e+00 0.000000e+00 6.400000e+01 4.000000e+01 0.000000e+00 0.000000e+00 0.000000e+00 0.000000e+00
193 84 8
4.000000e+00 0.000000e+00 5.400000e+01 8.944272e+01 0.000000e+00 0.000000e+00 0.000000e+00 0.000000e+00
194 22 84
1.000000e+01 0.000000e+00 8.400000e+01 1.131371e+02 0.000000e+00 0.000000e+00 0.000000e+00 0.000000e+00
195 44 84
8.000000e+00 0.000000e+00 4.300000e+01 1.442221e+02 0.000000e+00 0.000000e+00 0.000000e+00 0.000000e+00
196 70 46
1.000000e+00 0.000000e+00 1.100000e+01 8.944272e+01 0.000000e+00 0.000000e+00 0.000000e+00 0.000000e+00
197 62 39
1.000000e+01 0.000000e+00 2.000000e+00 8.944272e+01 0.000000e+00 0.000000e+00 0.000000e+00 0.000000e+00
198 39 70
1.000000e+01 0.000000e+00 6.600000e+01 8.000000e+01 0.000000e+00 0.000000e+00 0.000000e+00 0.000000e+00
199 70 62
0.000000e+00 0.000000e+00 1.300000e+01 4.000000e+01 0.000000e+00 0.000000e+00 0.000000e+00 0.000000e+00
200 39 46
1.000000e+01 0.000000e+00 9.600000e+01 4.000000e+01 0.000000e+00 0.000000e+00 0.000000e+00 0.000000e+00
201 89 39
1.000000e+01 0.000000e+00 6.000000e+01 8.944272e+01 0.000000e+00 0.000000e+00 0.000000e+00 0.000000e+00
202 62 89
8.000000e+00 0.000000e+00 5.200000e+01 1.264911e+02 0.000000e+00 0.000000e+00 0.000000e+00 0.000000e+00
203 1 4
3.000000e+00 0.000000e+00 4.900000e+01 8.944272e+01 0.000000e+00 0.000000e+00 0.000000e+00 0.000000e+00
204 4 55
1.000000e+01 0.000000e+00 8.900000e+01 1.697056e+02 0.000000e+00 0.000000e+00 0.000000e+00 0.000000e+00
205 84 57
1.000000e+01 0.000000e+00 3.800000e+01 1.264911e+02 0.000000e+00 0.000000e+00 0.000000e+00 0.000000e+00
206 57 1
1.000000e+01 0.000000e+00 7.000000e+01 1.264911e+02 0.000000e+00 0.000000e+00 0.000000e+00 0.000000e+00
207 1 84
2.000000e+00 0.000000e+00 1.400000e+01 8.000000e+01 0.000000e+00 0.000000e+00 0.000000e+00 0.000000e+00
208 55 62
1.000000e+01 0.000000e+00 6.200000e+01 1.131371e+02 0.000000e+00 0.000000e+00 0.000000e+00 0.000000e+00
209 4 56
1.000000e+01 0.000000e+00 8.700000e+01 1.442221e+02 0.000000e+00 0.000000e+00 0.000000e+00 0.000000e+00
210 56 62
8.000000e+00 0.000000e+00 4.200000e+01 1.442221e+02 0.000000e+00 0.000000e+00 0.000000e+00 0.000000e+00
211 62 4
7.000000e+00 0.000000e+00 8.800000e+01 2.039608e+02 0.000000e+00 0.000000e+00 0.000000e+00 0.000000e+00
212 89 49
6.000000e+00 0.000000e+00 3.700000e+01 4.000000e+01 0.000000e+00 0.000000e+00 0.000000e+00 0.000000e+00
213 15 84
1.000000e+01 0.000000e+00 2.900000e+01 1.264911e+02 0.000000e+00 0.000000e+00 0.000000e+00 0.000000e+00
214 44 15
1.000000e+01 0.000000e+00 2.500000e+01 2.433105e+02 0.000000e+00 0.000000e+00 0.000000e+00 0.000000e+00
215 20 38
1.000000e+01 0.000000e+00 9.100000e+01 6.000000e+02 0.000000e+00 0.000000e+00 0.000000e+00 0.000000e+00
216 57 87
1.000000e+01 0.000000e+00 7.800000e+01 1.200000e+02 0.000000e+00 0.000000e+00 0.000000e+00 0.000000e+00
217 87 4
5.000000e+00 0.000000e+00 7.500000e+01 1.788854e+02 0.000000e+00 0.000000e+00 0.000000e+00 0.000000e+00
218 4 57
4.000000e+00 0.000000e+00 2.400000e+01 8.944272e+01 0.000000e+00 0.000000e+00 0.000000e+00 0.000000e+00
219 89 20
4.000000e+00 0.000000e+00 3.500000e+01 5.656854e+01 0.000000e+00 0.000000e+00 0.000000e+00 0.000000e+00
220 88 14
0.000000e+00 0.000000e+00 9.200000e+01 4.000000e+01 0.000000e+00 0.000000e+00 0.000000e+00 0.000000e+00
221 14 89
1.000000e+01 0.000000e+00 6.100000e+01 4.000000e+01 0.000000e+00 0.000000e+00 0.000000e+00 0.000000e+00
222 89 88
1.000000e+01 0.000000e+00 5.200000e+01 5.656854e+01 0.000000e+00 0.000000e+00 0.000000e+00 0.000000e+00
223 62 88
1.000000e+01 0.000000e+00 8.300000e+01 1.131371e+02 0.000000e+00 0.000000e+00 0.000000e+00 0.000000e+00
224 9 90
6.000000e+00 0.000000e+00 2.300000e+01 4.000000e+01 0.000000e+00 0.000000e+00 0.000000e+00 0.000000e+00
225 90 42
1.000000e+01 0.000000e+00 3.400000e+01 8.000000e+01 0.000000e+00 0.000000e+00 0.000000e+00 0.000000e+00
226 42 9
1.000000e+01 0.000000e+00 2.800000e+01 8.944272e+01 0.000000e+00 0.000000e+00 0.000000e+00 0.000000e+00
227 14 20
1.000000e+01 0.000000e+00 9.100000e+01 8.944272e+01 0.000000e+00 0.000000e+00 0.000000e+00 0.000000e+00
228 54 20
1.000000e+01 0.000000e+00 6.100000e+01 1.649242e+02 0.000000e+00 0.000000e+00 0.000000e+00 0.000000e+00
229 14 54
1.000000e+01 0.000000e+00 4.700000e+01 8.000000e+01 0.000000e+00 0.000000e+00 0.000000e+00 0.000000e+00
230 15 98
7.000000e+00 0.000000e+00 3.000000e+01 5.656854e+01 0.000000e+00 0.000000e+00 0.000000e+00 0.000000e+00
231 98 57
6.000000e+00 0.000000e+00 2.600000e+01 5.656854e+01 0.000000e+00 0.000000e+00 0.000000e+00 0.000000e+00
232 57 15
2.000000e+00 0.000000e+00 2.500000e+01 8.000000e+01 0.000000e+00 0.000000e+00 0.000000e+00 0.000000e+00
233 9 88
1.000000e+01 0.000000e+00 9.100000e+01 1.264911e+02 0.000000e+00 0.000000e+00 0.000000e+00 0.000000e+00
234 62 9
8.000000e+00 0.000000e+00 3.800000e+01 1.264911e+02 0.000000e+00 0.000000e+00 0.000000e+00 0.000000e+00
235 42 88
1.000000e+01 0.000000e+00 7.100000e+01 8.944272e+01 0.000000e+00 0.000000e+00 0.000000e+00 0.000000e+00
236 56 9
1.000000e+00 0.000000e+00 8.500000e+01 4.000000e+01 0.000000e+00 0.000000e+00 0.000000e+00 0.000000e+00
237 71 56
3.000000e+00 0.000000e+00 7.700000e+01 4.000000e+01 0.000000e+00 0.000000e+00 0.000000e+00 0.000000e+00
238 4 71
1.000000e+01 0.000000e+00 2.400000e+01 1.697056e+02 0.000000e+00 0.000000e+00 0.000000e+00 0.000000e+00
239 21 87
8.000000e+00 0.000000e+00 9.500000e+01 1.264911e+02 0.000000e+00 0.000000e+00 0.000000e+00 0.000000e+00
240 87 98
1.000000e+00 0.000000e+00 3.900000e+01 8.944272e+01 0.000000e+00 0.000000e+00 0.000000e+00 0.000000e+00
241 98 21
0.000000e+00 0.000000e+00 7.000000e+01 8.944272e+01 0.000000e+00 0.000000e+00 0.000000e+00 0.000000e+00
242 56 90
5.000000e+00 0.000000e+00 4.400000e+01 5.656854e+01 0.000000e+00 0.000000e+00 0.000000e+00 0.000000e+00
243 27 90
4.000000e+00 0.000000e+00 8.900000e+01 5.656854e+01 0.000000e+00 0.000000e+00 0.000000e+00 0.000000e+00
244 90 71
0.000000e+00 0.000000e+00 3.700000e+01 4.000000e+01 0.000000e+00 0.000000e+00 0.000000e+00 0.000000e+00
245 71 27
0.000000e+00 0.000000e+00 7.000000e+01 8.944272e+01 0.000000e+00 0.000000e+00 0.000000e+00 0.000000e+00
246 87 93
1.000000e+01 0.000000e+00 8.500000e+01 8.944272e+01 0.000000e+00 0.000000e+00 0.000000e+00 0.000000e+00
247 93 4
1.000000e+01 0.000000e+00 2.200000e+01 2.000000e+02 0.000000e+00 0.000000e+00 0.000000e+00 0.000000e+00
248 42 54
8.000000e+00 0.000000e+00 6.500000e+01 8.000000e+01 0.000000e+00 0.000000e+00 0.000000e+00 0.000000e+00
249 54 88
3.000000e+00 0.000000e+00 8.600000e+01 8.944272e+01 0.000000e+00 0.000000e+00 0.000000e+00 0.000000e+00
250 27 7
7.000000e+00 0.000000e+00 2.200000e+01 4.000000e+01 0.000000e+00 0.000000e+00 0.000000e+00 0.000000e+00
251 7 42
3.000000e+00 0.000000e+00 9.400000e+01 4.000000e+01 0.000000e+00 0.000000e+00 0.000000e+00 0.000000e+00
252 42 27
1.000000e+01 0.000000e+00 3.900000e+01 5.656854e+01 0.000000e+00 0.000000e+00 0.000000e+00 0.000000e+00
253 15 21
2.000000e+00 0.000000e+00 2.900000e+01 8.944272e+01 0.000000e+00 0.000000e+00 0.000000e+00 0.000000e+00
254 31 24
1.000000e+01 0.000000e+00 9.000000e+00 5.656854e+01 0.000000e+00 0.000000e+00 0.000000e+00 0.000000e+00
255 24 54
1.000000e+01 0.000000e+00 3.100000e+01 8.944272e+01 0.000000e+00 0.000000e+00 0.000000e+00 0.000000e+00
256 54 31
1.000000e+01 0.000000e+00 9.300000e+01 4.000000e+01 0.000000e+00 0.000000e+00 0.000000e+00 0.000000e+00
257 17 7
1.000000e+01 0.000000e+00 7.800000e+01 5.656854e+01 0.000000e+00 0.000000e+00 0.000000e+00 0.000000e+00
258 27 17
1.000000e+01 0.000000e+00 4.000000e+01 4.000000e+01 0.000000e+00 0.000000e+00 0.000000e+00 0.000000e+00
259 7 61
0.000000e+00 0.000000e+00 2.800000e+01 4.000000e+01 0.000000e+00 0.000000e+00 0.000000e+00 0.000000e+00
260 61 42
1.000000e+01 0.000000e+00 9.000000e+01 5.656854e+01 0.000000e+00 0.000000e+00 0.000000e+00 0.000000e+00
261 17 97
1.000000e+01 0.000000e+00 7.800000e+01 1.200000e+02 0.000000e+00 0.000000e+00 0.000000e+00 0.000000e+00
262 97 7
1.000000e+01 0.000000e+00 7.600000e+01 8.944272e+01 0.000000e+00 0.000000e+00 0.000000e+00 0.000000e+00
263 61 54
2.000000e+00 0.000000e+00 7.500000e+01 5.656854e+01 0.000000e+00 0.000000e+00 0.000000e+00 0.000000e+00
264 97 61
6.000000e+00 0.000000e+00 2.400000e+01 5.656854e+01 0.000000e+00 0.000000e+00 0.000000e+00 0.000000e+00
265 61 31
4.000000e+00 0.000000e+00 3.400000e+01 4.000000e+01 0.000000e+00 0.000000e+00 0.000000e+00 0.000000e+00
266 97 24
4.000000e+00 0.000000e+00 7.000000e+00 4.000000e+01 0.000000e+00 0.000000e+00 0.000000e+00 0.000000e+00
267 31 97
0.000000e+00 0.000000e+00 3.100000e+01 4.000000e+01 0.000000e+00 0.000000e+00 0.000000e+00 0.000000e+00
268 93 71
6.000000e+00 0.000000e+00 9.300000e+01 1.442221e+02 0.000000e+00 0.000000e+00 0.000000e+00 0.000000e+00
269 52 87
1.000000e+01 0.000000e+00 2.100000e+01 1.264911e+02 0.000000e+00 0.000000e+00 0.000000e+00 0.000000e+00
270 21 52
7.000000e+00 0.000000e+00 9.400000e+01 8.000000e+01 0.000000e+00 0.000000e+00 0.000000e+00 0.000000e+00
271 44 21
3.000000e+00 0.000000e+00 8.100000e+01 3.200000e+02 0.000000e+00 0.000000e+00 0.000000e+00 0.000000e+00
272 71 17
6.000000e+00 0.000000e+00 5.800000e+01 1.131371e+02 0.000000e+00 0.000000e+00 0.000000e+00 0.000000e+00
273 13 97
1.000000e+01 0.000000e+00 4.800000e+01 1.264911e+02 0.000000e+00 0.000000e+00 0.000000e+00 0.000000e+00
274 17 13
1.000000e+01 0.000000e+00 9.000000e+01 4.000000e+01 0.000000e+00 0.000000e+00 0.000000e+00 0.000000e+00
275 93 82
1.000000e+01 0.000000e+00 2.000000e+01 8.944272e+01 0.000000e+00 0.000000e+00 0.000000e+00 0.000000e+00
276 82 71
4.000000e+00 0.000000e+00 5.000000e+00 1.264911e+02 0.000000e+00 0.000000e+00 0.000000e+00 0.000000e+00
277 52 93
1.000000e+01 0.000000e+00 6.600000e+01 2.000000e+02 0.000000e+00 0.000000e+00 0.000000e+00 0.000000e+00
278 13 24
6.000000e+00 0.000000e+00 4.600000e+01 1.649242e+02 0.000000e+00 0.000000e+00 0.000000e+00 0.000000e+00
279 24 20
1.000000e+01 0.000000e+00 3.000000e+01 2.400000e+02 0.000000e+00 0.000000e+00 0.000000e+00 0.000000e+00
280 82 17
1.000000e+01 0.000000e+00 8.000000e+00 1.264911e+02 0.000000e+00 0.000000e+00 0.000000e+00 0.000000e+00
281 82 13
3.000000e+00 0.000000e+00 9.800000e+01 1.200000e+02 0.000000e+00 0.000000e+00 0.000000e+00 0.000000e+00
282 36 82
2.000000e+00 0.000000e+00 8.000000e+01 4.000000e+01 0.000000e+00 0.000000e+00 0.000000e+00 0.000000e+00
283 93 36
8.000000e+00 0.000000e+00 4.100000e+01 5.656854e+01 0.000000e+00 0.000000e+00 0.000000e+00 0.000000e+00
284 52 36
1.000000e+00 0.000000e+00 8.800000e+01 2.433105e+02 0.000000e+00 0.000000e+00 0.000000e+00 0.000000e+00
****************************************
DESCRIPTION OF NODES :
NODE #, POSSIBLE TYPE (1 = SINK, 2 = SOURCE)
X, Y
DEMAND

1 2
650 203
-1.000000e+03
2
450 243
0.000000e+00
3
290 403
0.000000e+00
4
730 243
0.000000e+00
5
450 203
0.000000e+00
6
290 443
0.000000e+00
7
890 483
0.000000e+00
8
610 203
0.000000e+00
9
810 403
0.000000e+00
10
210 443
0.000000e+00
11
130 203
0.000000e+00
12
50 43
0.000000e+00
13
970 443
0.000000e+00
14
770 563
0.000000e+00
15
770 83
0.000000e+00
16
250 123
0.000000e+00
17
930 443
0.000000e+00
18
170 483
0.000000e+00
19
330 523
0.000000e+00
20
690 603
0.000000e+00
21
850 43
0.000000e+00
22
570 203
0.000000e+00
23
170 403
0.000000e+00
24
930 603
0.000000e+00
25
370 523
0.000000e+00
26
290 243
0.000000e+00
27
890 443
0.000000e+00
28
210 283
0.000000e+00
29
330 563
0.000000e+00
30
250 563
0.000000e+00
31
890 563
0.000000e+00
32
370 363
0.000000e+00
33
130 43
0.000000e+00
34
330 83
0.000000e+00
35
50 403
0.000000e+00
36
970 283
0.000000e+00
37
410 83
0.000000e+00
38
90 603
0.000000e+00
39
650 523
0.000000e+00
40
130 323
0.000000e+00
41
610 403
0.000000e+00
42
850 483
0.000000e+00
43
570 243
0.000000e+00
44
530 43
0.000000e+00
45
170 163
0.000000e+00
46
610 523
0.000000e+00
47
210 403
0.000000e+00
48
330 403
0.000000e+00
49
690 563
0.000000e+00
50
130 563
0.000000e+00
51
370 123
0.000000e+00
52
930 43
0.000000e+00
53
370 443
0.000000e+00
54
850 563
0.000000e+00
55
610 363
0.000000e+00
56
810 363
0.000000e+00
57
770 163
0.000000e+00
58
410 323
0.000000e+00
59
290 83
0.000000e+00
60
250 323
0.000000e+00
61
890 523
0.000000e+00
62
690 443
0.000000e+00
63
530 563
0.000000e+00
64
170 83
0.000000e+00
65
530 283
0.000000e+00
66
490 203
0.000000e+00
67
290 283
0.000000e+00
68
370 403
0.000000e+00
69
10 403
0.000000e+00
70
650 443
0.000000e+00
71
850 363
0.000000e+00
72
210 363
0.000000e+00
73
50 203
0.000000e+00
74
10 243
0.000000e+00
75
330 203
0.000000e+00
76
250 443
0.000000e+00
77
250 243
0.000000e+00
78
210 243
0.000000e+00
79
290 163
0.000000e+00
80
250 283
0.000000e+00
81
90 123
0.000000e+00
82
970 323
0.000000e+00
83
170 563
0.000000e+00
84
650 123
0.000000e+00
85
130 163
0.000000e+00
86
450 283
0.000000e+00
87
890 163
0.000000e+00
88
770 523
0.000000e+00
89
730 563
0.000000e+00
90
850 403
0.000000e+00
91
50 443
0.000000e+00
92
290 523
0.000000e+00
93
930 243
0.000000e+00
94
410 523
0.000000e+00
95
290 123
0.000000e+00
96
90 203
0.000000e+00
97
930 563
0.000000e+00
98
810 123
0.000000e+00
99
570 403
0.000000e+00
100 1
170 323
1.000000e+03
