//
// Copyright (C) 2011 - DIGITEO - Michael Baudin
// 
// This file must be used under the terms of the CeCILL.
// This source file is licensed as described in the file COPYING, which
// you should have received as part of this distribution.  The terms
// are also available at    
// http://www.cecill.info/licences/Licence_CeCILL_V2-en.txt
//
// <-- JVM NOT MANDATORY -->
path = mmgetpath (  );
path = fullfile(path,"tests","unit_tests");
//
filename = fullfile(mmgetpath(),"tests","unit_tests","A.mtx");
//
// With output argument.
[rows,cols,entries,rep,field,symm,comments] = mminfo(filename);
assert_checkequal(rows,4);
assert_checkequal(cols,4);
assert_checkequal(entries,6);
assert_checkequal(rep,"coordinate");
assert_checkequal(field,"complex");
assert_checkequal(symm,"hermitian");
assert_checkequal(comments,"%%% Generated by Scilab 27-Apr-2011");
//
// With output argument.
fd = mopen(filename,"r");
[rows,cols,entries,rep,field,symm,comments] = mminfo(fd);
mclose(fd);
assert_checkequal(rows,4);
assert_checkequal(cols,4);
assert_checkequal(entries,6);
assert_checkequal(rep,"coordinate");
assert_checkequal(field,"complex");
assert_checkequal(symm,"hermitian");
assert_checkequal(comments,"%%% Generated by Scilab 27-Apr-2011");
