iflag=1
atmost=1073741823
dimen=3
maxd=30
quasi(1)= 0.102750 0.861468 0.068175
quasi(2)= 0.705979 0.113136 0.506522
quasi(3)= 0.978561 0.532342 0.762253
quasi(4)= 0.329897 0.282107 0.328057
quasi(5)= 0.408047 0.647400 0.654600
quasi(6)= 0.775438 0.397518 0.215994
quasi(7)= 0.534102 0.943155 0.460007
quasi(8)= 0.149600 0.191606 0.894951
quasi(9)= 0.214946 0.586519 0.298221
quasi(10)= 0.601325 0.337305 0.861339
quasi(11)= 0.842920 0.761363 0.617323
quasi(12)= 0.473622 0.010117 0.057867
quasi(13)= 0.270487 0.933886 0.979373
quasi(14)= 0.921027 0.185250 0.415538
quasi(15)= 0.648217 0.733849 0.159803
quasi(16)= 0.043080 0.482944 0.719487
quasi(17)= 0.015017 0.694562 0.820813
quasi(18)= 0.676498 0.444115 0.261601
quasi(19)= 0.887070 0.894538 0.001711
quasi(20)= 0.304228 0.146482 0.565074
quasi(21)= 0.444827 0.785095 0.393566
quasi(22)= 0.871443 0.033268 0.953495
quasi(23)= 0.567125 0.610189 0.713137
quasi(24)= 0.249417 0.360518 0.149546
quasi(25)= 0.181935 0.981963 0.558763
quasi(26)= 0.501550 0.230932 0.124323
quasi(27)= 0.806098 0.686269 0.364685
quasi(28)= 0.377605 0.436783 0.802788
quasi(29)= 0.361989 0.509107 0.226243
quasi(30)= 0.946739 0.258475 0.660943
quasi(31)= 0.735908 0.838295 0.920836
quasi(32)= 0.072550 0.089444 0.481986
quasi(33)= 0.078716 0.559680 0.582608
quasi(34)= 0.729743 0.309457 0.023396
quasi(35)= 0.956690 0.857568 0.279131
quasi(36)= 0.352040 0.109226 0.842493
quasi(37)= 0.398905 0.962679 0.139737
quasi(38)= 0.784797 0.211146 0.699666
quasi(39)= 0.526634 0.635692 0.943682
quasi(40)= 0.156850 0.385789 0.380091
quasi(41)= 0.224332 0.773072 0.781465
quasi(42)= 0.592210 0.021847 0.347024
quasi(43)= 0.850143 0.566996 0.103012
quasi(44)= 0.466128 0.317766 0.541114
quasi(45)= 0.294277 0.737751 0.495821
quasi(46)= 0.897020 0.486855 0.930521
quasi(47)= 0.670332 0.906549 0.674789
quasi(48)= 0.021182 0.157901 0.235939
quasi(49)= 0.053517 0.882825 0.337752
quasi(50)= 0.637781 0.134757 0.776099
