iflag=1
atmost=1073741823
dimen=2
maxd=30
quasi(1)= 0.102750 0.861468
quasi(2)= 0.705979 0.113136
quasi(3)= 0.978561 0.532342
quasi(4)= 0.329897 0.282107
quasi(5)= 0.408047 0.647400
quasi(6)= 0.775438 0.397518
quasi(7)= 0.534102 0.943155
quasi(8)= 0.149600 0.191606
quasi(9)= 0.214946 0.586519
quasi(10)= 0.601325 0.337305
quasi(11)= 0.842920 0.761363
quasi(12)= 0.473622 0.010117
quasi(13)= 0.270487 0.933886
quasi(14)= 0.921027 0.185250
quasi(15)= 0.648217 0.733849
quasi(16)= 0.043080 0.482944
quasi(17)= 0.015017 0.694562
quasi(18)= 0.676498 0.444115
quasi(19)= 0.887070 0.894538
quasi(20)= 0.304228 0.146482
quasi(21)= 0.444827 0.785095
quasi(22)= 0.871443 0.033268
quasi(23)= 0.567125 0.610189
quasi(24)= 0.249417 0.360518
quasi(25)= 0.181935 0.981963
quasi(26)= 0.501550 0.230932
quasi(27)= 0.806098 0.686269
quasi(28)= 0.377605 0.436783
quasi(29)= 0.361989 0.509107
quasi(30)= 0.946739 0.258475
quasi(31)= 0.735908 0.838295
quasi(32)= 0.072550 0.089444
quasi(33)= 0.078716 0.559680
quasi(34)= 0.729743 0.309457
quasi(35)= 0.956690 0.857568
quasi(36)= 0.352040 0.109226
quasi(37)= 0.398905 0.962679
quasi(38)= 0.784797 0.211146
quasi(39)= 0.526634 0.635692
quasi(40)= 0.156850 0.385789
quasi(41)= 0.224332 0.773072
quasi(42)= 0.592210 0.021847
quasi(43)= 0.850143 0.566996
quasi(44)= 0.466128 0.317766
quasi(45)= 0.294277 0.737751
quasi(46)= 0.897020 0.486855
quasi(47)= 0.670332 0.906549
quasi(48)= 0.021182 0.157901
quasi(49)= 0.053517 0.882825
quasi(50)= 0.637781 0.134757
