// Copyright (C) 2011 - Michael Baudin
// Copyright (C) 2010 - DIGITEO - Michael Baudin
//
// This file must be used under the terms of the GNU LGPL license.
// <-- JVM NOT MANDATORY -->
// <-- ENGLISH IMPOSED -->
// Get default dimension
option = 4;
nprob = 1;
computed=intprb_getfunc([],[],[],[],nprob,option);
assert_checkequal ( computed , 10 );
// Get default parameters
option = 7;
nprob = 1;
n=intprb_getfunc([],[],[],[],nprob,4);
computed=intprb_getfunc([],n,[],[],nprob,option);
assert_checkequal ( computed , [] );
// Get f at x for Sum test case
p=intprb_getfunc([],[],[],[],nprob,4);
p=intprb_getfunc([],n,[],[],nprob,7);
m = 5;
x = grand(m,n,"def");
option = 1;
nprob = 1;
f=intprb_getfunc(m,n,x,p,nprob,option);
assert_checkequal ( size(f) , [m 1] );
// Get expectation for Sum test case
n = 10;
m = [];
x = [];
p = [];
option = 2;
nprob = 1;
e=intprb_getfunc(m,n,x,p,nprob,option);
assert_checkequal ( e , 0 );
// Get variance for Sum test case
n = 10;
m = [];
x = [];
p = [];
option = 3;
nprob = 1;
computed=intprb_getfunc(m,n,x,p,nprob,option);
assert_checkequal ( computed , 1 );
// See if the problem has variable size
n = [];
m = [];
x = [];
p = [];
option = 6;
nprob = 1;
computed=intprb_getfunc(m,n,x,p,nprob,option);
assert_checkequal ( computed , %t );
// Get full name
n = [];
m = [];
x = [];
p = [];
option = 5;
nprob = 1;
computed=intprb_getfunc(m,n,x,p,nprob,option);
assert_checkequal ( computed , "Sum of X" );
