// Copyright (C) 2005 - INRIA - Sage Group (IRISA)
// Copyright (C) 2011 - DIGITEO - Michael Baudin
//
// This file must be used under the terms of the CeCILL.
// This source file is licensed as described in the file COPYING, which
// you should have received as part of this distribution.  The terms
// are also available at
// http://www.cecill.info/licences/Licence_CeCILL_V2-en.txt
// <-- CLI SHELL MODE -->
// <-- ENGLISH IMPOSED -->
A = imsls_makefish( 4 );
xe = (1:16)';
b=A*xe;
[x,err,iter,flag,res] = imsls_cheby(A,b);
WARNING: imsls_cheby: Algorithm has not converged.
assert_checkequal(size(res,"*"),iter+1);
assert_checkalmostequal(x,xe,1.e-2);
assert_checkequal(iter,16);
assert_checkequal(flag,1);
assert_checktrue(err<1.e-2);
assert_checkequal(size(res,"*"),iter+1);
assert_checktrue(res<=1);
assert_checktrue(res($)<1.e-2);
//
M=eye(A);
max_it=100;
tol=1000*%eps;
x0=zeros(b);
[x,err,iter,flag,res] = imsls_cheby(A,b,x0,M,max_it,tol);
assert_checkequal(size(res,"*"),iter+1);
assert_checkalmostequal(x,xe,1.e-5);
assert_checkequal(iter,90);
assert_checkequal(flag,0);
assert_checktrue(err<1.e-7);
assert_checkequal(size(res,"*"),iter+1);
assert_checktrue(res<=1);
assert_checktrue(res($)<1.e-7);
