// This file is released under the 3-clause BSD license. See COPYING-BSD.
//=================================
//=================================
if scilab_div(3,5) <> 0.6 then bugmes();quit;end
//=================================
