 0.100000000000000E+00  0.100000000000000E+01  0.100000000000000E+01
 0.200000000000000E+00  0.100000000000000E+01  0.100000000000000E+01
 0.300000000000000E+00  0.100000000000000E+01  0.100000000000000E+01
 0.400000000000000E+00  0.100000000000000E+01  0.100000000000000E+01
 0.500000000000000E+00  0.900000000000000E+00  0.100000000000000E+01
 0.600000000000000E+00  0.900000000000000E+00  0.100000000000000E+01
 0.700000000000000E+00  0.900000000000000E+00  0.100000000000000E+01
 0.800000000000000E+00  0.900000000000000E+00  0.100000000000000E+01
 0.900000000000000E+00  0.900000000000000E+00  0.100000000000000E+01
 0.100000000000000E+01  0.810000000000000E+00  0.100000000000000E+01
 0.110000000000000E+01  0.810000000000000E+00  0.100000000000000E+01
 0.120000000000000E+01  0.810000000000000E+00  0.100000000000000E+01
 0.130000000000000E+01  0.810000000000000E+00  0.100000000000000E+01
 0.140000000000000E+01  0.810000000000000E+00  0.100000000000000E+01
 0.150000000000000E+01  0.729000000000000E+00  0.100000000000000E+01
 0.160000000000000E+01  0.729000000000000E+00  0.100000000000000E+01
 0.170000000000000E+01  0.729000000000000E+00  0.100000000000000E+01
 0.180000000000000E+01  0.729000000000000E+00  0.100000000000000E+01
 0.190000000000000E+01  0.729000000000000E+00  0.100000000000000E+01
 0.200000000000000E+01  0.656100000000000E+00  0.100000000000000E+01
 0.210000000000000E+01  0.656100000000000E+00  0.100000000000000E+01
 0.220000000000000E+01  0.656100000000000E+00  0.100000000000000E+01
 0.230000000000000E+01  0.656100000000000E+00  0.100000000000000E+01
 0.240000000000000E+01  0.656100000000000E+00  0.100000000000000E+01
 0.250000000000000E+01  0.590490000000000E+00  0.100000000000000E+01
 0.260000000000000E+01  0.590490000000000E+00  0.100000000000000E+01
 0.270000000000000E+01  0.590490000000000E+00  0.100000000000000E+01
 0.280000000000000E+01  0.590490000000000E+00  0.100000000000000E+01
 0.290000000000000E+01  0.590490000000000E+00  0.100000000000000E+01
 0.300000000000000E+01  0.531441000000000E+00  0.100000000000000E+01
 0.310000000000000E+01  0.531441000000000E+00  0.100000000000000E+01
 0.320000000000000E+01  0.531441000000000E+00  0.100000000000000E+01
 0.330000000000000E+01  0.531441000000000E+00  0.100000000000000E+01
 0.340000000000000E+01  0.531441000000000E+00  0.100000000000000E+01
 0.350000000000000E+01  0.526126590000000E+00  0.200000000000000E+01
 0.360000000000000E+01  0.526126590000000E+00  0.200000000000000E+01
 0.370000000000000E+01  0.526126590000000E+00  0.200000000000000E+01
 0.380000000000000E+01  0.526126590000000E+00  0.200000000000000E+01
 0.390000000000000E+01  0.526126590000000E+00  0.200000000000000E+01
 0.400000000000000E+01  0.578739249000000E+00  0.200000000000000E+01
 0.410000000000000E+01  0.578739249000000E+00  0.200000000000000E+01
 0.420000000000000E+01  0.578739249000000E+00  0.200000000000000E+01
 0.430000000000000E+01  0.578739249000000E+00  0.200000000000000E+01
 0.440000000000000E+01  0.578739249000000E+00  0.200000000000000E+01
 0.450000000000000E+01  0.636613173900000E+00  0.200000000000000E+01
 0.460000000000000E+01  0.636613173900000E+00  0.200000000000000E+01
 0.470000000000000E+01  0.636613173900000E+00  0.200000000000000E+01
 0.480000000000000E+01  0.636613173900000E+00  0.200000000000000E+01
 0.490000000000000E+01  0.636613173900000E+00  0.200000000000000E+01
 0.500000000000000E+01  0.700274491290001E+00  0.200000000000000E+01
 0.510000000000000E+01  0.700274491290001E+00  0.200000000000000E+01
 0.520000000000000E+01  0.700274491290001E+00  0.200000000000000E+01
 0.530000000000000E+01  0.700274491290001E+00  0.200000000000000E+01
 0.540000000000000E+01  0.700274491290001E+00  0.200000000000000E+01
 0.550000000000000E+01  0.770301940419001E+00  0.200000000000000E+01
 0.560000000000000E+01  0.770301940419001E+00  0.200000000000000E+01
 0.570000000000000E+01  0.770301940419001E+00  0.200000000000000E+01
 0.580000000000000E+01  0.770301940419001E+00  0.200000000000000E+01
 0.590000000000000E+01  0.770301940419001E+00  0.200000000000000E+01
 0.600000000000000E+01  0.847332134460901E+00  0.200000000000000E+01
 0.610000000000000E+01  0.847332134460901E+00  0.200000000000000E+01
 0.620000000000000E+01  0.847332134460901E+00  0.200000000000000E+01
 0.630000000000000E+01  0.847332134460901E+00  0.200000000000000E+01
 0.640000000000000E+01  0.847332134460901E+00  0.200000000000000E+01
 0.650000000000000E+01  0.932065347906991E+00  0.200000000000000E+01
 0.660000000000000E+01  0.932065347906991E+00  0.200000000000000E+01
 0.670000000000000E+01  0.932065347906991E+00  0.200000000000000E+01
 0.680000000000000E+01  0.932065347906991E+00  0.200000000000000E+01
 0.690000000000000E+01  0.932065347906991E+00  0.200000000000000E+01
 0.700000000000000E+01  0.922744694427921E+00  0.100000000000000E+01
 0.710000000000000E+01  0.922744694427921E+00  0.100000000000000E+01
 0.720000000000000E+01  0.922744694427921E+00  0.100000000000000E+01
 0.730000000000000E+01  0.922744694427921E+00  0.100000000000000E+01
 0.740000000000000E+01  0.922744694427921E+00  0.100000000000000E+01
 0.750000000000000E+01  0.830470224985129E+00  0.100000000000000E+01
 0.760000000000000E+01  0.830470224985129E+00  0.100000000000000E+01
 0.770000000000000E+01  0.830470224985129E+00  0.100000000000000E+01
 0.780000000000000E+01  0.830470224985129E+00  0.100000000000000E+01
 0.790000000000000E+01  0.830470224985129E+00  0.100000000000000E+01
 0.800000000000000E+01  0.747423202486616E+00  0.100000000000000E+01
 0.810000000000000E+01  0.747423202486616E+00  0.100000000000000E+01
 0.820000000000000E+01  0.747423202486616E+00  0.100000000000000E+01
 0.830000000000000E+01  0.747423202486616E+00  0.100000000000000E+01
 0.840000000000000E+01  0.747423202486616E+00  0.100000000000000E+01
 0.850000000000000E+01  0.672680882237955E+00  0.100000000000000E+01
 0.860000000000000E+01  0.672680882237955E+00  0.100000000000000E+01
 0.870000000000000E+01  0.672680882237955E+00  0.100000000000000E+01
 0.880000000000000E+01  0.672680882237955E+00  0.100000000000000E+01
 0.890000000000000E+01  0.672680882237955E+00  0.100000000000000E+01
 0.900000000000000E+01  0.605412794014159E+00  0.100000000000000E+01
 0.910000000000000E+01  0.605412794014159E+00  0.100000000000000E+01
 0.920000000000000E+01  0.605412794014159E+00  0.100000000000000E+01
 0.930000000000000E+01  0.605412794014159E+00  0.100000000000000E+01
 0.940000000000000E+01  0.605412794014159E+00  0.100000000000000E+01
 0.950000000000000E+01  0.544871514612743E+00  0.100000000000000E+01
 0.960000000000000E+01  0.544871514612743E+00  0.100000000000000E+01
 0.970000000000000E+01  0.544871514612743E+00  0.100000000000000E+01
 0.980000000000000E+01  0.544871514612743E+00  0.100000000000000E+01
 0.990000000000000E+01  0.544871514612743E+00  0.100000000000000E+01
 0.100000000000000E+02  0.539422799466616E+00  0.200000000000000E+01
 0.101000000000000E+02  0.539422799466616E+00  0.200000000000000E+01
 0.102000000000000E+02  0.539422799466616E+00  0.200000000000000E+01
 0.103000000000000E+02  0.539422799466616E+00  0.200000000000000E+01
 0.104000000000000E+02  0.539422799466616E+00  0.200000000000000E+01
 0.105000000000000E+02  0.593365079413278E+00  0.200000000000000E+01
 0.106000000000000E+02  0.593365079413278E+00  0.200000000000000E+01
 0.107000000000000E+02  0.593365079413278E+00  0.200000000000000E+01
 0.108000000000000E+02  0.593365079413278E+00  0.200000000000000E+01
 0.109000000000000E+02  0.593365079413278E+00  0.200000000000000E+01
 0.110000000000000E+02  0.652701587354605E+00  0.200000000000000E+01
 0.111000000000000E+02  0.652701587354605E+00  0.200000000000000E+01
 0.112000000000000E+02  0.652701587354605E+00  0.200000000000000E+01
 0.113000000000000E+02  0.652701587354605E+00  0.200000000000000E+01
 0.114000000000000E+02  0.652701587354605E+00  0.200000000000000E+01
 0.115000000000000E+02  0.717971746090066E+00  0.200000000000000E+01
 0.116000000000000E+02  0.717971746090066E+00  0.200000000000000E+01
 0.117000000000000E+02  0.717971746090066E+00  0.200000000000000E+01
 0.118000000000000E+02  0.717971746090066E+00  0.200000000000000E+01
 0.119000000000000E+02  0.717971746090066E+00  0.200000000000000E+01
 0.120000000000000E+02  0.789768920699073E+00  0.200000000000000E+01
 0.121000000000000E+02  0.789768920699073E+00  0.200000000000000E+01
 0.122000000000000E+02  0.789768920699073E+00  0.200000000000000E+01
 0.123000000000000E+02  0.789768920699073E+00  0.200000000000000E+01
 0.124000000000000E+02  0.789768920699073E+00  0.200000000000000E+01
 0.125000000000000E+02  0.868745812768980E+00  0.200000000000000E+01
 0.126000000000000E+02  0.868745812768980E+00  0.200000000000000E+01
 0.127000000000000E+02  0.868745812768980E+00  0.200000000000000E+01
 0.128000000000000E+02  0.868745812768980E+00  0.200000000000000E+01
 0.129000000000000E+02  0.868745812768980E+00  0.200000000000000E+01
 0.130000000000000E+02  0.955620394045878E+00  0.200000000000000E+01
 0.131000000000000E+02  0.955620394045878E+00  0.200000000000000E+01
 0.132000000000000E+02  0.955620394045878E+00  0.200000000000000E+01
 0.133000000000000E+02  0.955620394045878E+00  0.200000000000000E+01
 0.134000000000000E+02  0.955620394045878E+00  0.200000000000000E+01
 0.135000000000000E+02  0.946064190105419E+00  0.100000000000000E+01
 0.136000000000000E+02  0.946064190105419E+00  0.100000000000000E+01
 0.137000000000000E+02  0.946064190105419E+00  0.100000000000000E+01
 0.138000000000000E+02  0.946064190105419E+00  0.100000000000000E+01
 0.139000000000000E+02  0.946064190105419E+00  0.100000000000000E+01
 0.140000000000000E+02  0.851457771094878E+00  0.100000000000000E+01
 0.141000000000000E+02  0.851457771094878E+00  0.100000000000000E+01
 0.142000000000000E+02  0.851457771094878E+00  0.100000000000000E+01
 0.143000000000000E+02  0.851457771094878E+00  0.100000000000000E+01
 0.144000000000000E+02  0.851457771094878E+00  0.100000000000000E+01
 0.145000000000000E+02  0.766311993985390E+00  0.100000000000000E+01
 0.146000000000000E+02  0.766311993985390E+00  0.100000000000000E+01
 0.147000000000000E+02  0.766311993985390E+00  0.100000000000000E+01
 0.148000000000000E+02  0.766311993985390E+00  0.100000000000000E+01
 0.149000000000000E+02  0.766311993985390E+00  0.100000000000000E+01
 0.150000000000000E+02  0.689680794586851E+00  0.100000000000000E+01
 0.151000000000000E+02  0.689680794586851E+00  0.100000000000000E+01
 0.152000000000000E+02  0.689680794586851E+00  0.100000000000000E+01
 0.153000000000000E+02  0.689680794586851E+00  0.100000000000000E+01
 0.154000000000000E+02  0.689680794586851E+00  0.100000000000000E+01
 0.155000000000000E+02  0.620712715128166E+00  0.100000000000000E+01
 0.156000000000000E+02  0.620712715128166E+00  0.100000000000000E+01
 0.157000000000000E+02  0.620712715128166E+00  0.100000000000000E+01
 0.158000000000000E+02  0.620712715128166E+00  0.100000000000000E+01
 0.159000000000000E+02  0.620712715128166E+00  0.100000000000000E+01
 0.160000000000000E+02  0.558641443615349E+00  0.100000000000000E+01
 0.161000000000000E+02  0.558641443615349E+00  0.100000000000000E+01
 0.162000000000000E+02  0.558641443615349E+00  0.100000000000000E+01
 0.163000000000000E+02  0.558641443615349E+00  0.100000000000000E+01
 0.164000000000000E+02  0.558641443615349E+00  0.100000000000000E+01
 0.165000000000000E+02  0.502777299253814E+00  0.100000000000000E+01
 0.166000000000000E+02  0.502777299253814E+00  0.100000000000000E+01
 0.167000000000000E+02  0.502777299253814E+00  0.100000000000000E+01
 0.168000000000000E+02  0.502777299253814E+00  0.100000000000000E+01
 0.169000000000000E+02  0.502777299253814E+00  0.100000000000000E+01
 0.170000000000000E+02  0.497749526261276E+00  0.200000000000000E+01
 0.171000000000000E+02  0.497749526261276E+00  0.200000000000000E+01
 0.172000000000000E+02  0.497749526261276E+00  0.200000000000000E+01
 0.173000000000000E+02  0.497749526261276E+00  0.200000000000000E+01
 0.174000000000000E+02  0.497749526261276E+00  0.200000000000000E+01
 0.175000000000000E+02  0.547524478887404E+00  0.200000000000000E+01
 0.176000000000000E+02  0.547524478887404E+00  0.200000000000000E+01
 0.177000000000000E+02  0.547524478887404E+00  0.200000000000000E+01
 0.178000000000000E+02  0.547524478887404E+00  0.200000000000000E+01
 0.179000000000000E+02  0.547524478887404E+00  0.200000000000000E+01
 0.180000000000000E+02  0.602276926776144E+00  0.200000000000000E+01
 0.181000000000000E+02  0.602276926776144E+00  0.200000000000000E+01
 0.182000000000000E+02  0.602276926776144E+00  0.200000000000000E+01
 0.183000000000000E+02  0.602276926776144E+00  0.200000000000000E+01
 0.184000000000000E+02  0.602276926776144E+00  0.200000000000000E+01
 0.185000000000000E+02  0.662504619453759E+00  0.200000000000000E+01
 0.186000000000000E+02  0.662504619453759E+00  0.200000000000000E+01
 0.187000000000000E+02  0.662504619453759E+00  0.200000000000000E+01
 0.188000000000000E+02  0.662504619453759E+00  0.200000000000000E+01
 0.189000000000000E+02  0.662504619453759E+00  0.200000000000000E+01
 0.190000000000000E+02  0.728755081399135E+00  0.200000000000000E+01
 0.191000000000000E+02  0.728755081399135E+00  0.200000000000000E+01
 0.192000000000000E+02  0.728755081399135E+00  0.200000000000000E+01
 0.193000000000000E+02  0.728755081399135E+00  0.200000000000000E+01
 0.194000000000000E+02  0.728755081399135E+00  0.200000000000000E+01
 0.195000000000000E+02  0.801630589539048E+00  0.200000000000000E+01
 0.196000000000000E+02  0.801630589539048E+00  0.200000000000000E+01
 0.197000000000000E+02  0.801630589539048E+00  0.200000000000000E+01
 0.198000000000000E+02  0.801630589539048E+00  0.200000000000000E+01
 0.199000000000000E+02  0.801630589539048E+00  0.200000000000000E+01
