<?xml version="1.0" encoding="UTF-8" standalone="no"?>
<!-- Created with Inkscape (http://www.inkscape.org/) -->

<svg
   xmlns:dc="http://purl.org/dc/elements/1.1/"
   xmlns:cc="http://creativecommons.org/ns#"
   xmlns:rdf="http://www.w3.org/1999/02/22-rdf-syntax-ns#"
   xmlns:svg="http://www.w3.org/2000/svg"
   xmlns="http://www.w3.org/2000/svg"
   xmlns:sodipodi="http://sodipodi.sourceforge.net/DTD/sodipodi-0.dtd"
   xmlns:inkscape="http://www.inkscape.org/namespaces/inkscape"
   id="svg11300"
   height="48px"
   width="48px"
   version="1.1"
   inkscape:version="0.47 r22583"
   sodipodi:docname="CSB_f.svg">
  <defs
     id="defs3032">
    <inkscape:perspective
       sodipodi:type="inkscape:persp3d"
       inkscape:vp_x="0 : 24 : 1"
       inkscape:vp_y="0 : 1000 : 0"
       inkscape:vp_z="48 : 24 : 1"
       inkscape:persp3d-origin="24 : 16 : 1"
       id="perspective2828" />
    <inkscape:perspective
       id="perspective4764"
       inkscape:persp3d-origin="0.5 : 0.33333333 : 1"
       inkscape:vp_z="1 : 0.5 : 1"
       inkscape:vp_y="0 : 1000 : 0"
       inkscape:vp_x="0 : 0.5 : 1"
       sodipodi:type="inkscape:persp3d" />
  </defs>
  <sodipodi:namedview
     pagecolor="#ffffff"
     bordercolor="#666666"
     borderopacity="1"
     objecttolerance="10"
     gridtolerance="10"
     guidetolerance="10"
     inkscape:pageopacity="0"
     inkscape:pageshadow="2"
     inkscape:window-width="1024"
     inkscape:window-height="710"
     id="namedview3030"
     showgrid="false"
     inkscape:zoom="5.0833333"
     inkscape:cx="24"
     inkscape:cy="24"
     inkscape:window-x="-4"
     inkscape:window-y="-4"
     inkscape:window-maximized="1"
     inkscape:current-layer="layer1" />
  <title
     id="title3289">base scilan</title>
  <metadata
     id="metadata4">
    <rdf:RDF>
      <cc:Work
         rdf:about="">
        <dc:format>image/svg+xml</dc:format>
        <dc:type
           rdf:resource="http://purl.org/dc/dcmitype/StillImage" />
        <dc:creator>
          <cc:Agent>
            <dc:title>Mathieu Drouet / Take a sip</dc:title>
          </cc:Agent>
        </dc:creator>
        <dc:source>http://www.takeasip.net/</dc:source>
        <cc:license
           rdf:resource="http://creativecommons.org/licenses/publicdomain/" />
        <dc:title>base scilan</dc:title>
      </cc:Work>
      <cc:License
         rdf:about="http://creativecommons.org/licenses/publicdomain/">
        <cc:permits
           rdf:resource="http://creativecommons.org/ns#Reproduction" />
        <cc:permits
           rdf:resource="http://creativecommons.org/ns#Distribution" />
        <cc:permits
           rdf:resource="http://creativecommons.org/ns#DerivativeWorks" />
      </cc:License>
    </rdf:RDF>
  </metadata>
  <g
     id="layer1">
    <text
       xml:space="preserve"
       style="font-size:20;font-style:normal;font-weight:normal;fill:#000000;fill-opacity:1;stroke:none;font-family:Bitstream Vera Sans"
       x="7.6721311"
       y="30.295082"
       id="text2830"><tspan
         sodipodi:role="line"
         id="tspan2832"
         x="7.6721311"
         y="30.295082" /></text>
    <text
       xml:space="preserve"
       style="font-size:16px;font-style:normal;font-weight:normal;fill:#000000;fill-opacity:1;stroke:none;font-family:Bitstream Vera Sans"
       x="0.72131157"
       y="16.918034"
       id="text2834"><tspan
         sodipodi:role="line"
         id="tspan2836"
         x="0.72131157"
         y="16.918034">CSB_f</tspan></text>
    <rect
       style="fill:#e6e6e6"
       id="rect4624"
       width="30.295082"
       height="22.819672"
       x="8.852458"
       y="22.62295" />
    <path
       style="fill:none;stroke:#000000;stroke-width:1px;stroke-linecap:butt;stroke-linejoin:miter;stroke-opacity:1"
       d="m 11.803279,43.47541 c 1.770492,-8.852459 0.737743,-15.72949 5.901639,-15.737705 6.051371,-0.0096 2.756563,12.250275 9.639345,13.770493 4.333296,0.957105 5.114754,-2.950822 5.901639,-4.327871 C 34.032788,35.803278 36,25.377049 36,25.377049"
       id="path4794"
       sodipodi:nodetypes="csssc" />
    <path
       style="fill:#008000"
       d="m 11.537467,43.340746 c -0.05991,-0.05991 0.0044,-0.760542 0.142887,-1.556967 0.138495,-0.796424 0.488299,-3.207028 0.777343,-5.356896 0.613166,-4.560644 1.165346,-6.531091 2.153827,-7.685909 0.678783,-0.793005 1.999933,-1.437493 2.941552,-1.434959 1.535528,0.0041 3.142814,1.152232 3.821408,2.729667 0.226425,0.526341 0.726571,2.141175 1.111435,3.58852 0.87666,3.296832 1.563433,4.969848 2.437087,5.936878 1.236347,1.368489 3.061528,1.966987 4.674226,1.532733 1.664297,-0.448149 3.135678,-2.893183 4.097474,-6.80888 0.397985,-1.620295 1.872507,-8.600136 1.872507,-8.863758 0,-0.02565 0.177049,-3.37e-4 0.393443,0.05625 0.216393,0.05659 0.393442,0.130968 0.393442,0.165287 0,0.297479 -1.486638,7.169059 -1.93545,8.946094 -0.535342,2.119641 -1.535225,4.481623 -2.438251,5.759776 -1.178087,1.667482 -3.725038,2.127112 -5.891532,1.063204 -2.117404,-1.039802 -3.011659,-2.583966 -4.286864,-7.402387 -1.242538,-4.69499 -2.056053,-5.811305 -4.22678,-5.800037 -2.476138,0.01285 -3.412929,1.616305 -4.155452,7.112651 -0.863947,6.395155 -1.157863,8.009997 -1.468706,8.069414 -0.167571,0.03203 -0.353689,0.0092 -0.413596,-0.05068 z"
       id="path4798" />
  </g>
</svg>
