[INFO][GALauncherImpl] (GI0001) 12-06-15 14:22:13.145 Gene-Auto toolset ver 2.4.9 05/10/2011 started at 15/06/2012 14:22:13.144
[INFO]		 command line: /home/davidcl/work/projects/projetP/geneauto-p/demos/Subsystem.gsm.xml 
[INFO][FileUtil.cleanFolder] (GI0010) 12-06-15 14:22:13.149 Successfully cleaned folder "/home/davidcl/work/projects/projetP/geneauto-p/demos/Subsystem.gsm_ga/tmp/system1/system1/system1".
[INFO][FileUtil.cleanFolder] (GI0010) 12-06-15 14:22:13.205 Successfully cleaned folder "/home/davidcl/work/projects/projetP/geneauto-p/demos/Subsystem.gsm_ga/tmp/system1/system1/system2".
[INFO][FileUtil.cleanFolder] (GI0010) 12-06-15 14:22:13.206 Successfully cleaned folder "/home/davidcl/work/projects/projetP/geneauto-p/demos/Subsystem.gsm_ga/tmp/system1/system1".
[INFO][FileUtil.cleanFolder] (GI0010) 12-06-15 14:22:13.207 Successfully cleaned folder "/home/davidcl/work/projects/projetP/geneauto-p/demos/Subsystem.gsm_ga/tmp/system1".
[INFO][FileUtil.cleanFolder] (GI0010) 12-06-15 14:22:13.208 Successfully cleaned folder "/home/davidcl/work/projects/projetP/geneauto-p/demos/Subsystem.gsm_ga/tmp".
[INFO][FileUtil.cleanFolder] (GI0010) 12-06-15 14:22:13.210 Successfully cleaned folder "/home/davidcl/work/projects/projetP/geneauto-p/demos/Subsystem.gsm_ga/tmp".
[INFO][FileUtil.cleanFolder] (GI0010) 12-06-15 14:22:13.211 Successfully cleaned folder "/home/davidcl/work/projects/projetP/geneauto-p/demos/Subsystem.gsm_ga".
[INFO][TFMPreprocessor] (GI0002) 12-06-15 14:22:13.252 
[INFO]	
[INFO]	Elementary tool ver. 2.4.9 05/10/2011 started at 15/06/2012 14:22:13.251
[INFO]		 (command line: /home/davidcl/work/projects/projetP/geneauto-p/demos/Subsystem.gsm_ga/tmp/Subsystem.gsm.xml -o /home/davidcl/work/projects/projetP/geneauto-p/demos/Subsystem.gsm_ga/tmp/1-Subsystem.gsm_fmpr.gsm.xml )
[INFO][TFMPreprocessor] (GI0005) 12-06-15 14:22:13.252 Entering state Initializing
[INFO][TFMPreprocessor] (GI0007) 12-06-15 14:22:13.866 Time in state: 00:00:00.614(state Initializing)
[INFO][TFMPreprocessor] (GI0005) 12-06-15 14:22:13.867 Entering state HandlePorts
[INFO][TFMPreprocessor] (GI0007) 12-06-15 14:22:13.888 Time in state: 00:00:00.021(state HandlePorts)
[INFO][TFMPreprocessor] (GI0005) 12-06-15 14:22:13.888 Entering state ReplacingGenericBlocks
[INFO][TFMPreprocessor] (GI0007) 12-06-15 14:22:13.892 Time in state: 00:00:00.004(state ReplacingGenericBlocks)
[INFO][TFMPreprocessor] (GI0005) 12-06-15 14:22:13.892 Entering state CheckingGenericBlocks
[INFO][TFMPreprocessor] (GI0007) 12-06-15 14:22:13.897 Time in state: 00:00:00.003(state CheckingGenericBlocks)
[INFO][TFMPreprocessor] (GI0005) 12-06-15 14:22:13.897 Entering state ExecuteBlockPreprocessors
[INFO][TFMPreprocessor] (GI0007) 12-06-15 14:22:13.915 Time in state: 00:00:00.018(state ExecuteBlockPreprocessors)
[INFO][TFMPreprocessor] (GI0005) 12-06-15 14:22:13.915 Entering state ResolvingNameReference
[INFO][TFMPreprocessor] (GI0007) 12-06-15 14:22:13.920 Time in state: 00:00:00.005(state ResolvingNameReference)
[INFO][TFMPreprocessor] (GI0005) 12-06-15 14:22:13.920 Entering state ExpandingVirtualSubSystems
[INFO][TFMPreprocessor] (GI0007) 12-06-15 14:22:13.922 Time in state: 00:00:00.001(state ExpandingVirtualSubSystems)
[INFO][TFMPreprocessor] (GI0005) 12-06-15 14:22:13.923 Entering state TestingAlgebraicLoops
[INFO][TFMPreprocessor] (GI0007) 12-06-15 14:22:13.924 Time in state: 00:00:00.001(state TestingAlgebraicLoops)
[INFO][TFMPreprocessor] (GI0005) 12-06-15 14:22:13.924 Entering state AssignPriorities
[INFO][TFMPreprocessor] (GI0007) 12-06-15 14:22:13.925 Time in state: 00:00:00.000(state AssignPriorities)
[INFO][TFMPreprocessor] (GI0005) 12-06-15 14:22:13.925 Entering state SavingModel
[INFO][TFMPreprocessor] (GI0007) 12-06-15 14:22:14.163 Time in state: 00:00:00.238(state SavingModel)
[INFO][TFMPreprocessor] (GI0003) 12-06-15 14:22:14.164 Completed at 15/06/2012 14:22:14.163 (execution time 00:00:00.912)
[INFO]	-------------------------------------
[INFO]	
[INFO]	
[INFO][TBlockSequencer_coq] (GI0002) 12-06-15 14:22:14.167 
[INFO]	
[INFO]	Elementary tool ver. 2.4.9 05/10/2011 started at 15/06/2012 14:22:14.167
[INFO]		 (command line: /home/davidcl/work/projects/projetP/geneauto-p/demos/Subsystem.gsm_ga/tmp/1-Subsystem.gsm_fmpr.gsm.xml -o /home/davidcl/work/projects/projetP/geneauto-p/demos/Subsystem.gsm_ga/tmp/2-Subsystem.gsm_fmbs.gsm.xml )
[INFO][TBlockSequencer_coq] (GI0005) 12-06-15 14:22:14.168 Entering state Initializing
[INFO][TBlockSequencer_coq] (GI0007) 12-06-15 14:22:14.375 Time in state: 00:00:00.207(state Initializing)
[INFO][TBlockSequencer_coq] (GI0005) 12-06-15 14:22:14.375 Entering state Transforming
[INFO][TBlockSequencer_coq] (GI0007) 12-06-15 14:22:14.422 Time in state: 00:00:00.047(state Transforming)
[INFO][TBlockSequencer_coq] (GI0005) 12-06-15 14:22:14.422 Entering state SavingModel
[INFO][TBlockSequencer_coq] (GI0007) 12-06-15 14:22:14.527 Time in state: 00:00:00.105(state SavingModel)
[INFO][TBlockSequencer_coq] (GI0003) 12-06-15 14:22:14.528 Completed at 15/06/2012 14:22:14.527 (execution time 00:00:00.359)
[INFO]	-------------------------------------
[INFO]	
[INFO]	
[INFO][TTyper] (GI0002) 12-06-15 14:22:14.536 
[INFO]	
[INFO]	Elementary tool ver. 2.4.9 05/10/2011 started at 15/06/2012 14:22:14.536
[INFO]		 (command line: /home/davidcl/work/projects/projetP/geneauto-p/demos/Subsystem.gsm_ga/tmp/2-Subsystem.gsm_fmbs.gsm.xml -o /home/davidcl/work/projects/projetP/geneauto-p/demos/Subsystem.gsm_ga/tmp/3-Subsystem.gsm_fmty.gsm.xml )
[INFO][TTyper] (GI0005) 12-06-15 14:22:14.536 Entering state Initializing
[INFO][TTyper] (GI0007) 12-06-15 14:22:14.675 Time in state: 00:00:00.139(state Initializing)
[INFO][TTyper] (GI0005) 12-06-15 14:22:14.676 Entering state TypingModel
[INFO][TTyper] (GI0007) 12-06-15 14:22:14.837 Time in state: 00:00:00.161(state TypingModel)
[INFO][TTyper] (GI0005) 12-06-15 14:22:14.837 Entering state ValidatingModel
[INFO][TTyper] (GI0007) 12-06-15 14:22:14.839 Time in state: 00:00:00.001(state ValidatingModel)
[INFO][TTyper] (GI0005) 12-06-15 14:22:14.839 Entering state SavingModel
[INFO][TTyper] (GI0007) 12-06-15 14:22:14.958 Time in state: 00:00:00.119(state SavingModel)
[INFO][TTyper] (GI0003) 12-06-15 14:22:14.959 Completed at 15/06/2012 14:22:14.958 (execution time 00:00:00.422)
[INFO]	-------------------------------------
[INFO]	
[INFO]	
[INFO][TFMCodeModelGenerator] (GI0002) 12-06-15 14:22:14.975 
[INFO]	
[INFO]	Elementary tool ver. 2.4.9 05/10/2011 started at 15/06/2012 14:22:14.975
[INFO]		 (command line: /home/davidcl/work/projects/projetP/geneauto-p/demos/Subsystem.gsm_ga/tmp/3-Subsystem.gsm_fmty.gsm.xml --oCM /home/davidcl/work/projects/projetP/geneauto-p/demos/Subsystem.gsm_ga/tmp/4-Subsystem.gsm_fmcg.gcm.xml --oSM /home/davidcl/work/projects/projetP/geneauto-p/demos/Subsystem.gsm_ga/tmp/4-Subsystem.gsm_fmcg.gsm.xml )
[INFO][TFMCodeModelGenerator] (GI0005) 12-06-15 14:22:14.976 Entering state Initialising
[INFO][TFMCodeModelGenerator] (GI0007) 12-06-15 14:22:15.124 Time in state: 00:00:00.148(state Initialising)
[INFO][TFMCodeModelGenerator] (GI0005) 12-06-15 14:22:15.124 Entering state Pre-processing IO
[INFO][TFMCodeModelGenerator] (GI0007) 12-06-15 14:22:15.125 Time in state: 00:00:00.001(state Pre-processing IO)
[INFO][TFMCodeModelGenerator] (GI0005) 12-06-15 14:22:15.125 Entering state InitializeCodeModel
[INFO][TFMCodeModelGenerator] (GI0007) 12-06-15 14:22:15.128 Time in state: 00:00:00.003(state InitializeCodeModel)
[INFO][TFMCodeModelGenerator] (GI0005) 12-06-15 14:22:15.128 Entering state ConvertingModel
[INFO][TFMCodeModelGenerator.CMGConvertingModelState] (GI0006) 12-06-15 14:22:15.333 Block types used in conversion from code model to system model :
[INFO]	BlockType           BlockBackend / BlockTyper
[INFO]	----------------------------------------------
[INFO]	Sum                 geneauto.blocklibrary.backends.SumBackend / geneauto.blocklibrary.typers.SumTyper
[INFO]	Switch              geneauto.blocklibrary.backends.SwitchBackend / geneauto.blocklibrary.typers.SwitchTyper
[INFO]	UnitDelay           geneauto.blocklibrary.backends.UnitDelayBackend / geneauto.blocklibrary.typers.UnitDelayTyper
[INFO]	Product             geneauto.blocklibrary.backends.ProductBackend / geneauto.blocklibrary.typers.ProductTyper
[INFO]	SubSystem           geneauto.blocklibrary.backends.SubSystemImplBackend / geneauto.blocklibrary.typers.SystemTyper
[INFO]	Mux                 geneauto.blocklibrary.backends.MuxBackend / geneauto.blocklibrary.typers.MuxTyper
[INFO]	Inport              geneauto.blocklibrary.backends.InOutPortBackend / geneauto.blocklibrary.typers.InportTyper
[INFO]	If                  geneauto.blocklibrary.backends.IfBackend / geneauto.blocklibrary.typers.NullTyper
[INFO]	Outport             geneauto.blocklibrary.backends.InOutPortBackend / geneauto.blocklibrary.typers.SinkTyper
[INFO]	Constant            geneauto.blocklibrary.backends.ConstantBackend / geneauto.blocklibrary.typers.ConstantTyper
[INFO]	
[INFO][TFMCodeModelGenerator] (GI0007) 12-06-15 14:22:15.334 Time in state: 00:00:00.206(state ConvertingModel)
[INFO][TFMCodeModelGenerator] (GI0005) 12-06-15 14:22:15.335 Entering state Normalising CodeModel
[INFO][TFMCodeModelGenerator] (GI0007) 12-06-15 14:22:15.374 Time in state: 00:00:00.039(state Normalising CodeModel)
[INFO][TFMCodeModelGenerator] (GI0005) 12-06-15 14:22:15.374 Entering state Transforming IO
[INFO][TFMCodeModelGenerator] (GI0007) 12-06-15 14:22:15.375 Time in state: 00:00:00.001(state Transforming IO)
[INFO][TFMCodeModelGenerator] (GI0005) 12-06-15 14:22:15.375 Entering state ResolvingNameReference
[INFO][TFMCodeModelGenerator] (GI0007) 12-06-15 14:22:15.387 Time in state: 00:00:00.012(state ResolvingNameReference)
[INFO][TFMCodeModelGenerator] (GI0005) 12-06-15 14:22:15.388 Entering state Publishing Data Types
[INFO][TFMCodeModelGenerator] (GI0007) 12-06-15 14:22:15.400 Time in state: 00:00:00.012(state Publishing Data Types)
[INFO][TFMCodeModelGenerator] (GI0005) 12-06-15 14:22:15.400 Entering state SavingModel
[INFO][TFMCodeModelGenerator] (GI0007) 12-06-15 14:22:15.774 Time in state: 00:00:00.372(state SavingModel)
[INFO][TFMCodeModelGenerator] (GI0003) 12-06-15 14:22:15.774 Completed at 15/06/2012 14:22:15.774 (execution time 00:00:00.798)
[INFO]	-------------------------------------
[INFO]	
[INFO]	
[INFO][TCPrinter] (GI0002) 12-06-15 14:22:15.788 
[INFO]	
[INFO]	Elementary tool ver. 2.4.9 05/10/2011 started at 15/06/2012 14:22:15.788
[INFO]		 (command line: /home/davidcl/work/projects/projetP/geneauto-p/demos/Subsystem.gsm_ga/tmp/4-Subsystem.gsm_fmcg.gcm.xml -O /home/davidcl/work/projects/projetP/geneauto-p/demos/Subsystem.gsm_ga )
[INFO][TCPrinter] (GI0005) 12-06-15 14:22:15.789 Entering state Initialising
[INFO][TCPrinter] (GI0007) 12-06-15 14:22:15.976 Time in state: 00:00:00.187(state Initialising)
[INFO][TCPrinter] (GI0005) 12-06-15 14:22:15.977 Entering state Removing temporary elements
[INFO][TCPrinter] (GI0007) 12-06-15 14:22:15.978 Time in state: 00:00:00.000(state Removing temporary elements)
[INFO][TCPrinter] (GI0005) 12-06-15 14:22:15.978 Entering state Resolving observable variables
[INFO][TCPrinter] (GI0007) 12-06-15 14:22:15.980 Time in state: 00:00:00.002(state Resolving observable variables)
[INFO][TCPrinter] (GI0005) 12-06-15 14:22:15.980 Entering state Adapting CodeModel to C language
[INFO][TCPrinter] (GI0007) 12-06-15 14:22:16.059 Time in state: 00:00:00.079(state Adapting CodeModel to C language)
[INFO][TCPrinter] (GI0005) 12-06-15 14:22:16.059 Entering state NormalisingNames
[INFO][TCPrinter] (GI0007) 12-06-15 14:22:16.078 Time in state: 00:00:00.018(state NormalisingNames)
[INFO][TCPrinter] (GI0005) 12-06-15 14:22:16.078 Entering state Printing
[INFO][TCPrinter] (CP0089) 12-06-15 14:22:16.235 Writing file: /home/davidcl/work/projects/projetP/geneauto-p/demos/Subsystem.gsm_ga/B3_6.h
[INFO][TCPrinter] (CP0089) 12-06-15 14:22:16.235 Writing file: /home/davidcl/work/projects/projetP/geneauto-p/demos/Subsystem.gsm_ga/B3.c
[INFO][TCPrinter] (CP0089) 12-06-15 14:22:16.236 Writing file: /home/davidcl/work/projects/projetP/geneauto-p/demos/Subsystem.gsm_ga/B3_7.h
[INFO][TCPrinter] (CP0089) 12-06-15 14:22:16.236 Writing file: /home/davidcl/work/projects/projetP/geneauto-p/demos/Subsystem.gsm_ga/Subsystem.c
[INFO][TCPrinter] (CP0089) 12-06-15 14:22:16.237 Writing file: /home/davidcl/work/projects/projetP/geneauto-p/demos/Subsystem.gsm_ga/B3_7.c
[INFO][TCPrinter] (CP0089) 12-06-15 14:22:16.237 Writing file: /home/davidcl/work/projects/projetP/geneauto-p/demos/Subsystem.gsm_ga/Subsystem.h
[INFO][TCPrinter] (CP0089) 12-06-15 14:22:16.238 Writing file: /home/davidcl/work/projects/projetP/geneauto-p/demos/Subsystem.gsm_ga/Subsystem_types.h
[INFO][TCPrinter] (CP0089) 12-06-15 14:22:16.238 Writing file: /home/davidcl/work/projects/projetP/geneauto-p/demos/Subsystem.gsm_ga/B3_6.c
[INFO][TCPrinter] (CP0089) 12-06-15 14:22:16.239 Writing file: /home/davidcl/work/projects/projetP/geneauto-p/demos/Subsystem.gsm_ga/B3.h
[INFO][TCPrinter] (CP0089) 12-06-15 14:22:16.239 Writing file: /home/davidcl/work/projects/projetP/geneauto-p/demos/Subsystem.gsm_ga/GATypes.h
[INFO][TCPrinter] () 12-06-15 14:22:16.242 Copying file: GACommon.h
[INFO][TCPrinter] (GI0007) 12-06-15 14:22:16.243 Time in state: 00:00:00.165(state Printing)
[INFO][TCPrinter] (GI0005) 12-06-15 14:22:16.243 Entering state WritingCodeModel
[INFO][TCPrinter] (GI0007) 12-06-15 14:22:16.243 Time in state: 00:00:00.000(state WritingCodeModel)
[INFO][TCPrinter] (GI0003) 12-06-15 14:22:16.244 Completed at 15/06/2012 14:22:16.243 (execution time 00:00:00.455)
[INFO]	-------------------------------------
[INFO]	
[INFO]	
[INFO][GALauncherSCICOS] () 12-06-15 14:22:16.244 Gene-Auto Toolset Finished processing. at 15/06/2012 14:22:16.244, execution time 00:00:03.098
[INFO][GALauncherSCICOS] (GI000?) 12-06-15 14:22:16.244 TFMPreprocessor:            00:00:00.912
[INFO][GALauncherSCICOS] (GI000?) 12-06-15 14:22:16.245 TBlockSequencer_coq:        00:00:00.359
[INFO][GALauncherSCICOS] (GI000?) 12-06-15 14:22:16.245 TTyper:                     00:00:00.422
[INFO][GALauncherSCICOS] (GI000?) 12-06-15 14:22:16.245 TFMCodeModelGenerator:      00:00:00.798
[INFO][GALauncherSCICOS] (GI000?) 12-06-15 14:22:16.245 TCPrinter:                  00:00:00.455
[INFO][GALauncherSCICOS] (GI000?) 12-06-15 14:22:16.245 Full toolset:               00:00:03.098
