debug%12-06-15 14:17:47.130%Input dependencies:
debug%12-06-15 14:17:47.130%block( 1 ) = { }
debug%12-06-15 14:17:47.130%block( 2 ) = { }
debug%12-06-15 14:17:47.130%block( 3 ) = { C1 C2 C23 C24 C25 C26 C27 C28 R1 R2 R23 R24 R25 R26 R27 R28 }
debug%12-06-15 14:17:47.130%block( 4 ) = { C5 C11 C13 C26 C27 C28 R5 R11 R13 R26 R27 R28 }
debug%12-06-15 14:17:47.131%block( 5 ) = { C26 C27 C28 R26 R27 R28 }
debug%12-06-15 14:17:47.131%block( 6 ) = { C1 C2 C3 C23 C24 C25 C26 C27 C28 R1 R2 R3 R23 R24 R25 R26 R27 R28 }
debug%12-06-15 14:17:47.131%block( 7 ) = { C1 C2 C3 C23 C24 C25 C26 C27 C28 R1 R2 R3 R23 R24 R25 R26 R27 R28 }
debug%12-06-15 14:17:47.131%block( 8 ) = { C1 C2 C3 C6 C23 C24 C25 C26 C27 C28 R1 R2 R3 R6 R23 R24 R25 R26 R27 R28 }
debug%12-06-15 14:17:47.131%block( 9 ) = { C1 C2 C3 C7 C23 C24 C25 C26 C27 C28 R1 R2 R3 R7 R23 R24 R25 R26 R27 R28 }
debug%12-06-15 14:17:47.131%block( 10 ) = { C5 C26 C27 C28 R5 R26 R27 R28 }
debug%12-06-15 14:17:47.131%block( 11 ) = { C5 C26 C27 C28 R5 R26 R27 R28 }
debug%12-06-15 14:17:47.131%block( 12 ) = { C5 C10 C26 C27 C28 R5 R10 R26 R27 R28 }
debug%12-06-15 14:17:47.131%block( 13 ) = { C5 C11 C26 C27 C28 R5 R11 R26 R27 R28 }
debug%12-06-15 14:17:47.131%block( 14 ) = { C5 C10 C12 C26 C27 C28 R5 R10 R12 R26 R27 R28 }
debug%12-06-15 14:17:47.131%block( 15 ) = { C4 C5 C11 C13 C26 C27 C28 R4 R5 R11 R13 R26 R27 R28 }
debug%12-06-15 14:17:47.131%block( 16 ) = { C4 C5 C11 C13 C26 C27 C28 R4 R5 R11 R13 R26 R27 R28 }
debug%12-06-15 14:17:47.131%block( 17 ) = { C4 C5 C11 C13 C26 C27 C28 R4 R5 R11 R13 R26 R27 R28 }
debug%12-06-15 14:17:47.131%block( 18 ) = { C1 C2 C3 C6 C8 C23 C24 C25 C26 C27 C28 R1 R2 R3 R6 R8 R23 R24 R25 R26 R27 R28 }
debug%12-06-15 14:17:47.131%block( 19 ) = { C1 C2 C3 C7 C9 C23 C24 C25 C26 C27 C28 R1 R2 R3 R7 R9 R23 R24 R25 R26 R27 R28 }
debug%12-06-15 14:17:47.131%block( 20 ) = { C5 C10 C12 C14 C26 C27 C28 R5 R10 R12 R14 R26 R27 R28 }
debug%12-06-15 14:17:47.131%block( 21 ) = { C5 C10 C12 C14 C26 C27 C28 R5 R10 R12 R14 R26 R27 R28 }
debug%12-06-15 14:17:47.131%block( 22 ) = { C5 C10 C12 C14 C26 C27 C28 R5 R10 R12 R14 R26 R27 R28 }
debug%12-06-15 14:17:47.131%block( 23 ) = { C1 C2 R1 R2 }
debug%12-06-15 14:17:47.131%block( 24 ) = { }
debug%12-06-15 14:17:47.131%block( 25 ) = { C1 C2 C23 C24 R1 R2 R23 R24 }
debug%12-06-15 14:17:47.131%block( 26 ) = { }
debug%12-06-15 14:17:47.131%block( 27 ) = { }
debug%12-06-15 14:17:47.131%block( 28 ) = { }
debug%12-06-15 14:17:47.131%Output dependencies:
debug%12-06-15 14:17:47.132%block( 1 ) = { C1 }
debug%12-06-15 14:17:47.132%block( 2 ) = { C2 }
debug%12-06-15 14:17:47.132%block( 3 ) = { C1 C2 C3 C23 C24 C25 C26 C27 C28 R1 R2 R23 R24 R25 R26 R27 R28 }
debug%12-06-15 14:17:47.132%block( 4 ) = { C4 C5 C11 C13 C26 C27 C28 R5 R11 R13 R26 R27 R28 }
debug%12-06-15 14:17:47.132%block( 5 ) = { C5 C26 C27 C28 R26 R27 R28 }
debug%12-06-15 14:17:47.132%block( 6 ) = { C1 C2 C3 C6 C23 C24 C25 C26 C27 C28 R1 R2 R3 R23 R24 R25 R26 R27 R28 }
debug%12-06-15 14:17:47.132%block( 7 ) = { C1 C2 C3 C7 C23 C24 C25 C26 C27 C28 R1 R2 R3 R23 R24 R25 R26 R27 R28 }
debug%12-06-15 14:17:47.132%block( 8 ) = { C1 C2 C3 C6 C8 C23 C24 C25 C26 C27 C28 R1 R2 R3 R6 R23 R24 R25 R26 R27 R28 }
debug%12-06-15 14:17:47.132%block( 9 ) = { C1 C2 C3 C7 C9 C23 C24 C25 C26 C27 C28 R1 R2 R3 R7 R23 R24 R25 R26 R27 R28 }
debug%12-06-15 14:17:47.132%block( 10 ) = { C5 C10 C26 C27 C28 R5 R26 R27 R28 }
debug%12-06-15 14:17:47.132%block( 11 ) = { C5 C11 C26 C27 C28 R5 R26 R27 R28 }
debug%12-06-15 14:17:47.132%block( 12 ) = { C5 C10 C12 C26 C27 C28 R5 R10 R26 R27 R28 }
debug%12-06-15 14:17:47.132%block( 13 ) = { C5 C11 C13 C26 C27 C28 R5 R11 R26 R27 R28 }
debug%12-06-15 14:17:47.132%block( 14 ) = { C5 C10 C12 C14 C26 C27 C28 R5 R10 R12 R26 R27 R28 }
debug%12-06-15 14:17:47.132%block( 15 ) = { C4 C5 C11 C13 C15 C26 C27 C28 R4 R5 R11 R13 R26 R27 R28 }
debug%12-06-15 14:17:47.132%block( 16 ) = { C4 C5 C11 C13 C16 C26 C27 C28 R4 R5 R11 R13 R26 R27 R28 }
debug%12-06-15 14:17:47.132%block( 17 ) = { C4 C5 C11 C13 C17 C26 C27 C28 R4 R5 R11 R13 R26 R27 R28 }
debug%12-06-15 14:17:47.132%block( 18 ) = { C1 C2 C3 C6 C8 C18 C23 C24 C25 C26 C27 C28 R1 R2 R3 R6 R8 R23 R24 R25 R26 R27 R28 }
debug%12-06-15 14:17:47.132%block( 19 ) = { C1 C2 C3 C7 C9 C19 C23 C24 C25 C26 C27 C28 R1 R2 R3 R7 R9 R23 R24 R25 R26 R27 R28 }
debug%12-06-15 14:17:47.132%block( 20 ) = { C5 C10 C12 C14 C20 C26 C27 C28 R5 R10 R12 R14 R26 R27 R28 }
debug%12-06-15 14:17:47.132%block( 21 ) = { C5 C10 C12 C14 C21 C26 C27 C28 R5 R10 R12 R14 R26 R27 R28 }
debug%12-06-15 14:17:47.132%block( 22 ) = { C5 C10 C12 C14 C22 C26 C27 C28 R5 R10 R12 R14 R26 R27 R28 }
debug%12-06-15 14:17:47.133%block( 23 ) = { C1 C2 C23 R1 R2 }
debug%12-06-15 14:17:47.133%block( 24 ) = { C24 }
debug%12-06-15 14:17:47.133%block( 25 ) = { C1 C2 C23 C24 C25 R1 R2 R23 R24 }
debug%12-06-15 14:17:47.133%block( 26 ) = { C26 }
debug%12-06-15 14:17:47.133%block( 27 ) = { C27 }
debug%12-06-15 14:17:47.133%block( 28 ) = { C28 }
