<?xml version="1.0" encoding="UTF-8" standalone="no"?>
<svg xmlns="http://www.w3.org/2000/svg"
     xmlns:xlink="http://www.w3.org/1999/xlink"
     width="610px" height="460px" viewBox="0 0 610 460">
<title>Figure n°0</title>
<desc>
Creator: GL2PS 1.3.2, (C) 1999-2006 Christophe Geuzaine (geuz@geuz.org)
For: Scilab
CreationDate: Sat Feb 20 14:08:13 2010
</desc>
<defs>
</defs>
<polygon fill="#ffffff" points="0,0 610,0 610,460 0,460"/>
<g>
<polygon fill="#ffffff" points="76.25,402.5 533.75,57.5 76.25,57.5"/>
<polygon fill="#ffffff" points="76.25,402.5 533.75,402.5 533.75,57.5"/>
<polygon fill="#ffffff" points="76.25,402.5 533.75,402.5 533.75,402.5"/>
<polygon fill="#ffffff" points="76.25,402.5 76.25,57.5 76.25,57.5"/>
<polygon fill="#ffffff" points="76.25,402.5 533.75,402.5 76.25,402.5"/>
<polygon fill="#ffffff" points="76.25,402.5 76.25,57.5 76.25,402.5"/>
<text fill="#000000" x="469" y="419" transform="rotate(-0, 469, 419)" font-size="10" font-family="SansSerif" font-style="normal" font-weight="normal">1.5</text>
<text fill="#000000" x="412" y="419" transform="rotate(-0, 412, 419)" font-size="10" font-family="SansSerif" font-style="normal" font-weight="normal">1.0</text>
<text fill="#000000" x="354" y="419" transform="rotate(-0, 354, 419)" font-size="10" font-family="SansSerif" font-style="normal" font-weight="normal">0.5</text>
<text fill="#000000" x="297" y="419" transform="rotate(-0, 297, 419)" font-size="10" font-family="SansSerif" font-style="normal" font-weight="normal">0.0</text>
<text fill="#000000" x="238" y="419" transform="rotate(-0, 238, 419)" font-size="10" font-family="SansSerif" font-style="normal" font-weight="normal">-0.5</text>
<text fill="#000000" x="181" y="419" transform="rotate(-0, 181, 419)" font-size="10" font-family="SansSerif" font-style="normal" font-weight="normal">-1.0</text>
<text fill="#000000" x="124" y="419" transform="rotate(-0, 124, 419)" font-size="10" font-family="SansSerif" font-style="normal" font-weight="normal">-1.5</text>
<text fill="#000000" x="67" y="419" transform="rotate(-0, 67, 419)" font-size="10" font-family="SansSerif" font-style="normal" font-weight="normal">-2.0</text>
<text fill="#000000" x="52" y="62" transform="rotate(-0, 52, 62)" font-size="10" font-family="SansSerif" font-style="normal" font-weight="normal">2.0</text>
<text fill="#000000" x="52" y="106" transform="rotate(-0, 52, 106)" font-size="10" font-family="SansSerif" font-style="normal" font-weight="normal">1.5</text>
<text fill="#000000" x="53" y="149" transform="rotate(-0, 53, 149)" font-size="10" font-family="SansSerif" font-style="normal" font-weight="normal">1.0</text>
<text fill="#000000" x="52" y="192" transform="rotate(-0, 52, 192)" font-size="10" font-family="SansSerif" font-style="normal" font-weight="normal">0.5</text>
<text fill="#000000" x="52" y="235" transform="rotate(-0, 52, 235)" font-size="10" font-family="SansSerif" font-style="normal" font-weight="normal">0.0</text>
<text fill="#000000" x="49" y="278" transform="rotate(-0, 49, 278)" font-size="10" font-family="SansSerif" font-style="normal" font-weight="normal">-0.5</text>
<text fill="#000000" x="49" y="321" transform="rotate(-0, 49, 321)" font-size="10" font-family="SansSerif" font-style="normal" font-weight="normal">-1.0</text>
<text fill="#000000" x="49" y="364" transform="rotate(-0, 49, 364)" font-size="10" font-family="SansSerif" font-style="normal" font-weight="normal">-1.5</text>
<text fill="#000000" x="49" y="407" transform="rotate(-0, 49, 407)" font-size="10" font-family="SansSerif" font-style="normal" font-weight="normal">-2.0</text>
<text fill="#000000" x="526" y="419" transform="rotate(-0, 526, 419)" font-size="10" font-family="SansSerif" font-style="normal" font-weight="normal">2.0</text>
<polyline fill="none" stroke="#000000" stroke-width="0.5" points="505.156,402.5 505.156,405.605"/>
<polyline fill="none" stroke="#000000" stroke-width="0.5" points="390.781,402.5 390.781,405.605"/>
<polyline fill="none" stroke="#000000" stroke-width="0.5" points="333.594,402.5 333.594,405.605"/>
<polyline fill="none" stroke="#000000" stroke-width="0.5" points="276.406,402.5 276.406,405.605"/>
<polyline fill="none" stroke="#000000" stroke-width="0.5" points="219.219,402.5 219.219,405.605"/>
<polyline fill="none" stroke="#000000" stroke-width="0.5" points="162.031,402.5 162.031,405.605"/>
<polyline fill="none" stroke="#000000" stroke-width="0.5" points="104.844,402.5 104.844,405.605"/>
<polyline fill="none" stroke="#000000" stroke-width="0.5" points="533.75,402.5 533.75,407.675"/>
<polyline fill="none" stroke="#000000" stroke-width="0.5" points="476.563,402.5 476.563,407.675"/>
<polyline fill="none" stroke="#000000" stroke-width="0.5" points="419.375,402.5 419.375,407.675"/>
<polyline fill="none" stroke="#000000" stroke-width="0.5" points="362.188,402.5 362.188,407.675"/>
<polyline fill="none" stroke="#000000" stroke-width="0.5" points="305,402.5 305,407.675"/>
<polyline fill="none" stroke="#000000" stroke-width="0.5" points="247.813,402.5 247.813,407.675"/>
<polyline fill="none" stroke="#000000" stroke-width="0.5" points="190.625,402.5 190.625,407.675"/>
<polyline fill="none" stroke="#000000" stroke-width="0.5" points="133.438,402.5 133.438,407.675"/>
<polyline fill="none" stroke="#000000" stroke-width="0.5" points="76.25,402.5 76.25,407.675"/>
<polyline fill="none" stroke="#000000" stroke-width="0.5" points="76.25,402.5 533.75,402.5"/>
<polyline fill="none" stroke="#000000" stroke-width="0.5" points="76.25,79.0625 72.1372,79.0625"/>
<polyline fill="none" stroke="#000000" stroke-width="0.5" points="76.25,122.188 72.1372,122.188"/>
<polyline fill="none" stroke="#000000" stroke-width="0.5" points="76.25,165.313 72.1372,165.313"/>
<polyline fill="none" stroke="#000000" stroke-width="0.5" points="76.25,208.438 72.1372,208.438"/>
<polyline fill="none" stroke="#000000" stroke-width="0.5" points="76.25,251.563 72.1372,251.563"/>
<polyline fill="none" stroke="#000000" stroke-width="0.5" points="76.25,294.688 72.1372,294.688"/>
<polyline fill="none" stroke="#000000" stroke-width="0.5" points="76.25,337.813 72.1372,337.813"/>
<polyline fill="none" stroke="#000000" stroke-width="0.5" points="76.25,380.938 72.1372,380.938"/>
<polyline fill="none" stroke="#000000" stroke-width="0.5" points="76.25,57.5 69.395,57.5"/>
<polyline fill="none" stroke="#000000" stroke-width="0.5" points="76.25,100.625 69.395,100.625"/>
<polyline fill="none" stroke="#000000" stroke-width="0.5" points="76.25,143.75 69.395,143.75"/>
<polyline fill="none" stroke="#000000" stroke-width="0.5" points="76.25,186.875 69.395,186.875"/>
<polyline fill="none" stroke="#000000" stroke-width="0.5" points="76.25,230 69.395,230"/>
<polyline fill="none" stroke="#000000" stroke-width="0.5" points="76.25,273.125 69.395,273.125"/>
<polyline fill="none" stroke="#000000" stroke-width="0.5" points="76.25,316.25 69.395,316.25"/>
<polyline fill="none" stroke="#000000" stroke-width="0.5" points="76.25,359.375 69.395,359.375"/>
<polyline fill="none" stroke="#000000" stroke-width="0.5" points="76.25,402.5 69.395,402.5"/>
<polyline fill="none" stroke="#000000" stroke-width="0.5" points="76.25,402.5 76.25,57.5"/>
<polyline fill="none" stroke="#000000" stroke-width="0.5" points="447.969,402.5 447.969,405.605"/>
<text fill="#000000" x="148" y="314" transform="rotate(0, 148, 314)" font-size="10" font-family="SansSerif" font-style="normal" font-weight="normal"> 20</text>
<text fill="#000000" x="180" y="272" transform="rotate(0, 180, 272)" font-size="10" font-family="SansSerif" font-style="normal" font-weight="normal"> 10</text>
<text fill="#000000" x="435" y="186" transform="rotate(0, 435, 186)" font-size="10" font-family="SansSerif" font-style="normal" font-weight="normal"> 10</text>
<text fill="#000000" x="202" y="239" transform="rotate(0, 202, 239)" font-size="10" font-family="SansSerif" font-style="normal" font-weight="normal"> 5</text>
<text fill="#000000" x="413" y="217" transform="rotate(0, 413, 217)" font-size="10" font-family="SansSerif" font-style="normal" font-weight="normal"> 5</text>
<text fill="#000000" x="237" y="231" transform="rotate(0, 237, 231)" font-size="10" font-family="SansSerif" font-style="normal" font-weight="normal"> 2</text>
<text fill="#000000" x="377" y="225" transform="rotate(0, 377, 225)" font-size="10" font-family="SansSerif" font-style="normal" font-weight="normal"> 2</text>
<text fill="#000000" x="394" y="320" transform="rotate(0, 394, 320)" font-size="10" font-family="SansSerif" font-style="normal" font-weight="normal"> 0.3</text>
<text fill="#000000" x="466" y="142" transform="rotate(0, 466, 142)" font-size="10" font-family="SansSerif" font-style="normal" font-weight="normal"> 20</text>
<polyline fill="none" stroke="#000000" stroke-width="0.5" points="255.606,201.698 256.08,202.4 257.242,203.914 257.801,204.757 258.56,205.85 258.815,206.178 259.25,206.814 260.496,208.361 261.15,209.3 262.146,210.566 263.444,212.462 263.649,212.75 263.715,212.833 263.825,212.99 265.456,214.971 266.337,216.2 267.116,217.168 268.4,218.99 268.738,219.395 268.922,219.65 269.751,220.669 270.478,221.533 271.631,223.1 272.145,223.726 272.975,224.873 273.845,225.894 274.332,226.55 275.572,228.042 276.325,229.076 277.022,230 277.226,230.244 277.55,230.681 279.003,232.354 279.837,233.45 280.729,234.502 282.125,236.373 282.405,236.689 282.566,236.9 283.383,237.849 284.207,238.78 285.429,240.35 285.93,240.931 286.7,241.939 287.698,243.047 288.29,243.8 289.478,245.155 290.835,246.918 291.099,247.25 291.169,247.33 291.275,247.466 293.026,249.38 294.087,250.7 294.796,251.495 295.85,252.833 296.571,253.606 297.014,254.15 298.399,255.677 299.186,256.666 299.953,257.6 300.145,257.812 300.425,258.161 302.021,259.846 303.022,261.05 303.833,261.93 305,263.365 305.635,264.021 306.04,264.5 307.506,266.06 308.223,266.931 309.087,267.95 309.289,268.166 309.575,268.511 311.206,270.17 312.264,271.4 313.053,272.227 314.15,273.534 314.904,274.282 315.402,274.85 316.811,276.294 318.153,277.869 318.531,278.3 318.613,278.385 318.725,278.516 320.59,280.344 321.844,281.75 322.466,282.379 323.3,283.339 324.391,284.377 325.139,285.2 326.325,286.369 327.875,288.123 328.189,288.413 328.41,288.65 330.19,290.354 330.306,290.483 331.803,292.1 332.085,292.375 332.45,292.781 334.111,294.297 335.298,295.55 336.063,296.275 337.025,297.323 338.051,298.226 338.804,299 340.066,300.157 341.6,301.791 342.013,302.139 342.325,302.45 344.098,304.016 345.222,305.181 345.932,305.9 346.042,306 346.175,306.14 348.191,307.829 349.739,309.35 350.207,309.76 350.75,310.314 352.351,311.592 353.624,312.8 354.429,313.476 355.325,314.363 356.576,315.307 357.612,316.25 358.723,317.138 359.9,318.263 360.886,318.957 361.745,319.7 363.11,320.729 364.475,321.979 365.311,322.52 366.085,323.15 367.62,324.228 369.05,325.472 369.896,325.962 370.741,326.6 372.298,327.601 373.625,328.685 374.711,329.23 375.913,330.05 377.212,330.795 378.2,331.54 379.882,332.231 382.013,333.5 382.474,333.727 382.775,333.931 383.728,334.219 385.791,334.676 387.35,335.348 389.495,335.117 390.019,334.938 391.925,334.578 392.497,333.931 392.688,333.5 392.742,332.884 393.277,331.069 393.341,330.05 393.164,329.116 393.164,327.534 393.026,326.6 392.8,325.94 392.365,323.482 392.271,323.15 392.185,322.954 391.925,322.072 391.185,320.258 391.057,319.7 390.667,318.751 390.105,317.622 389.638,316.25 389.018,314.992 388.575,313.724 388.187,312.8 387.941,312.354 387.35,310.952 386.73,309.817 386.546,309.35 385.998,308.331 385.417,307.357 384.743,305.9 384.14,304.871 383.156,302.737 383.008,302.45 382.934,302.33 382.775,302.019 381.484,299.974 380.996,299 380.106,297.563 379.649,296.643 379.052,295.55 378.772,295.119 378.2,294.06 377.333,292.753 376.983,292.1 375.88,290.399 375.836,290.317 374.876,288.65 374.454,288.025 373.625,286.565 373.004,285.668 372.738,285.2 371.814,283.834 371.48,283.367 370.506,281.75 370.003,281.031 369.05,279.428 368.524,278.696 368.288,278.3 367.43,277.078 366.953,276.431 365.96,274.85 365.437,274.125 364.475,272.57 363.918,271.82 363.655,271.4 362.664,270.034 362.317,269.577 361.257,267.95 360.77,267.294 359.9,265.938 359.203,265.026 358.86,264.5 357.586,262.795 357.536,262.717 356.413,261.05 356.016,260.529 355.325,259.487 354.394,258.302 353.92,257.6 352.758,256.086 352.199,255.243 351.44,254.15 351.185,253.822 350.75,253.186 349.504,251.639 348.85,250.7 347.854,249.434 346.556,247.538 346.351,247.25 346.285,247.167 346.175,247.01 344.544,245.029 343.663,243.8 342.884,242.832 341.6,241.01 341.262,240.605 341.078,240.35 340.249,239.331 339.522,238.467 338.369,236.9 337.855,236.274 337.025,235.127 336.155,234.106 335.668,233.45 334.428,231.958 333.675,230.924 332.978,230 332.774,229.756 332.45,229.319 330.997,227.646 330.163,226.55 329.271,225.498 327.875,223.627 327.595,223.311 327.434,223.1 326.617,222.151 325.793,221.22 324.571,219.65 324.07,219.069 323.3,218.061 322.302,216.953 321.71,216.2 320.522,214.845 319.165,213.082 318.901,212.75 318.831,212.67 318.725,212.534 316.974,210.62 315.913,209.3 315.204,208.505 314.15,207.167 313.429,206.394 312.986,205.85 311.601,204.323 310.814,203.334 310.047,202.4 309.855,202.188 309.575,201.839 307.979,200.154 306.978,198.95 306.167,198.07 305,196.635 304.365,195.979 303.96,195.5 302.494,193.94 301.777,193.069 300.913,192.05 300.711,191.834 300.425,191.489 298.794,189.83 297.736,188.6 296.947,187.773 295.85,186.466 295.096,185.718 294.598,185.15 293.189,183.706 291.847,182.131 291.469,181.7 291.387,181.615 291.275,181.484 289.41,179.656 288.156,178.25 287.534,177.621 286.7,176.661 285.609,175.623 284.861,174.8 283.675,173.631 282.125,171.877 281.811,171.587 281.59,171.35 279.81,169.646 279.694,169.517 278.197,167.9 277.915,167.625 277.55,167.219 275.889,165.703 274.702,164.45 273.937,163.725 272.975,162.677 271.949,161.774 271.196,161 269.934,159.843 268.4,158.209 267.987,157.861 267.675,157.55 265.902,155.984 264.778,154.819 264.068,154.1 263.958,154 263.825,153.86 261.809,152.171 260.261,150.65 259.793,150.24 259.25,149.686 257.649,148.408 256.376,147.2 255.571,146.524 254.675,145.637 253.424,144.693 252.388,143.75 251.277,142.862 250.1,141.737 249.114,141.043 248.255,140.3 246.89,139.271 245.525,138.021 244.689,137.48 243.915,136.85 242.38,135.772 240.95,134.528 240.104,134.038 239.259,133.4 237.702,132.399 236.375,131.315 235.289,130.77 234.087,129.95 232.788,129.205 231.8,128.46 230.118,127.769 227.987,126.5 227.526,126.273 227.225,126.069 226.272,125.781 224.209,125.324 222.65,124.652 220.505,124.883 219.981,125.063 218.075,125.422 217.503,126.069 217.313,126.5 217.258,127.116 216.723,128.931 216.659,129.95 216.836,130.884 216.836,132.466 216.974,133.4 217.2,134.06 217.635,136.518 217.729,136.85 217.815,137.046 218.075,137.928"/>
<polyline fill="none" stroke="#0000ff" stroke-width="0.5" points="223.748,57.5 225.231,59.0034 227.225,60.9141 227.245,60.9351 227.26,60.9502 227.359,61.0513 229.177,62.9282 230.684,64.3999 231.159,64.8838 231.8,65.501 233.107,66.8643 234.105,67.8501 235.065,68.8379 236.375,70.1143 237.031,70.8052 237.527,71.2998 238.966,72.7959 240.95,74.75 240.95,74.75 240.95,74.75 240.95,74.75 242.853,76.7651 244.284,78.2002 244.804,78.7441 245.525,79.458 246.728,80.7427 247.624,81.6499 248.655,82.7393 250.1,84.1846 250.6,84.7231 250.968,85.1001 252.505,86.7363 253.195,87.4336 254.291,88.5498 254.45,88.7192 254.675,88.9453 256.337,90.7466 257.556,92 258.255,92.75 259.25,93.7603 260.165,94.7598 260.83,95.4502 262.061,96.7803 263.825,98.5894 263.992,98.7739 264.113,98.8999 264.761,99.6055 265.86,100.815 267.332,102.35 267.769,102.826 268.4,103.477 269.648,104.859 270.542,105.8 271.533,106.887 272.975,108.388 273.436,108.902 273.764,109.25 275.3,110.947 275.491,111.147 276.958,112.7 277.198,112.965 277.55,113.333 279.05,115.019 280.109,116.15 280.924,117.056 282.125,118.324 282.802,119.089 283.276,119.6 284.654,121.143 285.829,122.393 286.44,123.05 286.545,123.167 286.7,123.332 288.374,125.238 289.54,126.5 290.235,127.284 291.275,128.397 292.092,129.334 292.657,129.95 293.932,131.397 295.642,133.243 295.786,133.4 295.812,133.429 295.85,133.47 297.621,135.515 298.838,136.85 299.469,137.571 300.425,138.609 301.308,139.634 301.91,140.3 303.133,141.708 305,143.75 305,143.75 305,143.75 305,143.75 306.793,145.848 308.009,147.2 308.626,147.915 309.575,148.959 310.451,149.99 311.04,150.65 312.262,152.074 313.959,153.956 314.088,154.1 314.112,154.128 314.15,154.17 315.893,156.236 317.059,157.55 317.71,158.315 318.725,159.447 319.523,160.398 320.053,161 321.319,162.494 322.568,163.898 323.054,164.45 323.15,164.563 323.3,164.731 324.921,166.678 325.991,167.9 326.722,168.77 327.875,170.074 328.526,170.859 328.953,171.35 330.306,172.967 330.866,173.606 331.905,174.8 332.115,175.052 332.45,175.434 333.88,177.172 334.812,178.25 335.664,179.277 337.025,180.837 337.461,181.371 337.744,181.7 338.931,183.138 339.222,183.494 340.643,185.15 341.01,185.595 341.6,186.276 342.771,187.717 343.523,188.6 344.536,189.836 346.175,191.739 346.331,191.933 346.431,192.05 346.839,192.551 348.066,194.074 349.274,195.5 349.835,196.19 350.75,197.26 351.595,198.313 352.131,198.95 353.341,200.446 354.426,201.722 354.996,202.4 355.121,202.554 355.325,202.795 356.844,204.705 357.802,205.85 358.593,206.836 359.9,208.385 360.354,208.958 360.639,209.3 361.759,210.702 362.079,211.107 363.442,212.75 363.829,213.237 364.475,214.008 365.557,215.384 366.23,216.2 367.285,217.531 369.05,219.65 369.05,219.65 369.05,219.65 369.05,219.65 370.743,221.823 371.789,223.1 372.472,223.969 373.625,225.364 374.206,226.112 374.563,226.55 375.913,228.275 375.913,228.275 377.314,230 377.642,230.421 378.2,231.101 379.344,232.587 380.042,233.45 381.05,234.75 382.775,236.864 382.792,236.887 382.803,236.9 382.842,236.951 384.463,239.077 385.485,240.35 386.169,241.24 387.35,242.699 387.882,243.399 388.203,243.8 389.368,245.322 389.563,245.581 390.892,247.25 391.269,247.745 391.925,248.563 392.952,249.926 393.565,250.7 394.633,252.107 395.91,253.705 396.261,254.15 396.348,254.265 396.5,254.457 398,256.468 398.89,257.6 399.68,258.652 401.075,260.413 401.379,260.821 401.558,261.05 402.186,261.888 403.028,263.027 404.174,264.5 404.705,265.213 405.65,266.417 406.376,267.402 406.801,267.95 408.03,269.605 408.295,269.944 409.417,271.4 409.706,271.792 410.225,272.458 411.35,274.001 412.002,274.85 413,276.208 414.371,277.977 414.618,278.3 414.683,278.389 414.8,278.541 416.3,280.619 417.161,281.75 417.945,282.828 419.375,284.69 419.613,285.021 419.749,285.2 420.201,285.823 421.224,287.256 422.275,288.65 422.864,289.469 423.95,290.896 424.508,291.679 424.824,292.1 425.856,293.538 426.121,293.913 427.343,295.55 427.756,296.13 428.525,297.152 429.375,298.358 429.853,299 430.985,300.595 431.437,301.195 432.363,302.45 432.619,302.813 433.1,303.46 434.215,305.059 434.834,305.9 435.817,307.301 436.913,308.775 437.333,309.35 437.45,309.52 437.675,309.824 439.024,311.783 439.766,312.8 440.619,314.03 442.25,316.25 442.25,316.25 442.25,316.25 442.25,316.25 443.802,318.53 444.645,319.7 445.388,320.784 446.825,322.762 447,323.019 447.094,323.15 447.381,323.57 448.546,325.302 449.47,326.6 450.122,327.563 451.4,329.342 451.715,329.812 451.885,330.05 452.389,330.796 453.255,332.102 454.24,333.5 454.821,334.371 455.975,335.997 456.396,336.632 456.62,336.95 457.273,337.929 457.927,338.928 458.95,340.4 459.481,341.206 460.55,342.731 461.04,343.48 461.297,343.85 462.034,344.969 462.56,345.785 463.6,347.3 464.101,348.072 465.125,349.552 465.645,350.358 465.914,350.75 466.67,351.916 467.151,352.672 468.186,354.2 468.678,354.97 469.7,356.467 470.208,357.267 470.468,357.65 471.184,358.769 471.699,359.593 472.706,361.1 473.21,361.903 474.275,363.484 474.728,364.208 474.957,364.55 475.573,365.529 476.2,366.548 477.156,368 477.695,368.871 478.85,370.614 479.202,371.185 479.376,371.45 479.839,372.196 480.652,373.541 481.533,374.9 482.128,375.878 483.425,377.865 483.627,378.198 483.726,378.35 483.981,378.77 485.052,380.573 485.835,381.8 486.507,382.926 488,385.25 488,385.25 488,385.25 488,385.25 489.396,387.647 490.057,388.7 490.829,390.017 491.813,391.575 492.166,392.15 492.289,392.366 492.575,392.828 493.682,394.765 494.196,395.6 495.089,397.154 495.486,397.795 496.243,399.05 496.512,399.531 497.15,400.583 497.904,401.931 498.248,402.5"/>
<polyline fill="none" stroke="#0000ff" stroke-width="0.5" points="111.752,57.5 112.096,58.0688 112.85,59.4165 113.488,60.4688 113.757,60.9502 114.514,62.2046 114.911,62.8457 115.804,64.3999 116.318,65.2349 117.425,67.1724 117.711,67.6343 117.834,67.8501 118.188,68.4248 119.171,69.9829 119.943,71.2998 120.604,72.353 122,74.75 122,74.75 122,74.75 122,74.75 123.493,77.0742 124.165,78.2002 124.948,79.4272 126.019,81.2305 126.274,81.6499 126.373,81.8022 126.575,82.1353 127.872,84.1221 128.467,85.1001 129.348,86.459 130.161,87.8042 130.624,88.5498 130.798,88.8154 131.15,89.3862 132.305,91.1289 132.844,92 133.8,93.4517 134.427,94.4712 135.043,95.4502 135.272,95.7915 135.725,96.5156 136.79,98.0972 137.294,98.8999 138.301,100.407 138.816,101.231 139.532,102.35 139.792,102.733 140.3,103.533 141.322,105.03 141.814,105.8 142.849,107.328 143.33,108.084 144.086,109.25 144.355,109.642 144.875,110.448 145.899,111.928 146.4,112.7 147.44,114.215 147.966,115.031 148.703,116.15 148.96,116.52 149.45,117.269 150.519,118.794 151.05,119.6 152.073,121.072 152.727,122.071 153.38,123.05 153.604,123.368 154.025,124.003 155.179,125.629 155.76,126.5 156.745,127.898 157.611,129.204 158.115,129.95 158.285,130.188 158.6,130.658 159.878,132.437 160.53,133.4 161.454,134.698 162.619,136.43 162.906,136.85 163,136.981 163.175,137.238 164.612,139.216 165.355,140.3 166.198,141.47 167.75,143.75 167.75,143.75 167.75,143.75 167.75,143.75 169.381,145.97 170.234,147.2 170.976,148.217 172.325,150.176 172.55,150.48 172.667,150.65 173.087,151.225 174.183,152.699 175.166,154.1 175.785,154.941 176.9,156.54 177.381,157.187 177.637,157.55 178.563,158.805 179.015,159.405 180.147,161 180.625,161.642 181.475,162.848 182.244,163.87 182.657,164.45 183.879,166.087 184.144,166.462 185.176,167.9 185.492,168.321 186.05,169.104 187.136,170.531 187.725,171.35 188.776,172.744 189.799,174.177 190.251,174.8 190.387,174.979 190.625,175.31 192.055,177.172 192.839,178.25 193.7,179.381 195.2,181.459 195.317,181.611 195.382,181.7 195.629,182.023 197,183.792 197.998,185.15 198.65,185.999 199.775,187.542 200.294,188.208 200.583,188.6 201.705,190.056 201.97,190.395 203.199,192.05 203.624,192.598 204.35,193.583 205.295,194.787 205.826,195.5 206.972,196.973 207.814,198.112 208.442,198.95 208.621,199.179 208.925,199.587 210.32,201.348 211.11,202.4 212,203.532 213.5,205.543 213.652,205.735 213.739,205.85 214.09,206.295 215.367,207.893 216.435,209.3 217.048,210.074 218.075,211.438 218.731,212.255 219.108,212.75 220.437,214.419 220.632,214.678 221.797,216.2 222.118,216.601 222.65,217.301 223.831,218.76 224.515,219.65 225.537,220.923 227.158,223.049 227.197,223.1 227.208,223.113 227.225,223.136 228.95,225.25 229.958,226.55 230.656,227.413 231.8,228.899 232.358,229.579 232.686,230 234.087,231.725 234.087,231.725 235.438,233.45 235.794,233.888 236.375,234.636 237.528,236.031 238.211,236.9 239.257,238.177 240.95,240.35 240.95,240.35 240.95,240.35 240.95,240.35 242.715,242.469 243.77,243.8 244.443,244.616 245.525,245.992 246.171,246.763 246.558,247.25 247.921,248.893 248.241,249.298 249.361,250.7 249.646,251.042 250.1,251.615 251.407,253.164 252.198,254.15 253.156,255.295 254.675,257.205 254.879,257.446 255.004,257.6 255.574,258.278 256.659,259.554 257.869,261.05 258.405,261.687 259.25,262.74 260.165,263.81 260.726,264.5 261.934,265.926 263.161,267.449 263.569,267.95 263.669,268.067 263.825,268.261 265.464,270.164 266.477,271.4 267.229,272.283 268.4,273.724 268.99,274.405 269.357,274.85 270.778,276.506 271.069,276.862 272.256,278.3 272.539,278.629 272.975,279.163 274.336,280.723 275.188,281.75 276.12,282.828 277.55,284.566 277.885,284.948 278.095,285.2 279.134,286.394 279.694,287.033 281.047,288.65 281.474,289.141 282.125,289.926 283.278,291.23 284.009,292.1 285.079,293.322 286.7,295.269 286.85,295.437 286.946,295.55 287.432,296.102 288.681,297.506 289.947,299 290.477,299.602 291.275,300.553 292.29,301.685 292.941,302.45 294.107,303.764 295.85,305.83 295.888,305.872 295.912,305.9 296.041,306.044 297.738,307.926 298.96,309.35 299.549,310.01 300.425,311.041 301.374,312.085 301.991,312.8 303.207,314.152 305,316.25 305,316.25 305,316.25 305,316.25 306.867,318.292 308.09,319.7 308.692,320.366 309.575,321.391 310.531,322.429 311.162,323.15 312.379,324.485 314.15,326.53 314.188,326.571 314.214,326.6 314.358,326.757 316.068,328.603 317.343,330.05 317.908,330.666 318.725,331.603 319.765,332.716 320.46,333.5 321.626,334.762 323.3,336.668 323.455,336.833 323.56,336.95 324.171,337.607 325.346,338.857 326.724,340.4 327.198,340.911 327.875,341.676 329.076,342.944 329.891,343.85 330.95,344.981 332.45,346.667 332.802,347.035 333.042,347.3 334.509,348.853 334.7,349.053 336.236,350.75 336.564,351.098 337.025,351.612 338.467,353.113 339.458,354.2 340.352,355.141 341.6,356.523 342.231,357.174 342.668,357.65 344.14,359.185 345.239,360.395 345.887,361.1 346.008,361.226 346.175,361.411 347.939,363.22 349.17,364.55 349.835,365.24 350.75,366.24 351.745,367.25 352.444,368 353.663,369.253 355.325,371.055 355.55,371.281 355.709,371.45 356.805,372.566 357.495,373.264 359.032,374.9 359.4,375.277 359.9,375.815 361.345,377.261 362.376,378.35 363.272,379.257 364.475,380.542 365.196,381.256 365.716,381.8 367.147,383.235 369.05,385.25 369.05,385.25 369.05,385.25 369.05,385.25 371.034,387.204 372.473,388.7 372.969,389.195 373.625,389.886 374.935,391.162 375.895,392.15 376.893,393.136 378.2,394.499 378.841,395.116 379.316,395.6 380.823,397.072 382.641,398.949 382.74,399.05 382.755,399.065 382.775,399.086 384.769,400.997 386.252,402.5"/>
<polyline fill="none" stroke="#00ff00" stroke-width="0.5" points="272.568,57.5 272.733,57.6826 272.975,57.9424 274.579,59.7407 275.692,60.9502 276.442,61.7856 277.55,62.9805 278.305,63.8311 278.826,64.3999 280.154,65.8862 281.602,67.4556 281.964,67.8501 282.029,67.9229 282.125,68.0269 283.861,69.9907 285.056,71.2998 285.716,72.042 286.7,73.1123 287.566,74.0967 288.16,74.75 289.408,76.1582 291.275,78.2002 291.275,78.2002 291.275,78.2002 291.275,78.2002 293.096,80.2769 294.338,81.6499 294.942,82.3345 295.85,83.3315 296.781,84.3979 297.414,85.1001 298.614,86.4658 300.425,88.4639 300.47,88.5156 300.501,88.5498 300.648,88.7183 302.283,90.5991 303.54,92 304.12,92.6636 305,93.6377 305.949,94.7339 306.589,95.4502 307.773,96.8091 309.575,98.814 309.62,98.8662 309.65,98.8999 309.793,99.0645 311.423,100.956 312.664,102.35 313.251,103.028 314.15,104.031 315.072,105.105 315.688,105.8 316.886,107.187 318.725,109.25 318.725,109.25 318.725,109.25 318.725,109.25 320.518,111.348 321.711,112.7 322.336,113.427 323.3,114.512 324.149,115.51 324.712,116.15 325.954,117.599 327.417,119.255 327.721,119.6 327.781,119.671 327.875,119.777 329.568,121.773 330.685,123.05 331.375,123.86 332.45,125.081 333.183,125.948 333.664,126.5 334.977,128.045 335.909,129.108 336.642,129.95 336.792,130.126 337.025,130.392 338.573,132.233 339.585,133.4 340.37,134.328 341.6,135.736 342.172,136.419 342.544,136.85 343.956,138.524 344.214,138.821 345.492,140.3 345.757,140.615 346.175,141.096 347.534,142.725 348.416,143.75 349.32,144.828 350.75,146.479 351.118,146.922 351.356,147.2 352.391,148.438 352.889,149.037 354.271,150.65 354.678,151.138 355.325,151.889 356.452,153.25 357.177,154.1 358.227,155.361 359.9,157.31 360.022,157.458 360.101,157.55 360.436,157.954 361.778,159.584 362.981,161 363.555,161.693 364.475,162.769 365.327,163.807 365.872,164.45 367.091,165.927 368.27,167.312 368.768,167.9 368.876,168.031 369.05,168.236 370.624,170.163 371.625,171.35 372.39,172.282 373.625,173.738 374.161,174.396 374.5,174.8 375.913,176.525 375.913,176.525 377.36,178.25 377.68,178.642 378.2,179.258 379.428,180.774 380.203,181.7 381.182,182.901 382.775,184.796 382.953,185.016 383.064,185.15 383.522,185.713 384.687,187.158 385.887,188.6 386.442,189.285 387.35,190.37 388.191,191.416 388.717,192.05 389.932,193.553 390.931,194.75 391.552,195.5 391.693,195.675 391.925,195.954 393.42,197.823 394.35,198.95 395.162,199.959 396.5,201.571 396.913,202.089 397.169,202.4 398.193,203.676 398.639,204.237 399.964,205.85 400.382,206.373 401.075,207.212 402.112,208.518 402.752,209.3 403.84,210.665 405.407,212.566 405.557,212.75 405.592,212.794 405.65,212.865 407.3,214.956 408.314,216.2 409.029,217.102 410.225,218.561 410.763,219.244 411.093,219.65 412.378,221.273 412.478,221.401 413.855,223.1 414.208,223.546 414.8,224.273 415.921,225.705 416.604,226.55 417.637,227.861 419.375,230 419.375,230 419.375,230 419.375,230 421.068,232.173 422.094,233.45 422.783,234.33 423.95,235.773 424.502,236.483 424.836,236.9 426.105,238.525 426.203,238.651 427.562,240.35 427.918,240.808 428.525,241.562 429.618,242.976 430.275,243.8 431.318,245.144 432.867,247.074 433.007,247.25 433.041,247.294 433.1,247.368 434.721,249.478 435.69,250.7 436.421,251.646 437.675,253.218 438.128,253.809 438.398,254.15 439.401,255.452 439.812,255.989 441.083,257.6 441.511,258.157 442.25,259.089 443.199,260.334 443.763,261.05 444.884,262.514 445.91,263.81 446.452,264.5 446.588,264.679 446.825,264.979 448.258,266.87 449.104,267.95 449.941,269.05 451.4,270.904 451.639,271.22 451.78,271.4 452.29,272.071 453.302,273.416 454.419,274.85 454.984,275.597 455.975,276.862 456.665,277.78 457.069,278.3 458.332,279.973 458.532,280.228 459.709,281.75 460.014,282.154 460.55,282.843 461.676,284.351"/>
<polyline fill="none" stroke="#000000" stroke-width="0.5" points="226.844,157.263 226.992,157.55"/>
<polyline fill="none" stroke="#00ff00" stroke-width="0.5" points="462.332,285.2 463.342,286.544 464.766,288.379"/>
<polyline fill="none" stroke="#000000" stroke-width="0.5" points="254.675,200.513 255.606,201.698"/>
<polyline fill="none" stroke="#00ff00" stroke-width="0.5" points="464.975,288.65 465.029,288.723 465.125,288.847 466.673,290.932"/>
<polyline fill="none" stroke="#000000" stroke-width="0.5" points="248.743,192.05 249.23,192.706"/>
<polyline fill="none" stroke="#00ff00" stroke-width="0.5" points="467.57,292.1 468.337,293.128 469.7,294.894 470.012,295.315 470.192,295.55 470.823,296.397 471.656,297.525 472.781,299 473.317,299.723 474.275,300.971 474.975,301.922 475.377,302.45 476.622,304.13 476.782,304.341 477.965,305.9 478.281,306.329 478.85,307.075 479.923,308.541 480.536,309.35 481.566,310.751 482.721,312.269 483.121,312.8 483.229,312.948 483.425,313.206 484.854,315.172 485.666,316.25 486.495,317.385 488,319.375 488.152,319.585 488.239,319.7 488.531,320.101 489.77,321.815 490.768,323.15 491.407,324.031 492.575,325.585 493.049,326.243 493.316,326.6 494.209,327.832 494.668,328.472 495.84,330.05 496.301,330.69 497.15,331.827 497.929,332.913 498.364,333.5 499.546,335.143 499.826,335.518 500.883,336.95 501.178,337.362 501.725,338.1 502.79,339.597 503.382,340.4 504.404,341.83 505.394,343.167 505.895,343.85 506.036,344.049 506.3,344.407 507.633,346.294 508.369,347.3 509.243,348.531 510.875,350.75 510.875,350.75 510.875,350.75 510.875,350.75 512.458,353.006 513.325,354.2 514.063,355.246 515.45,357.146 515.681,357.476 515.808,357.65 516.212,358.225 517.263,359.733 518.249,361.1 518.862,361.977 520.025,363.58 520.468,364.216 520.708,364.55 521.47,365.64 522.047,366.475 523.14,368 523.642,368.723 524.6,370.054 525.234,370.972 525.576,371.45 526.646,372.994 526.811,373.233 527.997,374.9 528.399,375.485 529.175,376.569 529.979,377.744 530.411,378.35 531.551,380.008 531.759,380.299 532.819,381.8 533.136,382.263 533.75,383.129"/>
<polyline fill="none" stroke="#00ff00" stroke-width="0.5" points="76.25,76.8711 76.8643,77.7368 77.1807,78.2002 78.2412,79.7012 78.4487,79.9922 79.5894,81.6499 80.0205,82.2563 80.8252,83.4307 81.6006,84.5151 82.0029,85.1001 83.189,86.7671 83.3535,87.0063 84.4238,88.5498 84.7661,89.0283 85.3999,89.9463 86.3584,91.2773 86.8604,92 87.9531,93.5249 88.5303,94.3604 89.2915,95.4502 89.5322,95.7837 89.9751,96.4204 91.1377,98.0229 91.751,98.8999 92.7373,100.267 93.7876,101.775 94.1924,102.35 94.3188,102.524 94.5498,102.854 95.9375,104.754 96.6748,105.8 97.5425,106.994 99.125,109.25 99.125,109.25 99.125,109.25 99.125,109.25 100.757,111.469 101.631,112.7 102.367,113.706 103.7,115.593 103.964,115.951 104.105,116.15 104.606,116.833 105.596,118.17 106.618,119.6 107.21,120.403 108.275,121.9 108.822,122.638 109.117,123.05 110.174,124.482 110.454,124.857 111.636,126.5 112.071,127.087 112.85,128.173 113.699,129.31 114.16,129.95 115.332,131.528 115.791,132.168 116.684,133.4 116.951,133.757 117.425,134.415 118.593,135.969 119.232,136.85 120.23,138.185 121.469,139.899 121.761,140.3 121.848,140.415 122,140.625 123.505,142.615 124.334,143.75 125.146,144.828 126.575,146.794 126.771,147.052 126.879,147.2 127.279,147.731 128.434,149.249 129.464,150.65 130.077,151.459 131.15,152.925 131.719,153.671 132.035,154.1 133.218,155.659 133.378,155.87 134.623,157.55 135.025,158.078 135.725,159.029 136.683,160.277 137.219,161 138.344,162.475 139.177,163.603 139.808,164.45 139.988,164.685 140.3,165.106 141.663,166.872 142.43,167.9 143.327,169.068 144.875,171.153 144.971,171.277 145.025,171.35 145.234,171.621 146.658,173.456 147.668,174.8 148.324,175.649 149.45,177.157 149.986,177.846 150.291,178.25 151.468,179.772 151.668,180.027 152.931,181.7 153.335,182.22 154.025,183.138 155.016,184.403 155.581,185.15 156.698,186.584 157.71,187.929 158.22,188.6 158.361,188.78 158.6,189.096 160.059,190.95 160.896,192.05 161.742,193.13 163.175,195.021 163.412,195.321 163.548,195.5 164.09,196.19 165.116,197.486 166.237,198.95 166.801,199.666 167.75,200.911 168.489,201.843 168.917,202.4 170.188,204.011 170.599,204.548 171.602,205.85 171.872,206.191 172.325,206.782 173.579,208.354 174.31,209.3 175.279,210.522 176.9,212.632 176.959,212.706 176.993,212.75 177.133,212.926 178.682,214.856 179.725,216.2 180.382,217.024 181.475,218.438 182.082,219.192 182.438,219.65 183.797,221.349 183.895,221.475 185.164,223.1 185.498,223.517 186.05,224.227 187.217,225.67 187.906,226.55 188.932,227.827 190.625,230 190.625,230 190.625,230 190.625,230 192.363,232.139 193.396,233.45 194.079,234.295 195.2,235.727 195.792,236.454 196.145,236.9 197.522,238.599 197.622,238.727 198.907,240.35 199.237,240.756 199.775,241.439 200.971,242.898 201.686,243.8 202.7,245.044 204.35,247.135 204.408,247.206 204.443,247.25 204.593,247.434 206.16,249.335 207.248,250.7 207.888,251.482 208.925,252.788 209.618,253.627 210.036,254.15 211.361,255.763 211.807,256.324 212.831,257.6 213.087,257.911 213.5,258.429 214.838,260.041 215.65,261.05 216.58,262.177 218.075,264.046 218.307,264.325 218.448,264.5 219.069,265.25 220.068,266.447 221.283,267.95 221.809,268.584 222.65,269.63 223.558,270.715 224.113,271.4 225.313,272.842 226.478,274.287 226.936,274.85 227.047,274.984 227.225,275.204 228.818,277.099 229.797,278.3 230.572,279.226 231.8,280.742 232.32,281.358 232.64,281.75 234.087,283.475 234.087,283.475 235.5,285.2 235.839,285.604 236.375,286.262 237.61,287.718 238.375,288.65 239.376,289.837 240.95,291.764 241.124,291.969 241.232,292.1 241.73,292.688 242.909,294.073 244.128,295.55 244.673,296.193 245.525,297.231 246.445,298.307 247.019,299 248.222,300.416 249.564,302.046 249.899,302.45 249.978,302.542 250.1,302.69 251.773,304.639 252.823,305.9 253.548,306.75 254.675,308.111 255.322,308.862 255.729,309.35 257.111,310.963 257.609,311.563 258.644,312.8 258.882,313.078 259.25,313.521 260.68,315.172 261.584,316.25 262.466,317.275 263.825,318.904 264.243,319.385 264.508,319.7 265.786,321.179 266.044,321.476 267.456,323.15 267.828,323.581 268.4,324.264 269.63,325.672 270.415,326.6 271.427,327.767 272.975,329.608 273.208,329.874 273.358,330.05 274.091,330.892 275.023,331.955 276.336,333.5 276.817,334.052 277.55,334.919 278.625,336.14 279.315,336.95 280.432,338.227 282.125,340.223 282.219,340.329 282.279,340.4 282.583,340.745 284.046,342.401 285.288,343.85 285.851,344.49 286.7,345.488 287.664,346.573 288.289,347.3 289.482,348.652 291.275,350.75 291.275,350.75 291.275,350.75 291.275,350.75 293.114,352.813 294.313,354.2 294.928,354.895 295.85,355.969 296.749,356.972 297.336,357.65 298.577,359.044 300.207,360.936 300.35,361.1 300.38,361.134 300.425,361.186 302.227,363.191 303.411,364.55 304.051,365.266 305,366.362 305.88,367.336 306.46,368 307.717,369.401 309.352,371.282 309.499,371.45 309.53,371.484 309.575,371.536 311.386,373.534 312.586,374.9 313.219,375.602 314.15,376.668 315.058,377.666 315.662,378.35 316.904,379.723 318.725,381.8 318.725,381.8 318.725,381.8 318.725,381.8 320.592,383.842 321.84,385.25 322.434,385.903 323.3,386.888 324.284,387.958 324.944,388.7 326.139,390.009 327.875,391.973 327.971,392.077 328.036,392.15 328.398,392.544 329.846,394.114 331.174,395.6 331.695,396.169 332.45,397.02 333.558,398.214 334.308,399.05 335.421,400.259 337.025,402.058 337.267,402.317 337.432,402.5"/>
<polyline fill="none" stroke="#00ffff" stroke-width="0.5" points="322.89,57.5 323.052,57.687 323.3,57.9663 324.857,59.7754 325.891,60.9502 326.674,61.8555 327.875,63.2139 328.493,63.9341 328.902,64.3999 330.3,66.0215 330.845,66.6396 331.907,67.8501 332.121,68.0981 332.45,68.4717 333.921,70.1904 334.892,71.2998 335.73,72.2759 337.025,73.749 337.545,74.3579 337.887,74.75 339.345,76.4507 339.47,76.5938 340.871,78.2002 341.157,78.5337 341.6,79.0391 342.953,80.6294 343.841,81.6499 344.755,82.7207 346.175,84.3452 346.565,84.8057 346.821,85.1001 347.983,86.4634 348.357,86.9043 349.784,88.5498 350.162,88.9937 350.75,89.6689 351.954,91.0923 352.739,92 353.749,93.1885 355.325,95.0034 355.555,95.2764 355.705,95.4502 356.378,96.2441 357.338,97.3823 358.646,98.8999 359.135,99.4771 359.9,100.361 360.924,101.578 361.587,102.35 362.711,103.68 364.475,105.723 364.515,105.77 364.54,105.8 364.654,105.935 366.287,107.883 367.458,109.25 368.077,109.984 369.05,111.115 369.863,112.087 370.387,112.7 371.643,114.195 372.763,115.5 373.318,116.15 373.437,116.292 373.625,116.511 375.206,118.408 376.222,119.6 376.987,120.514 378.2,121.931 378.772,122.619 379.139,123.05 380.543,124.733 380.746,124.97 382.046,126.5 382.327,126.837 382.775,127.362 384.095,128.955 384.938,129.95 385.868,131.067 387.35,132.81 387.651,133.173 387.842,133.4 388.667,134.393 389.412,135.295 390.725,136.85 391.187,137.407 391.925,138.277 392.953,139.524 393.606,140.3 394.718,141.644 396.5,143.75 396.5,143.75 396.5,143.75 396.5,143.75 398.25,145.88 399.358,147.2 400.016,147.999 401.075,149.254 401.782,150.117 402.229,150.65 403.539,152.242 404.149,152.968 405.096,154.1 405.308,154.358 405.65,154.765 407.058,156.488 407.944,157.55 408.815,158.613 410.225,160.294 410.581,160.731 410.805,161 411.739,162.142 412.327,162.865 413.646,164.45 414.086,164.988 414.8,165.843 415.836,167.119 416.485,167.9 417.585,169.25 419.27,171.271 419.335,171.35 419.351,171.369 419.375,171.398 421.084,173.511 422.151,174.8 422.834,175.641 423.95,176.984 424.585,177.771 424.981,178.25 426.326,179.909 426.619,180.263 427.804,181.7 428.077,182.038 428.525,182.579 429.813,184.179 430.612,185.15 431.554,186.316 433.1,188.188 433.306,188.445 433.433,188.6 433.95,189.241 435.033,190.592 436.228,192.05 436.774,192.729 437.675,193.823 438.512,194.869 439.028,195.5 440.244,197.013 441.157,198.126 441.831,198.95 441.989,199.147 442.25,199.466 443.711,201.298 444.609,202.4 445.443,203.442 446.825,205.131 447.183,205.581 447.402,205.85 448.275,206.943 448.902,207.733 450.175,209.3 450.635,209.877 451.4,210.815 452.36,212.026 452.946,212.75 454.082,214.177 455.336,215.718 455.726,216.2 455.819,216.317 455.975,216.509 457.529,218.478 458.477,219.65 459.252,220.629 460.55,222.229 460.98,222.775 461.242,223.1 462.266,224.394 462.691,224.935 463.991,226.55 464.414,227.086 465.125,227.966 466.128,229.244 466.736,230 467.841,231.402 469.169,233.05 469.49,233.45 469.568,233.549 469.7,233.713 471.268,235.717 472.214,236.9 472.98,237.876 474.275,239.487 474.699,240.03 474.954,240.35 475.936,241.603 476.4,242.198 477.677,243.8 478.112,244.356 478.85,245.279 479.816,246.521 480.396,247.25 481.519,248.688 482.673,250.133 483.124,250.7 483.235,250.843 483.425,251.082 484.926,253.019 485.823,254.15 486.627,255.185 488,256.91 488.337,257.346 488.538,257.6 489.298,258.579 490.026,259.522 491.232,261.05 491.728,261.689 492.575,262.758 493.424,263.86 493.928,264.5 495.115,266.035 495.861,266.978 496.625,267.95 496.818,268.2 497.15,268.62 498.501,270.381 499.301,271.4 500.192,272.556 501.725,274.501 501.894,274.723 501.994,274.85 502.366,275.333 503.57,276.909 504.658,278.3 505.259,279.084 506.3,280.41 506.949,281.261 507.331,281.75 508.628,283.444 508.747,283.595 509.997,285.2 510.318,285.62 510.875,286.333 511.994,287.806 512.65,288.65 513.673,289.99 515.132,291.86 515.318,292.1 515.366,292.163 515.45,292.271 517.03,294.358 517.953,295.55 518.707,296.544 520.025,298.239 520.391,298.724 520.605,299 521.379,300.021 522.056,300.919 523.237,302.45 523.732,303.105 524.6,304.226 525.403,305.294 525.87,305.9 527.069,307.488 527.577,308.145 528.502,309.35 528.746,309.673 529.175,310.23 530.405,311.872 531.117,312.8 532.07,314.067 533.75,316.25 533.75,316.25 533.75,316.25 533.75,316.25"/>
<polyline fill="none" stroke="#00ffff" stroke-width="0.5" points="76.25,143.75 76.25,143.75 76.25,143.75 76.25,143.75 77.9302,145.933 78.8828,147.2 79.5947,148.128 80.8252,149.77 81.2539,150.327 81.4976,150.65 82.4233,151.855 82.9307,152.512 84.1299,154.1 84.5967,154.706 85.3999,155.774 86.2681,156.895 86.7632,157.55 87.9443,159.081 88.6206,159.979 89.395,161 89.6089,161.276 89.9751,161.761 91.293,163.456 92.0474,164.45 92.9702,165.642 94.5498,167.729 94.6338,167.837 94.6816,167.9 94.8677,168.14 96.3271,170.01 97.3496,171.35 98.0059,172.194 99.125,173.667 99.6821,174.38 100.003,174.8 101.253,176.405 101.372,176.556 102.669,178.25 103.051,178.739 103.7,179.59 104.741,180.916 105.342,181.7 106.43,183.091 107.634,184.667 108.006,185.15 108.106,185.277 108.275,185.499 109.808,187.444 110.699,188.6 111.499,189.619 112.85,191.38 113.182,191.8 113.375,192.05 114.139,193.022 114.885,193.965 116.072,195.5 116.576,196.14 117.425,197.242 118.272,198.311 118.768,198.95 119.974,200.478 120.702,201.421 121.462,202.4 121.663,202.654 122,203.09 123.373,204.815 124.177,205.85 125.074,206.981 126.575,208.918 126.765,209.157 126.876,209.3 127.327,209.867 128.481,211.313 129.604,212.75 130.184,213.479 131.15,214.721 131.888,215.644 132.323,216.2 133.6,217.802 134.064,218.397 135.046,219.65 135.301,219.97 135.725,220.513 137.02,222.124 137.786,223.1 138.732,224.283 140.3,226.287 140.432,226.451 140.51,226.55 140.831,226.95 142.159,228.598 143.264,230 143.872,230.756 144.875,232.034 145.586,232.914 146.009,233.45 147.309,235.065 147.734,235.606 148.758,236.9 149.02,237.225 149.45,237.771 150.748,239.371 151.523,240.35 152.471,241.522 154.025,243.491 154.181,243.683 154.274,243.8 154.664,244.282 155.918,245.823 157.054,247.25 157.64,247.974 158.6,249.185 159.365,250.123 159.825,250.7 161.098,252.267 161.725,253.057 162.598,254.15 162.817,254.419 163.175,254.869 164.557,256.558 165.391,257.6 166.289,258.702 167.75,260.534 168.011,260.853 168.169,261.05 168.843,261.874 169.756,262.987 170.972,264.5 171.488,265.131 172.325,266.177 173.226,267.271 173.772,267.95 174.967,269.408 176.05,270.759 176.567,271.4 176.694,271.555 176.9,271.812 178.446,273.684 179.388,274.85 180.188,275.821 181.475,277.421 181.923,277.962 182.196,278.3 183.381,279.737 183.674,280.091 185.019,281.75 185.415,282.229 186.05,283.016 187.166,284.359 187.849,285.2 188.916,286.489 190.625,288.602 190.649,288.631 190.665,288.65 190.73,288.729 192.415,290.75 193.515,292.1 194.164,292.881 195.2,294.157 195.914,295.012 196.354,295.55 197.673,297.135 198.261,297.858 199.195,299 199.419,299.269 199.775,299.706 201.185,301.387 202.056,302.45 202.942,303.512 204.35,305.235 204.692,305.642 204.904,305.9 205.851,307.032 206.461,307.758 207.771,309.35 208.218,309.883 208.925,310.746 209.984,312.001 210.642,312.8 211.75,314.12 213.5,316.25 213.5,316.25 213.5,316.25 213.5,316.25 215.282,318.356 216.394,319.7 217.047,320.476 218.075,321.723 218.813,322.593 219.275,323.15 220.588,324.705 221.333,325.607 222.158,326.6 222.349,326.827 222.65,327.19 224.132,328.933 225.062,330.05 225.905,331.045 227.225,332.638 227.673,333.163 227.954,333.5 229.254,335.03 229.457,335.267 230.861,336.95 231.228,337.381 231.8,338.069 233.013,339.486 233.778,340.4 234.794,341.592 236.375,343.489 236.563,343.708 236.682,343.85 237.237,344.5 238.357,345.805 239.613,347.3 240.137,347.913 240.95,348.885 241.923,350.016 242.542,350.75 243.713,352.117 245.346,354.065 245.46,354.2 245.485,354.23 245.525,354.277 247.289,356.32 248.413,357.65 249.076,358.422 250.1,359.639 250.865,360.523 251.354,361.1 252.662,362.618 253.622,363.756 254.295,364.55 254.445,364.724 254.675,364.997 256.251,366.812 257.261,368 258.046,368.908 259.25,370.331 259.838,371.006 260.216,371.45 261.643,373.096 262.017,373.537 263.179,374.9 263.435,375.194 263.825,375.655 265.245,377.279 266.159,378.35 267.047,379.371 268.4,380.961 268.843,381.466 269.129,381.8 270.53,383.406 270.655,383.549 272.113,385.25 272.455,385.642 272.975,386.251 274.27,387.724 275.108,388.7 276.079,389.81 277.55,391.528 277.879,391.902 278.093,392.15 279.155,393.36 279.7,393.979 281.098,395.6 281.507,396.066 282.125,396.786 283.326,398.145 284.109,399.05 285.143,400.225 286.7,402.034 286.948,402.313 287.11,402.5"/>
<polyline fill="none" stroke="#ff0000" stroke-width="0.5" points="391.878,57.5 391.896,57.522 391.925,57.5552 393.672,59.6328 394.797,60.9502 395.459,61.7349 396.5,62.9497 397.246,63.8379 397.725,64.3999 399.026,65.9453 399.892,66.9575 400.652,67.8501 400.816,68.0449 401.075,68.3477 402.59,70.1572 403.563,71.2998 404.372,72.2637 405.65,73.7612 406.157,74.3677 406.482,74.75 407.913,76.4561 407.932,76.4795 409.393,78.2002 409.715,78.585 410.225,79.1841 411.488,80.6978 412.294,81.6499 413.264,82.8086 414.8,84.6167 415.047,84.9136 415.205,85.1001 415.894,85.9248 416.814,87.0308 418.099,88.5498 418.591,89.1406 419.375,90.0649 420.363,91.2544 420.992,92 422.134,93.3696 423.796,95.3335 423.894,95.4502 423.916,95.4761 423.95,95.5166 425.676,97.5986 426.771,98.8999 427.447,99.7129 428.525,100.99 429.218,101.828 429.657,102.35 430.982,103.947 431.575,104.65 432.541,105.8 432.756,106.06 433.1,106.468 434.516,108.183 435.411,109.25 436.281,110.301 437.675,111.959 438.052,112.416 438.289,112.7 439.306,113.93 439.809,114.541 441.155,116.15 441.575,116.659 442.25,117.463 443.334,118.782 444.018,119.6 445.094,120.906 446.825,122.973 446.864,123.021 446.889,123.05 446.994,123.177 448.613,125.152 449.736,126.5 450.373,127.274 451.4,128.503 452.132,129.397 452.592,129.95 453.886,131.525 454.558,132.331 455.446,133.4 455.648,133.646 455.975,134.039 457.396,135.778 458.286,136.85 459.15,137.906 460.55,139.588 460.91,140.029 461.134,140.3 462.075,141.45 462.655,142.162 463.97,143.75 464.41,144.289 465.125,145.15 466.159,146.42 466.803,147.2 467.906,148.553 469.552,150.539 469.645,150.65 469.666,150.676 469.7,150.718 471.403,152.816 472.461,154.1 473.151,154.947 474.275,156.307 474.9,157.079 475.289,157.55 476.642,159.215 476.903,159.532 478.111,161 478.391,161.346 478.85,161.902 480.13,163.485 480.922,164.45 481.872,165.622 483.425,167.508 483.622,167.751 483.743,167.9 484.242,168.516 485.354,169.896 486.545,171.35 487.097,172.031 488,173.131 488.836,174.169 489.352,174.8 490.571,176.311 491.491,177.433 492.159,178.25 492.316,178.445 492.575,178.761 494.045,180.591 494.95,181.7 495.781,182.732 497.15,184.406 497.522,184.87 497.75,185.15 498.675,186.3 499.249,187.017 500.538,188.6 500.985,189.158 501.725,190.064 502.716,191.303 503.323,192.05 504.445,193.449 505.823,195.141 506.115,195.5 506.185,195.587 506.3,195.729 507.905,197.74 508.885,198.95 509.634,199.886 510.875,201.413 511.366,202.029 511.667,202.4 512.865,203.901 513.088,204.181 514.438,205.85 514.818,206.327 515.45,207.106 516.54,208.478 517.203,209.3 518.262,210.629 519.907,212.661 519.979,212.75 519.996,212.772 520.025,212.808 521.708,214.931 522.729,216.2 523.431,217.082 524.6,218.53 525.155,219.231 525.491,219.65 526.819,221.324 526.87,221.388 528.245,223.1 528.593,223.539 529.175,224.262 530.307,225.696 530.992,226.55 532.023,227.853 533.75,230 533.75,230 533.75,230 533.75,230"/>
<polyline fill="none" stroke="#ff0000" stroke-width="0.5" points="76.25,230 76.25,230 76.25,230 76.25,230 77.9771,232.147 79.0078,233.45 79.6929,234.304 80.8252,235.738 81.4067,236.461 81.7549,236.9 83.1299,238.612 83.1807,238.676 84.5088,240.35 84.8452,240.769 85.3999,241.47 86.5693,242.918 87.2705,243.8 88.292,245.069 89.9751,247.192 90.0039,247.228 90.021,247.25 90.0928,247.339 91.7378,249.371 92.7969,250.7 93.46,251.522 94.5498,252.894 95.1821,253.673 95.5625,254.15 96.9116,255.819 97.1348,256.099 98.3335,257.6 98.6338,257.971 99.125,258.587 100.366,260.114 101.115,261.05 102.095,262.26 103.7,264.271 103.815,264.413 103.885,264.5 104.177,264.859 105.555,266.551 106.677,267.95 107.284,268.697 108.275,269.936 109.015,270.842 109.462,271.4 110.751,272.983 111.325,273.7 112.25,274.85 112.478,275.13 112.85,275.594 114.219,277.268 115.05,278.3 115.955,279.409 117.425,281.239 117.684,281.555 117.841,281.75 118.509,282.567 119.429,283.689 120.648,285.2 121.164,285.831 122,286.869 122.903,287.969 123.455,288.65 124.646,290.104 125.758,291.484 126.257,292.1 126.378,292.249 126.575,292.492 128.128,294.378 129.078,295.55 129.87,296.515 131.15,298.098 131.609,298.654 131.889,299 133.097,300.468 133.358,300.785 134.711,302.45 135.1,302.921 135.725,303.693 136.849,305.053 137.539,305.9 138.597,307.184 140.3,309.282 140.334,309.324 140.355,309.35 140.448,309.461 142.094,311.447 143.197,312.8 143.841,313.58 144.875,314.85 145.59,315.711 146.03,316.25 147.345,317.838 147.925,318.55 148.866,319.7 149.09,319.971 149.45,320.412 150.85,322.094 151.714,323.15 152.604,324.222 154.025,325.961 154.352,326.354 154.554,326.6 155.442,327.669 156.114,328.475 157.408,330.05 157.868,330.603 158.6,331.497 159.627,332.726 160.264,333.5 161.387,334.848 163.006,336.823 163.111,336.95 163.136,336.979 163.175,337.027 164.906,339.094 165.982,340.4 166.666,341.218 167.75,342.537 168.425,343.341 168.845,343.85 170.191,345.459 170.694,346.07 171.711,347.3 171.948,347.584 172.325,348.041 173.719,349.699 174.589,350.75 175.484,351.817 176.9,353.532 177.244,353.94 177.459,354.2 178.425,355.35 179.018,356.053 180.343,357.65 180.782,358.172 181.475,359.01 182.553,360.287 183.229,361.1 184.324,362.401 186.05,364.483 186.084,364.524 186.106,364.55 186.204,364.667 187.866,366.63 189.008,368 189.637,368.746 190.625,369.935 191.409,370.859 191.901,371.45 193.186,372.969 194.106,374.075 194.795,374.9 194.953,375.086 195.2,375.383 196.736,377.191 197.706,378.35 198.512,379.302 199.775,380.816 200.285,381.415 200.607,381.8 202.068,383.521 202.087,383.544 203.518,385.25 203.843,385.632 204.35,386.239 205.628,387.736 206.437,388.7 207.41,389.843 208.925,391.652 209.184,391.955 209.348,392.15 210.108,393.042 210.974,394.055 212.275,395.6 212.754,396.162 213.5,397.05 214.541,398.265 215.203,399.05 216.328,400.367 218.075,402.445 218.104,402.478 218.122,402.5"/>
<polyline fill="none" stroke="#000000" stroke-width="0.5" points="253.984,199.471 254.675,200.513"/>
<polyline fill="none" stroke="#000000" stroke-width="0.5" points="253.587,198.95 253.984,199.471"/>
<polyline fill="none" stroke="#000000" stroke-width="0.5" points="252.464,197.283 253.587,198.95"/>
<polyline fill="none" stroke="#000000" stroke-width="0.5" points="252.414,197.205 252.464,197.283"/>
<polyline fill="none" stroke="#000000" stroke-width="0.5" points="251.14,195.5 252.414,197.205"/>
<polyline fill="none" stroke="#000000" stroke-width="0.5" points="250.797,194.974 251.14,195.5"/>
<polyline fill="none" stroke="#000000" stroke-width="0.5" points="250.1,194.063 250.797,194.974"/>
<polyline fill="none" stroke="#00ff00" stroke-width="0.5" points="464.766,288.379 464.975,288.65"/>
<polyline fill="none" stroke="#000000" stroke-width="0.5" points="249.23,192.706 250.1,194.063"/>
<polyline fill="none" stroke="#000000" stroke-width="0.5" points="247.683,190.423 248.743,192.05"/>
<polyline fill="none" stroke="#000000" stroke-width="0.5" points="247.336,189.966 247.683,190.423"/>
<polyline fill="none" stroke="#000000" stroke-width="0.5" points="246.345,188.6 247.336,189.966"/>
<polyline fill="none" stroke="#000000" stroke-width="0.5" points="246.082,188.18 246.345,188.6"/>
<polyline fill="none" stroke="#000000" stroke-width="0.5" points="245.525,187.43 246.082,188.18"/>
<polyline fill="none" stroke="#000000" stroke-width="0.5" points="244.563,185.875 245.525,187.43"/>
<polyline fill="none" stroke="#000000" stroke-width="0.5" points="244.04,185.15 244.563,185.875"/>
<polyline fill="none" stroke="#000000" stroke-width="0.5" points="243.047,183.569 244.04,185.15"/>
<polyline fill="none" stroke="#000000" stroke-width="0.5" points="242.57,182.922 243.047,183.569"/>
<polyline fill="none" stroke="#000000" stroke-width="0.5" points="241.712,181.7 242.57,182.922"/>
<polyline fill="none" stroke="#000000" stroke-width="0.5" points="241.476,181.304 241.712,181.7"/>
<polyline fill="none" stroke="#000000" stroke-width="0.5" points="240.95,180.572 241.476,181.304"/>
<polyline fill="none" stroke="#000000" stroke-width="0.5" points="239.997,178.969 240.95,180.572"/>
<polyline fill="none" stroke="#000000" stroke-width="0.5" points="239.494,178.25 239.997,178.969"/>
<polyline fill="none" stroke="#000000" stroke-width="0.5" points="238.52,176.633 239.494,178.25"/>
<polyline fill="none" stroke="#000000" stroke-width="0.5" points="238.186,176.166 238.52,176.633"/>
<polyline fill="none" stroke="#000000" stroke-width="0.5" points="237.262,174.8 238.186,176.166"/>
<polyline fill="none" stroke="#000000" stroke-width="0.5" points="236.996,174.332 237.262,174.8"/>
<polyline fill="none" stroke="#000000" stroke-width="0.5" points="225.86,155.129 226.844,157.263"/>
<polyline fill="none" stroke="#000000" stroke-width="0.5" points="225.257,154.1 225.86,155.129"/>
<polyline fill="none" stroke="#000000" stroke-width="0.5" points="224.583,152.643 225.257,154.1"/>
<polyline fill="none" stroke="#000000" stroke-width="0.5" points="224.002,151.669 224.583,152.643"/>
<polyline fill="none" stroke="#000000" stroke-width="0.5" points="223.454,150.65 224.002,151.669"/>
<polyline fill="none" stroke="#000000" stroke-width="0.5" points="223.27,150.183 223.454,150.65"/>
<polyline fill="none" stroke="#000000" stroke-width="0.5" points="222.65,149.048 223.27,150.183"/>
<polyline fill="none" stroke="#000000" stroke-width="0.5" points="222.059,147.646 222.65,149.048"/>
<polyline fill="none" stroke="#000000" stroke-width="0.5" points="221.813,147.2 222.059,147.646"/>
<polyline fill="none" stroke="#000000" stroke-width="0.5" points="236.375,173.435 236.996,174.332"/>
<polyline fill="none" stroke="#000000" stroke-width="0.5" points="235.546,171.975 236.375,173.435"/>
<polyline fill="none" stroke="#000000" stroke-width="0.5" points="235.124,171.35 235.546,171.975"/>
<polyline fill="none" stroke="#000000" stroke-width="0.5" points="234.164,169.683 235.124,171.35"/>
<polyline fill="none" stroke="#000000" stroke-width="0.5" points="234.12,169.601 234.164,169.683"/>
<polyline fill="none" stroke="#000000" stroke-width="0.5" points="233.017,167.9 234.12,169.601"/>
<polyline fill="none" stroke="#000000" stroke-width="0.5" points="232.667,167.247 233.017,167.9"/>
<polyline fill="none" stroke="#000000" stroke-width="0.5" points="231.8,165.94 232.667,167.247"/>
<polyline fill="none" stroke="#000000" stroke-width="0.5" points="231.228,164.881 231.8,165.94"/>
<polyline fill="none" stroke="#000000" stroke-width="0.5" points="230.948,164.45 231.228,164.881"/>
<polyline fill="none" stroke="#000000" stroke-width="0.5" points="230.351,163.357 230.948,164.45"/>
<polyline fill="none" stroke="#000000" stroke-width="0.5" points="229.894,162.438 230.351,163.357"/>
<polyline fill="none" stroke="#000000" stroke-width="0.5" points="229.004,161 229.894,162.438"/>
<polyline fill="none" stroke="#000000" stroke-width="0.5" points="228.516,160.026 229.004,161"/>
<polyline fill="none" stroke="#000000" stroke-width="0.5" points="227.225,157.981 228.516,160.026"/>
<polyline fill="none" stroke="#000000" stroke-width="0.5" points="227.066,157.67 227.225,157.981"/>
<polyline fill="none" stroke="#00ff00" stroke-width="0.5" points="466.673,290.932 467.57,292.1"/>
<polyline fill="none" stroke="#000000" stroke-width="0.5" points="226.992,157.55 227.066,157.67"/>
<polyline fill="none" stroke="#000000" stroke-width="0.5" points="221.425,146.276 221.813,147.2"/>
<polyline fill="none" stroke="#000000" stroke-width="0.5" points="220.982,145.008 221.425,146.276"/>
<polyline fill="none" stroke="#000000" stroke-width="0.5" points="220.362,143.75 220.982,145.008"/>
<polyline fill="none" stroke="#000000" stroke-width="0.5" points="219.895,142.378 220.362,143.75"/>
<polyline fill="none" stroke="#000000" stroke-width="0.5" points="219.333,141.249 219.895,142.378"/>
<polyline fill="none" stroke="#000000" stroke-width="0.5" points="218.943,140.3 219.333,141.249"/>
<polyline fill="none" stroke="#000000" stroke-width="0.5" points="218.815,139.742 218.943,140.3"/>
<polyline fill="none" stroke="#000000" stroke-width="0.5" points="218.075,137.928 218.815,139.742"/>
<polyline fill="none" stroke="#00ff00" stroke-width="0.5" points="461.676,284.351 462.332,285.2"/>
</g>
</svg>
