<?xml version="1.0" encoding="UTF-8" standalone="no"?>
<svg xmlns="http://www.w3.org/2000/svg"
     xmlns:xlink="http://www.w3.org/1999/xlink"
     width="500px" height="500px" viewBox="0 0 500 500">
<title>Figure 0</title>
<desc>
Creator: GL2PS 1.3.2, (C) 1999-2006 Christophe Geuzaine (geuz@geuz.org)
For: Scilab
CreationDate: Thu May 13 15:37:55 2010
</desc>
<defs>
</defs>
<g>
<polygon fill="#ffffff" points="62.5,437.5 437.5,437.5 62.5,62.5"/>
<polygon fill="#ffffff" points="437.5,437.5 437.5,62.5 62.5,62.5"/>
<polygon fill="#ffffff" points="62.5,437.5 62.5,62.5 62.5,437.5"/>
<polygon fill="#ffffff" points="62.5,437.5 437.5,437.5 62.5,437.5"/>
<polygon fill="#ffffff" points="62.5,62.5 62.5,62.5 62.5,437.5"/>
<polygon fill="#ffffff" points="437.5,437.5 437.5,437.5 62.5,437.5"/>
<text fill="#000000" x="33" y="442" font-size="10" font-family="SansSerif.plain">-1.0</text>
<text fill="#000000" x="33" y="405" font-size="10" font-family="SansSerif.plain">-0.8</text>
<text fill="#000000" x="33" y="367" font-size="10" font-family="SansSerif.plain">-0.6</text>
<text fill="#000000" x="33" y="330" font-size="10" font-family="SansSerif.plain">-0.4</text>
<text fill="#000000" x="33" y="292" font-size="10" font-family="SansSerif.plain">-0.2</text>
<text fill="#000000" x="38" y="255" font-size="10" font-family="SansSerif.plain">0.0</text>
<text fill="#000000" x="39" y="217" font-size="10" font-family="SansSerif.plain">0.2</text>
<text fill="#000000" x="39" y="180" font-size="10" font-family="SansSerif.plain">0.4</text>
<text fill="#000000" x="39" y="142" font-size="10" font-family="SansSerif.plain">0.6</text>
<text fill="#000000" x="38" y="105" font-size="10" font-family="SansSerif.plain">0.8</text>
<text fill="#000000" x="39" y="67" font-size="10" font-family="SansSerif.plain">1.0</text>
<text fill="#000000" x="52" y="455" font-size="10" font-family="SansSerif.plain">-1.0</text>
<text fill="#000000" x="89" y="455" font-size="10" font-family="SansSerif.plain">-0.8</text>
<text fill="#000000" x="127" y="455" font-size="10" font-family="SansSerif.plain">-0.6</text>
<text fill="#000000" x="164" y="455" font-size="10" font-family="SansSerif.plain">-0.4</text>
<text fill="#000000" x="202" y="455" font-size="10" font-family="SansSerif.plain">-0.2</text>
<text fill="#000000" x="242" y="455" font-size="10" font-family="SansSerif.plain">0.0</text>
<text fill="#000000" x="280" y="455" font-size="10" font-family="SansSerif.plain">0.2</text>
<text fill="#000000" x="317" y="455" font-size="10" font-family="SansSerif.plain">0.4</text>
<text fill="#000000" x="355" y="455" font-size="10" font-family="SansSerif.plain">0.6</text>
<text fill="#000000" x="392" y="455" font-size="10" font-family="SansSerif.plain">0.8</text>
<text fill="#000000" x="430" y="455" font-size="10" font-family="SansSerif.plain">1.0</text>
<polyline fill="none" stroke="#000000" stroke-width="1" points="62.5,437.5 62.5,62.5"/>
<polyline fill="none" stroke="#000000" stroke-width="1" points="62.5,437.5 56.875,437.5"/>
<polyline fill="none" stroke="#000000" stroke-width="1" points="62.5,400 56.875,400"/>
<polyline fill="none" stroke="#000000" stroke-width="1" points="62.5,362.5 56.875,362.5"/>
<polyline fill="none" stroke="#000000" stroke-width="1" points="62.5,325 56.875,325"/>
<polyline fill="none" stroke="#000000" stroke-width="1" points="62.5,287.5 56.875,287.5"/>
<polyline fill="none" stroke="#000000" stroke-width="1" points="62.5,250 56.875,250"/>
<polyline fill="none" stroke="#000000" stroke-width="1" points="62.5,212.5 56.875,212.5"/>
<polyline fill="none" stroke="#000000" stroke-width="1" points="62.5,175 56.875,175"/>
<polyline fill="none" stroke="#000000" stroke-width="1" points="62.5,137.5 56.875,137.5"/>
<polyline fill="none" stroke="#000000" stroke-width="1" points="62.5,100 56.875,100"/>
<polyline fill="none" stroke="#000000" stroke-width="1" points="62.5,62.5 56.875,62.5"/>
<polyline fill="none" stroke="#000000" stroke-width="1" points="62.5,418.75 59.125,418.75"/>
<polyline fill="none" stroke="#000000" stroke-width="1" points="62.5,381.25 59.125,381.25"/>
<polyline fill="none" stroke="#000000" stroke-width="1" points="62.5,343.75 59.125,343.75"/>
<polyline fill="none" stroke="#000000" stroke-width="1" points="62.5,306.25 59.125,306.25"/>
<polyline fill="none" stroke="#000000" stroke-width="1" points="62.5,268.75 59.125,268.75"/>
<polyline fill="none" stroke="#000000" stroke-width="1" points="62.5,231.25 59.125,231.25"/>
<polyline fill="none" stroke="#000000" stroke-width="1" points="62.5,193.75 59.125,193.75"/>
<polyline fill="none" stroke="#000000" stroke-width="1" points="62.5,156.25 59.125,156.25"/>
<polyline fill="none" stroke="#000000" stroke-width="1" points="62.5,118.75 59.125,118.75"/>
<polyline fill="none" stroke="#000000" stroke-width="1" points="62.5,81.25 59.125,81.25"/>
<polyline fill="none" stroke="#000000" stroke-width="1" points="62.5,437.5 437.5,437.5"/>
<polyline fill="none" stroke="#000000" stroke-width="1" points="62.5,437.5 62.5,443.125"/>
<polyline fill="none" stroke="#000000" stroke-width="1" points="100,437.5 100,443.125"/>
<polyline fill="none" stroke="#000000" stroke-width="1" points="137.5,437.5 137.5,443.125"/>
<polyline fill="none" stroke="#000000" stroke-width="1" points="175,437.5 175,443.125"/>
<polyline fill="none" stroke="#000000" stroke-width="1" points="212.5,437.5 212.5,443.125"/>
<polyline fill="none" stroke="#000000" stroke-width="1" points="250,437.5 250,443.125"/>
<polyline fill="none" stroke="#000000" stroke-width="1" points="287.5,437.5 287.5,443.125"/>
<polyline fill="none" stroke="#000000" stroke-width="1" points="325,437.5 325,443.125"/>
<polyline fill="none" stroke="#000000" stroke-width="1" points="362.5,437.5 362.5,443.125"/>
<polyline fill="none" stroke="#000000" stroke-width="1" points="400,437.5 400,443.125"/>
<polyline fill="none" stroke="#000000" stroke-width="1" points="437.5,437.5 437.5,443.125"/>
<polyline fill="none" stroke="#000000" stroke-width="1" points="81.25,437.5 81.25,440.875"/>
<polyline fill="none" stroke="#000000" stroke-width="1" points="118.75,437.5 118.75,440.875"/>
<polyline fill="none" stroke="#000000" stroke-width="1" points="156.25,437.5 156.25,440.875"/>
<polyline fill="none" stroke="#000000" stroke-width="1" points="193.75,437.5 193.75,440.875"/>
<polyline fill="none" stroke="#000000" stroke-width="1" points="231.25,437.5 231.25,440.875"/>
<polyline fill="none" stroke="#000000" stroke-width="1" points="268.75,437.5 268.75,440.875"/>
<polyline fill="none" stroke="#000000" stroke-width="1" points="306.25,437.5 306.25,440.875"/>
<polyline fill="none" stroke="#000000" stroke-width="1" points="343.75,437.5 343.75,440.875"/>
<polyline fill="none" stroke="#000000" stroke-width="1" points="381.25,437.5 381.25,440.875"/>
<polyline fill="none" stroke="#000000" stroke-width="1" points="418.75,437.5 418.75,440.875"/>
<text fill="#000000" x="333" y="228" font-size="10" font-family="SansSerif.plain"> 0.1</text>
<text fill="#000000" x="368" y="221" font-size="10" font-family="SansSerif.plain"> 0.2</text>
<text fill="#000000" x="417" y="217" font-size="10" font-family="SansSerif.plain"> 0.4</text>
<text fill="#000000" x="397" y="393" font-size="10" font-family="SansSerif.plain"> 0.6</text>
<text fill="#000000" x="397" y="103" font-size="10" font-family="SansSerif.plain"> 0.6</text>
<text fill="#000000" x="107" y="103" font-size="10" font-family="SansSerif.plain"> 0.6</text>
<text fill="#000000" x="107" y="393" font-size="10" font-family="SansSerif.plain"> 0.6</text>
<text fill="#000000" x="420" y="416" font-size="10" font-family="SansSerif.plain"> 0.8</text>
<text fill="#000000" x="420" y="80" font-size="10" font-family="SansSerif.plain"> 0.8</text>
<text fill="#000000" x="84" y="80" font-size="10" font-family="SansSerif.plain"> 0.8</text>
<text fill="#000000" x="84" y="416" font-size="10" font-family="SansSerif.plain"> 0.8</text>
<polyline fill="none" stroke="#000000" stroke-width="1" points="168.561,269.905 168.739,270.655 168.782,270.833 168.87,271.143 169.574,273.608 169.864,274.621 170.485,276.485 170.515,276.576 171.126,278.409 171.464,279.294 172.348,281.617 172.514,282.031 172.58,282.197 172.77,282.619 173.684,284.649 174.285,285.985 174.902,287.219 176.136,289.688 176.166,289.743 176.181,289.773 176.243,289.879 177.554,292.143 178.374,293.561 178.974,294.511 179.924,296.015 180.458,296.815 180.813,297.348 182.029,299.032 183.125,300.549 183.549,301.136 183.62,301.228 183.712,301.346 185.328,303.308 186.659,304.924 187.053,305.371 187.5,305.878 188.872,307.341 190.157,308.712 190.723,309.277 191.288,309.843 192.659,311.128 194.122,312.5 194.629,312.947 195.076,313.341 196.692,314.672 198.654,316.288 198.772,316.38 198.864,316.451 199.451,316.875 200.968,317.971 202.652,319.187 203.185,319.542 203.985,320.076 205.489,321.026 206.439,321.626 207.857,322.446 210.121,323.757 210.227,323.819 210.257,323.834 210.312,323.864 212.781,325.098 214.015,325.715 215.351,326.316 217.381,327.23 217.803,327.419 217.969,327.486 218.383,327.652 220.706,328.536 221.591,328.874 223.424,329.485 223.515,329.515 225.379,330.136 226.392,330.426 228.857,331.13 229.167,331.218 229.345,331.261 230.095,331.439 232.425,331.969 232.955,332.089 233.749,332.234 235.61,332.572 236.742,332.778 238.292,332.989 238.898,333.072 240.53,333.295 242.302,333.456 242.571,333.48 244.318,333.639 245.837,333.708 246.622,333.744 248.106,333.811 249.522,333.811 250.478,333.811 251.894,333.811 253.378,333.744 254.163,333.708 255.682,333.639 257.429,333.48 257.698,333.456 259.47,333.295 261.102,333.072 261.708,332.989 263.258,332.778 264.39,332.572 266.251,332.234 267.045,332.089 267.575,331.969 269.905,331.439 270.655,331.261 270.833,331.218 271.143,331.13 273.608,330.426 274.621,330.136 276.485,329.515 276.576,329.485 278.409,328.874 279.294,328.536 281.617,327.652 282.031,327.486 282.197,327.419 282.619,327.23 284.649,326.316 285.985,325.715 287.219,325.098 289.688,323.864 289.743,323.834 289.773,323.819 289.879,323.757 292.143,322.446 293.561,321.626 294.511,321.026 296.015,320.076 296.815,319.542 297.348,319.187 299.032,317.971 300.549,316.875 301.136,316.451 301.228,316.38 301.346,316.288 303.308,314.672 304.924,313.341 305.371,312.947 305.878,312.5 307.341,311.128 308.712,309.843 309.277,309.277 309.843,308.712 311.128,307.341 312.5,305.878 312.947,305.371 313.341,304.924 314.672,303.308 316.288,301.346 316.38,301.228 316.451,301.136 316.875,300.549 317.971,299.032 319.187,297.348 319.542,296.815 320.076,296.015 321.026,294.511 321.626,293.561 322.446,292.143 323.757,289.879 323.819,289.773 323.834,289.743 323.864,289.688 325.098,287.219 325.715,285.985 326.316,284.649 327.23,282.619 327.419,282.197 327.486,282.031 327.652,281.617 328.536,279.294 328.874,278.409 329.485,276.576 329.515,276.485 330.136,274.621 330.426,273.608 331.13,271.143 331.218,270.833 331.261,270.655 331.439,269.905 331.969,267.575 332.089,267.045 332.234,266.251 332.572,264.39 332.778,263.258 332.989,261.708 333.072,261.102 333.295,259.47 333.456,257.698 333.48,257.429 333.639,255.682 333.708,254.163 333.744,253.378 333.811,251.894 333.811,250.478 333.811,249.522 333.811,248.106 333.744,246.622 333.708,245.837 333.639,244.318 333.48,242.571 333.456,242.302 333.295,240.53 333.072,238.898 332.989,238.292 332.778,236.742 332.572,235.61 332.234,233.749 332.089,232.955 331.969,232.425 331.439,230.095 331.261,229.345 331.218,229.167 331.13,228.857 330.426,226.392 330.136,225.379 329.515,223.515 329.485,223.424 328.874,221.591 328.536,220.706 327.652,218.383 327.486,217.969 327.419,217.803 327.23,217.381 326.316,215.351 325.715,214.015 325.098,212.781 323.864,210.312 323.834,210.257 323.819,210.227 323.757,210.121 322.446,207.857 321.626,206.439 321.026,205.489 320.076,203.985 319.542,203.185 319.187,202.652 317.971,200.968 316.875,199.451 316.451,198.864 316.38,198.772 316.288,198.654 314.672,196.692 313.341,195.076 312.947,194.629 312.5,194.122 311.128,192.659 309.843,191.288 309.277,190.723 308.712,190.157 307.341,188.872 305.878,187.5 305.371,187.053 304.924,186.659 303.308,185.328 301.346,183.712 301.228,183.62 301.136,183.549 300.549,183.125 299.032,182.029 297.348,180.813 296.815,180.458 296.015,179.924 294.511,178.974 293.561,178.374 292.143,177.554 289.879,176.243 289.773,176.181 289.743,176.166 289.688,176.136 287.219,174.902 285.985,174.285 284.649,173.684 282.619,172.77 282.197,172.581 282.031,172.514 281.617,172.348 279.294,171.464 278.409,171.126 276.576,170.515 276.485,170.485 274.621,169.864 273.608,169.574 271.143,168.87 270.833,168.782 270.655,168.739 269.905,168.561 267.575,168.031 267.045,167.911 266.251,167.766 264.39,167.428 263.258,167.222 261.708,167.011 261.102,166.928 259.47,166.705 257.698,166.544 257.429,166.52 255.682,166.361 254.163,166.292 253.378,166.256 251.894,166.189 250.478,166.189 249.522,166.189 248.106,166.189 246.622,166.256 245.837,166.292 244.318,166.361 242.571,166.52 242.302,166.544 240.53,166.705 238.898,166.928 238.292,167.011 236.742,167.222 235.61,167.428 233.749,167.766 232.955,167.911 232.425,168.031 230.095,168.561 229.345,168.739 229.167,168.782 228.857,168.87 226.392,169.574 225.379,169.864 223.515,170.485 223.424,170.515 221.591,171.126 220.706,171.464 218.383,172.348 217.969,172.514 217.803,172.581 217.381,172.77 215.351,173.684 214.015,174.285 212.781,174.902 210.312,176.136 210.257,176.166 210.227,176.181 210.121,176.243 207.857,177.554 206.439,178.374 205.489,178.974 203.985,179.924 203.185,180.458 202.652,180.813 200.968,182.029 199.451,183.125 198.864,183.549 198.772,183.62 198.654,183.712 196.692,185.328 195.076,186.659 194.629,187.053 194.122,187.5 192.659,188.872 191.288,190.157 190.723,190.723 190.157,191.288 188.872,192.659 187.5,194.122 187.053,194.629 186.659,195.076 185.328,196.692 183.712,198.654 183.62,198.772 183.549,198.864 183.125,199.451 182.029,200.968 180.813,202.652 180.458,203.185 179.924,203.985 178.974,205.489 178.374,206.439 177.554,207.857 176.243,210.121 176.181,210.227 176.166,210.257 176.136,210.312 174.902,212.781 174.285,214.015 173.684,215.351 172.77,217.381 172.58,217.803 172.514,217.969 172.348,218.383 171.464,220.706 171.126,221.591 170.515,223.424 170.485,223.515 169.864,225.379 169.574,226.392 168.87,228.857 168.782,229.167 168.739,229.345 168.561,230.095 168.031,232.425 167.911,232.955 167.766,233.749 167.428,235.61 167.222,236.742 167.011,238.292 166.928,238.898 166.705,240.53 166.544,242.302 166.52,242.571 166.361,244.318 166.292,245.837 166.256,246.622 166.189,248.106 166.189,249.522 166.189,250.478 166.189,251.894 166.256,253.378 166.292,254.163 166.361,255.682 166.52,257.429 166.544,257.698 166.705,259.47 166.928,261.102 167.011,261.708 167.222,263.258 167.428,264.39 167.766,266.251 167.911,267.045 168.031,267.575 168.561,269.905"/>
<polyline fill="none" stroke="#0000ff" stroke-width="1" points="134.47,276.677 134.797,278.081 134.874,278.409 135.021,278.96 135.586,281.081 135.884,282.197 136.432,284.023 136.49,284.217 137.02,285.985 137.33,286.913 138.258,289.697 138.277,289.753 138.284,289.773 138.3,289.815 139.318,292.5 139.72,293.561 140.401,295.205 140.753,296.056 141.288,297.348 141.522,297.872 142.045,299.038 142.711,300.471 143.019,301.136 143.957,303.012 143.994,303.084 144.913,304.924 145.234,305.523 145.833,306.641 146.573,307.973 146.984,308.712 147.965,310.368 148.657,311.536 149.228,312.5 149.38,312.741 149.621,313.124 150.872,315.037 151.69,316.288 152.393,317.304 153.409,318.771 153.955,319.53 154.348,320.076 155.579,321.694 157.197,323.824 157.215,323.846 157.229,323.864 157.386,324.053 158.936,325.913 160.385,327.652 160.665,327.971 160.985,328.337 162.466,329.959 163.818,331.439 164.285,331.928 164.773,332.438 166.167,333.833 167.562,335.227 168.072,335.715 168.561,336.182 170.041,337.534 171.663,339.015 172.029,339.335 172.348,339.615 174.087,341.064 175.947,342.614 176.136,342.771 176.154,342.785 176.176,342.803 178.306,344.422 179.924,345.652 180.47,346.045 181.229,346.591 182.696,347.607 183.712,348.31 184.963,349.128 186.876,350.379 187.259,350.62 187.5,350.772 188.464,351.343 189.632,352.035 191.288,353.016 192.027,353.427 193.359,354.167 194.477,354.766 195.076,355.087 196.916,356.006 196.988,356.043 198.864,356.981 199.529,357.289 200.962,357.955 202.128,358.478 202.652,358.712 203.944,359.247 204.795,359.599 206.439,360.28 207.5,360.682 210.185,361.7 210.227,361.716 210.247,361.723 210.303,361.742 213.087,362.67 214.015,362.98 215.783,363.51 215.977,363.568 217.803,364.116 218.919,364.414 221.04,364.979 221.591,365.126 221.919,365.203 223.323,365.53 225,365.909 225.379,365.995 225.955,366.106 228.163,366.534 229.167,366.728 230.594,366.958 231.397,367.088 232.955,367.339 234.708,367.565 235.031,367.607 236.742,367.827 238.102,367.959 239.286,368.074 240.53,368.194 241.586,368.262 243.378,368.378 244.318,368.438 245.17,368.466 247.323,368.535 248.106,368.561 248.864,368.561 251.136,368.561 251.894,368.561 252.677,368.535 254.83,368.466 255.682,368.438 256.622,368.378 258.414,368.262 259.47,368.194 260.714,368.074 261.898,367.959 263.258,367.827 264.969,367.607 265.292,367.565 267.045,367.339 268.603,367.088 269.406,366.958 270.833,366.728 271.837,366.534 274.045,366.106 274.621,365.995 275,365.909 276.677,365.53 278.081,365.203 278.409,365.126 278.96,364.979 281.081,364.414 282.197,364.116 284.023,363.568 284.217,363.51 285.985,362.98 286.913,362.67 289.697,361.742 289.753,361.723 289.773,361.716 289.815,361.7 292.5,360.682 293.561,360.28 295.205,359.599 296.056,359.247 297.348,358.712 297.872,358.478 299.038,357.955 300.471,357.289 301.136,356.981 303.012,356.043 303.084,356.006 304.924,355.087 305.523,354.766 306.641,354.167 307.973,353.427 308.712,353.016 310.368,352.035 311.536,351.343 312.5,350.772 312.741,350.62 313.124,350.379 315.037,349.128 316.288,348.31 317.304,347.607 318.771,346.591 319.53,346.045 320.076,345.652 321.694,344.422 323.824,342.803 323.846,342.785 323.864,342.771 324.053,342.614 325.913,341.064 327.652,339.615 327.971,339.335 328.337,339.015 329.959,337.534 331.439,336.182 331.928,335.715 332.438,335.227 333.833,333.833 335.227,332.438 335.715,331.928 336.182,331.439 337.534,329.959 339.015,328.337 339.335,327.971 339.615,327.652 341.064,325.913 342.614,324.053 342.771,323.864 342.785,323.846 342.803,323.824 344.422,321.694 345.652,320.076 346.045,319.53 346.591,318.771 347.607,317.304 348.31,316.288 349.128,315.037 350.379,313.124 350.62,312.741 350.772,312.5 351.343,311.536 352.035,310.368 353.016,308.712 353.427,307.973 354.167,306.641 354.766,305.523 355.087,304.924 356.006,303.084 356.043,303.012 356.981,301.136 357.289,300.471 357.955,299.038 358.478,297.872 358.712,297.348 359.247,296.056 359.599,295.205 360.28,293.561 360.682,292.5 361.7,289.815 361.716,289.773 361.723,289.753 361.742,289.697 362.67,286.913 362.98,285.985 363.51,284.217 363.568,284.023 364.116,282.197 364.414,281.081 364.979,278.96 365.126,278.409 365.203,278.081 365.53,276.677 365.909,275 365.995,274.621 366.106,274.045 366.534,271.837 366.728,270.833 366.958,269.406 367.088,268.603 367.339,267.045 367.565,265.292 367.607,264.969 367.827,263.258 367.959,261.898 368.074,260.714 368.194,259.47 368.262,258.414 368.378,256.622 368.438,255.682 368.466,254.83 368.535,252.677 368.561,251.894 368.561,251.136 368.561,248.864 368.561,248.106 368.535,247.323 368.466,245.17 368.438,244.318 368.378,243.378 368.262,241.586 368.194,240.53 368.074,239.286 367.959,238.102 367.827,236.742 367.607,235.031 367.565,234.708 367.339,232.955 367.088,231.397 366.958,230.594 366.728,229.167 366.534,228.163 366.106,225.955 365.995,225.379 365.909,225 365.53,223.323 365.203,221.919 365.126,221.591 364.979,221.04 364.414,218.919 364.116,217.803 363.568,215.977 363.51,215.783 362.98,214.015 362.67,213.087 361.742,210.303 361.723,210.247 361.716,210.227 361.7,210.185 360.682,207.5 360.28,206.439 359.599,204.795 359.247,203.944 358.712,202.652 358.478,202.128 357.955,200.962 357.289,199.529 356.981,198.864 356.043,196.988 356.006,196.916 355.087,195.076 354.766,194.477 354.167,193.359 353.427,192.027 353.016,191.288 352.035,189.632 351.343,188.464 350.772,187.5 350.62,187.259 350.379,186.876 349.128,184.963 348.31,183.712 347.607,182.696 346.591,181.229 346.045,180.47 345.652,179.924 344.422,178.306 342.803,176.176 342.785,176.154 342.771,176.136 342.614,175.947 341.064,174.087 339.615,172.348 339.335,172.029 339.015,171.663 337.534,170.041 336.182,168.561 335.715,168.072 335.227,167.562 333.833,166.167 332.438,164.773 331.928,164.285 331.439,163.818 329.959,162.466 328.337,160.985 327.971,160.665 327.652,160.385 325.913,158.936 324.053,157.386 323.864,157.229 323.846,157.215 323.824,157.197 321.694,155.578 320.076,154.348 319.53,153.955 318.771,153.409 317.304,152.393 316.288,151.69 315.037,150.872 313.124,149.621 312.741,149.38 312.5,149.228 311.536,148.657 310.368,147.965 308.712,146.984 307.973,146.573 306.641,145.833 305.523,145.234 304.924,144.913 303.084,143.994 303.012,143.957 301.136,143.019 300.471,142.711 299.038,142.045 297.872,141.522 297.348,141.288 296.056,140.753 295.205,140.401 293.561,139.72 292.5,139.318 289.815,138.3 289.773,138.284 289.753,138.277 289.697,138.258 286.913,137.33 285.985,137.02 284.217,136.49 284.023,136.432 282.197,135.884 281.081,135.586 278.96,135.021 278.409,134.874 278.081,134.797 276.677,134.47 275,134.091 274.621,134.005 274.045,133.894 271.837,133.466 270.833,133.272 269.406,133.042 268.603,132.912 267.045,132.661 265.292,132.435 264.969,132.393 263.258,132.173 261.898,132.041 260.714,131.926 259.47,131.806 258.414,131.738 256.622,131.622 255.682,131.562 254.83,131.534 252.677,131.465 251.894,131.439 251.136,131.439 248.864,131.439 248.106,131.439 247.323,131.465 245.17,131.534 244.318,131.562 243.378,131.622 241.586,131.738 240.53,131.806 239.286,131.926 238.102,132.041 236.742,132.173 235.031,132.393 234.708,132.435 232.955,132.661 231.397,132.912 230.594,133.042 229.167,133.272 228.163,133.466 225.955,133.894 225.379,134.005 225,134.091 223.323,134.47 221.919,134.797 221.591,134.874 221.04,135.021 218.919,135.586 217.803,135.884 215.977,136.432 215.783,136.49 214.015,137.02 213.087,137.33 210.303,138.258 210.247,138.277 210.227,138.284 210.185,138.3 207.5,139.318 206.439,139.72 204.795,140.401 203.944,140.753 202.652,141.288 202.128,141.522 200.962,142.045 199.529,142.711 198.864,143.019 196.988,143.957 196.916,143.994 195.076,144.913 194.477,145.234 193.359,145.833 192.027,146.573 191.288,146.984 189.632,147.965 188.464,148.657 187.5,149.228 187.259,149.38 186.876,149.621 184.963,150.872 183.712,151.69 182.696,152.393 181.229,153.409 180.47,153.955 179.924,154.348 178.306,155.578 176.176,157.197 176.154,157.215 176.136,157.229 175.947,157.386 174.087,158.936 172.348,160.385 172.029,160.665 171.663,160.985 170.041,162.466 168.561,163.818 168.072,164.285 167.562,164.773 166.167,166.167 164.773,167.562 164.285,168.072 163.818,168.561 162.466,170.041 160.985,171.663 160.665,172.029 160.385,172.348 158.936,174.087 157.386,175.947 157.229,176.136 157.215,176.154 157.197,176.176 155.579,178.306 154.348,179.924 153.955,180.47 153.409,181.229 152.393,182.696 151.69,183.712 150.872,184.963 149.621,186.876 149.38,187.259 149.228,187.5 148.657,188.464 147.965,189.632 146.984,191.288 146.573,192.027 145.833,193.359 145.234,194.477 144.913,195.076 143.994,196.916 143.957,196.988 143.019,198.864 142.711,199.529 142.045,200.962 141.522,202.128 141.288,202.652 140.753,203.944 140.401,204.795 139.72,206.439 139.318,207.5 138.3,210.185 138.284,210.227 138.277,210.247 138.258,210.303 137.33,213.087 137.02,214.015 136.49,215.783 136.432,215.977 135.884,217.803 135.586,218.919 135.021,221.04 134.874,221.591 134.797,221.919 134.47,223.323 134.091,225 134.005,225.379 133.894,225.955 133.466,228.163 133.272,229.167 133.042,230.594 132.912,231.397 132.661,232.955 132.435,234.708 132.393,235.031 132.173,236.742 132.041,238.102 131.926,239.286 131.806,240.53 131.738,241.586 131.622,243.378 131.562,244.318 131.534,245.17 131.465,247.323 131.439,248.106 131.439,248.864 131.439,251.136 131.439,251.894 131.465,252.677 131.534,254.83 131.562,255.682 131.622,256.622 131.738,258.414 131.806,259.47 131.926,260.714 132.041,261.898 132.173,263.258 132.393,264.969 132.435,265.292 132.661,267.045 132.912,268.603 133.042,269.406 133.272,270.833 133.466,271.837 133.894,274.045 134.005,274.621 134.091,275 134.47,276.677"/>
<polyline fill="none" stroke="#00ff00" stroke-width="1" points="85.2273,281.179 85.387,282.037 85.4167,282.197 85.4668,282.436 86.0395,285.173 86.2095,285.985 86.5071,287.265 86.7389,288.261 87.0904,289.773 87.4825,291.305 87.7308,292.276 88.0594,293.561 88.2679,294.308 89.0152,296.985 89.0958,297.268 89.1189,297.348 89.1654,297.499 89.9897,300.162 90.2913,301.136 90.9192,303.02 90.9294,303.051 91.5539,304.924 91.8826,305.845 92.803,308.422 92.8808,308.634 92.9093,308.712 92.9773,308.886 93.9427,311.36 94.3875,312.5 95.0333,314.058 95.5098,315.207 95.9581,316.288 96.1511,316.728 96.5909,317.729 97.3191,319.348 97.6468,320.076 98.5266,321.928 98.6021,322.087 99.446,323.864 99.7569,324.485 100.379,325.729 101.03,327 101.365,327.652 102.345,329.473 102.515,329.787 103.404,331.439 103.679,331.927 104.167,332.791 105.06,334.334 105.577,335.227 106.474,336.708 107.74,338.801 107.87,339.015 107.903,339.067 107.955,339.149 109.392,341.366 110.325,342.803 110.896,343.649 111.742,344.902 112.435,345.899 112.916,346.591 114.012,348.109 115.53,350.211 115.602,350.307 115.655,350.379 116.075,350.923 117.25,352.447 118.577,354.167 118.906,354.579 119.318,355.093 120.61,356.662 121.674,357.955 122.333,358.727 123.106,359.633 124.093,360.756 124.96,361.742 125.881,362.756 126.894,363.87 127.697,364.727 128.451,365.53 129.548,366.664 130.682,367.834 131.424,368.576 132.166,369.318 133.336,370.452 134.47,371.549 135.273,372.303 136.13,373.106 137.244,374.119 138.258,375.04 139.244,375.907 140.367,376.894 141.273,377.667 142.045,378.326 143.338,379.39 144.907,380.682 145.421,381.094 145.833,381.423 147.553,382.75 149.077,383.925 149.621,384.345 149.693,384.398 149.789,384.47 151.891,385.988 153.409,387.084 154.101,387.565 155.098,388.258 156.351,389.104 157.197,389.675 158.634,390.608 160.851,392.045 160.933,392.097 160.985,392.13 161.199,392.26 163.292,393.526 164.773,394.423 165.666,394.94 167.209,395.833 168.073,396.321 168.561,396.596 170.213,397.485 170.527,397.655 172.348,398.635 173,398.97 174.271,399.621 175.515,400.243 176.136,400.554 177.913,401.398 178.072,401.473 179.924,402.353 180.652,402.681 182.271,403.409 183.272,403.849 183.712,404.042 184.793,404.49 185.942,404.967 187.5,405.613 188.64,406.057 191.114,407.023 191.288,407.091 191.366,407.119 191.578,407.197 194.155,408.117 195.076,408.446 196.949,409.071 196.98,409.081 198.864,409.709 199.838,410.01 202.501,410.835 202.652,410.881 202.732,410.904 203.015,410.985 205.692,411.732 206.439,411.941 207.724,412.269 208.695,412.518 210.227,412.91 211.739,413.261 212.735,413.493 214.015,413.791 214.827,413.961 217.564,414.533 217.803,414.583 217.963,414.613 218.821,414.773 221.165,415.199 221.591,415.276 222.19,415.372 224.424,415.727 225.379,415.879 226.66,416.054 227.739,416.201 229.167,416.396 230.997,416.604 231.111,416.616 232.955,416.826 234.545,416.97 235.213,417.031 236.742,417.17 238.044,417.259 239.315,417.346 240.53,417.429 241.613,417.478 243.313,417.555 244.318,417.601 245.257,417.622 247.212,417.667 248.106,417.687 248.98,417.687 251.02,417.687 251.894,417.687 252.788,417.667 254.743,417.622 255.682,417.601 256.687,417.555 258.387,417.478 259.47,417.429 260.685,417.346 261.956,417.259 263.258,417.17 264.787,417.031 265.455,416.97 267.045,416.826 268.889,416.616 269.003,416.604 270.833,416.396 272.261,416.201 273.34,416.054 274.621,415.879 275.576,415.727 277.81,415.372 278.409,415.276 278.835,415.199 281.179,414.773 282.037,414.613 282.197,414.583 282.436,414.533 285.173,413.961 285.985,413.791 287.265,413.493 288.261,413.261 289.773,412.91 291.305,412.518 292.276,412.269 293.561,411.941 294.308,411.732 296.985,410.985 297.268,410.904 297.348,410.881 297.499,410.835 300.162,410.01 301.136,409.709 303.02,409.081 303.051,409.071 304.924,408.446 305.845,408.117 308.422,407.197 308.634,407.119 308.712,407.091 308.886,407.023 311.36,406.057 312.5,405.613 314.058,404.967 315.207,404.49 316.288,404.042 316.728,403.849 317.729,403.409 319.348,402.681 320.076,402.353 321.928,401.473 322.087,401.398 323.864,400.554 324.485,400.243 325.729,399.621 327,398.97 327.652,398.635 329.473,397.655 329.787,397.485 331.439,396.596 331.927,396.321 332.791,395.833 334.334,394.94 335.227,394.423 336.708,393.526 338.801,392.26 339.015,392.13 339.067,392.097 339.149,392.045 341.366,390.608 342.803,389.675 343.649,389.104 344.902,388.258 345.899,387.565 346.591,387.084 348.109,385.988 350.211,384.47 350.307,384.398 350.379,384.345 350.923,383.925 352.447,382.75 354.167,381.423 354.579,381.094 355.093,380.682 356.662,379.39 357.955,378.326 358.727,377.667 359.633,376.894 360.756,375.907 361.742,375.04 362.756,374.119 363.87,373.106 364.727,372.303 365.53,371.549 366.664,370.452 367.834,369.318 368.576,368.576 369.318,367.834 370.452,366.664 371.549,365.53 372.303,364.727 373.106,363.87 374.119,362.756 375.04,361.742 375.907,360.756 376.894,359.633 377.667,358.727 378.326,357.955 379.39,356.662 380.682,355.093 381.094,354.579 381.423,354.167 382.75,352.447 383.925,350.923 384.345,350.379 384.398,350.307 384.47,350.211 385.988,348.109 387.084,346.591 387.565,345.899 388.258,344.902 389.104,343.649 389.675,342.803 390.608,341.366 392.045,339.149 392.097,339.067 392.13,339.015 392.26,338.801 393.526,336.708 394.423,335.227 394.94,334.334 395.833,332.791 396.321,331.927 396.596,331.439 397.485,329.787 397.655,329.473 398.635,327.652 398.97,327 399.621,325.729 400.243,324.485 400.554,323.864 401.398,322.087 401.473,321.928 402.353,320.076 402.681,319.348 403.409,317.729 403.849,316.728 404.042,316.288 404.49,315.207 404.967,314.058 405.613,312.5 406.057,311.36 407.023,308.886 407.091,308.712 407.119,308.634 407.197,308.422 408.117,305.845 408.446,304.924 409.071,303.051 409.081,303.02 409.709,301.136 410.01,300.162 410.835,297.499 410.881,297.348 410.904,297.268 410.985,296.985 411.732,294.308 411.941,293.561 412.269,292.276 412.518,291.305 412.91,289.773 413.261,288.261 413.493,287.265 413.791,285.985 413.961,285.173 414.533,282.436 414.583,282.197 414.613,282.037 414.773,281.179 415.199,278.835 415.276,278.409 415.372,277.81 415.727,275.576 415.879,274.621 416.054,273.34 416.201,272.261 416.396,270.833 416.604,269.003 416.616,268.889 416.826,267.045 416.97,265.455 417.031,264.787 417.17,263.258 417.259,261.956 417.346,260.685 417.429,259.47 417.478,258.387 417.555,256.687 417.601,255.682 417.622,254.743 417.667,252.788 417.687,251.894 417.687,251.02 417.687,248.98 417.687,248.106 417.667,247.212 417.622,245.257 417.601,244.318 417.555,243.313 417.478,241.613 417.429,240.53 417.346,239.315 417.259,238.044 417.17,236.742 417.031,235.213 416.97,234.545 416.826,232.955 416.616,231.111 416.604,230.997 416.396,229.167 416.201,227.739 416.054,226.66 415.879,225.379 415.727,224.424 415.372,222.19 415.276,221.591 415.199,221.165 414.773,218.821 414.613,217.963 414.583,217.803 414.533,217.564 413.961,214.827 413.791,214.015 413.493,212.735 413.261,211.739 412.91,210.227 412.518,208.695 412.269,207.724 411.941,206.439 411.732,205.692 410.985,203.015 410.904,202.732 410.881,202.652 410.835,202.501 410.01,199.838 409.709,198.864 409.081,196.98 409.071,196.949 408.446,195.076 408.117,194.155 407.197,191.578 407.119,191.366 407.091,191.288 407.023,191.114 406.057,188.64 405.613,187.5 404.967,185.942 404.49,184.793 404.042,183.712 403.849,183.272 403.409,182.271 402.681,180.652 402.353,179.924 401.473,178.072 401.398,177.913 400.554,176.136 400.243,175.515 399.621,174.271 398.97,173 398.635,172.348 397.655,170.527 397.485,170.213 396.596,168.561 396.321,168.073 395.833,167.209 394.94,165.666 394.423,164.773 393.526,163.292 392.26,161.199 392.13,160.985 392.097,160.933 392.045,160.851 390.608,158.634 389.675,157.197 389.104,156.351 388.258,155.098 387.565,154.101 387.084,153.409 385.988,151.891 384.47,149.789 384.398,149.693 384.345,149.621 383.925,149.077 382.75,147.553 381.423,145.833 381.094,145.421 380.682,144.907 379.39,143.338 378.326,142.045 377.667,141.273 376.894,140.367 375.907,139.244 375.04,138.258 374.119,137.244 373.106,136.13 372.303,135.273 371.549,134.47 370.452,133.336 369.318,132.166 368.576,131.424 367.834,130.682 366.664,129.548 365.53,128.451 364.727,127.697 363.87,126.894 362.756,125.881 361.742,124.96 360.756,124.093 359.633,123.106 358.727,122.333 357.955,121.674 356.662,120.61 355.093,119.318 354.579,118.906 354.167,118.577 352.447,117.25 350.923,116.075 350.379,115.655 350.307,115.602 350.211,115.53 348.109,114.012 346.591,112.916 345.899,112.435 344.902,111.742 343.649,110.896 342.803,110.325 341.366,109.392 339.149,107.955 339.067,107.903 339.015,107.87 338.801,107.74 336.708,106.474 335.227,105.577 334.334,105.06 332.791,104.167 331.927,103.679 331.439,103.404 329.787,102.515 329.473,102.345 327.652,101.365 327,101.03 325.729,100.379 324.485,99.757 323.864,99.446 322.087,98.6021 321.928,98.5266 320.076,97.6468 319.348,97.3191 317.729,96.5909 316.728,96.1511 316.288,95.9581 315.207,95.5098 314.058,95.0333 312.5,94.3875 311.36,93.9427 308.886,92.9773 308.712,92.9093 308.634,92.8808 308.422,92.803 305.845,91.8826 304.924,91.5539 303.051,90.9294 303.02,90.9192 301.136,90.2913 300.162,89.9897 297.499,89.1653 297.348,89.1189 297.268,89.0958 296.985,89.0151 294.308,88.2679 293.561,88.0594 292.276,87.7308 291.305,87.4825 289.773,87.0904 288.261,86.7389 287.265,86.5071 285.985,86.2095 285.173,86.0395 282.436,85.4668 282.197,85.4167 282.037,85.387 281.179,85.2273 278.835,84.8011 278.409,84.7236 277.81,84.6284 275.576,84.2729 274.621,84.121 273.34,83.9464 272.261,83.7993 270.833,83.6045 269.003,83.3965 268.889,83.3836 267.045,83.1741 265.455,83.0295 264.787,82.9688 263.258,82.8297 261.956,82.741 260.685,82.6543 259.47,82.5714 258.387,82.5222 256.687,82.445 255.682,82.3993 254.743,82.378 252.788,82.3335 251.894,82.3132 251.02,82.3132 248.98,82.3132 248.106,82.3132 247.212,82.3335 245.257,82.378 244.318,82.3993 243.313,82.445 241.613,82.5222 240.53,82.5714 239.315,82.6543 238.044,82.741 236.742,82.8297 235.213,82.9688 234.545,83.0295 232.955,83.1741 231.111,83.3836 230.997,83.3965 229.167,83.6045 227.739,83.7993 226.66,83.9464 225.379,84.121 224.424,84.2729 222.19,84.6284 221.591,84.7236 221.165,84.8011 218.821,85.2273 217.963,85.387 217.803,85.4167 217.564,85.4668 214.827,86.0395 214.015,86.2095 212.735,86.5071 211.739,86.7389 210.227,87.0904 208.695,87.4825 207.724,87.7308 206.439,88.0594 205.692,88.2679 203.015,89.0151 202.732,89.0958 202.652,89.1189 202.501,89.1653 199.838,89.9897 198.864,90.2913 196.98,90.9192 196.949,90.9294 195.076,91.5539 194.155,91.8826 191.578,92.803 191.366,92.8808 191.288,92.9093 191.114,92.9773 188.64,93.9427 187.5,94.3875 185.942,95.0333 184.793,95.5098 183.712,95.9581 183.272,96.1511 182.271,96.5909 180.652,97.3191 179.924,97.6468 178.072,98.5266 177.913,98.6021 176.136,99.446 175.515,99.757 174.271,100.379 173,101.03 172.348,101.365 170.527,102.345 170.213,102.515 168.561,103.404 168.073,103.679 167.209,104.167 165.666,105.06 164.773,105.577 163.292,106.474 161.199,107.74 160.985,107.87 160.933,107.903 160.851,107.955 158.634,109.392 157.197,110.325 156.351,110.896 155.098,111.742 154.101,112.435 153.409,112.916 151.891,114.012 149.789,115.53 149.693,115.602 149.621,115.655 149.077,116.075 147.553,117.25 145.833,118.577 145.421,118.906 144.907,119.318 143.338,120.61 142.045,121.674 141.273,122.333 140.367,123.106 139.244,124.093 138.258,124.96 137.244,125.881 136.13,126.894 135.273,127.697 134.47,128.451 133.336,129.548 132.166,130.682 131.424,131.424 130.682,132.166 129.548,133.336 128.451,134.47 127.697,135.273 126.894,136.13 125.881,137.244 124.96,138.258 124.093,139.244 123.106,140.367 122.333,141.273 121.674,142.045 120.61,143.338 119.318,144.907 118.906,145.421 118.577,145.833 117.25,147.553 116.075,149.077 115.655,149.621 115.602,149.693 115.53,149.789 114.012,151.891 112.916,153.409 112.435,154.101 111.742,155.098 110.896,156.351 110.325,157.197 109.392,158.634 107.955,160.851 107.903,160.933 107.87,160.985 107.74,161.199 106.474,163.292 105.577,164.773 105.06,165.666 104.167,167.209 103.679,168.073 103.404,168.561 102.515,170.213 102.345,170.527 101.365,172.348 101.03,173 100.379,174.271 99.7569,175.515 99.446,176.136 98.6021,177.913 98.5266,178.072 97.6468,179.924 97.3191,180.652 96.5909,182.271 96.1511,183.272 95.9581,183.712 95.5098,184.793 95.0333,185.942 94.3875,187.5 93.9427,188.64 92.9773,191.114 92.9093,191.288 92.8808,191.366 92.803,191.578 91.8826,194.155 91.5539,195.076 90.9294,196.949 90.9192,196.98 90.2913,198.864 89.9897,199.838 89.1654,202.501 89.1189,202.652 89.0958,202.732 89.0152,203.015 88.2679,205.692 88.0594,206.439 87.7308,207.724 87.4825,208.695 87.0904,210.227 86.7389,211.739 86.5071,212.735 86.2095,214.015 86.0395,214.827 85.4668,217.564 85.4167,217.803 85.387,217.963 85.2273,218.821 84.8011,221.165 84.7236,221.591 84.6284,222.19 84.2729,224.424 84.121,225.379 83.9464,226.66 83.7992,227.739 83.6045,229.167 83.3965,230.997 83.3836,231.111 83.1741,232.955 83.0295,234.545 82.9688,235.213 82.8297,236.742 82.741,238.044 82.6543,239.315 82.5714,240.53 82.5222,241.613 82.445,243.313 82.3993,244.318 82.378,245.257 82.3335,247.212 82.3132,248.106 82.3132,248.98 82.3132,251.02 82.3132,251.894 82.3335,252.788 82.378,254.743 82.3993,255.682 82.445,256.687 82.5222,258.387 82.5714,259.47 82.6543,260.685 82.741,261.956 82.8297,263.258 82.9688,264.787 83.0295,265.455 83.1741,267.045 83.3836,268.889 83.3965,269.003 83.6045,270.833 83.7992,272.261 83.9464,273.34 84.121,274.621 84.2729,275.576 84.6284,277.81 84.7236,278.409 84.8011,278.835 85.2273,281.179"/>
<polyline fill="none" stroke="#00ffff" stroke-width="1" points="437.5,333.833 437.068,334.795 436.874,335.227 436.32,336.407 435.864,337.379 435.096,339.015 434.641,339.944 433.712,341.84 433.391,342.482 433.231,342.803 432.708,343.808 432.098,344.977 431.258,346.591 430.789,347.456 429.924,349.053 429.452,349.907 429.191,350.379 428.201,352.102 428.076,352.319 427.015,354.167 426.687,354.717 426.136,355.641 425.261,357.079 424.728,357.955 423.808,359.414 422.348,361.729 422.343,361.737 422.34,361.742 422.323,361.768 420.828,364.01 419.815,365.53 419.303,366.273 418.561,367.351 417.747,368.505 417.175,369.318 416.163,370.709 414.773,372.621 414.566,372.899 414.412,373.106 413.22,374.659 412.924,375.045 411.505,376.894 411.275,377.184 410.985,377.551 409.584,379.281 408.451,380.682 407.881,381.366 407.197,382.186 406.145,383.418 405.248,384.47 404.388,385.449 403.409,386.564 402.607,387.455 401.884,388.258 400.797,389.433 399.621,390.704 398.968,391.393 398.349,392.045 397.107,393.32 395.833,394.627 395.23,395.23 394.627,395.833 393.32,397.107 392.045,398.349 391.393,398.968 390.704,399.621 389.433,400.797 388.258,401.884 387.455,402.607 386.564,403.409 385.449,404.388 384.47,405.248 383.418,406.145 382.186,407.197 381.366,407.881 380.682,408.451 379.281,409.584 377.551,410.985 377.184,411.275 376.894,411.505 375.045,412.924 374.659,413.22 373.106,414.412 372.899,414.566 372.621,414.773 370.709,416.163 369.318,417.175 368.505,417.747 367.351,418.561 366.273,419.303 365.53,419.815 364.01,420.828 361.768,422.323 361.742,422.34 361.737,422.343 361.729,422.348 359.414,423.808 357.955,424.728 357.079,425.261 355.641,426.136 354.717,426.687 354.167,427.015 352.319,428.076 352.102,428.201 350.379,429.191 349.907,429.452 349.053,429.924 347.456,430.789 346.591,431.258 344.977,432.098 343.808,432.708 342.803,433.231 342.482,433.391 341.84,433.712 339.944,434.641 339.015,435.096 337.379,435.864 336.407,436.32 335.227,436.874 334.795,437.068 333.833,437.5"/>
<polyline fill="none" stroke="#00ffff" stroke-width="1" points="333.833,62.5 334.795,62.9321 335.227,63.1262 336.407,63.6801 337.379,64.1362 339.015,64.9041 339.944,65.3591 341.84,66.2879 342.482,66.6088 342.803,66.7692 343.808,67.2925 344.977,67.9016 346.591,68.7421 347.456,69.2107 349.053,70.0757 349.907,70.5479 350.379,70.8091 352.102,71.7993 352.319,71.9236 354.167,72.9852 354.717,73.3131 355.641,73.8636 357.079,74.739 357.955,75.2717 359.414,76.1919 361.729,77.6515 361.737,77.6566 361.742,77.6599 361.768,77.6768 364.01,79.1717 365.53,80.1852 366.273,80.6968 367.351,81.4394 368.505,82.2525 369.318,82.8254 370.709,83.8367 372.621,85.2273 372.899,85.4343 373.106,85.5884 374.659,86.7803 375.045,87.0764 376.894,88.4954 377.184,88.7249 377.551,89.0151 379.281,90.4156 380.682,91.5494 381.366,92.1193 382.186,92.803 383.418,93.8547 384.47,94.7524 385.449,95.6119 386.564,96.5909 387.455,97.3933 388.258,98.1155 389.433,99.2031 390.704,100.379 391.393,101.032 392.045,101.651 393.32,102.893 394.627,104.167 395.23,104.77 395.833,105.373 397.107,106.68 398.349,107.955 398.968,108.607 399.621,109.296 400.797,110.567 401.884,111.742 402.607,112.545 403.409,113.436 404.388,114.551 405.248,115.53 406.145,116.582 407.197,117.814 407.881,118.634 408.451,119.318 409.584,120.719 410.985,122.449 411.275,122.816 411.505,123.106 412.924,124.955 413.22,125.341 414.412,126.894 414.566,127.101 414.773,127.379 416.163,129.291 417.175,130.682 417.747,131.495 418.561,132.649 419.303,133.727 419.815,134.47 420.828,135.99 422.323,138.232 422.34,138.258 422.343,138.263 422.348,138.271 423.808,140.586 424.728,142.045 425.261,142.921 426.136,144.359 426.687,145.283 427.015,145.833 428.076,147.681 428.201,147.898 429.191,149.621 429.452,150.093 429.924,150.947 430.789,152.544 431.258,153.409 432.098,155.023 432.708,156.192 433.231,157.197 433.391,157.518 433.712,158.16 434.641,160.056 435.096,160.985 435.864,162.621 436.32,163.593 436.874,164.773 437.068,165.205 437.5,166.167"/>
<polyline fill="none" stroke="#00ffff" stroke-width="1" points="62.5,166.167 62.9321,165.205 63.1262,164.773 63.6801,163.593 64.1362,162.621 64.9041,160.985 65.3591,160.056 66.2879,158.16 66.6088,157.518 66.7692,157.197 67.2925,156.192 67.9016,155.023 68.7421,153.409 69.2107,152.544 70.0757,150.947 70.5479,150.093 70.8092,149.621 71.7993,147.898 71.9236,147.681 72.9852,145.833 73.3131,145.283 73.8636,144.359 74.739,142.921 75.2717,142.045 76.1919,140.586 77.6515,138.271 77.6566,138.263 77.6599,138.258 77.6768,138.232 79.1717,135.99 80.1852,134.47 80.6968,133.727 81.4394,132.649 82.2525,131.495 82.8254,130.682 83.8367,129.291 85.2273,127.379 85.4343,127.101 85.5884,126.894 86.7803,125.341 87.0764,124.955 88.4954,123.106 88.7249,122.816 89.0152,122.449 90.4157,120.719 91.5494,119.318 92.1192,118.634 92.803,117.814 93.8547,116.582 94.7524,115.53 95.612,114.551 96.5909,113.436 97.3933,112.545 98.1155,111.742 99.2031,110.567 100.379,109.296 101.032,108.607 101.651,107.955 102.893,106.68 104.167,105.373 104.77,104.77 105.373,104.167 106.68,102.893 107.955,101.651 108.607,101.032 109.296,100.379 110.567,99.2031 111.742,98.1155 112.545,97.3933 113.436,96.5909 114.551,95.6119 115.53,94.7524 116.582,93.8547 117.814,92.803 118.634,92.1193 119.318,91.5494 120.719,90.4156 122.449,89.0151 122.816,88.7249 123.106,88.4954 124.955,87.0764 125.341,86.7803 126.894,85.5884 127.101,85.4343 127.379,85.2273 129.291,83.8367 130.682,82.8254 131.495,82.2525 132.649,81.4394 133.727,80.6968 134.47,80.1852 135.99,79.1717 138.232,77.6768 138.258,77.6599 138.263,77.6566 138.271,77.6515 140.586,76.1919 142.045,75.2717 142.921,74.739 144.359,73.8636 145.283,73.3131 145.833,72.9852 147.681,71.9236 147.898,71.7993 149.621,70.8091 150.093,70.5479 150.947,70.0757 152.544,69.2107 153.409,68.7421 155.023,67.9016 156.192,67.2925 157.197,66.7692 157.518,66.6088 158.16,66.2879 160.056,65.3591 160.985,64.9041 162.621,64.1362 163.593,63.6801 164.773,63.1262 165.205,62.9321 166.167,62.5"/>
<polyline fill="none" stroke="#00ffff" stroke-width="1" points="62.5,333.833 62.9321,334.795 63.1262,335.227 63.6801,336.407 64.1362,337.379 64.9041,339.015 65.3591,339.944 66.2879,341.84 66.6088,342.482 66.7692,342.803 67.2925,343.808 67.9016,344.977 68.7421,346.591 69.2107,347.456 70.0757,349.053 70.5479,349.907 70.8092,350.379 71.7993,352.102 71.9236,352.319 72.9852,354.167 73.3131,354.717 73.8636,355.641 74.739,357.079 75.2717,357.955 76.1919,359.414 77.6515,361.729 77.6566,361.737 77.6599,361.742 77.6768,361.768 79.1717,364.01 80.1852,365.53 80.6968,366.273 81.4394,367.351 82.2525,368.505 82.8254,369.318 83.8367,370.709 85.2273,372.621 85.4343,372.899 85.5884,373.106 86.7803,374.659 87.0764,375.045 88.4954,376.894 88.7249,377.184 89.0152,377.551 90.4157,379.281 91.5494,380.682 92.1192,381.366 92.803,382.186 93.8547,383.418 94.7524,384.47 95.612,385.449 96.5909,386.564 97.3933,387.455 98.1155,388.258 99.2031,389.433 100.379,390.704 101.032,391.393 101.651,392.045 102.893,393.32 104.167,394.627 104.77,395.23 105.373,395.833 106.68,397.107 107.955,398.349 108.607,398.968 109.296,399.621 110.567,400.797 111.742,401.884 112.545,402.607 113.436,403.409 114.551,404.388 115.53,405.248 116.582,406.145 117.814,407.197 118.634,407.881 119.318,408.451 120.719,409.584 122.449,410.985 122.816,411.275 123.106,411.505 124.955,412.924 125.341,413.22 126.894,414.412 127.101,414.566 127.379,414.773 129.291,416.163 130.682,417.175 131.495,417.747 132.649,418.561 133.727,419.303 134.47,419.815 135.99,420.828 138.232,422.323 138.258,422.34 138.263,422.343 138.271,422.348 140.586,423.808 142.045,424.728 142.921,425.261 144.359,426.136 145.283,426.687 145.833,427.015 147.681,428.076 147.898,428.201 149.621,429.191 150.093,429.452 150.947,429.924 152.544,430.789 153.409,431.258 155.023,432.098 156.192,432.708 157.197,433.231 157.518,433.391 158.16,433.712 160.056,434.641 160.985,435.096 162.621,435.864 163.593,436.32 164.773,436.874 165.205,437.068 166.167,437.5"/>
<polyline fill="none" stroke="#ff0000" stroke-width="1" points="437.5,395.23 437.237,395.57 437.032,395.833 435.561,397.682 435.208,398.125 434.017,399.621 433.88,399.789 433.712,399.995 432.16,401.857 430.867,403.409 430.433,403.918 429.924,404.513 428.674,405.947 427.583,407.197 426.9,407.961 426.136,408.816 425.101,409.95 424.156,410.985 423.283,411.919 422.348,412.918 421.442,413.867 420.577,414.773 419.58,415.792 418.561,416.835 417.698,417.698 416.835,418.561 415.792,419.58 414.773,420.577 413.867,421.442 412.918,422.348 411.919,423.283 410.985,424.156 409.95,425.101 408.816,426.136 407.961,426.9 407.197,427.583 405.947,428.674 404.513,429.924 403.918,430.433 403.409,430.867 401.857,432.16 399.995,433.712 399.789,433.88 399.621,434.017 398.125,435.208 397.682,435.561 395.833,437.032 395.57,437.237 395.23,437.5"/>
<polyline fill="none" stroke="#ff0000" stroke-width="1" points="395.23,62.5 395.57,62.7634 395.833,62.9677 397.682,64.4391 398.125,64.7917 399.621,65.9825 399.789,66.1198 399.995,66.2879 401.857,67.8396 403.409,69.1328 403.918,69.5671 404.513,70.0757 405.947,71.3262 407.197,72.417 407.961,73.0997 408.816,73.8636 409.95,74.8988 410.985,75.8441 411.919,76.7173 412.918,77.6515 413.867,78.5576 414.773,79.4234 415.792,80.4201 416.835,81.4394 417.698,82.3024 418.561,83.1655 419.58,84.2079 420.577,85.2273 421.442,86.1334 422.348,87.0816 423.283,88.081 424.156,89.0151 425.101,90.0504 426.136,91.1841 426.9,92.0391 427.583,92.803 428.674,94.0535 429.924,95.4869 430.433,96.0823 430.867,96.5909 432.16,98.1426 433.712,100.005 433.88,100.211 434.017,100.379 435.208,101.875 435.561,102.318 437.032,104.167 437.237,104.43 437.5,104.77"/>
<polyline fill="none" stroke="#ff0000" stroke-width="1" points="62.5,104.77 62.7634,104.43 62.9677,104.167 64.4391,102.318 64.7917,101.875 65.9825,100.379 66.1198,100.211 66.2879,100.005 67.8396,98.1426 69.1327,96.5909 69.5672,96.0823 70.0757,95.4869 71.3262,94.0535 72.417,92.803 73.0997,92.0391 73.8636,91.1841 74.8988,90.0504 75.844,89.0151 76.7173,88.081 77.6515,87.0816 78.5576,86.1334 79.4234,85.2273 80.4201,84.2079 81.4394,83.1655 82.3024,82.3024 83.1655,81.4394 84.2079,80.4201 85.2273,79.4234 86.1333,78.5576 87.0816,77.6515 88.081,76.7173 89.0152,75.8441 90.0504,74.8988 91.1842,73.8636 92.0391,73.0997 92.803,72.417 94.0535,71.3262 95.4869,70.0757 96.0823,69.5671 96.5909,69.1328 98.1427,67.8396 100.005,66.2879 100.211,66.1198 100.379,65.9825 101.875,64.7917 102.318,64.4391 104.167,62.9677 104.43,62.7634 104.77,62.5"/>
<polyline fill="none" stroke="#ff0000" stroke-width="1" points="62.5,395.23 62.7634,395.57 62.9677,395.833 64.4391,397.682 64.7917,398.125 65.9825,399.621 66.1198,399.789 66.2879,399.995 67.8396,401.857 69.1327,403.409 69.5672,403.918 70.0757,404.513 71.3262,405.947 72.417,407.197 73.0997,407.961 73.8636,408.816 74.8988,409.95 75.844,410.985 76.7173,411.919 77.6515,412.918 78.5576,413.867 79.4234,414.773 80.4201,415.792 81.4394,416.835 82.3024,417.698 83.1655,418.561 84.2079,419.58 85.2273,420.577 86.1333,421.442 87.0816,422.348 88.081,423.283 89.0152,424.156 90.0504,425.101 91.1842,426.136 92.0391,426.9 92.803,427.583 94.0535,428.674 95.4869,429.924 96.0823,430.433 96.5909,430.867 98.1427,432.16 100.005,433.712 100.211,433.88 100.379,434.017 101.875,435.208 102.318,435.561 104.167,437.032 104.43,437.237 104.77,437.5"/>
</g>
</svg>
