<?xml version="1.0" encoding="UTF-8" standalone="no"?>
<svg xmlns="http://www.w3.org/2000/svg"
     xmlns:xlink="http://www.w3.org/1999/xlink"
     width="610px" height="460px" viewBox="0 0 610 460"
     style="stroke:none">
<title>Figure n°0</title>
<desc>
Creator: GL2PS 1.3.2, (C) 1999-2006 Christophe Geuzaine (geuz@geuz.org)
For: Scilab
CreationDate: Sun May 16 16:34:39 2010
</desc>
<defs>
</defs>
<polygon fill="#ffffff" points="0,0 610,0 610,460 0,460"/>
<g>
<polygon fill="#ffffff" points="76.25,402.5 76.25,57.5 76.25,57.5"/>
<polygon fill="#ffffff" points="76.25,402.5 76.25,57.5 76.25,402.5"/>
<polygon fill="#ffffff" points="76.25,402.5 533.75,402.5 533.75,402.5"/>
<polygon fill="#ffffff" points="76.25,402.5 533.75,402.5 76.25,402.5"/>
<polygon fill="#ffffff" points="76.25,402.5 533.75,402.5 533.75,57.5"/>
<polygon fill="#ffffff" points="76.25,402.5 533.75,57.5 76.25,57.5"/>
<polyline fill="none" stroke="#000000" stroke-width="0.5" points="371.049,402.5 373.264,401.179 375.023,400.141 378.299,397.925 381.939,395.459 383.177,394.564 384.368,393.706 387.738,390.962 390.855,388.418 392.177,387.271 393.695,385.944 396.347,383.376 398.414,381.377 400.35,379.352 403.03,376.546 404.194,375.212 404.957,374.337 407.75,370.854 407.898,370.665 410.616,367.296 411.24,366.44 412.375,364.895 414.442,361.818 415.494,360.255 417.458,357.048 418.165,355.884 419.803,353.214 420.362,352.196 421.711,349.738 423.023,347.159 423.508,346.173 424.438,344.112 425.416,341.933 426.672,339.133 427.668,336.592 428.757,333.81 429.446,332.092 429.772,331.125 431.047,327.297 431.615,325.478 431.745,325.051 431.913,324.397 433.15,319.596 433.56,318.01 434.007,315.771 434.472,313.55 434.994,310.969 435.496,307.608 435.552,307.322 436.055,303.929 436.353,300.891 436.455,299.848 436.753,296.888 436.864,294.234 436.939,292.44 437.06,289.847 437.042,287.323 437.022,285.343 436.995,282.806 436.836,280.126 436.725,278.52 436.557,275.765 436.194,272.606 436.12,271.941 435.738,268.725 435.208,265.581 435.077,264.718 434.556,261.684 434.054,259.415 433.383,256.408 433.002,254.643 432.657,253.426 431.065,247.612 431.047,247.602 431.047,247.596 431.047,247.57 429.092,242.038 428.571,240.561 427.454,237.851 426.952,236.614 425.667,233.521 424.634,231.313 422.735,227.252 422.363,226.479 422.186,226.122 421.711,225.221 419.412,221.177 418.417,219.439 416.461,216.353 415.41,214.692 413.967,212.398 413.418,211.61 412.375,210.104 410.086,207.083 408.773,205.357 406.577,202.688 403.03,198.396 402.993,198.349 402.965,198.316 402.76,198.104 399.028,194.303 396.049,191.275 394.998,190.29 393.695,189.053 390.697,186.498 388.045,184.235 386.249,182.81 384.368,181.308 381.548,179.317 378.542,177.194 376.68,175.952 375.023,174.859 371.495,172.812 366.916,170.153 366.208,169.763 365.688,169.481 363.333,168.378 360.475,167.04 356.352,165.106 354.62,164.426 351.251,163.112 348.402,162.064 347.025,161.551 343.609,160.547 341.803,160.01 337.68,158.795 334.888,158.177 329.573,157.001 328.344,156.728 327.618,156.621 323.895,156.071 319.762,155.495 318.999,155.388 318.003,155.318 311.283,154.848 309.663,154.735 307.895,154.735 302.105,154.735 300.328,154.735 298.708,154.848 291.997,155.318 291.001,155.388 290.229,155.495 286.105,156.071 282.391,156.621 281.656,156.728 280.427,157.001 275.112,158.177 272.33,158.795 268.206,160.01 266.391,160.547 262.984,161.551 261.598,162.064 258.749,163.112 255.389,164.426 253.648,165.106 249.525,167.04 246.667,168.378 244.313,169.481 243.792,169.763 243.075,170.153 238.495,172.812 234.977,174.859 233.33,175.952 231.458,177.194 228.452,179.317 225.641,181.308 223.751,182.81 221.955,184.235 219.303,186.498 216.296,189.053 214.993,190.29 213.96,191.275 210.972,194.303 207.249,198.104 207.035,198.316 207.007,198.349 206.97,198.396 203.423,202.688 201.217,205.357 199.914,207.083 197.625,210.104 196.582,211.61 196.033,212.398 194.59,214.692 193.539,216.353 191.583,219.439 190.588,221.177 188.289,225.221 187.814,226.122 187.628,226.479 187.265,227.252 185.366,231.313 184.324,233.521 183.058,236.614 182.546,237.851 181.438,240.561 180.908,242.038 178.953,247.57 178.953,247.596 178.944,247.602 178.944,247.612 177.343,253.426 177.008,254.643 176.617,256.408 175.946,259.415 175.444,261.684 174.932,264.718 174.783,265.581 174.252,268.725 173.88,271.941 173.806,272.606 173.443,275.765 173.266,278.52 173.164,280.126 173.005,282.806 172.987,285.343 172.958,287.323 172.94,289.847 173.061,292.44 173.136,294.234 173.256,296.888 173.545,299.848 173.647,300.891 173.945,303.929 174.457,307.322 174.495,307.608 175.006,310.969 175.537,313.55 175.984,315.771 176.44,318.01 176.85,319.596 178.087,324.397 178.255,325.051 178.385,325.478 178.953,327.297 180.237,331.125 180.554,332.092 181.233,333.81 182.322,336.592 183.318,339.133 184.584,341.933 185.552,344.112 186.483,346.173 186.986,347.159 188.289,349.738 189.638,352.196 190.197,353.214 191.835,355.884 192.542,357.048 194.506,360.255 195.558,361.818 197.625,364.895 198.76,366.44 199.393,367.296 202.092,370.665 202.241,370.854 205.034,374.337 205.806,375.212 206.97,376.546 209.65,379.352 211.586,381.377 213.653,383.376 216.296,385.944 217.823,387.271 219.135,388.418 222.262,390.962 225.641,393.706 226.823,394.564 228.061,395.459 231.71,397.925 234.977,400.141 236.727,401.179 238.951,402.5"/>
<polyline fill="none" stroke="#0000ff" stroke-width="0.5" points="452.65,402.5 454.94,399.399 456.346,397.506 457.854,395.459 458.263,394.863 459.054,393.719 461.372,390.164 462.508,388.418 464.36,385.373 465.421,383.621 466.771,381.377 467.264,380.523 468.399,378.513 469.982,375.532 470.615,374.337 471.918,371.68 472.532,370.419 474.068,367.296 474.999,365.232 476.972,360.828 477.232,360.255 477.344,359.965 477.735,359.022 479.467,354.524 479.969,353.214 480.76,350.925 481.449,348.973 482.417,346.173 483.283,343.325 483.832,341.575 484.577,339.133 485.005,337.572 486.308,332.658 486.466,332.092 486.559,331.707 487.062,329.477 487.89,325.675 488.03,325.051 488.179,324.211 489.026,319.492 489.296,318.01 489.575,316.124 489.994,313.174 490.31,310.969 490.58,308.315 490.757,306.71 491.045,303.929 491.26,300.762 491.315,300.089 491.539,296.888 491.641,293.44 491.641,293.297 491.753,289.847 491.725,286.332 491.725,286.321 491.716,282.806 491.558,279.419 491.548,279.144 491.399,275.765 491.157,272.686 491.073,271.747 490.822,268.725 490.524,266.118 490.282,264.111 489.994,261.684 489.696,259.705 489.146,256.213 488.905,254.643 488.672,253.433 487.639,248.027 487.555,247.602 487.471,247.292 487.062,245.509 486.057,241.325 485.861,240.561 485.544,239.415 484.446,235.498 483.888,233.521 482.873,230.359 482.687,229.781 481.635,226.479 480.807,224.166 479.606,220.854 479.104,219.439 478.787,218.646 477.735,216.015 476.581,213.27 476.209,212.398 475.39,210.633 474.189,208.03 472.951,205.357 471.694,202.869 470.019,199.539 469.396,198.316 469.107,197.779 468.399,196.475 466.296,192.853 465.384,191.275 463.364,188.024 462.74,187.012 461.009,184.235 460.348,183.252 459.054,181.294 457.165,178.62 456.15,177.194 453.823,174.099 452.334,172.128 450.845,170.153 450.426,169.622 449.719,168.74 446.796,165.316 444.916,163.112 443.073,161.08 440.374,158.095 439.247,156.925 438.428,156.071 435.208,152.928 431.857,149.646 431.233,149.031 431.149,148.953 431.047,148.856 426.793,145.189 423.098,141.99 422.438,141.442 421.711,140.844 417.812,137.885 413.958,134.949 413.148,134.364 412.375,133.802 408.215,131.04 403.505,127.908 403.254,127.743 403.03,127.604 401.299,126.602 397.985,124.679 393.695,122.201 392.652,121.656 391.144,120.867 387.067,118.832 384.368,117.484 381.315,116.129 376.122,113.827 375.423,113.529 375.023,113.36 373.804,112.904 369.187,111.185 365.688,109.879 362.811,108.958 356.603,106.975 356.352,106.895 356.24,106.866 355.942,106.786 349.287,105.079 347.025,104.499 342.846,103.645 342.055,103.483 337.68,102.585 334.543,102.104 330.689,101.51 328.344,101.15 326.706,100.982 319.697,100.264 318.999,100.193 318.44,100.165 310.25,99.7451 309.701,99.7178 309.663,99.7163 309.635,99.7163 300.374,99.7163 300.328,99.7163 300.299,99.7178 299.75,99.7451 291.55,100.165 291.001,100.193 290.312,100.264 283.303,100.982 281.656,101.15 279.32,101.51 275.448,102.104 272.33,102.585 267.945,103.483 267.154,103.645 262.984,104.499 260.723,105.079 254.058,106.786 253.751,106.866 253.648,106.895 253.397,106.975 247.189,108.958 244.313,109.879 240.813,111.185 236.196,112.904 234.977,113.36 234.577,113.529 233.878,113.827 228.694,116.129 225.641,117.484 222.942,118.832 218.865,120.867 217.348,121.656 216.296,122.201 212.015,124.679 208.701,126.602 206.97,127.604 206.746,127.743 206.485,127.908 201.776,131.04 197.625,133.802 196.852,134.364 196.042,134.949 192.179,137.885 188.289,140.844 187.563,141.442 186.902,141.99 183.197,145.189 178.953,148.856 178.851,148.953 178.767,149.031 178.134,149.646 174.783,152.928 171.581,156.071 170.743,156.925 169.617,158.095 166.927,161.08 165.084,163.112 163.204,165.316 160.281,168.74 159.574,169.622 159.155,170.153 157.657,172.128 156.177,174.099 153.84,177.194 152.835,178.62 150.946,181.294 149.643,183.252 148.991,184.235 147.26,187.012 146.636,188.024 144.607,191.275 143.695,192.853 141.61,196.475 140.893,197.779 140.604,198.316 139.99,199.539 138.306,202.869 137.049,205.357 135.811,208.03 134.61,210.633 133.791,212.398 133.428,213.27 132.274,216.015 131.222,218.646 130.906,219.439 130.394,220.854 129.203,224.166 128.374,226.479 127.313,229.781 127.127,230.359 126.112,233.521 125.554,235.498 124.456,239.415 124.13,240.561 123.943,241.325 122.929,245.509 122.52,247.292 122.454,247.602 122.371,248.027 121.328,253.433 121.095,254.643 120.854,256.213 120.304,259.705 119.997,261.684 119.718,264.111 119.476,266.118 119.168,268.725 118.927,271.747 118.843,272.686 118.601,275.765 118.452,279.144 118.442,279.419 118.293,282.806 118.275,286.321 118.275,286.332 118.247,289.847 118.359,293.297 118.359,293.44 118.471,296.888 118.694,300.089 118.731,300.762 118.945,303.929 119.243,306.71 119.411,308.315 119.69,310.969 120.016,313.174 120.425,316.124 120.704,318.01 120.965,319.492 121.821,324.211 121.97,325.051 122.11,325.675 122.929,329.477 123.441,331.707 123.534,332.092 123.692,332.658 125.004,337.572 125.423,339.133 126.177,341.575 126.708,343.325 127.583,346.173 128.551,348.973 129.24,350.925 130.031,353.214 130.533,354.524 132.274,359.022 132.656,359.965 132.777,360.255 133.028,360.828 135.001,365.232 135.932,367.296 137.468,370.419 138.082,371.68 139.385,374.337 140.018,375.532 141.61,378.513 142.745,380.523 143.22,381.377 144.579,383.621 145.649,385.373 147.492,388.418 148.628,390.164 150.946,393.719 151.737,394.863 152.146,395.459 153.654,397.506 155.05,399.399 157.34,402.5"/>
<polyline fill="none" stroke="#00ff00" stroke-width="0.5" points="533.75,290.551 533.583,296.767 533.583,296.888 533.583,297.017 533.201,303.52 533.191,303.929 533.145,304.385 532.643,310.131 532.559,310.969 532.456,311.952 531.889,316.609 531.73,318.01 531.47,319.731 530.976,322.963 530.669,325.051 530.176,327.743 529.915,329.201 529.394,332.092 528.705,335.328 528.565,336.005 527.896,339.133 527.355,341.352 526.574,344.54 526.183,346.173 525.875,347.279 524.405,352.617 524.274,353.108 524.247,353.214 524.191,353.384 522.469,358.786 521.994,360.255 521.119,362.734 520.551,364.38 519.527,367.296 518.532,369.896 517.536,372.486 516.828,374.337 516.4,375.338 515.079,378.528 514.138,380.673 513.84,381.377 513.161,382.824 511.728,385.888 510.527,388.418 509.214,391.04 507.763,393.937 506.999,395.459 506.627,396.132 505.743,397.794 503.891,401.099 503.099,402.5"/>
<polyline fill="none" stroke="#00ff00" stroke-width="0.5" points="76.25,286.327 76.2686,282.82 76.2686,282.806 76.2686,282.792 76.52,275.966 76.5293,275.765 76.5386,275.548 76.9575,269.261 76.9946,268.725 77.0596,268.115 77.5903,262.695 77.6929,261.684 77.8511,260.479 78.3906,256.259 78.605,254.643 78.9214,252.625 79.3589,249.945 79.731,247.602 80.3267,244.532 80.4756,243.745 81.0806,240.561 81.7231,237.653 82.0581,236.181 82.6445,233.521 83.1284,231.662 84.1709,227.551 84.4409,226.479 84.6362,225.767 85.5859,222.447 86.312,219.99 86.4795,219.439 86.7773,218.541 88.1641,214.34 88.8062,212.398 90.0068,209.062 90.1094,208.772 91.3564,205.357 92.1758,203.282 93.7954,199.167 94.1304,198.316 94.3257,197.864 94.9214,196.459 96.6528,192.581 97.2393,191.275 98.5518,188.539 99.1006,187.388 100.618,184.235 101.632,182.256 104.229,177.218 104.239,177.194 104.248,177.183 104.257,177.158 107.068,172.27 108.278,170.153 109.954,167.408 111.713,164.538 112.579,163.112 112.914,162.594 113.603,161.53 116.041,157.917 117.289,156.071 119.271,153.309 121.626,150.021 122.333,149.031 122.547,148.739 122.929,148.226 126.028,144.321 127.872,141.99 129.565,139.95 132.274,136.695 133.195,135.644 133.8,134.949 136.993,131.472 137.254,131.19 140.27,127.908 140.837,127.323 141.61,126.515 144.858,123.318 147.353,120.867 148.944,119.361 150.946,117.477 153.17,115.503 155.05,113.827 157.508,111.736 160.281,109.374 161.947,108.042 163.521,106.786 166.545,104.465 169.617,102.099 171.218,100.952 172.903,99.7451 176.058,97.562 178.953,95.562 181,94.2485 183.412,92.7041 186.092,91.0449 188.289,89.6836 191.323,87.9512 195.335,85.6631 196.656,84.9312 197.625,84.396 202.213,82.0786 202.725,81.8174 206.97,79.6753 207.835,79.2764 209.259,78.6226 213.69,76.6523 216.296,75.4912 219.684,74.1362 225.139,71.9546 225.641,71.7568 225.799,71.7007 226.134,71.5815 232.203,69.4917 234.977,68.5381 238.765,67.3975 241.697,66.5151 244.313,65.7271 245.485,65.4243 248.911,64.541 252.466,63.6504 253.648,63.355 255.817,62.9023 259.736,62.0874 262.984,61.4097 267.229,60.7017 268.318,60.521 272.33,59.853 275.001,59.5186 279.776,58.9214 281.656,58.6855 283.08,58.5674 290.387,57.958 291.001,57.9072 291.513,57.8862 300.299,57.5195 300.328,57.5181 300.355,57.5181 309.654,57.5181 309.663,57.5181 309.691,57.5195 318.497,57.8862 318.999,57.9072 319.613,57.958 326.92,58.5674 328.344,58.6855 330.224,58.9214 334.999,59.5186 337.68,59.853 341.691,60.521 342.771,60.7017 347.025,61.4097 350.264,62.0874 354.183,62.9023 356.352,63.355 357.534,63.6504 361.089,64.541 364.515,65.4243 365.688,65.7271 368.303,66.5151 371.235,67.3975 375.023,68.5381 377.797,69.4917 383.875,71.5815 384.201,71.7007 384.368,71.7568 384.861,71.9546 390.316,74.1362 393.695,75.4912 396.31,76.6523 400.741,78.6226 402.174,79.2764 403.03,79.6753 407.275,81.8174 407.787,82.0786 412.375,84.396 413.344,84.9312 414.674,85.6631 418.667,87.9512 421.711,89.6836 423.908,91.0449 426.588,92.7041 428.99,94.2485 431.047,95.562 433.942,97.562 437.106,99.7451 438.782,100.952 440.374,102.099 443.455,104.465 446.489,106.786 448.053,108.042 449.719,109.374 452.483,111.736 454.94,113.827 456.83,115.503 459.054,117.477 461.046,119.361 462.657,120.867 465.142,123.318 468.399,126.515 469.172,127.323 469.73,127.908 472.746,131.19 473.007,131.472 476.2,134.949 476.805,135.644 477.735,136.695 480.435,139.95 482.128,141.99 483.981,144.321 487.062,148.226 487.462,148.739 487.676,149.031 488.383,150.021 490.729,153.309 492.711,156.071 493.959,157.917 496.397,161.53 497.086,162.594 497.421,163.112 498.296,164.538 500.046,167.408 501.722,170.153 502.932,172.27 505.743,177.158 505.752,177.183 505.752,177.194 505.771,177.218 508.358,182.256 509.382,184.235 510.899,187.388 511.458,188.539 512.761,191.275 513.347,192.581 515.079,196.459 515.684,197.864 515.87,198.316 516.195,199.167 517.824,203.282 518.653,205.357 519.881,208.772 519.993,209.062 521.203,212.398 521.845,214.34 523.223,218.541 523.521,219.439 523.688,219.99 524.405,222.447 525.364,225.767 525.568,226.479 525.838,227.551 526.872,231.662 527.355,233.521 527.942,236.181 528.268,237.653 528.919,240.561 529.534,243.745 529.683,244.532 530.269,247.602 530.641,249.945 531.079,252.625 531.404,254.643 531.609,256.259 532.149,260.479 532.316,261.684 532.41,262.695 532.94,268.115 532.996,268.725 533.042,269.261 533.461,275.548 533.471,275.765 533.489,275.966 533.731,282.792 533.731,282.806 533.731,282.82 533.75,286.327"/>
<polyline fill="none" stroke="#00ff00" stroke-width="0.5" points="76.25,290.551 76.4082,296.767 76.4175,296.888 76.4268,297.017 76.79,303.52 76.8086,303.929 76.855,304.385 77.3672,310.131 77.4321,310.969 77.5532,311.952 78.1113,316.609 78.27,318.01 78.5303,319.731 79.0239,322.963 79.3311,325.051 79.8149,327.743 80.085,329.201 80.606,332.092 81.2949,335.328 81.4438,336.005 82.1045,339.133 82.6445,341.352 83.417,344.54 83.8174,346.173 84.1245,347.279 85.5859,352.617 85.7256,353.108 85.7534,353.214 85.8091,353.384 87.5313,358.786 88.0059,360.255 88.8716,362.734 89.4487,364.38 90.4727,367.296 91.4775,369.896 92.4736,372.486 93.1812,374.337 93.5996,375.338 94.9214,378.528 95.8618,380.673 96.1689,381.377 96.8389,382.824 98.2817,385.888 99.4639,388.418 100.786,391.04 102.237,393.937 103.001,395.459 103.364,396.132 104.257,397.794 106.119,401.099 106.91,402.5"/>
<polyline fill="none" stroke="#00ffff" stroke-width="0.5" points="437.022,57.5 438.921,58.604 440.374,59.458 444.069,61.7617 448.518,64.541 449.16,64.96 449.719,65.3188 454.065,68.3071 458.822,71.5815 458.952,71.6685 459.054,71.75 463.615,75.1895 468.148,78.6226 468.278,78.7148 468.399,78.8101 472.737,82.3955 476.674,85.6631 477.167,86.0859 477.735,86.5659 481.431,89.9131 484.511,92.7041 485.656,93.7695 487.062,95.0942 489.733,97.7305 491.781,99.7451 493.745,101.754 496.397,104.483 497.654,105.837 498.539,106.786 501.442,110.028 502.978,111.737 504.84,113.827 505.193,114.24 505.743,114.878 508.768,118.58 510.648,120.867 512.295,122.965 515.079,126.507 515.749,127.401 516.13,127.908 517.368,129.642 519.034,131.959 521.194,134.949 522.292,136.55 524.405,139.643 525.447,141.211 525.959,141.99 527.337,144.198 528.454,145.98 530.362,149.031 531.414,150.789 533.75,154.704"/>
<polyline fill="none" stroke="#00ffff" stroke-width="0.5" points="76.25,154.704 78.5864,150.789 79.6289,149.031 81.5464,145.98 82.6631,144.198 84.0405,141.99 84.5527,141.211 85.5859,139.643 87.7173,136.55 88.8062,134.949 90.9565,131.959 92.6226,129.642 93.8696,127.908 94.2515,127.401 94.9214,126.507 97.7046,122.965 99.3521,120.867 101.223,118.58 104.257,114.878 104.807,114.24 105.169,113.827 107.031,111.737 108.558,110.028 111.461,106.786 112.336,105.837 113.603,104.483 116.265,101.754 118.219,99.7451 120.267,97.7305 122.929,95.0942 124.353,93.7695 125.479,92.7041 128.569,89.9131 132.274,86.5659 132.833,86.0859 133.326,85.6631 137.272,82.3955 141.61,78.8101 141.722,78.7148 141.852,78.6226 146.385,75.1895 150.946,71.75 151.057,71.6685 151.178,71.5815 155.944,68.3071 160.281,65.3188 160.831,64.96 161.491,64.541 165.931,61.7617 169.617,59.458 171.079,58.604 172.968,57.5"/>
<polyline fill="none" stroke="#ff0000" stroke-width="0.5" points="491.725,57.5 493.95,59.3511 496.397,61.3975 498.333,63.0859 499.99,64.541 502.606,66.9019 505.743,69.7305 506.832,70.7607 507.688,71.5815 510.909,74.7236 514.287,78.0322 514.901,78.6226 514.976,78.6997 515.079,78.8037 518.857,82.8071 521.575,85.6631 522.729,86.9351 524.405,88.7808 526.48,91.144 527.839,92.7041 530.148,95.4233 533.75,99.6943"/>
<polyline fill="none" stroke="#ff0000" stroke-width="0.5" points="76.25,99.6943 79.8613,95.4233 82.1514,92.7041 83.5195,91.144 85.5859,88.7808 87.2705,86.9351 88.4341,85.6631 91.1333,82.8071 94.9214,78.8037 95.0239,78.6997 95.0986,78.6226 95.7129,78.0322 99.0913,74.7236 102.303,71.5815 103.178,70.7607 104.257,69.7305 107.394,66.9019 110.01,64.541 111.667,63.0859 113.603,61.3975 116.05,59.3511 118.275,57.5"/>
<polyline fill="none" stroke="#0000ff" stroke-width="0.5" points="415,287 423,287"/>
<polyline fill="none" stroke="#0000ff" stroke-width="0.5" points="419,291 419,283"/>
<polyline fill="none" stroke="#0000ff" stroke-width="0.5" points="416.171,284.171 421.829,289.829"/>
<polyline fill="none" stroke="#0000ff" stroke-width="0.5" points="416.171,289.829 421.829,284.171"/>
<polygon fill="#ffffff" points="305.392,168.019 305,168 305,172"/>
<polygon fill="#ffffff" points="305.392,168.019 305,172 305,172"/>
<polygon fill="#ffffff" points="305.78,168.077 305.392,168.019 305,172"/>
<polygon fill="#ffffff" points="305.78,168.077 305,172 305,172"/>
<polygon fill="#ffffff" points="306.161,168.172 305.78,168.077 305,172"/>
<polygon fill="#ffffff" points="306.161,168.172 305,172 305,172"/>
<polygon fill="#ffffff" points="306.531,168.305 306.161,168.172 305,172"/>
<polygon fill="#ffffff" points="306.531,168.305 305,172 305,172"/>
<polygon fill="#ffffff" points="306.886,168.472 306.531,168.305 305,172"/>
<polygon fill="#ffffff" points="306.886,168.472 305,172 305,172"/>
<polygon fill="#ffffff" points="307.222,168.674 306.886,168.472 305,172"/>
<polygon fill="#ffffff" points="307.222,168.674 305,172 305,172"/>
<polygon fill="#ffffff" points="307.538,168.908 307.222,168.674 305,172"/>
<polygon fill="#ffffff" points="307.538,168.908 305,172 305,172"/>
<polygon fill="#ffffff" points="307.829,169.171 307.538,168.908 305,172"/>
<polygon fill="#ffffff" points="307.829,169.171 305,172 305,172"/>
<polygon fill="#ffffff" points="308.092,169.462 307.829,169.171 305,172"/>
<polygon fill="#ffffff" points="308.092,169.462 305,172 305,172"/>
<polygon fill="#ffffff" points="308.326,169.778 308.092,169.462 305,172"/>
<polygon fill="#ffffff" points="308.326,169.778 305,172 305,172"/>
<polygon fill="#ffffff" points="308.528,170.114 308.326,169.778 305,172"/>
<polygon fill="#ffffff" points="308.528,170.114 305,172 305,172"/>
<polygon fill="#ffffff" points="308.695,170.469 308.528,170.114 305,172"/>
<polygon fill="#ffffff" points="308.695,170.469 305,172 305,172"/>
<polygon fill="#ffffff" points="308.828,170.839 308.695,170.469 305,172"/>
<polygon fill="#ffffff" points="308.828,170.839 305,172 305,172"/>
<polygon fill="#ffffff" points="308.923,171.22 308.828,170.839 305,172"/>
<polygon fill="#ffffff" points="308.923,171.22 305,172 305,172"/>
<polygon fill="#ffffff" points="308.981,171.608 308.923,171.22 305,172"/>
<polygon fill="#ffffff" points="308.981,171.608 305,172 305,172"/>
<polygon fill="#ffffff" points="309,172 308.981,171.608 305,172"/>
<polygon fill="#ffffff" points="309,172 305,172 305,172"/>
<polygon fill="#ffffff" points="308.981,172.392 309,172 305,172"/>
<polygon fill="#ffffff" points="308.981,172.392 305,172 305,172"/>
<polygon fill="#ffffff" points="308.923,172.78 308.981,172.392 305,172"/>
<polygon fill="#ffffff" points="308.923,172.78 305,172 305,172"/>
<polygon fill="#ffffff" points="308.828,173.161 308.923,172.78 305,172"/>
<polygon fill="#ffffff" points="308.828,173.161 305,172 305,172"/>
<polygon fill="#ffffff" points="308.695,173.531 308.828,173.161 305,172"/>
<polygon fill="#ffffff" points="308.695,173.531 305,172 305,172"/>
<polygon fill="#ffffff" points="308.528,173.886 308.695,173.531 305,172"/>
<polygon fill="#ffffff" points="308.528,173.886 305,172 305,172"/>
<polygon fill="#ffffff" points="308.326,174.222 308.528,173.886 305,172"/>
<polygon fill="#ffffff" points="308.326,174.222 305,172 305,172"/>
<polygon fill="#ffffff" points="308.092,174.538 308.326,174.222 305,172"/>
<polygon fill="#ffffff" points="308.092,174.538 305,172 305,172"/>
<polygon fill="#ffffff" points="307.829,174.829 308.092,174.538 305,172"/>
<polygon fill="#ffffff" points="307.829,174.829 305,172 305,172"/>
<polygon fill="#ffffff" points="307.538,175.092 307.829,174.829 305,172"/>
<polygon fill="#ffffff" points="307.538,175.092 305,172 305,172"/>
<polygon fill="#ffffff" points="307.222,175.326 307.538,175.092 305,172"/>
<polygon fill="#ffffff" points="307.222,175.326 305,172 305,172"/>
<polygon fill="#ffffff" points="306.886,175.528 307.222,175.326 305,172"/>
<polygon fill="#ffffff" points="306.886,175.528 305,172 305,172"/>
<polygon fill="#ffffff" points="306.531,175.695 306.886,175.528 305,172"/>
<polygon fill="#ffffff" points="306.531,175.695 305,172 305,172"/>
<polygon fill="#ffffff" points="306.161,175.828 306.531,175.695 305,172"/>
<polygon fill="#ffffff" points="306.161,175.828 305,172 305,172"/>
<polygon fill="#ffffff" points="305.78,175.923 306.161,175.828 305,172"/>
<polygon fill="#ffffff" points="305.78,175.923 305,172 305,172"/>
<polygon fill="#ffffff" points="305.392,175.981 305.78,175.923 305,172"/>
<polygon fill="#ffffff" points="305.392,175.981 305,172 305,172"/>
<polygon fill="#ffffff" points="305,176 305.392,175.981 305,172"/>
<polygon fill="#ffffff" points="305,176 305,172 305,172"/>
<polygon fill="#ffffff" points="304.608,175.981 305,176 305,172"/>
<polygon fill="#ffffff" points="304.608,175.981 305,172 305,172"/>
<polygon fill="#ffffff" points="304.22,175.923 304.608,175.981 305,172"/>
<polygon fill="#ffffff" points="304.22,175.923 305,172 305,172"/>
<polygon fill="#ffffff" points="303.839,175.828 304.22,175.923 305,172"/>
<polygon fill="#ffffff" points="303.839,175.828 305,172 305,172"/>
<polygon fill="#ffffff" points="303.469,175.695 303.839,175.828 305,172"/>
<polygon fill="#ffffff" points="303.469,175.695 305,172 305,172"/>
<polygon fill="#ffffff" points="303.114,175.528 303.469,175.695 305,172"/>
<polygon fill="#ffffff" points="303.114,175.528 305,172 305,172"/>
<polygon fill="#ffffff" points="302.778,175.326 303.114,175.528 305,172"/>
<polygon fill="#ffffff" points="302.778,175.326 305,172 305,172"/>
<polygon fill="#ffffff" points="302.462,175.092 302.778,175.326 305,172"/>
<polygon fill="#ffffff" points="302.462,175.092 305,172 305,172"/>
<polygon fill="#ffffff" points="302.171,174.829 302.462,175.092 305,172"/>
<polygon fill="#ffffff" points="302.171,174.829 305,172 305,172"/>
<polygon fill="#ffffff" points="301.908,174.538 302.171,174.829 305,172"/>
<polygon fill="#ffffff" points="301.908,174.538 305,172 305,172"/>
<polygon fill="#ffffff" points="301.674,174.222 301.908,174.538 305,172"/>
<polygon fill="#ffffff" points="301.674,174.222 305,172 305,172"/>
<polygon fill="#ffffff" points="301.472,173.886 301.674,174.222 305,172"/>
<polygon fill="#ffffff" points="301.472,173.886 305,172 305,172"/>
<polygon fill="#ffffff" points="301.305,173.531 301.472,173.886 305,172"/>
<polygon fill="#ffffff" points="301.305,173.531 305,172 305,172"/>
<polygon fill="#ffffff" points="301.172,173.161 301.305,173.531 305,172"/>
<polygon fill="#ffffff" points="301.172,173.161 305,172 305,172"/>
<polygon fill="#ffffff" points="301.077,172.78 301.172,173.161 305,172"/>
<polygon fill="#ffffff" points="301.077,172.78 305,172 305,172"/>
<polygon fill="#ffffff" points="301.019,172.392 301.077,172.78 305,172"/>
<polygon fill="#ffffff" points="301.019,172.392 305,172 305,172"/>
<polygon fill="#ffffff" points="301,172 301.019,172.392 305,172"/>
<polygon fill="#ffffff" points="301,172 305,172 305,172"/>
<polygon fill="#ffffff" points="301.019,171.608 301,172 305,172"/>
<polygon fill="#ffffff" points="301.019,171.608 305,172 305,172"/>
<polygon fill="#ffffff" points="301.077,171.22 301.019,171.608 305,172"/>
<polygon fill="#ffffff" points="301.077,171.22 305,172 305,172"/>
<polygon fill="#ffffff" points="301.172,170.839 301.077,171.22 305,172"/>
<polygon fill="#ffffff" points="301.172,170.839 305,172 305,172"/>
<polygon fill="#ffffff" points="301.305,170.469 301.172,170.839 305,172"/>
<polygon fill="#ffffff" points="301.305,170.469 305,172 305,172"/>
<polygon fill="#ffffff" points="301.472,170.114 301.305,170.469 305,172"/>
<polygon fill="#ffffff" points="301.472,170.114 305,172 305,172"/>
<polygon fill="#ffffff" points="301.674,169.778 301.472,170.114 305,172"/>
<polygon fill="#ffffff" points="301.674,169.778 305,172 305,172"/>
<polygon fill="#ffffff" points="301.908,169.462 301.674,169.778 305,172"/>
<polygon fill="#ffffff" points="301.908,169.462 305,172 305,172"/>
<polygon fill="#ffffff" points="302.171,169.171 301.908,169.462 305,172"/>
<polygon fill="#ffffff" points="302.171,169.171 305,172 305,172"/>
<polygon fill="#ffffff" points="302.462,168.908 302.171,169.171 305,172"/>
<polygon fill="#ffffff" points="302.462,168.908 305,172 305,172"/>
<polygon fill="#ffffff" points="302.778,168.674 302.462,168.908 305,172"/>
<polygon fill="#ffffff" points="302.778,168.674 305,172 305,172"/>
<polygon fill="#ffffff" points="303.114,168.472 302.778,168.674 305,172"/>
<polygon fill="#ffffff" points="303.114,168.472 305,172 305,172"/>
<polygon fill="#ffffff" points="303.469,168.305 303.114,168.472 305,172"/>
<polygon fill="#ffffff" points="303.469,168.305 305,172 305,172"/>
<polygon fill="#ffffff" points="303.839,168.172 303.469,168.305 305,172"/>
<polygon fill="#ffffff" points="303.839,168.172 305,172 305,172"/>
<polygon fill="#ffffff" points="304.22,168.077 303.839,168.172 305,172"/>
<polygon fill="#ffffff" points="304.22,168.077 305,172 305,172"/>
<polygon fill="#ffffff" points="304.608,168.019 304.22,168.077 305,172"/>
<polygon fill="#ffffff" points="304.608,168.019 305,172 305,172"/>
<polygon fill="#ffffff" points="305,168 304.608,168.019 305,172"/>
<polygon fill="#ffffff" points="305,168 305,172 305,172"/>
<polyline fill="none" stroke="#ff0000" stroke-width="0.5" points="309,172 308.981,171.608 308.923,171.22 308.828,170.839 308.695,170.469 308.528,170.114 308.326,169.778 308.092,169.462 307.829,169.171 307.538,168.908 307.222,168.674 306.886,168.472 306.531,168.305 306.161,168.172 305.78,168.077 305.392,168.019 305,168 304.608,168.019 304.22,168.077 303.839,168.172 303.469,168.305 303.114,168.472 302.778,168.674 302.462,168.908 302.171,169.171 301.908,169.462 301.674,169.778 301.472,170.114 301.305,170.469 301.172,170.839 301.077,171.22 301.019,171.608 301,172 301.019,172.392 301.077,172.78 301.172,173.161 301.305,173.531 301.472,173.886 301.674,174.222 301.908,174.538 302.171,174.829 302.462,175.092 302.778,175.326 303.114,175.528 303.469,175.695 303.839,175.828 304.22,175.923 304.608,175.981 305,176 305.392,175.981 305.78,175.923 306.161,175.828 306.531,175.695 306.886,175.528 307.222,175.326 307.538,175.092 307.829,174.829 308.092,174.538 308.326,174.222 308.528,173.886 308.695,173.531 308.828,173.161 308.923,172.78 308.981,172.392 309,172"/>
<text fill="#000000" style="stroke:none" x="303" y="153" transform="rotate(0, 303, 153)" font-size="10" font-family="SansSerif" font-style="normal" font-weight="normal"> 1</text>
<text fill="#000000" style="stroke:none" x="301" y="98" transform="rotate(0, 301, 98)" font-size="10" font-family="SansSerif" font-style="normal" font-weight="normal"> 1</text>
<text fill="#000000" style="stroke:none" x="87" y="351" transform="rotate(0, 87, 351)" font-size="10" font-family="SansSerif" font-style="normal" font-weight="normal"> 1</text>
<text fill="#000000" style="stroke:none" x="497" y="102" transform="rotate(0, 497, 102)" font-size="10" font-family="SansSerif" font-style="normal" font-weight="normal"> 1</text>
<text fill="#000000" style="stroke:none" x="117" y="100" transform="rotate(0, 117, 100)" font-size="10" font-family="SansSerif" font-style="normal" font-weight="normal"> 1</text>
<text fill="#000000" style="stroke:none" x="516" y="77" transform="rotate(0, 516, 77)" font-size="10" font-family="SansSerif" font-style="normal" font-weight="normal"> 1</text>
<text fill="#000000" style="stroke:none" x="97" y="76" transform="rotate(0, 97, 76)" font-size="10" font-family="SansSerif" font-style="normal" font-weight="normal"> 1</text>
<polyline fill="none" stroke="#000000" stroke-width="0.5" points="76.25,402.5 76.25,57.5"/>
<polyline fill="none" stroke="#000000" stroke-width="0.5" points="76.25,402.5 69.395,402.5"/>
<polyline fill="none" stroke="#000000" stroke-width="0.5" points="76.25,345 69.395,345"/>
<polyline fill="none" stroke="#000000" stroke-width="0.5" points="76.25,287.5 69.395,287.5"/>
<polyline fill="none" stroke="#000000" stroke-width="0.5" points="76.25,230 69.395,230"/>
<polyline fill="none" stroke="#000000" stroke-width="0.5" points="76.25,172.5 69.395,172.5"/>
<polyline fill="none" stroke="#000000" stroke-width="0.5" points="76.25,115 69.395,115"/>
<polyline fill="none" stroke="#000000" stroke-width="0.5" points="76.25,57.5 69.395,57.5"/>
<polyline fill="none" stroke="#000000" stroke-width="0.5" points="76.25,388.125 72.1372,388.125"/>
<polyline fill="none" stroke="#000000" stroke-width="0.5" points="76.25,373.75 72.1372,373.75"/>
<polyline fill="none" stroke="#000000" stroke-width="0.5" points="76.25,359.375 72.1372,359.375"/>
<polyline fill="none" stroke="#000000" stroke-width="0.5" points="76.25,330.625 72.1372,330.625"/>
<polyline fill="none" stroke="#000000" stroke-width="0.5" points="76.25,316.25 72.1372,316.25"/>
<polyline fill="none" stroke="#000000" stroke-width="0.5" points="76.25,301.875 72.1372,301.875"/>
<polyline fill="none" stroke="#000000" stroke-width="0.5" points="76.25,273.125 72.1372,273.125"/>
<polyline fill="none" stroke="#000000" stroke-width="0.5" points="76.25,258.75 72.1372,258.75"/>
<polyline fill="none" stroke="#000000" stroke-width="0.5" points="76.25,244.375 72.1372,244.375"/>
<polyline fill="none" stroke="#000000" stroke-width="0.5" points="76.25,215.625 72.1372,215.625"/>
<polyline fill="none" stroke="#000000" stroke-width="0.5" points="76.25,201.25 72.1372,201.25"/>
<polyline fill="none" stroke="#000000" stroke-width="0.5" points="76.25,186.875 72.1372,186.875"/>
<polyline fill="none" stroke="#000000" stroke-width="0.5" points="76.25,158.125 72.1372,158.125"/>
<polyline fill="none" stroke="#000000" stroke-width="0.5" points="76.25,143.75 72.1372,143.75"/>
<polyline fill="none" stroke="#000000" stroke-width="0.5" points="76.25,129.375 72.1372,129.375"/>
<polyline fill="none" stroke="#000000" stroke-width="0.5" points="76.25,100.625 72.1372,100.625"/>
<polyline fill="none" stroke="#000000" stroke-width="0.5" points="76.25,86.25 72.1372,86.25"/>
<polyline fill="none" stroke="#000000" stroke-width="0.5" points="76.25,71.875 72.1372,71.875"/>
<text fill="#000000" style="stroke:none" x="52" y="407" transform="rotate(0, 52, 407)" font-size="10" font-family="SansSerif" font-style="normal" font-weight="normal">0.0</text>
<text fill="#000000" style="stroke:none" x="52" y="350" transform="rotate(0, 52, 350)" font-size="10" font-family="SansSerif" font-style="normal" font-weight="normal">0.5</text>
<text fill="#000000" style="stroke:none" x="53" y="292" transform="rotate(0, 53, 292)" font-size="10" font-family="SansSerif" font-style="normal" font-weight="normal">1.0</text>
<text fill="#000000" style="stroke:none" x="52" y="235" transform="rotate(0, 52, 235)" font-size="10" font-family="SansSerif" font-style="normal" font-weight="normal">1.5</text>
<text fill="#000000" style="stroke:none" x="52" y="177" transform="rotate(0, 52, 177)" font-size="10" font-family="SansSerif" font-style="normal" font-weight="normal">2.0</text>
<text fill="#000000" style="stroke:none" x="52" y="120" transform="rotate(0, 52, 120)" font-size="10" font-family="SansSerif" font-style="normal" font-weight="normal">2.5</text>
<text fill="#000000" style="stroke:none" x="52" y="62" transform="rotate(0, 52, 62)" font-size="10" font-family="SansSerif" font-style="normal" font-weight="normal">3.0</text>
<polyline fill="none" stroke="#000000" stroke-width="0.5" points="76.25,402.5 533.75,402.5"/>
<polyline fill="none" stroke="#000000" stroke-width="0.5" points="76.25,402.5 76.25,407.675"/>
<polyline fill="none" stroke="#000000" stroke-width="0.5" points="133.438,402.5 133.438,407.675"/>
<polyline fill="none" stroke="#000000" stroke-width="0.5" points="190.625,402.5 190.625,407.675"/>
<polyline fill="none" stroke="#000000" stroke-width="0.5" points="247.813,402.5 247.813,407.675"/>
<polyline fill="none" stroke="#000000" stroke-width="0.5" points="305,402.5 305,407.675"/>
<polyline fill="none" stroke="#000000" stroke-width="0.5" points="362.188,402.5 362.188,407.675"/>
<polyline fill="none" stroke="#000000" stroke-width="0.5" points="419.375,402.5 419.375,407.675"/>
<polyline fill="none" stroke="#000000" stroke-width="0.5" points="476.563,402.5 476.563,407.675"/>
<polyline fill="none" stroke="#000000" stroke-width="0.5" points="533.75,402.5 533.75,407.675"/>
<polyline fill="none" stroke="#000000" stroke-width="0.5" points="104.844,402.5 104.844,405.605"/>
<polyline fill="none" stroke="#000000" stroke-width="0.5" points="162.031,402.5 162.031,405.605"/>
<polyline fill="none" stroke="#000000" stroke-width="0.5" points="219.219,402.5 219.219,405.605"/>
<polyline fill="none" stroke="#000000" stroke-width="0.5" points="276.406,402.5 276.406,405.605"/>
<polyline fill="none" stroke="#000000" stroke-width="0.5" points="333.594,402.5 333.594,405.605"/>
<polyline fill="none" stroke="#000000" stroke-width="0.5" points="390.781,402.5 390.781,405.605"/>
<polyline fill="none" stroke="#000000" stroke-width="0.5" points="447.969,402.5 447.969,405.605"/>
<polyline fill="none" stroke="#000000" stroke-width="0.5" points="505.156,402.5 505.156,405.605"/>
<text fill="#000000" style="stroke:none" x="59" y="419" transform="rotate(0, 59, 419)" font-size="10" font-family="SansSerif" font-style="normal" font-weight="normal">0.9980</text>
<text fill="#000000" style="stroke:none" x="116" y="419" transform="rotate(0, 116, 419)" font-size="10" font-family="SansSerif" font-style="normal" font-weight="normal">0.9985</text>
<text fill="#000000" style="stroke:none" x="174" y="419" transform="rotate(0, 174, 419)" font-size="10" font-family="SansSerif" font-style="normal" font-weight="normal">0.9990</text>
<text fill="#000000" style="stroke:none" x="231" y="419" transform="rotate(0, 231, 419)" font-size="10" font-family="SansSerif" font-style="normal" font-weight="normal">0.9995</text>
<text fill="#000000" style="stroke:none" x="288" y="419" transform="rotate(0, 288, 419)" font-size="10" font-family="SansSerif" font-style="normal" font-weight="normal">1.0000</text>
<text fill="#000000" style="stroke:none" x="345" y="419" transform="rotate(0, 345, 419)" font-size="10" font-family="SansSerif" font-style="normal" font-weight="normal">1.0005</text>
<text fill="#000000" style="stroke:none" x="403" y="419" transform="rotate(0, 403, 419)" font-size="10" font-family="SansSerif" font-style="normal" font-weight="normal">1.0010</text>
<text fill="#000000" style="stroke:none" x="460" y="419" transform="rotate(0, 460, 419)" font-size="10" font-family="SansSerif" font-style="normal" font-weight="normal">1.0015</text>
<text fill="#000000" style="stroke:none" x="517" y="419" transform="rotate(0, 517, 419)" font-size="10" font-family="SansSerif" font-style="normal" font-weight="normal">1.0020</text>
</g>
</svg>
